{"text_format":"1","workbook":"xlsx","n_sheets":23,"sheets":["Lotto1 R630 1","Operating System","Lotto1 T630R 1","Lotto1 R730 1","Lotto1 R730xd 1","Lotto1 T630 1 (Tower)","Lotto1 T630 1 (Tower) Prest","RACK, Accessori e Servizi","Riepilogo","Lotto1 R630 2","Lotto1 R630 3","Lotto1 T630R 2","Lotto1 T630R 3","Lotto1 R730 2","Lotto1 R730 3","Lotto1 R730xd 2","Lotto1 R730xd 3","Codici","Processor","PCI","HDD","Memory","Servizi Opzionali"],"not_rendered":{"charts":0,"images":19,"macros":1,"external_links":1,"defined_names":166,"comments":0,"pivot_tables":0},"unopened":[],"bounds":{"document_bytes":16777216,"sheet_cells":100000,"rows_first":2000,"rows_last":500,"rows_between":2000,"halvings":0,"cell_chars":16384,"cell_head_chars":4096},"cells_cut":0,"cells_raw":0,"read":"whole","date_system":"1900"}

{"sheet":"Lotto1 R630 1","index":0,"n_rows":171,"n_cols":9,"rows_kept":171,"cut":false,"hidden":false,"merged":[[73,1,73,4],[94,7,95,8],[43,2,43,4],[49,1,49,4],[50,2,50,4],[53,1,53,4],[39,1,39,4],[40,2,40,4],[42,1,42,4],[96,2,96,4],[54,2,54,4],[56,1,56,4],[77,2,77,4],[91,1,91,4],[92,2,92,4],[57,2,57,4],[59,1,59,4],[61,1,61,4],[74,2,74,4],[76,1,76,4],[95,1,95,3],[64,1,64,4],[29,1,29,4],[30,2,30,4],[33,1,33,4],[34,2,34,4],[36,1,36,4],[20,1,20,4],[21,2,21,4],[23,1,23,4],[24,2,24,4],[27,2,27,4],[26,1,26,4],[4,0,4,4],[5,0,5,4],[10,0,11,5],[12,0,12,5],[18,2,18,4],[118,2,118,4],[99,1,99,4],[100,2,100,4],[102,1,102,4],[103,2,103,4],[105,1,105,4],[106,2,106,4],[108,1,108,4],[109,2,109,4],[111,1,111,4],[115,2,115,4],[117,1,117,4],[114,1,114,4],[171,1,171,4],[163,2,163,4],[165,1,165,4],[166,2,166,4],[168,1,168,4],[169,2,169,4],[160,2,160,4],[162,1,162,4],[157,2,157,4],[141,1,141,4],[142,2,142,4],[144,1,144,4],[145,2,145,4],[147,1,147,4],[148,2,148,4],[150,1,150,4],[151,2,151,4],[153,1,153,4],[154,2,154,4],[156,1,156,4],[96,8,99,10],[159,1,159,4],[139,2,139,4],[120,1,120,4],[124,2,124,4],[126,1,126,4],[127,2,127,4],[129,1,129,4],[130,2,130,4],[132,1,132,4],[133,2,133,4],[135,1,135,4],[136,2,136,4],[138,1,138,4],[123,1,123,4],[121,2,121,4]]}
["IN ROSSO LE OPZIONI 20%"]
[]
[]
[]
["Tecnologie Server 1 Lotto 1"]
[]
[null,null,null,null,null,null,null,"Totale Server e Opzioni",{"$f":"F18*SRV_A","v":0}]
[null,null,null,null,null,null,null,"Totale Ulteriori Opzioni ",{"$f":"G17*SRV_A-(G73*SRV_A)+G73-(SRV_A*G70)+G70","v":0}]
[]
[null,null,null,null,null,null,null,"TOTALE CONVENZIONE",{"$f":"I8+I7","v":0}]
["Components: \nServer DELL PowerEdge R630 (1CPU Intel® Xeon® E5-2640 v4, 32GB RDIMM, 2xHDD 300GB 10K RPM SAS 12Gbps 2.5in)"]
[]
[]
[]
["PowerEdge R630","Category: Server"]
[null,"Quantity: ",null,null,null,1720]
[null,null,null,null,null,{"$f":"SUM(F21:F186)","v":0},{"$f":"SUM(G21:G186)","v":0}]
[null,null,null,null,null,{"$f":"SUM(F16:F17)","v":1720}]
[null,"Base"]
[null,"PowerEdge R630 for Intel v4 CPUs, 8HDD",1,null,"[210-ACXS][329-BCZI]"]
[]
[null,"Configurazione dello chassis"]
[null,"Chassis with up to 8, 2.5\" Hard Drives, up to 2 PCIe Slots (With Optional Riser)",1,null,"[321-BBKJ]"]
[]
[null,"Processore"]
[null,"Intel Xeon E5-2640 v4 2.4GHz 25M Cache 8.0GT/s QPI Turbo HT 10C/20T (90W) Max Mem 2133MHz",1,null,"[338-BJDL]"]
[]
[null,"Processore aggiuntivo"]
[null,"No Additional Processor",{"$f":"VLOOKUP($B$29, CPU_A, 2, FALSE)","v":0},{"$f":"VLOOKUP($B$29, CPU_A, 3, FALSE)","v":""},{"$f":"VLOOKUP($B$29, CPU_A, 5, FALSE)","v":"[374-BBBX]"},{"$f":"VLOOKUP(B29, CPU_A, 12, FALSE)","v":0}]
[]
[null,"Processor Thermal Configuration"]
[null,"1 CPU up to 120W",1,null,"[370-ABWN][412-AAEE]"]
[null,{"$f":"VLOOKUP($B$29, CPU_A, 6, FALSE)","v":""},{"$f":"VLOOKUP($B$29, CPU_A, 7, FALSE)","v":""},null,{"$f":"VLOOKUP($B$29, CPU_A, 8, FALSE)","v":""}]
[]
[null,"Tipo di configurazione memoria"]
[null,"Performance Optimized",1,null,"[370-AAIP]"]
[]
[null,"Memoria Totale in GB",{"$f":"IF(F29=728,IF(B39=32,\"ATTENZIONE: AUMENTARE LA RAM\",\"\"),\"\")","v":""}]
[null,32]
[]
[null,"Tipo e velocità della memoria DIMM"]
[null,"2400MT/s RDIMMs",1,null,"[370-ACPH]"]
[]
[null,"Capacità di memoria"]
[null,{"$f":"IF($B$29=\"No Additional Processor\",VLOOKUP($B$39, MEM_A1, 8, FALSE),VLOOKUP($B$39, MEM_A2, 8, FALSE))","v":"32GB RDIMM, 2400MT/s, Dual Rank, x4 Data Width"},{"$f":"IF($B$29=\"No Additional Processor\",VLOOKUP($B$39, MEM_A1, 9, FALSE),VLOOKUP($B$39, MEM_A2, 9, FALSE))","v":1},null,{"$f":"IF($B$29=\"No Additional Processor\",VLOOKUP($B$39, MEM_A1, 10, FALSE),VLOOKUP($B$39, MEM_A2, 10, FALSE))","v":"[370-ACNS]"}]
[]
[null,{"$f":"IF($B$29=\"No Additional Processor\",VLOOKUP($B$39, MEM_A1, 2, FALSE),VLOOKUP($B$39, MEM_A2, 2, FALSE))","v":""},{"$f":"IF($B$29=\"No Additional Processor\",VLOOKUP($B$39, MEM_A1, 3, FALSE),VLOOKUP($B$39, MEM_A2, 3, FALSE))","v":""},{"$f":"IF($B$29=\"No Additional Processor\",VLOOKUP($B$39, MEM_A1, 4, FALSE),VLOOKUP($B$39, MEM_A2, 4, FALSE))","v":""},{"$f":"IF($B$29=\"No Additional Processor\",VLOOKUP($B$39, MEM_A1, 6, FALSE),VLOOKUP($B$39, MEM_A2, 6, FALSE))","v":""},{"$f":"IF($B$29=\"No Additional Processor\",VLOOKUP($B$39, MEM_A1, 7, FALSE),VLOOKUP($B$39, MEM_A2, 7, FALSE))","v":""}]
[]
[null,{"$f":"IF($B$29=\"No Additional Processor\",VLOOKUP($B$39, MEM_A1, 11, FALSE),VLOOKUP($B$39, MEM_A2, 11, FALSE))","v":""},{"$f":"IF($B$29=\"No Additional Processor\",VLOOKUP($B$39, MEM_A1, 12, FALSE),VLOOKUP($B$39, MEM_A2, 12, FALSE))","v":""},{"$f":"IF($B$29=\"No Additional Processor\",VLOOKUP($B$39, MEM_A1, 13, FALSE),VLOOKUP($B$39, MEM_A2, 13, FALSE))","v":""},{"$f":"IF($B$29=\"No Additional Processor\",VLOOKUP($B$39, MEM_A1, 15, FALSE),VLOOKUP($B$39, MEM_A2, 15, FALSE))","v":""},{"$f":"IF($B$29=\"No Additional Processor\",VLOOKUP($B$39, MEM_A1, 16, FALSE),VLOOKUP($B$39, MEM_A2, 16, FALSE))","v":""}]
[]
[null,"Sistema operativo preinstallato"]
[null,"No Operating System",{"$f":"VLOOKUP($B$52, OS_A, 2, FALSE)","v":""},{"$f":"VLOOKUP($B$52, OS_A, 3, FALSE)","v":""},{"$f":"VLOOKUP($B$52, OS_A, 5, FALSE)","v":"[611-BBBF]"},{"$f":"VLOOKUP($B$52, OS_A, 6, FALSE)","v":""}]
[null,{"$f":"IF($B$29=\"No Additional Processor\",VLOOKUP($B$52, OS_A, 20, FALSE),VLOOKUP($B$52, OS_A2, 20, FALSE))","v":""},{"$f":"IF($B$29=\"No Additional Processor\",VLOOKUP($B$52, OS_A, 21, FALSE),VLOOKUP($B$52, OS_A2, 21, FALSE))","v":0},{"$f":"IF($B$29=\"No Additional Processor\",VLOOKUP($B$52, OS_A, 22, FALSE),VLOOKUP($B$52, OS_A2, 22, FALSE))","v":""},{"$f":"IF($B$29=\"No Additional Processor\",VLOOKUP($B$52, OS_A, 24, FALSE),VLOOKUP($B$52, OS_A2, 24, FALSE))","v":""},{"$f":"IF($B$29=\"No Additional Processor\",VLOOKUP($B$52, OS_A, 25, FALSE),VLOOKUP($B$52, OS_A2, 25, FALSE))","v":""}]
[]
[null,"OS Media Kits"]
[null,"No Media Required",1,null,"[605-BBFN]"]
[]
[null,"Client Access Licenses"]
[null,{"$f":"VLOOKUP($B$52, OS_A, 8, FALSE)","v":"None"},null,{"$f":"VLOOKUP($B$52, OS_A, 10, FALSE)","v":""},{"$f":"VLOOKUP($B$52, OS_A, 12, FALSE)","v":""},{"$f":"VLOOKUP($B$52, OS_A, 13, FALSE)*C59","v":0}]
[]
[null,{"$f":"VLOOKUP($B$52, OS_A, 14, FALSE)","v":"None"},null,{"$f":"VLOOKUP($B$52, OS_A, 16, FALSE)","v":""},{"$f":"VLOOKUP($B$52, OS_A, 18, FALSE)","v":""},{"$f":"VLOOKUP($B$52, OS_A, 19, FALSE)*C61","v":0}]
[]
[null,"Sistema operativo SUSE Linux Enterprise Server"]
[null,"None\n",{"$f":"VLOOKUP($B$64,SUSE, 2, FALSE)","v":0},{"$f":"VLOOKUP($B$64,SUSE, 3, FALSE)","v":""},{"$f":"VLOOKUP($B$64,SUSE, 5, FALSE)","v":""},null,{"$f":"VLOOKUP($B$64, SUSE, 6, FALSE)*C64","v":0}]
[]
[null,"Sistema operativo VMware"]
[null,"None",{"$f":"VLOOKUP($B$67,VMWARE, 2, FALSE)+C29","v":0},{"$f":"VLOOKUP($B$67,VMWARE, 3, FALSE)","v":""},{"$f":"VLOOKUP($B$67,VMWARE, 5, FALSE)","v":""},null,{"$f":"VLOOKUP($B$67, VMWARE, 6, FALSE)*C67","v":0}]
[]
[null,"VMware vCenter Server Standard"]
[null,"None",{"$f":"VLOOKUP($B$70,VMWARE2, 2, FALSE)","v":0},{"$f":"VLOOKUP($B$70,VMWARE2, 3, FALSE)","v":""},{"$f":"VLOOKUP($B$70,VMWARE2, 5, FALSE)","v":""},null,{"$f":"VLOOKUP($B$70, VMWARE2, 6, FALSE)*C70","v":0}]
[]
[null,"Essentials Plus Kit"]
[null,"None",{"$f":"IF(SRV_A<4,VLOOKUP($B$73,VMWARE1, 2, FALSE),0)","v":0},{"$f":"VLOOKUP($B$73,VMWARE1, 3, FALSE)","v":""},{"$f":"VLOOKUP($B$73,VMWARE1, 5, FALSE)","v":""},null,{"$f":"VLOOKUP($B$73, VMWARE1, 6, FALSE)*C73","v":0}]
[]
[null,"Controller RAID"]
[null,"PERC H730 Integrated RAID Controller, 1GB Cache",1,null,"[405-AAEG]"]
[]
[null,"Dischi rigidi (numero massimo totale 8)"]
[null,"300GB 10K RPM SAS 12Gbps 2.5in Hot-plug Hard Drive",2,null,"[400-AJPK]"]
[]
[null,"300GB 10K RPM SAS 12Gbps 2.5in Hot-plug Hard Drive,CusKit",null,{"$f":"VLOOKUP($B$81, HDD_A,3, FALSE)","v":"TS1L1-HD300"},{"$f":"VLOOKUP($B$81, HDD_A,5, FALSE)","v":"[400-AJOQ]"},{"$f":"VLOOKUP($B$81, HDD_B,6, FALSE)*C81","v":0}]
[]
[null,"1.2TB 10K RPM SAS 12Gbps 2.5in Hot-plug Hard Drive,CusKit",null,{"$f":"VLOOKUP($B$83, HDD_A,3, FALSE)","v":"TS1L1-HD1200"},{"$f":"VLOOKUP($B$83, HDD_A,5, FALSE)","v":"[400-AJPD]"},{"$f":"VLOOKUP($B$83, HDD_B,6, FALSE)*C83","v":0}]
[]
[null,"1.8TB 10K RPM SAS 12Gbps 512e 2.5in Hot-plug Hard Drive,CusKit",null,"TS1L1-HD1800","[400-AJQP]",null,{"$f":"VLOOKUP($B$85, HDD_B,6, FALSE)*C85","v":0}]
[]
[null,"960GB Solid State Drive SAS Mix Use MLC 2.5in Hot-plug Drive, PX04SV, Cus Kit",null,"TS1L1-SSD800","[400-ANNX]",null,{"$f":"VLOOKUP($B$87, HDD_B,6, FALSE)*C87","v":0}]
[]
[null,"1.92TB Solid State Drive SAS Mix Use MLC 2.5in Hot-plug Drive, PX04SV, Cus Kit",null,"TS1L1-SSD1920","[400-ANMN]",null,{"$f":"VLOOKUP($B$89, HDD_B,6, FALSE)*C89","v":0}]
[]
[null,"DISCHI TOTALI",{"$f":"SUM(C79:C90)","v":2},{"$f":"IF(C91<=8,\"      OK\",\"     ERRORE:   Totale n° di dischi superiore al consentito\")","v":"      OK"}]
[]
[null,"Configurazione RAID"]
[null,"C3 - RAID 1 for H330 (2 HDDs)",1,null,{"$f":"VLOOKUP($B$94,  RAID_A1, 2, FALSE)","v":"[780-BBJK]"}]
[null,"Hot Spare for 300GB HDD","No",null,null,null,null,{"$f":"IF(B96=\"SCRIVERE QUI' LA CONFIGURAZIONE RAID RICHIESTA.\nR630 1\n\",\"ATTENZIONE COMPILARE IL CAMPO DELLA SCELTA RAID\", \"\")","v":"ATTENZIONE COMPILARE IL CAMPO DELLA SCELTA RAID"}]
[null,"SCRIVERE QUI' LA CONFIGURAZIONE RAID RICHIESTA.\nR630 1\n"]
[null,"Configurazione RAID HDD 1TB"]
[null,"",1,null,{"$f":"VLOOKUP($B$98,  RAID_A2, 2, FALSE)","v":""}]
[null,"Hot Spare for 1TB HDD","No"]
[]
[null,"Impostazioni del BIOS per la gestione dell'alimentazione"]
[null,"Performance BIOS Setting",1,null,"[384-BBBL]"]
[]
[null,"Alimentatore"]
[null,"Dual, Hot-plug, Redundant Power Supply (1+1), 750W, Titanium, 200-240VAC",{"$f":"VLOOKUP(B105,upsell_1, 2, FALSE)","v":1},{"$f":"VLOOKUP(B105,upsell_1, 3, FALSE)","v":""},{"$f":"VLOOKUP(B105,upsell_1, 5, FALSE)","v":"[450-ADWT]"},{"$f":"VLOOKUP(B105,upsell_1, 6, FALSE)","v":0},{"$f":"VLOOKUP(B105,upsell_1, 7, FALSE)","v":0}]
[]
[null,"Cavi di alimentazione"]
[null,"Rack Power Cord 2M (C13/C14 12A)",2,null,"[450-AADY]"]
[]
[null,"PCIe Riser"]
[null,{"$f":"VLOOKUP(B29, CPU_A, 9, FALSE)","v":"Riser with up to 1, x8 PCIe Slots + 1, x16 PCIe Slots for x8, 2 PCIe Chassis with 1 Processor"},{"$f":"VLOOKUP($B$29, CPU_A, 10, FALSE)","v":1},null,{"$f":"VLOOKUP($B$29, CPU_A, 11, FALSE)","v":"[330-BBCS]"}]
[]
[null,"TPM Module"]
[null,"PowerEdge Server FIPS TPM 2.0",1,null,"[461-AADM]"]
[]
[null,"Embedded Systems Management"]
[null,"iDRAC8 Enterprise, integrated Dell Remote Access Controller, Enterprise",1,null,"[385-BBHO]"]
[]
[null,"Adattatore di rete"]
[null,"Broadcom 5720 QP 1Gb Network Daughter Card",{"$f":"VLOOKUP($B$120,upsell_1, 2, FALSE)","v":1},{"$f":"VLOOKUP($B$120,upsell_1, 3, FALSE)","v":""},{"$f":"VLOOKUP($B$120,upsell_1, 5, FALSE)","v":"[540-BBBW]"},{"$f":"VLOOKUP($B$120,upsell_1, 6, FALSE)","v":""},{"$f":"VLOOKUP($B$120,upsell_1, 7, FALSE)","v":0}]
[]
[null,"Modulo Doppia SD"]
[null,"None ",{"$f":"VLOOKUP($B$123,upsell_1, 2, FALSE)","v":0},{"$f":"VLOOKUP($B$123,upsell_1, 3, FALSE)","v":""},{"$f":"VLOOKUP($B$123,upsell_1, 4, FALSE)","v":""},{"$f":"VLOOKUP($B$123,upsell_1, 6, FALSE)","v":""},{"$f":"VLOOKUP($B$123,upsell_1, 7, FALSE)","v":0}]
[]
[null,"Additional Card for PCIe Slot 1 (Low Profile)"]
[null,"None",{"$f":"VLOOKUP($B$126,  PCI_A1, 2, FALSE)","v":""},{"$f":"VLOOKUP($B$126,  PCI_A1, 3, FALSE)","v":""},{"$f":"VLOOKUP($B$126,  PCI_A1, 5, FALSE)","v":""},{"$f":"VLOOKUP($B$126,  PCI_A1, 6, FALSE)","v":""},{"$f":"VLOOKUP($B$126,  PCI_A1, 7, FALSE)","v":0}]
[]
[null,"Additional Card for PCIe Slot 2 (Full height)"]
[null,"None",{"$f":"VLOOKUP($B$129,  PCI_A2, 2, FALSE)","v":""},{"$f":"VLOOKUP($B$129,  PCI_A2, 3, FALSE)","v":""},{"$f":"VLOOKUP($B$129,  PCI_A2, 5, FALSE)","v":""},{"$f":"VLOOKUP($B$129,  PCI_A2, 6, FALSE)","v":""},{"$f":"VLOOKUP($B$129,  PCI_A2, 7, FALSE)","v":0}]
[]
[null,"Pannello frontale"]
[null,"No Bezel Option",{"$f":"VLOOKUP(B132,upsell_1, 2, FALSE)","v":1},{"$f":"VLOOKUP(B132,upsell_1, 3, FALSE)","v":""},{"$f":"VLOOKUP(B132,upsell_1, 5, FALSE)","v":"[350-BBBW]"},{"$f":"VLOOKUP(B132,upsell_1, 6, FALSE)","v":0},{"$f":"VLOOKUP(B132,upsell_1, 7, FALSE)","v":0}]
[]
[null,"Guide per rack"]
[null,"ReadyRails™ Sliding Rails Without Cable Management Arm",{"$f":"VLOOKUP(B135,upsell_1, 2, FALSE)","v":1},{"$f":"VLOOKUP(B135,upsell_1, 3, FALSE)","v":""},{"$f":"VLOOKUP(B135,upsell_1, 5, FALSE)","v":"[770-BBBC]"},{"$f":"VLOOKUP(B135,upsell_1, 6, FALSE)","v":0},{"$f":"VLOOKUP(B135,upsell_1, 7, FALSE)","v":0}]
[]
[null,"Unità ottica interna"]
[null,"No Internal Optical Drive for 8 HDD Chassis",1,"","[429-AAQN]",null,""]
[]
[null,"Accessori Server"]
[null,"PowerEdge SFP+, 10GbE SR/SX, Optical Tranceiver, LC Connector, for Intel and Broadcom,CusKit",{"$f":"(VLOOKUP(B129,PCI_A2,9,FALSE))+((VLOOKUP(B126,PCI_A1,9,FALSE)))","v":0},null,"[407-BBQE]"]
[]
[null,"Sistema documentazione"]
[null,"Electronic System Documentation and OpenManage DVD Kit",1,null,"[343-BBDK]"]
[]
[null,"SHIPPING"]
[null,"R630 Shipping - 8 Drive Chassis, EMEA1 (English/French/German/Spanish/Russian/Hebrew)",1,null,"[340-AMIN]"]
[]
[null,"Order Information"]
[null,"PowerEdge Order - EMEA",1,null,"[800-11671]"]
[]
[null,"Base warranty"]
[null,"3Yr Basic Warranty - Next Business Day - Minimum Warranty",1,null,"[709-12767][709-12768]"]
[]
[null,"Servizi di assitenza"]
[null,"Dell Channel Order - Service Info only",1,null,"[710-31085]"]
[]
[null,"Estenzione di Garanzia"]
[null,"None",{"$f":"VLOOKUP($B$159,  SO_A1, 2, FALSE)","v":""},{"$f":"VLOOKUP($B$159,  SO_A1, 3, FALSE)","v":""},{"$f":"VLOOKUP($B$159,  SO_A1, 5, FALSE)","v":""},{"$f":"VLOOKUP($B$159,  SO_A1, 6, FALSE)","v":""}]
[]
[null,"Protezione dei dati - Keep Your Hard Drive "]
[null,"None",{"$f":"VLOOKUP($B$162,  SO_A2, 2, FALSE)","v":""},{"$f":"VLOOKUP($B$162,  SO_A2, 3, FALSE)","v":""},{"$f":"VLOOKUP($B$162,  SO_A2,5, FALSE)","v":""},{"$f":"VLOOKUP($B$162,  SO_A2, 6, FALSE)","v":""}]
[]
[null,"Servizi di Installazione"]
[null,"No Installation Service Selected",1,null,"[683-11870]"]
[]
[null,"Channel only - Support Extension"]
[null,"Channel 39M Basic Warranty - Next Business Day",1,null,"[723-28776]"]
[]
[null,"Warranty Upgrades - Non-Std/Local POS"]
[null,"CSTM CONSIP - 39M Onsite Labor Support for CRU for Servers with Basic Warranty",1,null,"[681-24467]"]

{"sheet":"Operating System","index":1,"n_rows":71,"n_cols":25,"rows_kept":71,"cut":false,"hidden":true,"merged":[[0,1,0,2]]}
["Operating System"]
["R630 1CPU"]
["No Operating System",{"$f":"\"\"","v":""},{"$f":"\"\"","v":""},{"$f":"\"\"","v":""},"[611-BBBF]",{"$f":"\"\"","v":""},null,"None",{"$f":"\"\"","v":""},{"$f":"\"\"","v":""},{"$f":"\"\"","v":""},{"$f":"\"\"","v":""},null,"None",{"$f":"\"\"","v":""},{"$f":"\"\"","v":""},{"$f":"\"\"","v":""},{"$f":"\"\"","v":""},null,{"$f":"\"\"","v":""},0,{"$f":"\"\"","v":""},{"$f":"\"\"","v":""},{"$f":"\"\"","v":""},{"$f":"\"\"","v":""}]
["Microsoft Windows Server 2016 Standard Edition ROK 16 Core",1,"TS1L1-WIN1",null,"[634-BIPU]",598,null,"1-pack of Windows Server 2016 User CALs (Standard or Datacenter)",1,"TS1L1-CALUSER",null,"[618-10778]",25,"1-pack of Windows Server 2016 Device CALs (Standard or Datacenter)",1,"TS1L1-CALDEV",null,"[618-10777]",22,{"$f":"\"\"","v":""},0,{"$f":"\"\"","v":""},{"$f":"\"\"","v":""},{"$f":"\"\"","v":""},{"$f":"\"\"","v":""}]
["CentOS 7.0",1,"TS1L1-LINUX",null,{"$f":"\"\"","v":""},47,null,"None",{"$f":"\"\"","v":""},{"$f":"\"\"","v":""},{"$f":"\"\"","v":""},{"$f":"\"\"","v":""},null,"None",{"$f":"\"\"","v":""},{"$f":"\"\"","v":""},{"$f":"\"\"","v":""},{"$f":"\"\"","v":""},null,{"$f":"\"\"","v":""},0,{"$f":"\"\"","v":""},{"$f":"\"\"","v":""},{"$f":"\"\"","v":""},{"$f":"\"\"","v":""}]
["Microsoft Windows Server 2016 Standard Edition Additional License 2 Core",2,"TS1L1-WIN2CORE","TS1L4-WIN2CORE","871159-A21",108]
[]
["R630 2CPU"]
["No Operating System",{"$f":"\"\"","v":""},{"$f":"\"\"","v":""},{"$f":"\"\"","v":""},"[611-BBBF]",{"$f":"\"\"","v":""},null,"None",{"$f":"\"\"","v":""},{"$f":"\"\"","v":""},{"$f":"\"\"","v":""},{"$f":"\"\"","v":""},null,"None",{"$f":"\"\"","v":""},{"$f":"\"\"","v":""},{"$f":"\"\"","v":""},{"$f":"\"\"","v":""},null,{"$f":"\"\"","v":""},0,{"$f":"\"\"","v":""},{"$f":"\"\"","v":""},{"$f":"\"\"","v":""}]
["Microsoft Windows Server 2016 Standard Edition ROK 16 Core",1,"TS1L1-WIN1",null,"[634-BIPU]",598,null,"1-pack of Windows Server 2016 User CALs (Standard or Datacenter)",1,"TS1L1-CALUSER",null,"[618-10778]",25,"1-pack of Windows Server 2016 Device CALs (Standard or Datacenter)",1,"TS1L1-CALDEV",null,"[618-10777]",22,"Microsoft Windows Server 2016 Standard Edition Additional License 2 Core",2,"TS1L1-WIN2CORE","TS1L4-WIN2CORE","[634-BJQW]",150]
["CentOS 7.0",1,"TS1L1-LINUX",null,{"$f":"\"\"","v":""},47,null,"None",{"$f":"\"\"","v":""},{"$f":"\"\"","v":""},{"$f":"\"\"","v":""},{"$f":"\"\"","v":""},null,"None",{"$f":"\"\"","v":""},{"$f":"\"\"","v":""},{"$f":"\"\"","v":""},{"$f":"\"\"","v":""},null,{"$f":"\"\"","v":""},0,{"$f":"\"\"","v":""},{"$f":"\"\"","v":""},{"$f":"\"\"","v":""}]
[]
[]
["Red Hat Enterprise Linux,2SKT,1 Physical OR 2Guest,1Yr PREMIUM SUB,No Media,CUS",1,{"$f":"CONCATENATE(\"TS1L1-\",E14)","v":"TS1L1-634-BIPV"},null,"634-BIPV",null,990,"None",{"$f":"\"\"","v":""},{"$f":"\"\"","v":""},{"$f":"\"\"","v":""},{"$f":"\"\"","v":""},null,"None",{"$f":"\"\"","v":""},{"$f":"\"\"","v":""},{"$f":"\"\"","v":""},{"$f":"\"\"","v":""},null,{"$f":"\"\"","v":""},{"$f":"\"\"","v":""},{"$f":"\"\"","v":""},{"$f":"\"\"","v":""},{"$f":"\"\"","v":""},{"$f":"\"\"","v":""}]
["Red Hat Enterprise Linux,2SKT,1 Physical OR 2Guest,3Yr PREMIUM SUB,No Media,Cus Kit",1,"TS1L1-634-BIPX",null,"634-BIPX",null,2820,"None",{"$f":"\"\"","v":""},{"$f":"\"\"","v":""},{"$f":"\"\"","v":""},{"$f":"\"\"","v":""},null,"None",{"$f":"\"\"","v":""},{"$f":"\"\"","v":""},{"$f":"\"\"","v":""},{"$f":"\"\"","v":""},null,{"$f":"\"\"","v":""},{"$f":"\"\"","v":""},{"$f":"\"\"","v":""},{"$f":"\"\"","v":""},{"$f":"\"\"","v":""},{"$f":"\"\"","v":""}]
["Red Hat Enterprise Linux,2SKT,1 Physical OR 2Guest,5Yr PREMIUM SUB,No Media,CUS",1,"TS1L1-634-BIPW",null,"634-BIPW",null,4700,"None",{"$f":"\"\"","v":""},{"$f":"\"\"","v":""},{"$f":"\"\"","v":""},{"$f":"\"\"","v":""},null,"None",{"$f":"\"\"","v":""},{"$f":"\"\"","v":""},{"$f":"\"\"","v":""},{"$f":"\"\"","v":""},null,{"$f":"\"\"","v":""},{"$f":"\"\"","v":""},{"$f":"\"\"","v":""},{"$f":"\"\"","v":""},{"$f":"\"\"","v":""},{"$f":"\"\"","v":""}]
["VMware vSphere Essentials Plus",1,"TS1L1-210-AIKY",null,"210-AIKY",null,5730,"None",{"$f":"\"\"","v":""},{"$f":"\"\"","v":""},{"$f":"\"\"","v":""},{"$f":"\"\"","v":""},null,"None",{"$f":"\"\"","v":""},{"$f":"\"\"","v":""},{"$f":"\"\"","v":""},{"$f":"\"\"","v":""},null,{"$f":"\"\"","v":""},{"$f":"\"\"","v":""},{"$f":"\"\"","v":""},{"$f":"\"\"","v":""},{"$f":"\"\"","v":""},{"$f":"\"\"","v":""}]
["VMware vSphere EnterprisePlus",1,"TS1L1-210-AHRP",null,"210-AHRP",null,5230,"None",{"$f":"\"\"","v":""},{"$f":"\"\"","v":""},{"$f":"\"\"","v":""},{"$f":"\"\"","v":""},null,"None",{"$f":"\"\"","v":""},{"$f":"\"\"","v":""},{"$f":"\"\"","v":""},{"$f":"\"\"","v":""},null,{"$f":"\"\"","v":""},{"$f":"\"\"","v":""},{"$f":"\"\"","v":""},{"$f":"\"\"","v":""},{"$f":"\"\"","v":""},{"$f":"\"\"","v":""}]
["VMware vCenter Standard",1,"TS1L1-210-AHRF",null,"210-AHRF",null,8961,"None",{"$f":"\"\"","v":""},{"$f":"\"\"","v":""},{"$f":"\"\"","v":""},{"$f":"\"\"","v":""},null,"None",{"$f":"\"\"","v":""},{"$f":"\"\"","v":""},{"$f":"\"\"","v":""},{"$f":"\"\"","v":""},null,{"$f":"\"\"","v":""},{"$f":"\"\"","v":""},{"$f":"\"\"","v":""},{"$f":"\"\"","v":""},{"$f":"\"\"","v":""},{"$f":"\"\"","v":""}]
[]
["Red Hat Enterprise Linux,2SKT,1 Physical OR 2Guest,1Yr PREMIUM SUB,No Media,CUS",1,{"$f":"CONCATENATE(\"TS1L1-\",E21)","v":"TS1L1-634-BIPV"},null,"634-BIPV",null,990,"None",{"$f":"\"\"","v":""},{"$f":"\"\"","v":""},{"$f":"\"\"","v":""},{"$f":"\"\"","v":""},null,"None",{"$f":"\"\"","v":""},{"$f":"\"\"","v":""},{"$f":"\"\"","v":""},{"$f":"\"\"","v":""},null,{"$f":"\"\"","v":""},{"$f":"\"\"","v":""},{"$f":"\"\"","v":""},{"$f":"\"\"","v":""},{"$f":"\"\"","v":""}]
["Red Hat Enterprise Linux,2SKT,1 Physical OR 2Guest,3Yr PREMIUM SUB,No Media,Cus Kit",1,"TS1L1-634-BIPX",null,"634-BIPX",null,2820,"None",{"$f":"\"\"","v":""},{"$f":"\"\"","v":""},{"$f":"\"\"","v":""},{"$f":"\"\"","v":""},null,"None",{"$f":"\"\"","v":""},{"$f":"\"\"","v":""},{"$f":"\"\"","v":""},{"$f":"\"\"","v":""},null,{"$f":"\"\"","v":""},{"$f":"\"\"","v":""},{"$f":"\"\"","v":""},{"$f":"\"\"","v":""},{"$f":"\"\"","v":""}]
["Red Hat Enterprise Linux,2SKT,1 Physical OR 2Guest,5Yr PREMIUM SUB,No Media,CUS",1,"TS1L1-634-BIPW",null,"634-BIPW",null,4700,"None",{"$f":"\"\"","v":""},{"$f":"\"\"","v":""},{"$f":"\"\"","v":""},{"$f":"\"\"","v":""},null,"None",{"$f":"\"\"","v":""},{"$f":"\"\"","v":""},{"$f":"\"\"","v":""},{"$f":"\"\"","v":""},null,{"$f":"\"\"","v":""},{"$f":"\"\"","v":""},{"$f":"\"\"","v":""},{"$f":"\"\"","v":""},{"$f":"\"\"","v":""}]
["VMware vSphere Essentials Plus",1,"TS1L1-210-AIKY",null,"210-AIKY",null,5730,"None",{"$f":"\"\"","v":""},{"$f":"\"\"","v":""},{"$f":"\"\"","v":""},{"$f":"\"\"","v":""},null,"None",{"$f":"\"\"","v":""},{"$f":"\"\"","v":""},{"$f":"\"\"","v":""},{"$f":"\"\"","v":""},null,{"$f":"\"\"","v":""},{"$f":"\"\"","v":""},{"$f":"\"\"","v":""},{"$f":"\"\"","v":""},{"$f":"\"\"","v":""}]
["VMware vSphere EnterprisePlus",1,"TS1L1-210-AHRP",null,"210-AHRP",null,5230,"None",{"$f":"\"\"","v":""},{"$f":"\"\"","v":""},{"$f":"\"\"","v":""},{"$f":"\"\"","v":""},null,"None",{"$f":"\"\"","v":""},{"$f":"\"\"","v":""},{"$f":"\"\"","v":""},{"$f":"\"\"","v":""},null,{"$f":"\"\"","v":""},{"$f":"\"\"","v":""},{"$f":"\"\"","v":""},{"$f":"\"\"","v":""},{"$f":"\"\"","v":""}]
["VMware vCenter Standard",1,"TS1L1-210-AHRF",null,"210-AHRF",null,8961,"None",{"$f":"\"\"","v":""},{"$f":"\"\"","v":""},{"$f":"\"\"","v":""},{"$f":"\"\"","v":""},null,"None",{"$f":"\"\"","v":""},{"$f":"\"\"","v":""},{"$f":"\"\"","v":""},{"$f":"\"\"","v":""},null,{"$f":"\"\"","v":""},{"$f":"\"\"","v":""},{"$f":"\"\"","v":""},{"$f":"\"\"","v":""},{"$f":"\"\"","v":""}]
[]
["R730xd 1CPU"]
["No Operating System",{"$f":"\"\"","v":""},{"$f":"\"\"","v":""},{"$f":"\"\"","v":""},"[611-BBBF]",{"$f":"\"\"","v":""},null,"None",{"$f":"\"\"","v":""},{"$f":"\"\"","v":""},{"$f":"\"\"","v":""},{"$f":"\"\"","v":""},null,"None",{"$f":"\"\"","v":""},{"$f":"\"\"","v":""},{"$f":"\"\"","v":""},{"$f":"\"\"","v":""},null,{"$f":"\"\"","v":""},0,{"$f":"\"\"","v":""},{"$f":"\"\"","v":""},{"$f":"\"\"","v":""},{"$f":"\"\"","v":""}]
["Microsoft Windows Server 2016 Standard Edition ROK 16 Core",1,"TS1L1-WIN1",null,"[634-BIPU]",598,null,"1-pack of Windows Server 2016 User CALs (Standard or Datacenter)",1,"TS1L1-CALUSER",null,"[618-10778]",25,"1-pack of Windows Server 2016 Device CALs (Standard or Datacenter)",1,"TS1L1-CALDEV",null,"[618-10777]",22,{"$f":"\"\"","v":""},0,{"$f":"\"\"","v":""},{"$f":"\"\"","v":""},{"$f":"\"\"","v":""},{"$f":"\"\"","v":""}]
["CentOS 7.0",1,"TS1L1-LINUX",null,{"$f":"\"\"","v":""},47,null,"None",{"$f":"\"\"","v":""},{"$f":"\"\"","v":""},{"$f":"\"\"","v":""},{"$f":"\"\"","v":""},null,"None",{"$f":"\"\"","v":""},{"$f":"\"\"","v":""},{"$f":"\"\"","v":""},{"$f":"\"\"","v":""},null,{"$f":"\"\"","v":""},0,{"$f":"\"\"","v":""},{"$f":"\"\"","v":""},{"$f":"\"\"","v":""},{"$f":"\"\"","v":""}]
[]
["R730xd 2CPU"]
["No Operating System",{"$f":"\"\"","v":""},{"$f":"\"\"","v":""},{"$f":"\"\"","v":""},"[611-BBBF]",{"$f":"\"\"","v":""},null,"None",{"$f":"\"\"","v":""},{"$f":"\"\"","v":""},{"$f":"\"\"","v":""},{"$f":"\"\"","v":""},null,"None",{"$f":"\"\"","v":""},{"$f":"\"\"","v":""},{"$f":"\"\"","v":""},{"$f":"\"\"","v":""},null,{"$f":"\"\"","v":""},0,{"$f":"\"\"","v":""},{"$f":"\"\"","v":""},{"$f":"\"\"","v":""}]
["Microsoft Windows Server 2016 Standard Edition ROK 16 Core",1,"TS1L1-WIN1",null,"[634-BIPU]",598,null,"1-pack of Windows Server 2016 User CALs (Standard or Datacenter)",1,"TS1L1-CALUSER",null,"[618-10778]",25,"1-pack of Windows Server 2016 Device CALs (Standard or Datacenter)",1,"TS1L1-CALDEV",null,"[618-10777]",22,"Microsoft Windows Server 2016 Standard Edition Additional License 2 Core",6,"TS1L1-WIN2CORE","TS1L4-WIN2CORE","[634-BJQW]",450]
["CentOS 7.0",1,"TS1L1-LINUX",null,{"$f":"\"\"","v":""},47,null,"None",{"$f":"\"\"","v":""},{"$f":"\"\"","v":""},{"$f":"\"\"","v":""},{"$f":"\"\"","v":""},null,"None",{"$f":"\"\"","v":""},{"$f":"\"\"","v":""},{"$f":"\"\"","v":""},{"$f":"\"\"","v":""},null,{"$f":"\"\"","v":""},0,{"$f":"\"\"","v":""},{"$f":"\"\"","v":""},{"$f":"\"\"","v":""}]
[]
["T630 2650"]
["No Operating System",{"$f":"\"\"","v":""},{"$f":"\"\"","v":""},{"$f":"\"\"","v":""},"[611-BBBF]",{"$f":"\"\"","v":""},null,"None",{"$f":"\"\"","v":""},{"$f":"\"\"","v":""},{"$f":"\"\"","v":""},{"$f":"\"\"","v":""},null,"None",{"$f":"\"\"","v":""},{"$f":"\"\"","v":""},{"$f":"\"\"","v":""},{"$f":"\"\"","v":""},null,{"$f":"\"\"","v":""},0,{"$f":"\"\"","v":""},{"$f":"\"\"","v":""},{"$f":"\"\"","v":""}]
["Microsoft Windows Server 2016 Standard Edition ROK 16 Core",1,"TS1L1-WIN1",null,"[634-BIPU]",598,null,"1-pack of Windows Server 2016 User CALs (Standard or Datacenter)",1,"10L1-CALUSER","S10L1-T630-USR","[618-10778]",25,"1-pack of Windows Server 2012 Device CALs (Standard or Datacenter)",1,"10L1-CALDEV","S10L1-T630-DEV","[618-10777]",25,"Microsoft Windows Server 2016 Standard Edition Additional License 2 Core",0,"TS1L1-WIN2CORE","TS1L4-WIN2CORE","[634-BJQW]",300]
["CentOS 7.0",1,"TS1L1-LINUX",null,{"$f":"\"\"","v":""},47,null,"None",{"$f":"\"\"","v":""},{"$f":"\"\"","v":""},{"$f":"\"\"","v":""},{"$f":"\"\"","v":""},null,"None",{"$f":"\"\"","v":""},{"$f":"\"\"","v":""},{"$f":"\"\"","v":""},{"$f":"\"\"","v":""},null,{"$f":"\"\"","v":""},0,{"$f":"\"\"","v":""},{"$f":"\"\"","v":""},{"$f":"\"\"","v":""}]
[]
["T630 2650 2CPU"]
["No Operating System",{"$f":"\"\"","v":""},{"$f":"\"\"","v":""},{"$f":"\"\"","v":""},"[611-BBBF]",{"$f":"\"\"","v":""},null,"None",{"$f":"\"\"","v":""},{"$f":"\"\"","v":""},{"$f":"\"\"","v":""},{"$f":"\"\"","v":""},null,"None",{"$f":"\"\"","v":""},{"$f":"\"\"","v":""},{"$f":"\"\"","v":""},{"$f":"\"\"","v":""},null,{"$f":"\"\"","v":""},0,{"$f":"\"\"","v":""},{"$f":"\"\"","v":""},{"$f":"\"\"","v":""}]
["Microsoft Windows Server 2016 Standard Edition ROK 16 Core",1,"TS1L1-WIN1",null,"[634-BIPU]",598,null,"1-pack of Windows Server 2016 User CALs (Standard or Datacenter)",1,"10L1-CALUSER","S10L1-T630-USR","[618-10778]",25,"1-pack of Windows Server 2012 Device CALs (Standard or Datacenter)",1,"10L1-CALDEV","S10L1-T630-DEV","[618-10777]",25,"Microsoft Windows Server 2016 Standard Edition Additional License 2 Core",4,"TS1L1-WIN2CORE","TS1L4-WIN2CORE","[634-BJQW]",300]
["CentOS 7.0",1,"TS1L1-LINUX",null,{"$f":"\"\"","v":""},47,null,"None",{"$f":"\"\"","v":""},{"$f":"\"\"","v":""},{"$f":"\"\"","v":""},{"$f":"\"\"","v":""},null,"None",{"$f":"\"\"","v":""},{"$f":"\"\"","v":""},{"$f":"\"\"","v":""},{"$f":"\"\"","v":""},null,{"$f":"\"\"","v":""},0,{"$f":"\"\"","v":""},{"$f":"\"\"","v":""},{"$f":"\"\"","v":""}]
[]
[]
[]
["None\n",0,"","","",0]
["SUSE Linux Enterprise Server, x86 & x86-64, 1-2 Sockets or 1-2 Virtual Machines, Standard Subscription, 3 Years",1,"TS1-874-006887","TS1-874-006887","874-006887",1350]
["SUSE Linux Enterprise Server, x86 & x86-64, 1-2 Sockets or 1-2 Virtual Machines, Standard Subscription, 5 Years",1,"TS1-874-006898","TS1-874-006898","874-006898",2242.5]
["SUSE Linux Enterprise Server, x86 & x86-64, 1-2 Sockets with Unlimited Virtual Machines, Standard Subscription, 3 Years",1,"TS1-874-006888","TS1-874-006888","874-006888",2692.5]
["SUSE Linux Enterprise Server, x86 & x86-64, 1-2 Sockets with Unlimited Virtual Machines, Standard Subscription, 5 Years",1,"TS1-874-006902","TS1-874-006902","874-006902",4500]
["SUSE Linux Enterprise Server, x86 & x86-64, 1-2 Sockets or 1-2 Virtual Machines, Priority Subscription, 3 Year",1,"TS1-874-006883","TS1-874-006883","874-006883",2520]
["SUSE Linux Enterprise Server, x86 & x86-64, 1-2 Sockets or 1-2 Virtual Machines, Priority Subscription, 5 Year",1,"TS1-874-006894","TS1-874-006894","874-006894",4200]
["SUSE Linux Enterprise Server, x86 & x86-64, 1-2 Sockets with Unlimited Virtual Machines, Priority Subscription, 3 Year",1,"TS1-874-006884","TS1-874-006884","874-006884",5100]
["SUSE Linux Enterprise Server, x86 & x86-64, 1-2 Sockets with Unlimited Virtual Machines, Priority Subscription, 5 Year",1,"TS1-874-006895","TS1-874-006895","874-006895",8400]
["VMWARE"]
["None",0,"","","",0]
["VMware vSphere Standard, 1CPU, 3YR License/Maintenance",1,"TS1-210-AHRT","TS1-210-AHRT","210-AHRT",1463]
["VMware vSphere Enterprise Plus, 1CPU, 3YR License/Maintenance",1,"TS1-210-AHRP","TS1-210-AHRP","210-AHRP",4400]
[]
[null,null,null,null,null,null,null,"R630","T630R","R730","R730xd","T630","T630P"]
["VMWARE1",null,null,null,null,null,1,{"$f":"SRV_A","v":0},{"$f":"SRV_C","v":0},{"$f":"SRV_B1.1","v":0},{"$f":"SRV_B","v":0},{"$f":"SRV_D","v":0},{"$f":"SRV_E","v":0}]
["None",0,"","","",0,2,{"$f":"SRV_AA","v":0},{"$f":"SRV_CC","v":0},{"$f":"SRV_B1.2","v":0},{"$f":"SRV_BB","v":0}]
["VMware vSphere Essentials Plus, 6CPU, 3YR",1,"TS1-210-AIKY","TS1-210-AIKY","210-AIKY",4100,3,{"$f":"SRV_AAA","v":0},{"$f":"SRV_CCC","v":0},{"$f":"SRV_B1.3","v":0},{"$f":"SRV_BB","v":0}]
[]
["VMWARE2"]
["None",0,"","","",0]
["VMware vCenter Standard, 3YR License/Maintenance",1,"TS1-210-AHRF","TS1-210-AHRF","210-AHRF",8338]

{"sheet":"Lotto1 T630R 1","index":2,"n_rows":188,"n_cols":9,"rows_kept":188,"cut":false,"hidden":false,"merged":[[96,7,97,8],[28,2,28,4],[4,0,4,4],[10,0,10,4],[11,0,12,5],[13,0,13,5],[19,2,19,4],[21,1,21,4],[22,2,22,4],[24,1,24,4],[25,2,25,4],[27,1,27,4],[54,1,54,4],[30,1,30,4],[31,2,31,4],[34,1,34,4],[35,2,35,4],[37,1,37,4],[40,1,40,4],[41,2,41,4],[43,1,43,4],[44,2,44,4],[50,1,50,4],[51,2,51,4],[97,2,97,4],[55,2,55,4],[57,1,57,4],[58,2,58,4],[60,1,60,4],[62,1,62,4],[75,2,75,4],[77,1,77,4],[78,2,78,4],[92,1,92,4],[93,2,93,4],[65,1,65,4],[96,1,96,3],[74,1,74,4],[118,1,118,4],[122,2,122,4],[100,1,100,4],[101,2,101,4],[103,1,103,4],[107,2,107,4],[109,1,109,4],[110,2,110,4],[115,1,115,4],[186,2,186,4],[173,1,173,4],[174,2,174,4],[188,1,188,4],[104,2,104,4],[106,1,106,4],[133,2,133,4],[135,1,135,4],[136,2,136,4],[176,1,176,4],[177,2,177,4],[179,1,179,4],[180,2,180,4],[167,1,167,4],[168,2,168,4],[170,1,170,4],[182,1,182,4],[183,2,183,4],[185,1,185,4],[171,2,171,4],[119,2,119,4],[121,1,121,4],[126,1,126,4],[127,2,127,4],[145,2,145,4],[144,1,144,4],[138,1,138,4],[139,2,139,4],[141,1,141,4],[142,2,142,4],[130,2,130,4],[132,1,132,4],[129,1,129,4],[112,1,112,4],[116,2,116,4],[165,2,165,4],[147,1,147,4],[148,2,148,4],[150,1,150,4],[158,1,158,4],[159,2,159,4],[161,1,161,4],[162,2,162,4],[164,1,164,4],[151,2,151,4],[153,1,153,4],[154,2,154,4]]}
["IN ROSSO LE OPZIONI 20%"]
[]
[]
[]
["Tecnologie Server 1 Lotto 1"]
[]
[null,null,null,null,null,null,null,"Totale Server e Opzioni",{"$f":"F18*SRV_C","v":0}]
[null,null,null,null,null,null,null,"Totale Ulteriori Opzioni ",{"$f":"G17*SRV_C-(G74*SRV_C)+G74-(SRV_C*G71)+G71","v":0}]
[]
[null,null,null,null,null,null,null,"TOTALE CONVENZIONE",{"$f":"I8+I7","v":0}]
[]
["Components: \nServer DELL PowerEdge T630 (1CPU Intel® Xeon® E5-2640 v4, 32GB RDIMM, 2xHDD 300GB 10K RPM SAS 12Gbps 2.5in)"]
[]
[]
[]
["PowerEdge T630","Category: Server",null,null,null,1720]
[null,"Quantity: ",null,null,null,{"$f":"SUM(F21:F186)","v":0},{"$f":"SUM(G21:G186)","v":0}]
[null,null,null,null,null,{"$f":"SUM(F16:F17)","v":1720}]
[]
[null,"Base"]
[null,"PowerEdge T630 for Intel v4 CPUs",1,null,"[210-ACWJ][329-BCZH]"]
[]
[null,"Configurazione dello chassis"]
[null,"Chassis with up to 16, 2.5\" Hard Drives, Rack Configuration",1,null,"[321-BBJW]"]
[]
[null,"Processore"]
[null,"Intel Xeon E5-2640 v4 2.4GHz 25M Cache 8.0GT/s QPI Turbo HT 10C/20T (90W) Max Mem 2133MHz",1,null,"[338-BJDL]"]
[]
[null,"Processore aggiuntivo"]
[null,"No Additional Processor",{"$f":"VLOOKUP($B$30, CPU_C, 2, FALSE)","v":0},{"$f":"VLOOKUP($B$30, CPU_C, 3, FALSE)","v":""},{"$f":"VLOOKUP($B$30, CPU_C, 5, FALSE)","v":"[374-BBBX]"},{"$f":"VLOOKUP(B30, CPU_C, 12, FALSE)","v":0}]
[]
[null,"Processor Thermal Configuration"]
[null,"1 CPU up to 105W",1,null,"[412-AADW]"]
[null,{"$f":"VLOOKUP($B$30, CPU_C, 6, FALSE)","v":""},{"$f":"VLOOKUP($B$30, CPU_C, 7, FALSE)","v":""},null,{"$f":"VLOOKUP($B$30, CPU_C, 8, FALSE)","v":""}]
[]
[null,"Tipo di configurazione memoria"]
[null,"Performance Optimized",1,null,"[370-AAIP]"]
[]
[null,"Total Memory in GB",{"$f":"IF(F30=728,IF(B40=32,\"ATTENZIONE: AUMENTARE LA RAM\",\"\"),\"\")","v":""}]
[null,32]
[]
[null,"Tipo e velocità della memoria DIMM"]
[null,"2400MT/s RDIMMs",1,null,"[370-ACPH]"]
[]
[null,"Capacità di memoria"]
[null,"32GB RDIMM, 2400MT/s, Dual Rank, x4 Data Width",1,null,"[370-ACNS]"]
[]
[null,{"$f":"IF($B$30=\"No Additional Processor\",VLOOKUP($B$40, MEM_A1, 2, FALSE),VLOOKUP($B$40, MEM_A2, 2, FALSE))","v":""},{"$f":"IF($B$30=\"No Additional Processor\",VLOOKUP($B$40, MEM_A1, 3, FALSE),VLOOKUP($B$40, MEM_A2, 3, FALSE))","v":""},{"$f":"IF($B$30=\"No Additional Processor\",VLOOKUP($B$40, MEM_A1, 4, FALSE),VLOOKUP($B$40, MEM_A2, 4, FALSE))","v":""},{"$f":"IF($B$30=\"No Additional Processor\",VLOOKUP($B$40, MEM_A1, 6, FALSE),VLOOKUP($B$40, MEM_A2, 6, FALSE))","v":""},{"$f":"IF($B$30=\"No Additional Processor\",VLOOKUP($B$40, MEM_A1, 7, FALSE),VLOOKUP($B$40, MEM_A2, 7, FALSE))","v":""}]
[]
[null,{"$f":"IF($B$30=\"No Additional Processor\",VLOOKUP($B$40, MEM_A1, 11, FALSE),VLOOKUP($B$40, MEM_A2, 11, FALSE))","v":""},{"$f":"IF($B$30=\"No Additional Processor\",VLOOKUP($B$40, MEM_A1, 12, FALSE),VLOOKUP($B$40, MEM_A2, 12, FALSE))","v":""},{"$f":"IF($B$30=\"No Additional Processor\",VLOOKUP($B$40, MEM_A1, 13, FALSE),VLOOKUP($B$40, MEM_A2, 13, FALSE))","v":""},{"$f":"IF($B$30=\"No Additional Processor\",VLOOKUP($B$40, MEM_A1, 15, FALSE),VLOOKUP($B$40, MEM_A2, 15, FALSE))","v":""},{"$f":"IF($B$30=\"No Additional Processor\",VLOOKUP($B$40, MEM_A1, 16, FALSE),VLOOKUP($B$40, MEM_A2, 16, FALSE))","v":""}]
[]
[null,"Sistema operativo preinstallato"]
[null,"No Operating System",{"$f":"VLOOKUP($B$53, OS_A, 2, FALSE)","v":""},{"$f":"VLOOKUP($B$53, OS_A, 3, FALSE)","v":""},{"$f":"VLOOKUP($B$53, OS_A, 5, FALSE)","v":"[611-BBBF]"},{"$f":"VLOOKUP($B$53, OS_A, 6, FALSE)","v":""}]
[null,{"$f":"IF($B$34=\"No Additional Processor\",VLOOKUP($B$53, OS_A, 20, FALSE),VLOOKUP($B$53, OS_A2, 20, FALSE))","v":""},{"$f":"IF($B$34=\"No Additional Processor\",VLOOKUP($B$53, OS_A, 21, FALSE),VLOOKUP($B$53, OS_A2, 21, FALSE))","v":0},{"$f":"IF($B$34=\"No Additional Processor\",VLOOKUP($B$53, OS_A, 22, FALSE),VLOOKUP($B$53, OS_A2, 22, FALSE))","v":""},{"$f":"IF($B$34=\"No Additional Processor\",VLOOKUP($B$53, OS_A, 24, FALSE),VLOOKUP($B$53, OS_A2, 24, FALSE))","v":""},{"$f":"IF($B$34=\"No Additional Processor\",VLOOKUP($B$53, OS_A, 25, FALSE),VLOOKUP($B$53, OS_A2, 25, FALSE))","v":0}]
[]
[null,"OS Media Kits"]
[null,"No Media Required",1,null,"[605-BBFN]"]
[]
[null,"Client Access Licenses"]
[null,{"$f":"VLOOKUP($B$53, OS_A, 8, FALSE)","v":"None"},null,{"$f":"VLOOKUP($B$53, OS_A, 10, FALSE)","v":""},{"$f":"VLOOKUP($B$53, OS_A, 12, FALSE)","v":""},{"$f":"VLOOKUP($B$53, OS_A, 13, FALSE)*C60","v":0}]
[]
[null,{"$f":"VLOOKUP($B$53, OS_A, 14, FALSE)","v":"None"},null,{"$f":"VLOOKUP($B$53, OS_A, 16, FALSE)","v":""},{"$f":"VLOOKUP($B$53, OS_A, 18, FALSE)","v":""},{"$f":"VLOOKUP($B$53, OS_A, 19, FALSE)*C62","v":0}]
[]
[null,"Sistema operativo SUSE Linux Enterprise Server"]
[null,"None\n",{"$f":"VLOOKUP($B$65,SUSE, 2, FALSE)","v":0},{"$f":"VLOOKUP($B$65,SUSE, 3, FALSE)","v":""},{"$f":"VLOOKUP($B$65,SUSE, 5, FALSE)","v":""},null,{"$f":"VLOOKUP($B$65, SUSE, 6, FALSE)*C65","v":0}]
[]
[null,"Sistema operativo VMware"]
[null,"None",{"$f":"VLOOKUP($B$68,VMWARE, 2, FALSE)+C30","v":0},{"$f":"VLOOKUP($B$68,VMWARE, 3, FALSE)","v":""},{"$f":"VLOOKUP($B$68,VMWARE, 5, FALSE)","v":""},null,{"$f":"VLOOKUP($B$68, VMWARE, 6, FALSE)*C68","v":0}]
[]
[null,"VMware vCenter Server Standard"]
[null,"None",{"$f":"VLOOKUP($B$71,VMWARE2, 2, FALSE)","v":0},{"$f":"VLOOKUP($B$71,VMWARE2, 3, FALSE)","v":""},{"$f":"VLOOKUP($B$71,VMWARE2, 5, FALSE)","v":""},null,{"$f":"VLOOKUP($B$71, VMWARE2, 6, FALSE)*C71","v":0}]
[]
[null,"Essentials Plus Kit"]
[null,"None",{"$f":"IF(SRV_A<4,VLOOKUP($B$74,VMWARE1, 2, FALSE),0)","v":0},{"$f":"VLOOKUP($B$74,VMWARE1, 3, FALSE)","v":""},{"$f":"VLOOKUP($B$74,VMWARE1, 5, FALSE)","v":""},null,{"$f":"VLOOKUP($B$74, VMWARE1, 6, FALSE)*C74","v":0}]
[]
[null,"Controller RAID"]
[null,"PERC H730P Adapter RAID Controller, 2GB NV Cache",1,null,"[405-AACU]"]
[]
[null,"Dischi rigidi (numero massimo totale 16)"]
[null,"300GB 10K RPM SAS 12Gbps 2.5in Hot-plug Hard Drive",2,null,"[400-AJPK]"]
[]
[null,"300GB 10K RPM SAS 12Gbps 2.5in Hot-plug Hard Drive,CusKit",null,{"$f":"VLOOKUP($B$82, HDD_C,3, FALSE)","v":"TS1L1-HD300"},{"$f":"VLOOKUP($B$82, HDD_C,5, FALSE)","v":"400-AJOQ"},{"$f":"VLOOKUP($B$82, HDD_C,6, FALSE)*C82","v":0}]
[]
[null,"1.2TB 10K RPM SAS 12Gbps 2.5in Hot-plug Hard Drive,CusKit",null,{"$f":"VLOOKUP($B$84, HDD_C,3, FALSE)","v":"TS1L1-HD1200"},{"$f":"VLOOKUP($B$84, HDD_C,5, FALSE)","v":"400-AJPD"},{"$f":"VLOOKUP($B$84, HDD_C,6, FALSE)*C84","v":0}]
[]
[null,"1.8TB 10K RPM SAS 12Gbps 512e 2.5in Hot-plug Hard Drive,CusKit",null,"TS1L1-HD1800","[400-AJQP]",null,{"$f":"VLOOKUP($B$86, HDD_B,6, FALSE)*C86","v":0}]
[]
[null,"960GB Solid State Drive SAS Mix Use MLC 2.5in Hot-plug Drive, PX04SV, Cus Kit",null,"TS1L1-SSD800","[400-ANNX]",null,{"$f":"VLOOKUP($B$88, HDD_B,6, FALSE)*C88","v":0}]
[]
[null,"1.92TB Solid State Drive SAS Mix Use MLC 2.5in Hot-plug Drive, PX04SV, Cus Kit",null,"TS1L1-SSD1920","[400-ANMN]",null,{"$f":"VLOOKUP($B$90, HDD_B,6, FALSE)*C90","v":0}]
[]
[null,"DISCHI TOTALI",{"$f":"SUM(C80:C91)","v":2},{"$f":"IF(C92<=16,\"      OK\",\"     ERRORE:   Totale n° di dischi superiore al consentito\")","v":"      OK"}]
[]
[null,"Configurazione RAID"]
[null,"C3 - RAID 1 for H330 (2 HDDs)",1,null,{"$f":"VLOOKUP($B$95,  RAID_C1, 2, FALSE)","v":"[780-BBJK]"}]
[null,"Hot Spare for 300GB HDD","No"]
[null,"SCRIVERE QUI' LA CONFIGURAZIONE RAID RICHIESTA.\nT630 1\n",null,null,null,null,null,{"$f":"IF(B97=\"SCRIVERE QUI' LA CONFIGURAZIONE RAID RICHIESTA.\nT630 1\n\",\"ATTENZIONE COMPILARE IL CAMPO DELLA SCELTA RAID\", \"\")","v":"ATTENZIONE COMPILARE IL CAMPO DELLA SCELTA RAID"}]
[null,"Configurazione RAID HDD 1TB"]
[null,"",1,null,{"$f":"VLOOKUP($B$99,  RAID_C2, 2, FALSE)","v":""}]
[null,"Hot Spare for 1TB HDD","No"]
[]
[null,"Impostazioni del BIOS per la gestione dell'alimentazione"]
[null,"Performance BIOS Setting",1,null,"[384-BBBL]"]
[]
[null,"Raffreddamento"]
[null,"Fresh Air Cooling",1,null,"[384-BBDW]"]
[]
[null,"Alimentatore"]
[null,"Dual, Hot-plug, Redundant Power Supply (1+1), 750W, Titanium, 200-240VAC",1,null,"[450-ADWT]"]
[]
[null,"Cavi di alimentazione"]
[null,"C13 to C14, PDU Style, 10 AMP, 6.5 Feet (2m), Power Cord",2,null,"[450-AADY]"]
[]
[null,"TPM Module"]
[null,"PowerEdge Server FIPS TPM 2.0",1,null,"[461-AADM]"]
[]
[null,"Embedded Systems Management"]
[null,"iDrac8, Enterprise",1,null,"[385-BBHO]"]
[]
[null,"Modulo Doppia SD"]
[null,"None ",{"$f":"VLOOKUP($B$121,upsell_1, 2, FALSE)","v":0},{"$f":"VLOOKUP($B$121,upsell_1, 3, FALSE)","v":""},{"$f":"VLOOKUP($B$121,upsell_1, 4, FALSE)","v":""},{"$f":"VLOOKUP($B$121,upsell_1, 6, FALSE)","v":""},{"$f":"VLOOKUP($B$121,upsell_1, 7, FALSE)","v":0}]
[]
[null,"Adattatore di rete aggiuntivo"]
[null,"On-Board LOM 1GBE (Dual Port for Towers, Quad Port for Racks and Blades)",1,null,"[542-BBBP]"]
[]
[null,"Broadcom 5720 DP 1Gb Network Interface Card",1,null,"[540-BBCX]"]
[]
[null,"Additional Card for PCIe Slot 2 (CPU 1)"]
[null,"None",{"$f":"VLOOKUP($B$129,  PCI_C1, 2, FALSE)","v":""},{"$f":"VLOOKUP($B$129,  PCI_C1, 3, FALSE)","v":""},{"$f":"VLOOKUP($B$129,  PCI_C1, 5, FALSE)","v":""},{"$f":"VLOOKUP($B$129,  PCI_C2, 6, FALSE)","v":""},{"$f":"VLOOKUP($B$129,  PCI_C1, 7, FALSE)","v":0}]
[]
[null,"Additional Card for PCIe Slot 3 (CPU 1)"]
[null,"None",{"$f":"VLOOKUP($B$132,  PCI_C2, 2, FALSE)","v":""},{"$f":"VLOOKUP($B$132,  PCI_C2, 3, FALSE)","v":""},{"$f":"VLOOKUP($B$132,  PCI_C2, 5, FALSE)","v":""},{"$f":"VLOOKUP($B$132,  PCI_C2, 6, FALSE)","v":""},{"$f":"VLOOKUP($B$132,  PCI_C2, 7, FALSE)","v":0}]
[]
[null,"Additional Card for PCIe Slot 4 (CPU 2)"]
[null,"None",{"$f":"IF(B135=\"Aggiungere Secondo Processore\",\"\",(VLOOKUP(B135,PCI_C3, 2, FALSE)))","v":""},{"$f":"IF(B135=\"Aggiungere Secondo Processore\",\"\",(VLOOKUP(B135,  PCI_C3, 3, FALSE)))","v":""},{"$f":"VLOOKUP($B$135,  PCI_C3, 5, FALSE)","v":""},{"$f":"VLOOKUP($B$135,  PCI_C3, 6, FALSE)","v":""},{"$f":"VLOOKUP($B$135,  PCI_C3, 7, FALSE)","v":0}]
[]
[null,"Additional Card for PCIe Slot 5 (CPU 2)"]
[null,"None",{"$f":"IF(B138=\"Aggiungere Secondo Processore\",\"\",(VLOOKUP(B138,PCI_C4, 2, FALSE)))","v":""},{"$f":"IF(B138=\"Aggiungere Secondo Processore\",\"\",(VLOOKUP(B138,  PCI_C4, 3, FALSE)))","v":""},{"$f":"VLOOKUP($B$138,  PCI_C4, 5, FALSE)","v":""},{"$f":"VLOOKUP($B$138,  PCI_C4, 6, FALSE)","v":""},{"$f":"VLOOKUP($B$138,  PCI_C4, 7, FALSE)","v":0}]
[]
[null,"Additional Card for PCIe Slot 6 (CPU 2)"]
[null,"None",{"$f":"IF(B141=\"Aggiungere Secondo Processore\",\"\",(VLOOKUP(B141,PCI_C4, 2, FALSE)))","v":""},{"$f":"IF(B141=\"Aggiungere Secondo Processore\",\"\",(VLOOKUP(B141,  PCI_C4, 3, FALSE)))","v":""},{"$f":"VLOOKUP($B$141,  PCI_C5, 5, FALSE)","v":""},{"$f":"VLOOKUP($B$141,  PCI_C5, 6, FALSE)","v":""},{"$f":"VLOOKUP($B$141,  PCI_C5, 7, FALSE)","v":0}]
[]
[null,"Additional Card for PCIe Slot 7 (CPU 2)"]
[null,"None",{"$f":"IF(B144=\"Aggiungere Secondo Processore\",\"\",(VLOOKUP(B144,PCI_C4, 2, FALSE)))","v":""},{"$f":"IF(B144=\"Aggiungere Secondo Processore\",\"\",(VLOOKUP(B144,  PCI_C4, 3, FALSE)))","v":""},{"$f":"VLOOKUP($B$144,  PCI_C6, 5, FALSE)","v":""},{"$f":"VLOOKUP($B$144,  PCI_C6, 6, FALSE)","v":""},{"$f":"VLOOKUP($B$144,  PCI_C6, 7, FALSE)","v":0}]
[]
[null,"Pannello frontale"]
[null,"No Bezel",1,null,"[350-BBBW]"]
[]
[null,"Guide per rack"]
[null,"Ready Rails Sliding Rails",1,null,"[770-BBJI]"]
[]
[null,"Unità ottica interna"]
[null,"No Internal Optical Drive, 2.5in Chassis",1,null,"[429-AAIQ][429-AAQS]"]
[]
[null,"Accessori per server"]
[null,"Redundant Fan Option",1,null,"[750-AAFF]"]
[]
[null,"PowerEdge SFP+, 10GbE SR/SX, Optical Tranceiver, LC Connector, for Intel and Broadcom,CusKit",{"$f":"(VLOOKUP(B132,PCI_C2,8,FALSE))+((VLOOKUP(B129,PCI_C1,8,FALSE)))+((VLOOKUP(B135,PCI_C3,8,FALSE)))+((VLOOKUP(B138,PCI_C4,8,FALSE)))+((VLOOKUP(B141,PCI_C5,8,FALSE)))+((VLOOKUP(B144,PCI_C6,8,FALSE)))","v":{"$error":"#VALUE!"}},null,"[407-BBQE]"]
[]
[null,"System Documentation"]
[null,"Electronic System Documentation and OpenManage DVD Kit, PowerEdge T630",1,null,"[343-BBDE]"]
[]
[null,"SHIPPING"]
[null,"PowerEdge T630 Shipping EMEA1 (English/French/German/Spanish/Russian/Hebrew)",1,null,"[340-AMBT]"]
[]
[null,"Order Information"]
[null,"Enterprise Order - EMEA",1,null,"[800-11671]"]
[]
[null,"Base warranty"]
[null,"3Yr Basic Warranty - Next Business Day - Minimum Warranty",1,null,"[709-12798][709-12799]"]
[]
[null,"Servizi di assitenza"]
[null,"Dell Channel Order - Service Info only",1,null,"[710-31085]"]
[]
[null,"Aggiornamenti della garanzia"]
[null,"None",{"$f":"VLOOKUP($B$176,  SO_C1, 2, FALSE)","v":""},{"$f":"VLOOKUP($B$176,  SO_C1, 3, FALSE)","v":""},{"$f":"VLOOKUP($B$176,  SO_C1, 5, FALSE)","v":""},{"$f":"VLOOKUP($B$176,  SO_C1, 6, FALSE)","v":""}]
[]
[null,"Protezione dei dati - Keep Your Hard Drive "]
[null,"None",{"$f":"VLOOKUP($B$179,  SO_C2, 2, FALSE)","v":""},{"$f":"VLOOKUP($B$179,  SO_C2, 3, FALSE)","v":""},{"$f":"VLOOKUP($B$179,  SO_C2,5, FALSE)","v":""},{"$f":"VLOOKUP($B$179,  SO_C2, 6, FALSE)","v":""}]
[]
[null,"Servizi di Installazione"]
[null,"No Installation Service Selected",1,null,"[683-11870]"]
[]
[null,"Channel only - Support Extension"]
[null,"Channel 39M Basic Warranty - Next Business Day",1,null,"[723-28783]"]
[]
[null,"Warranty Upgrades - Non-Std/Local POS"]
[null,"CSTM CONSIP - 39M Onsite Labor Support for CRU for Servers with Basic Warranty",1,null,"[681-24467]"]

{"sheet":"Lotto1 R730 1","index":3,"n_rows":183,"n_cols":9,"rows_kept":183,"cut":false,"hidden":false,"merged":[[27,2,27,4],[4,0,4,4],[5,0,5,4],[10,0,11,5],[12,0,12,5],[18,2,18,4],[20,1,20,4],[21,2,21,4],[23,1,23,4],[24,2,24,4],[26,1,26,4],[87,1,87,4],[64,1,64,4],[73,1,73,4],[53,1,53,4],[29,1,29,4],[30,2,30,4],[33,1,33,4],[34,2,34,4],[36,1,36,4],[39,1,39,4],[40,2,40,4],[42,1,42,4],[43,2,43,4],[49,1,49,4],[50,2,50,4],[74,2,74,4],[76,1,76,4],[77,2,77,4],[83,1,83,4],[85,1,85,4],[54,2,54,4],[56,1,56,4],[57,2,57,4],[59,1,59,4],[61,1,61,4],[103,2,103,4],[105,1,105,4],[106,2,106,4],[95,1,95,3],[91,1,91,4],[92,2,92,4],[96,2,96,4],[99,1,99,4],[100,2,100,4],[102,1,102,4],[95,7,96,8],[133,2,133,4],[109,2,109,4],[111,1,111,4],[114,1,114,4],[115,2,115,4],[117,1,117,4],[118,2,118,4],[120,1,120,4],[127,2,127,4],[129,1,129,4],[130,2,130,4],[132,1,132,4],[121,2,121,4],[123,1,123,4],[108,1,108,4],[151,2,151,4],[135,1,135,4],[136,2,136,4],[138,1,138,4],[139,2,139,4],[141,1,141,4],[142,2,142,4],[144,1,144,4],[145,2,145,4],[147,1,147,4],[148,2,148,4],[150,1,150,4],[169,2,169,4],[153,1,153,4],[154,2,154,4],[156,1,156,4],[157,2,157,4],[159,1,159,4],[160,2,160,4],[180,1,180,4],[181,2,181,4],[183,1,183,4],[124,2,124,4],[126,1,126,4],[171,1,171,4],[172,2,172,4],[174,1,174,4],[175,2,175,4],[177,1,177,4],[178,2,178,4],[162,1,162,4],[163,2,163,4],[165,1,165,4],[166,2,166,4],[168,1,168,4]]}
["IN ROSSO LE OPZIONI 20%"]
[]
[]
[]
["Tecnologie Server 1 Lotto 1"]
[]
[null,null,null,null,null,null,null,"Totale Server e Opzioni",{"$f":"F17*SRV_B1.1","v":0}]
[null,null,null,null,null,null,null,"Totale Ulteriori Opzioni ",{"$f":"G16*SRV_B1.1-(G73*SRV_B1.1)+G73-(SRV_B1.1*G70)+G70","v":0}]
[]
[null,null,null,null,null,null,null,"TOTALE CONVENZIONE",{"$f":"I8+I7","v":0}]
["Components: \nServer DELL PowerEdge R730 (1CPU Intel® Xeon® E5-2680 v4, 64GB RDIMM, 2xHDD 300GB 10K RPM SAS 12Gbps 2.5in)"]
[]
[]
[]
["PowerEdge R730","Category: Server",null,null,null,{"$f":"2371","v":2371}]
[null,"Quantity: ",null,null,null,{"$f":"SUM(F20:F185)","v":0},{"$f":"SUM(G20:G185)","v":0}]
[null,null,null,null,null,{"$f":"SUM(F15:F16)","v":2371}]
[]
[null,"Base"]
[null,"PowerEdge R730xd for Intel v4 CPUs",1,null,"[210-ACXU][329-BCZK]"]
[]
[null,"Configurazione dello chassis"]
[null,"Chassis with up to 16, 2.5\" Hard Drives",1,null,"[350-BBIL]"]
[]
[null,"Processore"]
[null,"Intel Xeon E5-2680 v4 2.4GHz,35M Cache,9.60GT/s QPI,Turbo,HT,14C/28T (120W) Max Mem 2400MHz",1,null,"[338-BJDO]"]
[]
[null,"Processore aggiuntivo"]
[null,"No Additional Processor",{"$f":"VLOOKUP($B$29, CPU_B.1, 2, FALSE)","v":0},{"$f":"VLOOKUP($B$29, CPU_B.1, 3, FALSE)","v":""},{"$f":"VLOOKUP($B$29, CPU_B.1, 5, FALSE)","v":"[374-BBBX]"},{"$f":"VLOOKUP(B29, CPU_B.1, 12, FALSE)","v":0}]
[]
[null,"Processor Thermal Configuration"]
[null,"1 CPU Standard",1,null,"[370-ABWF][374-BBHM][750-AAEL]"]
[null,{"$f":"VLOOKUP($B$29, CPU_B, 6, FALSE)","v":""},{"$f":"VLOOKUP($B$29, CPU_B, 7, FALSE)","v":""},null,{"$f":"VLOOKUP($B$29, CPU_B, 8, FALSE)","v":""}]
[]
[null,"Tipo di configurazione memoria"]
[null,"Performance Optimized",1,null,"[370-AAIP]"]
[]
[null,"Memoria Totale in GB",null,{"$f":"IF(('Lotto1 R730 1'!$D$12=0),\"\",'Lotto1 R730 1'!#REF!)","v":""}]
[null,64]
[]
[null,"Tipo e velocità della memoria DIMM"]
[null,"2400MT/s RDIMMs",1,null,"[370-ACPH]"]
[]
[null,"Capacità di memoria"]
[null,"32GB RDIMM, 2400MT/s, Dual Rank, x4 Data Width",2,null,"[370-ACNS]"]
[]
[null,{"$f":"IF($B$29=\"No Additional Processor\",VLOOKUP($B$39, MEM_B1, 2, FALSE),VLOOKUP($B$39, MEM_B2, 2, FALSE))","v":""},{"$f":"IF($B$29=\"No Additional Processor\",VLOOKUP($B$39, MEM_B1, 3, FALSE),VLOOKUP($B$39, MEM_B2, 3, FALSE))","v":""},{"$f":"IF($B$29=\"No Additional Processor\",VLOOKUP($B$39, MEM_B1, 4, FALSE),VLOOKUP($B$39, MEM_B2, 4, FALSE))","v":""},{"$f":"IF($B$29=\"No Additional Processor\",VLOOKUP($B$39, MEM_B1, 6, FALSE),VLOOKUP($B$39, MEM_B2, 6, FALSE))","v":""},{"$f":"IF($B$29=\"No Additional Processor\",VLOOKUP($B$39, MEM_B1, 7, FALSE),VLOOKUP($B$39, MEM_B2, 7, FALSE))","v":""}]
[]
[null,{"$f":"IF($B$29=\"No Additional Processor\",VLOOKUP($B$39, MEM_B1, 11, FALSE),VLOOKUP($B$39, MEM_B2, 11, FALSE))","v":""},{"$f":"IF($B$29=\"No Additional Processor\",VLOOKUP($B$39, MEM_B1, 12, FALSE),VLOOKUP($B$39, MEM_B2, 12, FALSE))","v":""},{"$f":"IF($B$29=\"No Additional Processor\",VLOOKUP($B$39, MEM_B1, 13, FALSE),VLOOKUP($B$39, MEM_B2, 13, FALSE))","v":""},{"$f":"IF($B$29=\"No Additional Processor\",VLOOKUP($B$39, MEM_B1, 15, FALSE),VLOOKUP($B$39, MEM_B2, 15, FALSE))","v":""},{"$f":"IF($B$29=\"No Additional Processor\",VLOOKUP($B$39, MEM_B1, 16, FALSE),VLOOKUP($B$39, MEM_B2, 16, FALSE))","v":""}]
[]
[null,"Sistema operativo preinstallato"]
[null,"No Operating System",{"$f":"VLOOKUP($B$52, OS_B, 2, FALSE)","v":""},{"$f":"VLOOKUP($B$52, OS_B, 3, FALSE)","v":""},{"$f":"VLOOKUP($B$52, OS_B, 5, FALSE)","v":"[611-BBBF]"},{"$f":"VLOOKUP($B$52, OS_B, 6, FALSE)","v":""}]
[null,{"$f":"IF($B$29=\"No Additional Processor\",VLOOKUP($B$52, OS_B, 20, FALSE),VLOOKUP($B$52, OS_B2, 20, FALSE))","v":""},{"$f":"IF($B$29=\"No Additional Processor\",VLOOKUP($B$52, OS_B, 21, FALSE),VLOOKUP($B$52, OS_B2, 21, FALSE))","v":0},{"$f":"IF($B$29=\"No Additional Processor\",VLOOKUP($B$52, OS_A, 22, FALSE),VLOOKUP($B$52, OS_B2, 22, FALSE))","v":""},{"$f":"IF($B$29=\"No Additional Processor\",VLOOKUP($B$52, OS_B, 24, FALSE),VLOOKUP($B$52, OS_B2, 24, FALSE))","v":""},{"$f":"IF($B$29=\"No Additional Processor\",VLOOKUP($B$52, OS_B, 25, FALSE),VLOOKUP($B$52, OS_B2, 25, FALSE))","v":""}]
[]
[null,"OS Media Kits"]
[null,"No Media Required",1,null,"[605-BBFN]"]
[]
[null,"Client Access Licenses"]
[null,{"$f":"VLOOKUP($B$52, OS_B, 8, FALSE)","v":"None"},null,{"$f":"VLOOKUP($B$52, OS_A, 10, FALSE)","v":""},{"$f":"VLOOKUP($B$52, OS_A, 12, FALSE)","v":""},{"$f":"VLOOKUP($B$52, OS_A, 13, FALSE)*C59","v":0}]
[]
[null,{"$f":"VLOOKUP($B$52, OS_A, 14, FALSE)","v":"None"},null,{"$f":"VLOOKUP($B$52, OS_A, 16, FALSE)","v":""},{"$f":"VLOOKUP($B$52, OS_A, 18, FALSE)","v":""},{"$f":"VLOOKUP($B$52, OS_A, 19, FALSE)*C61","v":0}]
[]
[null,"Sistema operativo SUSE Linux Enterprise Server"]
[null,"None\n",{"$f":"VLOOKUP($B$64,SUSE, 2, FALSE)","v":0},{"$f":"VLOOKUP($B$64,SUSE, 3, FALSE)","v":""},{"$f":"VLOOKUP($B$64,SUSE, 5, FALSE)","v":""},null,{"$f":"VLOOKUP($B$64, SUSE, 6, FALSE)*C64","v":0}]
[]
[null,"Sistema operativo VMware"]
[null,"None",{"$f":"VLOOKUP($B$67,VMWARE, 2, FALSE)+C29","v":0},{"$f":"VLOOKUP($B$67,VMWARE, 3, FALSE)","v":""},{"$f":"VLOOKUP($B$67,VMWARE, 5, FALSE)","v":""},null,{"$f":"VLOOKUP($B$67, VMWARE, 6, FALSE)*C67","v":0}]
[]
[null,"VMware vCenter Server Standard"]
[null,"None",{"$f":"VLOOKUP($B$70,VMWARE2, 2, FALSE)","v":0},{"$f":"VLOOKUP($B$70,VMWARE2, 3, FALSE)","v":""},{"$f":"VLOOKUP($B$70,VMWARE2, 5, FALSE)","v":""},null,{"$f":"VLOOKUP($B$70, VMWARE2, 6, FALSE)*C70","v":0}]
[]
[null,"Essentials Plus Kit"]
[null,"None",{"$f":"IF(SRV_A<4,VLOOKUP($B$73,VMWARE1, 2, FALSE),0)","v":0},{"$f":"VLOOKUP($B$73,VMWARE1, 3, FALSE)","v":""},{"$f":"VLOOKUP($B$73,VMWARE1, 5, FALSE)","v":""},null,{"$f":"VLOOKUP($B$73, VMWARE1, 6, FALSE)*C73","v":0}]
[]
[null,"Controller"]
[null,"PERC H730P Integrated RAID Controller, 2GB Cache",{"$f":"VLOOKUP($B$76,PERC, 2, FALSE)","v":0},{"$f":"VLOOKUP($B$76,PERC, 3, FALSE)","v":""},{"$f":"VLOOKUP($B$76,PERC, 4, FALSE)","v":""},{"$f":"VLOOKUP($B$76,PERC, 6, FALSE)","v":""},{"$f":"VLOOKUP($B$76,PERC, 7, FALSE)","v":0}]
[]
[null,"Dischi rigidi (numero massimo totale 16)"]
[null,"300GB 10K RPM SAS 12Gbps 2.5in Hot-plug Hard Drive",2,null,"[400-AJPK]"]
[]
[null,"300GB 10K RPM SAS 12Gbps 2.5in Hot-plug Hard Drive,CusKit",null,{"$f":"VLOOKUP($B$81, HDD_A,3, FALSE)","v":"TS1L1-HD300"},{"$f":"VLOOKUP($B$81, HDD_A,5, FALSE)","v":"[400-AJOQ]"},{"$f":"VLOOKUP($B$81, HDD_B,6, FALSE)*C81","v":0}]
[]
[null,"1.2TB 10K RPM SAS 12Gbps 2.5in Hot-plug Hard Drive,CusKit",null,{"$f":"VLOOKUP($B$83, HDD_A,3, FALSE)","v":"TS1L1-HD1200"},{"$f":"VLOOKUP($B$83, HDD_A,5, FALSE)","v":"[400-AJPD]"},{"$f":"VLOOKUP($B$83, HDD_B,6, FALSE)*C83","v":0}]
[]
[null,"1.8TB 10K RPM SAS 12Gbps 512e 2.5in Hot-plug Hard Drive,CusKit",null,"TS1L1-HD1800","[400-AJQP]",{"$f":"VLOOKUP($B$85, HDD_B,6, FALSE)*C85","v":0}]
[]
[null,"960GB Solid State Drive SAS Mix Use MLC 2.5in Hot-plug Drive, PX04SV, Cus Kit",null,"TS1L1-SSD800","[400-ANNX]",{"$f":"VLOOKUP($B$87, HDD_B,6, FALSE)*C87","v":0}]
[]
[null,"1.92TB Solid State Drive SAS Mix Use MLC 2.5in Hot-plug Drive, PX04SV, Cus Kit",null,"TS1L1-SSD1920","[400-ANMN]",{"$f":"VLOOKUP($B$89, HDD_B,6, FALSE)*C89","v":0}]
[]
[null,"DISCHI TOTALI",{"$f":"SUM(C79:C90)","v":2},{"$f":"IF(C91<=16,\"      OK\",\"     ERRORE:   Totale n° di dischi superiore al consentito\")","v":"      OK"}]
[]
[null,"Configurazione RAID"]
[null,"C3 - RAID 1 for H330 (2 HDDs)",1,null,{"$f":"VLOOKUP($B$94,  RAID_B1, 2, FALSE)","v":"[780-BBJK]"}]
[null,"Hot Spare for 300GB HDD","No"]
[null,"SCRIVERE QUI' LA CONFIGURAZIONE RAID RICHIESTA.\nR730 1\n",null,null,null,null,null,{"$f":"IF(B96=\"SCRIVERE QUI' LA CONFIGURAZIONE RAID RICHIESTA.\nR730 1\n\",\"ATTENZIONE COMPILARE IL CAMPO DELLA SCELTA RAID\", \"\")","v":"ATTENZIONE COMPILARE IL CAMPO DELLA SCELTA RAID"}]
[null,"Configurazione RAID HDD 1TB"]
[null,"",1,null,{"$f":"VLOOKUP($B$98,  RAID_B2, 2, FALSE)","v":""}]
[null,"Hot Spare for 1TB HDD","No"]
[]
[null,"Impostazioni del BIOS per la gestione dell'alimentazione"]
[null,"Performance BIOS Setting",1,null,"[384-BBBL]"]
[]
[null,"Alimentatore"]
[null,"Dual, Hot-plug, Redundant Power Supply (1+1), 750W, Titanium, 200-240VAC",1,null,"[450-ADWT]"]
[]
[null,"Cavi di alimentazione"]
[null,"Rack Power Cord 2M (C13/C14 12A)",2,null,"[450-AADY]"]
[]
[null,"PCIe Riser"]
[null,"Risers with up to 4, x8 PCIe Slots + 2, x16 PCIe Slots",1,null,"[330-BBCO][330-BBCQ]"]
[]
[null,"TPM Module"]
[null,"PowerEdge Server FIPS TPM 2.0",1,null,"[461-AADM]"]
[]
[null,"Embedded Systems Management"]
[null,"iDRAC8 Enterprise, integrated Dell Remote Access Controller, Enterprise",1,null,"[385-BBHO]"]
[]
[null,"Adattatore di rete"]
[null,"Broadcom 5720 QP 1Gb Network Daughter Card",1,null,"[540-BBBW]"]
[]
[null,"Modulo Doppia SD"]
[null,"None ",{"$f":"VLOOKUP($B$123,upsell_1, 2, FALSE)","v":0},{"$f":"VLOOKUP($B$123,upsell_1, 3, FALSE)","v":""},{"$f":"VLOOKUP($B$123,upsell_1, 4, FALSE)","v":""},{"$f":"VLOOKUP($B$123,upsell_1, 6, FALSE)","v":""},{"$f":"VLOOKUP($B$123,upsell_1, 7, FALSE)","v":0}]
[]
[null,"Additional Card for PCIe Slot 7 (Full height) (CPU 1)"]
[null,"Broadcom 5720 DP 1Gb Network Interface Card",null,{"$f":"\"\"","v":""},"540-BBCX"]
[]
[null,"Additional Card for PCIe Slot 6 (Full height) (CPU 1)"]
[null,"None",{"$f":"VLOOKUP($B$129,  PCI_B1.1, 2, FALSE)","v":""},{"$f":"VLOOKUP($B$129,  PCI_B1.1, 3, FALSE)","v":""},{"$f":"VLOOKUP($B$129,  PCI_B1.1, 5, FALSE)","v":""},{"$f":"VLOOKUP($B$129,  PCI_B1.1, 6, FALSE)","v":""},{"$f":"VLOOKUP($B$129,  PCI_B1.1, 7, FALSE)","v":0}]
[]
[null,"Additional Card for PCIe Slot 5 (Full height) (CPU 1)"]
[null,"None",{"$f":"VLOOKUP($B$132,  PCI_B2, 2, FALSE)","v":""},{"$f":"VLOOKUP($B$132,  PCI_B2, 3, FALSE)","v":""},{"$f":"VLOOKUP($B$132,  PCI_B2, 5, FALSE)","v":""},{"$f":"VLOOKUP($B$132,  PCI_B2, 6, FALSE)","v":""},{"$f":"VLOOKUP($B$132,  PCI_B2, 7, FALSE)","v":0}]
[]
[null,"Additional Card for PCIe Slot 4 (Full height) (CPU 2)"]
[null,"Aggiungere Secondo Processore",{"$f":"IF(B135=\"Aggiungere Secondo Processore\",\"\",(VLOOKUP(B135,PCI_B3, 2, FALSE)))","v":""},{"$f":"IF(B135=\"Aggiungere Secondo Processore\",\"\",(VLOOKUP(B135,  PCI_B3, 3, FALSE)))","v":""},{"$f":"IF(B135=\"Aggiungere Secondo Processore\",\"\",VLOOKUP($B$135,PCI_B3,5,FALSE))","v":""},{"$f":"IF(B135=\"Aggiungere Secondo Processore\",0,VLOOKUP($B$135,PCI_B3,6,FALSE))","v":0},{"$f":"IF(B135=\"Aggiungere Secondo Processore\",0,VLOOKUP($B$135,PCI_B3,7,FALSE))","v":0}]
[]
[null,"Additional Card for PCIe Slot 3 (Low Profile) (CPU 2)"]
[null,"Aggiungere Secondo Processore",{"$f":"IF(B138=\"Aggiungere Secondo Processore\",\"\",(VLOOKUP(B138,PCI_B4, 2, FALSE)))","v":""},{"$f":"IF(B138=\"Aggiungere Secondo Processore\",\"\",(VLOOKUP(B138,  PCI_B4, 3, FALSE)))","v":""},{"$f":"IF(B138=\"Aggiungere Secondo Processore\",\"\",VLOOKUP($B$138,PCI_B4,5,FALSE))","v":""},{"$f":"IF(B138=\"Aggiungere Secondo Processore\",0,VLOOKUP($B$138,PCI_B4,6,FALSE))","v":0},{"$f":"IF(B138=\"Aggiungere Secondo Processore\",0,VLOOKUP($B$138,PCI_B4,7,FALSE))","v":0}]
[]
[null,"Additional Card for PCIe Slot 2 (Low Profile) (CPU 2)"]
[null,"Aggiungere Secondo Processore",{"$f":"IF(B141=\"Aggiungere Secondo Processore\",\"\",(VLOOKUP(B141,PCI_B5, 2, FALSE)))","v":""},{"$f":"IF(B141=\"Aggiungere Secondo Processore\",\"\",(VLOOKUP(B141,  PCI_B5, 3, FALSE)))","v":""},{"$f":"IF(B141=\"Aggiungere Secondo Processore\",\"\",VLOOKUP($B$141,PCI_B5,5,FALSE))","v":""},{"$f":"IF(B141=\"Aggiungere Secondo Processore\",0,VLOOKUP($B$141,PCI_B5,6,FALSE))","v":0},{"$f":"IF(B141=\"Aggiungere Secondo Processore\",0,VLOOKUP($B$141,PCI_B5,7,FALSE))","v":0}]
[]
[null,"Additional Card for PCIe Slot 1 (Low Profile) (CPU 2)"]
[null,"Aggiungere Secondo Processore",{"$f":"IF(B144=\"Aggiungere Secondo Processore\",\"\",(VLOOKUP(B144,PCI_B6, 2, FALSE)))","v":""},{"$f":"IF(B144=\"Aggiungere Secondo Processore\",\"\",(VLOOKUP(B144,  PCI_B6, 3, FALSE)))","v":""},{"$f":"IF(B144=\"Aggiungere Secondo Processore\",\"\",VLOOKUP($B$144,PCI_B5,5,FALSE))","v":""},{"$f":"IF(B144=\"Aggiungere Secondo Processore\",0,VLOOKUP($B$144,PCI_B5,6,FALSE))","v":0},{"$f":"IF(B144=\"Aggiungere Secondo Processore\",0,VLOOKUP($B$144,PCI_B5,7,FALSE))","v":0}]
[]
[null,"Pannello frontale"]
[null,"No Bezel Option",1,null,"350-BBBW"]
[]
[null,"Guide per rack"]
[null,"ReadyRails™ Sliding Rails Without Cable Management Arm",1,null,"[770-BBBQ]"]
[]
[null,"Server Accessories"]
[null,"PowerEdge SFP+, 10GbE SR/SX, Optical Tranceiver, LC Connector, for Intel and Broadcom,CusKit",{"$f":"(VLOOKUP(B144,PCI_A2,8,FALSE))+((VLOOKUP(B129,PCI_B1.1,8,FALSE)))","v":{"$error":"#N/A"}},null,"[407-BBQE]"]
[]
[null,"System Documentation"]
[null,"Electronic System Documentation and OpenManage DVD Kit",1,null,"[631-AAJG]"]
[]
[null,"SHIPPING"]
[null,"PowerEdge R730 Shipping EMEA1 (English/French/German/Spanish/Russian/Hebrew)",1,null,"340-ALXX"]
[]
[null,"Order Information"]
[null,"PowerEdge Order - EMEA",1,null,"[800-11671]"]
[]
[null,"Base warranty"]
[null,"3Yr Basic Warranty - Next Business Day - Minimum Warranty",1,null,"[709-12777][709-12778]"]
[]
[null,"Servizi di assitenza"]
[null,"Dell Channel Order - Service Info only",1,null,"[710-31085]"]
[]
[null,"Aggiornamenti della garanzia"]
[null,"None",{"$f":"VLOOKUP($B$171,  SO_B1,2, FALSE)","v":""},{"$f":"VLOOKUP($B$171,  SO_B1, 3, FALSE)","v":""},{"$f":"VLOOKUP($B$171,  SO_B1, 5, FALSE)","v":""},{"$f":"VLOOKUP($B$171,  SO_B1, 6, FALSE)","v":""}]
[]
[null,"Protezione dei dati - Keep Your Hard Drive "]
[null,"None",{"$f":"VLOOKUP($B$174,  SO_B2, 2, FALSE)","v":""},{"$f":"VLOOKUP($B$174,  SO_B2, 3, FALSE)","v":""},{"$f":"VLOOKUP($B$174,  SO_B2,5, FALSE)","v":""},{"$f":"VLOOKUP($B$174,  SO_B2, 6, FALSE)","v":""}]
[]
[null,"Servizi di Installazione"]
[null,"No Installation Service Selected",1,null,"[683-11870]"]
[]
[null,"Channel only - Support Extension"]
[null,"Channel 39M Basic Warranty - Next Business Day",1,null,"[723-38675]"]
[]
[null,"Warranty Upgrades - Non-Std/Local POS"]
[null,"CSTM CONSIP - 39M Onsite Labor Support for CRU for Servers with Basic Warranty",1,null,"[681-24467]"]

{"sheet":"Lotto1 R730xd 1","index":4,"n_rows":181,"n_cols":9,"rows_kept":181,"cut":false,"hidden":false,"merged":[[96,7,97,8],[18,2,18,4],[4,0,4,4],[5,0,5,4],[10,0,11,5],[12,0,12,5],[39,1,39,4],[20,1,20,4],[21,2,21,4],[23,1,23,4],[24,2,24,4],[26,1,26,4],[27,2,27,4],[29,1,29,4],[30,2,30,4],[33,1,33,4],[34,2,34,4],[36,1,36,4],[75,2,75,4],[40,2,40,4],[42,1,42,4],[43,2,43,4],[49,1,49,4],[50,2,50,4],[53,1,53,4],[54,2,54,4],[57,1,57,4],[58,2,58,4],[60,1,60,4],[62,1,62,4],[65,1,65,4],[74,1,74,4],[107,2,107,4],[77,1,77,4],[78,2,78,4],[84,1,84,4],[93,2,93,4],[97,2,97,4],[100,1,100,4],[101,2,101,4],[103,1,103,4],[104,2,104,4],[106,1,106,4],[86,1,86,4],[88,1,88,4],[92,1,92,4],[96,1,96,3],[143,2,143,4],[109,1,109,4],[110,2,110,4],[112,1,112,4],[116,2,116,4],[118,1,118,4],[119,2,119,4],[121,1,121,4],[125,2,125,4],[127,1,127,4],[140,2,140,4],[142,1,142,4],[115,1,115,4],[122,2,122,4],[124,1,124,4],[158,2,158,4],[145,1,145,4],[146,2,146,4],[148,1,148,4],[149,2,149,4],[151,1,151,4],[152,2,152,4],[154,1,154,4],[155,2,155,4],[157,1,157,4],[172,1,172,4],[160,1,160,4],[161,2,161,4],[163,1,163,4],[164,2,164,4],[166,1,166,4],[167,2,167,4],[181,1,181,4],[128,2,128,4],[130,1,130,4],[131,2,131,4],[133,1,133,4],[134,2,134,4],[136,1,136,4],[137,2,137,4],[139,1,139,4],[173,2,173,4],[175,1,175,4],[176,2,176,4],[178,1,178,4],[179,2,179,4],[169,1,169,4],[170,2,170,4]]}
["IN ROSSO LE OPZIONI 20%"]
[]
[]
[]
["Tecnologie Server 1 Lotto 1"]
[]
[null,null,null,null,null,null,null,"Totale Server e Opzioni",{"$f":"F17*SRV_B","v":0}]
[null,null,null,null,null,null,null,"Totale Ulteriori Opzioni ",{"$f":"G16*SRV_B-(G74*SRV_B)+G74-(SRV_B*G71)+G71","v":0}]
[]
[null,null,null,null,null,null,null,"TOTALE CONVENZIONE",{"$f":"I8+I7","v":0}]
["Components: \nServer DELL PowerEdge R730xd (1CPU Intel® Xeon® E5-2680 v4, 64GB RDIMM, 2xHDD 300GB 10K RPM SAS 12Gbps 2.5in)"]
[]
[]
[]
["PowerEdge R730xd","Category: Server",null,null,null,{"$f":"2371","v":2371}]
[null,"Quantity: ",null,null,null,{"$f":"SUM(F20:F191)","v":0},{"$f":"SUM(G20:G191)","v":0}]
[null,null,null,null,null,{"$f":"SUM(F15:F16)","v":2371}]
[]
[null,"Base"]
[null,"PowerEdge R730xd for Intel v4 CPUs",1,null,"[210-ADBC][329-BCZK]"]
[]
[null,"Configurazione dello chassis"]
[null,"Chassis with up to 24, 2.5\" Hard Drives",1,null,"[350-BBFD]"]
[]
[null,"Processore"]
[null,"Intel Xeon E5-2680 v4 2.4GHz,35M Cache,9.60GT/s QPI,Turbo,HT,14C/28T (120W) Max Mem 2400MHz",1,null,"[338-BJDO]"]
[]
[null,"Processore aggiuntivo"]
[null,"No Additional Processor",{"$f":"VLOOKUP($B$29, CPU_B, 2, FALSE)","v":0},{"$f":"VLOOKUP($B$29, CPU_B, 3, FALSE)","v":""},{"$f":"VLOOKUP($B$29, CPU_B, 5, FALSE)","v":"[374-BBBX]"},{"$f":"VLOOKUP(B29, CPU_B, 12, FALSE)","v":0}]
[]
[null,"Processor Thermal Configuration"]
[null,"1 CPU Standard",1,null,"[370-ABWF][374-BBHM][750-AAEL]"]
[null,{"$f":"VLOOKUP($B$29, CPU_B, 6, FALSE)","v":""},{"$f":"VLOOKUP($B$29, CPU_B, 7, FALSE)","v":""},null,{"$f":"VLOOKUP($B$29, CPU_B, 8, FALSE)","v":""}]
[]
[null,"Tipo di configurazione memoria"]
[null,"Performance Optimized",1,null,"[370-AAIP]"]
[]
[null,"Memoria Totale in GB",null,{"$f":"IF(('Lotto1 R730xd 1'!$D$12=0),\"\",'Lotto1 R730xd 1'!#REF!)","v":""}]
[null,64]
[]
[null,"Tipo e velocità della memoria DIMM"]
[null,"2400MT/s RDIMMs",1,null,"[370-ACPH]"]
[]
[null,"Capacità di memoria"]
[null,"32GB RDIMM, 2400MT/s, Dual Rank, x4 Data Width",2,null,"[370-ACNS]"]
[]
[null,{"$f":"IF($B$29=\"No Additional Processor\",VLOOKUP($B$39, MEM_B1, 2, FALSE),VLOOKUP($B$39, MEM_B2, 2, FALSE))","v":""},{"$f":"IF($B$29=\"No Additional Processor\",VLOOKUP($B$39, MEM_B1, 3, FALSE),VLOOKUP($B$39, MEM_B2, 3, FALSE))","v":""},{"$f":"IF($B$29=\"No Additional Processor\",VLOOKUP($B$39, MEM_B1, 4, FALSE),VLOOKUP($B$39, MEM_B2, 4, FALSE))","v":""},{"$f":"IF($B$29=\"No Additional Processor\",VLOOKUP($B$39, MEM_B1, 6, FALSE),VLOOKUP($B$39, MEM_B2, 6, FALSE))","v":""},{"$f":"IF($B$29=\"No Additional Processor\",VLOOKUP($B$39, MEM_B1, 7, FALSE),VLOOKUP($B$39, MEM_B2, 7, FALSE))","v":""}]
[]
[null,{"$f":"IF($B$29=\"No Additional Processor\",VLOOKUP($B$39, MEM_B1, 11, FALSE),VLOOKUP($B$39, MEM_B2, 11, FALSE))","v":""},{"$f":"IF($B$29=\"No Additional Processor\",VLOOKUP($B$39, MEM_B1, 12, FALSE),VLOOKUP($B$39, MEM_B2, 12, FALSE))","v":""},{"$f":"IF($B$29=\"No Additional Processor\",VLOOKUP($B$39, MEM_B1, 13, FALSE),VLOOKUP($B$39, MEM_B2, 13, FALSE))","v":""},{"$f":"IF($B$29=\"No Additional Processor\",VLOOKUP($B$39, MEM_B1, 15, FALSE),VLOOKUP($B$39, MEM_B2, 15, FALSE))","v":""},{"$f":"IF($B$29=\"No Additional Processor\",VLOOKUP($B$39, MEM_B1, 16, FALSE),VLOOKUP($B$39, MEM_B2, 16, FALSE))","v":""}]
[]
[null,"Sistema operativo preinstallato"]
[null,"No Operating System",{"$f":"VLOOKUP($B$52, OS_B, 2, FALSE)","v":""},{"$f":"VLOOKUP($B$52, OS_B, 3, FALSE)","v":""},{"$f":"VLOOKUP($B$52, OS_B, 5, FALSE)","v":"[611-BBBF]"},{"$f":"VLOOKUP($B$52, OS_B, 6, FALSE)","v":""}]
[null,{"$f":"IF($B$29=\"No Additional Processor\",VLOOKUP($B$52, OS_B, 20, FALSE),VLOOKUP($B$52, OS_B2, 20, FALSE))","v":""},{"$f":"IF($B$29=\"No Additional Processor\",VLOOKUP($B$52, OS_B, 21, FALSE),VLOOKUP($B$52, OS_B2, 21, FALSE))","v":0},{"$f":"IF($B$29=\"No Additional Processor\",VLOOKUP($B$52, OS_A, 22, FALSE),VLOOKUP($B$52, OS_B2, 22, FALSE))","v":""},{"$f":"IF($B$29=\"No Additional Processor\",VLOOKUP($B$52, OS_B, 24, FALSE),VLOOKUP($B$52, OS_B2, 24, FALSE))","v":""},{"$f":"IF($B$29=\"No Additional Processor\",VLOOKUP($B$52, OS_B, 25, FALSE),VLOOKUP($B$52, OS_B2, 25, FALSE))","v":""}]
[]
[null,"OS Media Kits"]
[null,"No Media Required",1,null,"[605-BBFN]"]
[]
[]
[null,"Client Access Licenses"]
[null,{"$f":"VLOOKUP($B$52, OS_B, 8, FALSE)","v":"None"},null,{"$f":"VLOOKUP($B$52, OS_A, 10, FALSE)","v":""},{"$f":"VLOOKUP($B$52, OS_A, 12, FALSE)","v":""},{"$f":"VLOOKUP($B$52, OS_A, 13, FALSE)*C60","v":0}]
[]
[null,{"$f":"VLOOKUP($B$52, OS_A, 14, FALSE)","v":"None"},null,{"$f":"VLOOKUP($B$52, OS_A, 16, FALSE)","v":""},{"$f":"VLOOKUP($B$52, OS_A, 18, FALSE)","v":""},{"$f":"VLOOKUP($B$52, OS_A, 19, FALSE)*C62","v":0}]
[]
[null,"Sistema operativo SUSE Linux Enterprise Server"]
[null,"None\n",{"$f":"VLOOKUP($B$65,SUSE, 2, FALSE)","v":0},{"$f":"VLOOKUP($B$65,SUSE, 3, FALSE)","v":""},{"$f":"VLOOKUP($B$65,SUSE, 5, FALSE)","v":""},null,{"$f":"VLOOKUP($B$65, SUSE, 6, FALSE)*C65","v":0}]
[]
[null,"Sistema operativo VMware"]
[null,"None",{"$f":"VLOOKUP($B$68,VMWARE, 2, FALSE)+C29","v":0},{"$f":"VLOOKUP($B$68,VMWARE, 3, FALSE)","v":""},{"$f":"VLOOKUP($B$68,VMWARE, 5, FALSE)","v":""},null,{"$f":"VLOOKUP($B$68, VMWARE, 6, FALSE)*C68","v":0}]
[]
[null,"VMware vCenter Server Standard"]
[null,"None",{"$f":"VLOOKUP($B$71,VMWARE2, 2, FALSE)","v":0},{"$f":"VLOOKUP($B$71,VMWARE2, 3, FALSE)","v":""},{"$f":"VLOOKUP($B$71,VMWARE2, 5, FALSE)","v":""},null,{"$f":"VLOOKUP($B$71, VMWARE2, 6, FALSE)*C71","v":0}]
[]
[null,"Essentials Plus Kit"]
[null,"None",{"$f":"IF(SRV_A<4,VLOOKUP($B$74,VMWARE1, 2, FALSE),0)","v":0},{"$f":"VLOOKUP($B$74,VMWARE1, 3, FALSE)","v":""},{"$f":"VLOOKUP($B$74,VMWARE1, 5, FALSE)","v":""},null,{"$f":"VLOOKUP($B$74, VMWARE1, 6, FALSE)*C74","v":0}]
[]
[null,"Controller RAID"]
[null,"PERC H730P Integrated RAID Controller, 2GB Cache",{"$f":"VLOOKUP($B$77,PERC, 2, FALSE)","v":0},{"$f":"VLOOKUP($B$77,PERC, 3, FALSE)","v":""},{"$f":"VLOOKUP($B$77,PERC, 4, FALSE)","v":""},{"$f":"VLOOKUP($B$77,PERC, 6, FALSE)","v":""},{"$f":"VLOOKUP($B$77,PERC, 7, FALSE)","v":0}]
[]
[null,"Dischi rigidi  (numero massimo totale 24)"]
[null,"300GB 10K RPM SAS 12Gbps 2.5in Hot-plug Hard Drive",2,null,"[400-AJPK]"]
[]
[null,"300GB 10K RPM SAS 12Gbps 2.5in Hot-plug Hard Drive,CusKit",null,{"$f":"VLOOKUP($B$82, HDD_A,3, FALSE)","v":"TS1L1-HD300"},{"$f":"VLOOKUP($B$82, HDD_A,5, FALSE)","v":"[400-AJOQ]"},{"$f":"VLOOKUP($B$82, HDD_B,6, FALSE)*C82","v":0}]
[]
[null,"1.2TB 10K RPM SAS 12Gbps 2.5in Hot-plug Hard Drive,CusKit",null,{"$f":"VLOOKUP($B$84, HDD_A,3, FALSE)","v":"TS1L1-HD1200"},{"$f":"VLOOKUP($B$84, HDD_A,5, FALSE)","v":"[400-AJPD]"},{"$f":"VLOOKUP($B$84, HDD_B,6, FALSE)*C84","v":0}]
[]
[null,"1.8TB 10K RPM SAS 12Gbps 512e 2.5in Hot-plug Hard Drive,CusKit",null,"TS1L1-HD1800","[400-AJQP]",{"$f":"VLOOKUP($B$86, HDD_B,6, FALSE)*C86","v":0}]
[]
[null,"960GB Solid State Drive SAS Mix Use MLC 2.5in Hot-plug Drive, PX04SV, Cus Kit",null,"TS1L1-SSD800","[400-ANNX]",{"$f":"VLOOKUP($B$88, HDD_B,6, FALSE)*C88","v":0}]
[]
[null,"1.92TB Solid State Drive SAS Mix Use MLC 2.5in Hot-plug Drive, PX04SV, Cus Kit",null,"TS1L1-SSD1920","[400-ANMN]",{"$f":"VLOOKUP($B$90, HDD_B,6, FALSE)*C90","v":0}]
[]
[null,"DISCHI TOTALI",{"$f":"SUM(C80:C91)","v":2},{"$f":"IF(C92<=24,\"      OK\",\"     ERRORE:   Totale n° di dischi superiore al consentito\")","v":"      OK"}]
[]
[null,"Configurazione RAID"]
[null,"C3 - RAID 1 for H330 (2 HDDs)",1,null,{"$f":"VLOOKUP($B$95,  RAID_B1, 2, FALSE)","v":"[780-BBJK]"}]
[null,"Hot Spare for 300GB HDD","No"]
[null,"SCRIVERE QUI' LA CONFIGURAZIONE RAID RICHIESTA.\nR730XD 1\n",null,null,null,null,null,{"$f":"IF(B97=\"SCRIVERE QUI' LA CONFIGURAZIONE RAID RICHIESTA.\nR730XD 1\n\",\"ATTENZIONE COMPILARE IL CAMPO DELLA SCELTA RAID\", \"\")","v":"ATTENZIONE COMPILARE IL CAMPO DELLA SCELTA RAID"}]
[null,"Configurazione RAID HDD 1TB"]
[null,"",1,null,{"$f":"VLOOKUP($B$99,  RAID_B2, 2, FALSE)","v":""}]
[null,"Hot Spare for 1TB HDD","No"]
[]
[null,"Impostazioni del BIOS per la gestione dell'alimentazione"]
[null,"Performance BIOS Setting",1,null,"[384-BBBL]"]
[]
[null,"Alimentatore"]
[null,"Dual, Hot-plug, Redundant Power Supply (1+1), 750W, Titanium, 200-240VAC",1,null,"[450-ADWT]"]
[]
[null,"Cavi di alimentazione"]
[null,"Rack Power Cord 2M (C13/C14 12A)",2,null,"[450-AADY]"]
[]
[null,"PCIe Riser"]
[null,"Risers with up to 4, x8 PCIe Slots + 2, x16 PCIe Slots",1,null,"[330-BBCO][330-BBCR]"]
[]
[null,"TPM Module"]
[null,"PowerEdge Server FIPS TPM 2.0",1,null,"[461-AADM]"]
[]
[null,"Embedded Systems Management"]
[null,"iDRAC8 Enterprise, integrated Dell Remote Access Controller, Enterprise",1,null,"[385-BBHO]"]
[]
[null,"Adattatore di rete"]
[null,"Broadcom 5720 QP 1Gb Network Daughter Card",1,null,"[540-BBBW]"]
[]
[null,"Modulo Doppia SD"]
[null,"None ",{"$f":"VLOOKUP($B$124,upsell_1, 2, FALSE)","v":0},{"$f":"VLOOKUP($B$124,upsell_1, 3, FALSE)","v":""},{"$f":"VLOOKUP($B$124,upsell_1, 4, FALSE)","v":""},{"$f":"VLOOKUP($B$124,upsell_1, 6, FALSE)","v":""},{"$f":"VLOOKUP($B$124,upsell_1, 7, FALSE)","v":0}]
[]
[null,"Additional Card for PCIe Slot 6 (Full height) (CPU 1)"]
[null,"Broadcom 5719 QP 1Gb Network Interface Card",{"$f":"VLOOKUP($B$127,  PCI_B1, 2, FALSE)","v":""},{"$f":"VLOOKUP($B$127,  PCI_B1, 3, FALSE)","v":""},{"$f":"VLOOKUP($B$127,  PCI_B1, 5, FALSE)","v":"540-BBCW"},{"$f":"VLOOKUP($B$127,  PCI_B1, 6, FALSE)","v":""},{"$f":"VLOOKUP($B$127,  PCI_B1, 7, FALSE)","v":0}]
[]
[null,"Additional Card for PCIe Slot 5 (Full height) (CPU 1)"]
[null,"None",{"$f":"VLOOKUP($B$130,  PCI_B2, 2, FALSE)","v":""},{"$f":"VLOOKUP($B$130,  PCI_B2, 3, FALSE)","v":""},{"$f":"VLOOKUP($B$130,  PCI_B2, 5, FALSE)","v":""},{"$f":"VLOOKUP($B$130,  PCI_B2, 6, FALSE)","v":""},{"$f":"VLOOKUP($B$130,  PCI_B2, 7, FALSE)","v":0}]
[]
[null,"Additional Card for PCIe Slot 4 (Full height) (CPU 2)"]
[null,"None",{"$f":"IF(B133=\"Aggiungere Secondo Processore\",\"\",(VLOOKUP(B133,PCI_B3, 2, FALSE)))","v":""},{"$f":"IF(B133=\"Aggiungere Secondo Processore\",\"\",(VLOOKUP(B133,  PCI_B3, 3, FALSE)))","v":""},{"$f":"IF(B133=\"Aggiungere Secondo Processore\",\"\",VLOOKUP($B$133,PCI_B3,5,FALSE))","v":""},{"$f":"IF(B133=\"Aggiungere Secondo Processore\",0,VLOOKUP($B$133,PCI_B3,6,FALSE))","v":""},{"$f":"IF(B133=\"Aggiungere Secondo Processore\",0,VLOOKUP($B$133,PCI_B3,7,FALSE))","v":0}]
[]
[null,"Additional Card for PCIe Slot 3 (Low Profile) (CPU 2)"]
[null,"None",{"$f":"IF(B136=\"Aggiungere Secondo Processore\",\"\",(VLOOKUP(B136,PCI_B4, 2, FALSE)))","v":""},{"$f":"IF(B136=\"Aggiungere Secondo Processore\",\"\",(VLOOKUP(B136,  PCI_B4, 3, FALSE)))","v":""},{"$f":"IF(B136=\"Aggiungere Secondo Processore\",\"\",VLOOKUP($B$136,PCI_B4,5,FALSE))","v":""},{"$f":"IF(B136=\"Aggiungere Secondo Processore\",0,VLOOKUP($B$136,PCI_B4,6,FALSE))","v":""},{"$f":"IF(B136=\"Aggiungere Secondo Processore\",0,VLOOKUP($B$136,PCI_B4,7,FALSE))","v":0}]
[]
[null,"Additional Card for PCIe Slot 2 (Low Profile) (CPU 2)"]
[null,"None",{"$f":"IF(B139=\"Aggiungere Secondo Processore\",\"\",(VLOOKUP(B139,PCI_B5, 2, FALSE)))","v":""},{"$f":"IF(B139=\"Aggiungere Secondo Processore\",\"\",(VLOOKUP(B139,  PCI_B5, 3, FALSE)))","v":""},{"$f":"IF(B139=\"Aggiungere Secondo Processore\",\"\",VLOOKUP($B$139,PCI_B5,5,FALSE))","v":""},{"$f":"IF(B139=\"Aggiungere Secondo Processore\",0,VLOOKUP($B$139,PCI_B5,6,FALSE))","v":""},{"$f":"IF(B139=\"Aggiungere Secondo Processore\",0,VLOOKUP($B$139,PCI_B5,7,FALSE))","v":0}]
[]
[null,"Additional Card for PCIe Slot 1 (Low Profile) (CPU 2)"]
[null,"None",{"$f":"IF(B142=\"Aggiungere Secondo Processore\",\"\",(VLOOKUP(B142,PCI_B6, 2, FALSE)))","v":""},{"$f":"IF(B142=\"Aggiungere Secondo Processore\",\"\",(VLOOKUP(B142,  PCI_B6, 3, FALSE)))","v":""},{"$f":"IF(B142=\"Aggiungere Secondo Processore\",\"\",VLOOKUP($B$142,PCI_B5,5,FALSE))","v":""},{"$f":"IF(B142=\"Aggiungere Secondo Processore\",0,VLOOKUP($B$142,PCI_B5,6,FALSE))","v":""},{"$f":"IF(B142=\"Aggiungere Secondo Processore\",0,VLOOKUP($B$142,PCI_B5,7,FALSE))","v":0}]
[]
[null,"Pannello frontale"]
[null,"No Bezel Option",1,null,"350-BBBW"]
[]
[null,"Guide per rack"]
[null,"ReadyRails™ Sliding Rails Without Cable Management Arm",1,null,"[770-BBBQ]"]
[]
[null,"Server Accessories"]
[null,"PowerEdge SFP+, 10GbE SR/SX, Optical Tranceiver, LC Connector, for Intel and Broadcom,CusKit",{"$f":"(VLOOKUP(B142,PCI_A2,8,FALSE))+((VLOOKUP(B127,PCI_A1,8,FALSE)))","v":{"$error":"#VALUE!"}},null,"[407-BBQE]"]
[]
[null,"System Documentation"]
[null,"Electronic System Documentation and OpenManage DVD Kit",1,null,"[631-AAJG]"]
[]
[null,"SHIPPING"]
[null,"PowerEdge R730xd Shipping EMEA1 (English/French/German/Spanish/Russian/Hebrew)",1,null,"[340-AMGS]"]
[]
[null,"Order Information"]
[null,"PowerEdge Order - EMEA",1,null,"[800-11671]"]
[]
[null,"Base warranty"]
[null,"3Yr Basic Warranty - Next Business Day - Minimum Warranty",1,null,"[709-12780][709-12781]"]
[]
[null,"Servizi di assitenza"]
[null,"Dell Channel Order - Service Info only",1,null,"[710-31085]"]
[]
[null,"Aggiornamenti della garanzia"]
[null,"None",{"$f":"VLOOKUP($B$169,  SO_B1,2, FALSE)","v":""},{"$f":"VLOOKUP($B$169,  SO_B1, 3, FALSE)","v":""},{"$f":"VLOOKUP($B$169,  SO_B1, 5, FALSE)","v":""},{"$f":"VLOOKUP($B$169,  SO_B1, 6, FALSE)","v":""}]
[]
[null,"Protezione dei dati - Keep Your Hard Drive "]
[null,"None",{"$f":"VLOOKUP($B$172,  SO_B2, 2, FALSE)","v":""},{"$f":"VLOOKUP($B$172,  SO_B2, 3, FALSE)","v":""},{"$f":"VLOOKUP($B$172,  SO_B2,5, FALSE)","v":""},{"$f":"VLOOKUP($B$172,  SO_B2, 6, FALSE)","v":""}]
[]
[null,"Servizi di Installazione"]
[null,"No Installation Service Selected",1,null,"[683-11870]"]
[]
[null,"Channel only - Support Extension"]
[null,"Channel 39M Basic Warranty - Next Business Day",1,null,"[723-28780]"]
[]
[null,"Warranty Upgrades - Non-Std/Local POS"]
[null,"CSTM CONSIP - 39M Onsite Labor Support for CRU for Servers with Basic Warranty",1,null,"[681-24467]"]

{"sheet":"Lotto1 T630 1 (Tower)","index":5,"n_rows":180,"n_cols":9,"rows_kept":180,"cut":false,"hidden":false,"merged":[[14,2,14,4],[4,0,4,4],[5,0,5,4],[6,0,7,5],[8,0,8,5],[35,1,35,4],[16,1,16,4],[17,2,17,4],[19,1,19,4],[20,2,20,4],[22,1,22,4],[23,2,23,4],[25,1,25,4],[26,2,26,4],[29,1,29,4],[30,2,30,4],[32,1,32,4],[70,2,70,4],[36,2,36,4],[38,1,38,4],[39,2,39,4],[45,1,45,4],[46,2,46,4],[49,1,49,4],[50,2,50,4],[52,1,52,4],[53,2,53,4],[55,1,55,4],[57,1,57,4],[60,1,60,4],[69,1,69,4],[72,1,72,4],[73,2,73,4],[82,2,82,4],[85,1,85,3],[81,1,81,4],[95,1,95,4],[96,2,96,4],[98,1,98,4],[99,2,99,4],[101,1,101,4],[86,2,86,4],[89,1,89,4],[90,2,90,4],[92,1,92,4],[93,2,93,4],[85,7,86,8],[127,1,127,4],[105,2,105,4],[107,1,107,4],[108,2,108,4],[112,1,112,4],[116,2,116,4],[118,1,118,4],[119,2,119,4],[121,1,121,4],[122,2,122,4],[124,1,124,4],[125,2,125,4],[113,2,113,4],[115,1,115,4],[104,1,104,4],[150,1,150,4],[128,2,128,4],[130,1,130,4],[131,2,131,4],[133,1,133,4],[134,2,134,4],[136,1,136,4],[137,2,137,4],[139,1,139,4],[140,2,140,4],[142,1,142,4],[143,2,143,4],[147,1,147,4],[148,2,148,4],[168,1,168,4],[151,2,151,4],[153,1,153,4],[154,2,154,4],[156,1,156,4],[157,2,157,4],[159,1,159,4],[160,2,160,4],[162,1,162,4],[163,2,163,4],[165,1,165,4],[166,2,166,4],[178,2,178,4],[180,1,180,4],[169,2,169,4],[171,1,171,4],[172,2,172,4],[174,1,174,4],[175,2,175,4],[177,1,177,4]]}
["IN ROSSO LE OPZIONI 20%"]
[]
[]
[]
["Tecnologie Server 1 Lotto 1"]
[]
["Components: \nServer DELL PowerEdge T630 (1CPU Intel® Xeon® E5-2640 v4, 32GB RDIMM, 2xHDD 300GB 10K RPM SAS 12Gbps 2.5in)",null,null,null,null,null,null,"Totale Server e Opzioni",{"$f":"F13*SRV_D","v":0}]
[null,null,null,null,null,null,null,"Totale Ulteriori Opzioni ",{"$f":"G12*SRV_D-(G69*SRV_D)+G69-(SRV_D*G66)+G66","v":0}]
[]
[null,null,null,null,null,null,null,"TOTALE CONVENZIONE",{"$f":"I8+I7","v":0}]
["PowerEdge T630","Category: Server",null,null,null,2158]
[null,"Quantity: ",null,null,null,{"$f":"SUM(F16:F181)","v":0},{"$f":"SUM(G16:G190)","v":0}]
[null,null,null,null,null,{"$f":"SUM(F11:F12)","v":2158}]
[]
[null,"Base"]
[null,"PowerEdge T630 for Intel v4 CPUs",1,null,"[210-ACWJ][329-BCZH]"]
[]
[null,"Configurazione dello chassis"]
[null,"Chassis with up to 18, 3.5\" Hard Drives, Tower Configuration",1,null,"[321-BBJT]"]
[]
[null,"Processore"]
[null,"Intel Xeon E5-2640 v4 2.4GHz 25M Cache 8.0GT/s QPI Turbo HT 10C/20T (90W) Max Mem 2133MHz",1,null,"[338-BJDL]"]
[]
[null,"Processore aggiuntivo"]
[null,"No Additional Processor",{"$f":"VLOOKUP($B$25, CPU_D, 2, FALSE)","v":0},{"$f":"VLOOKUP($B$25, CPU_D, 3, FALSE)","v":""},{"$f":"VLOOKUP($B$25, CPU_D, 5, FALSE)","v":"[374-BBBX]"},{"$f":"VLOOKUP(B25, CPU_D, 12, FALSE)","v":0}]
[]
[null,"Processor Thermal Configuration"]
[null,"1 CPU up to 105W",1,null,"[412-AADW]"]
[null,{"$f":"VLOOKUP($B$25, CPU_C, 6, FALSE)","v":""},{"$f":"VLOOKUP($B$25, CPU_C, 7, FALSE)","v":""},null,{"$f":"VLOOKUP($B$25, CPU_C, 8, FALSE)","v":""}]
[]
[null,"Tipo di configurazione memoria"]
[null,"Performance Optimized",1,null,"[370-AAIP]"]
[]
[null,"Total Memory in GB",{"$f":"IF(F25=650,IF(B35=32,\"ATTENZIONE: AUMENTARE LA RAM\",\"\"),\"\")","v":""}]
[null,32]
[]
[null,"Tipo e velocità della memoria DIMM"]
[null,"2400MT/s RDIMMs",1,null,"[370-ACPH]"]
[]
[null,"Capacità di memoria"]
[null,"32GB RDIMM, 2400MT/s, Dual Rank, x4 Data Width",1,null,"[370-ACNS]"]
[]
[null,{"$f":"IF($B$25=\"No Additional Processor\",VLOOKUP($B$35, MEM_A1, 2, FALSE),VLOOKUP($B$35, MEM_A2, 2, FALSE))","v":""},{"$f":"IF($B$25=\"No Additional Processor\",VLOOKUP($B$35, MEM_A1, 3, FALSE),VLOOKUP($B$35, MEM_A2, 3, FALSE))","v":""},{"$f":"IF($B$25=\"No Additional Processor\",VLOOKUP($B$35, MEM_A1, 4, FALSE),VLOOKUP($B$35, MEM_A2, 4, FALSE))","v":""},{"$f":"IF($B$25=\"No Additional Processor\",VLOOKUP($B$35, MEM_A1, 6, FALSE),VLOOKUP($B$35, MEM_A2, 6, FALSE))","v":""},{"$f":"IF($B$25=\"No Additional Processor\",VLOOKUP($B$35, MEM_A1, 7, FALSE),VLOOKUP($B$35, MEM_A2, 7, FALSE))","v":""}]
[]
[null,{"$f":"IF($B$25=\"No Additional Processor\",VLOOKUP($B$35, MEM_A1, 11, FALSE),VLOOKUP($B$35, MEM_A2, 11, FALSE))","v":""},{"$f":"IF($B$25=\"No Additional Processor\",VLOOKUP($B$35, MEM_A1, 12, FALSE),VLOOKUP($B$35, MEM_A2, 12, FALSE))","v":""},{"$f":"IF($B$25=\"No Additional Processor\",VLOOKUP($B$35, MEM_A1, 13, FALSE),VLOOKUP($B$35, MEM_A2, 13, FALSE))","v":""},{"$f":"IF($B$25=\"No Additional Processor\",VLOOKUP($B$35, MEM_A1, 15, FALSE),VLOOKUP($B$35, MEM_A2, 15, FALSE))","v":""},{"$f":"IF($B$25=\"No Additional Processor\",VLOOKUP($B$35, MEM_A1, 16, FALSE),VLOOKUP($B$35, MEM_A2, 16, FALSE))","v":""}]
[]
[null,"Sistema operativo preinstallato"]
[null,"No Operating System",{"$f":"VLOOKUP($B$48, OS_A, 2, FALSE)","v":""},{"$f":"VLOOKUP($B$48, OS_A, 3, FALSE)","v":""},{"$f":"VLOOKUP($B$48, OS_A, 5, FALSE)","v":"[611-BBBF]"},{"$f":"VLOOKUP($B$48, OS_A, 6, FALSE)","v":""}]
[null,{"$f":"IF($B$25=\"No Additional Processor\",VLOOKUP($B$48, OS_A, 20, FALSE),VLOOKUP($B$48, OS_A2, 20, FALSE))","v":""},{"$f":"IF($B$25=\"No Additional Processor\",VLOOKUP($B$48, OS_A, 21, FALSE),VLOOKUP($B$48, OS_A2, 21, FALSE))","v":0},{"$f":"IF($B$25=\"No Additional Processor\",VLOOKUP($B$48, OS_A, 22, FALSE),VLOOKUP($B$48, OS_A2, 22, FALSE))","v":""},{"$f":"IF($B$25=\"No Additional Processor\",VLOOKUP($B$48, OS_A, 24, FALSE),VLOOKUP($B$48, OS_A2, 24, FALSE))","v":""},{"$f":"IF($B$25=\"No Additional Processor\",VLOOKUP($B$48, OS_A, 25, FALSE),VLOOKUP($B$48, OS_A2, 25, FALSE))","v":""}]
[]
[null,"OS Media Kits"]
[null,"No Media Required",1,null,"[605-BBFN]"]
[]
[null,"Client Access Licenses"]
[null,{"$f":"VLOOKUP($B$48, OS_A, 8, FALSE)","v":"None"},null,{"$f":"VLOOKUP($B$48, OS_A, 10, FALSE)","v":""},{"$f":"VLOOKUP($B$48, OS_A, 12, FALSE)","v":""},{"$f":"VLOOKUP($B$48, OS_A, 13, FALSE)*C55","v":0}]
[]
[null,{"$f":"VLOOKUP($B$48, OS_A, 14, FALSE)","v":"None"},null,{"$f":"VLOOKUP($B$48, OS_A, 16, FALSE)","v":""},{"$f":"VLOOKUP($B$48, OS_A, 18, FALSE)","v":""},{"$f":"VLOOKUP($B$48, OS_A, 19, FALSE)*C57","v":0}]
[]
[null,"Sistema operativo SUSE Linux Enterprise Server"]
[null,"None\n",{"$f":"VLOOKUP($B$60,SUSE, 2, FALSE)","v":0},{"$f":"VLOOKUP($B$60,SUSE, 3, FALSE)","v":""},{"$f":"VLOOKUP($B$60,SUSE, 5, FALSE)","v":""},null,{"$f":"VLOOKUP($B$60, SUSE, 6, FALSE)*C60","v":0}]
[]
[null,"Sistema operativo VMware"]
[null,"None",{"$f":"VLOOKUP($B$63,VMWARE, 2, FALSE)+C25","v":0},{"$f":"VLOOKUP($B$63,VMWARE, 3, FALSE)","v":""},{"$f":"VLOOKUP($B$63,VMWARE, 5, FALSE)","v":""},null,{"$f":"VLOOKUP($B$63, VMWARE, 6, FALSE)*C63","v":0}]
[]
[null,"VMware vCenter Server Standard"]
[null,"None",{"$f":"VLOOKUP($B$66,VMWARE2, 2, FALSE)","v":0},{"$f":"VLOOKUP($B$66,VMWARE2, 3, FALSE)","v":""},{"$f":"VLOOKUP($B$66,VMWARE2, 5, FALSE)","v":""},null,{"$f":"VLOOKUP($B$66, VMWARE2, 6, FALSE)*C66","v":0}]
[]
[null,"Essentials Plus Kit"]
[null,"None",{"$f":"IF(SRV_A<4,VLOOKUP($B$69,VMWARE1, 2, FALSE),0)","v":0},{"$f":"VLOOKUP($B$69,VMWARE1, 3, FALSE)","v":""},{"$f":"VLOOKUP($B$69,VMWARE1, 5, FALSE)","v":""},null,{"$f":"VLOOKUP($B$69, VMWARE1, 6, FALSE)*C69","v":0}]
[]
[null,"Controller RAID"]
[null,"PERC H730 RAID Controller, 1GB NV Cache",1,null,"[405-AADT]"]
[]
[null,"Dischi rigidi"]
[null,"300GB 10K RPM SAS 2.5in Hot-plug Hard Drive,3.5in HYB CARR",2,null,"[400-AJOZ]"]
[]
[null,"300GB 10K RPM SAS 2.5in Hot-plug Hard Drive,3.5in HYB CARR,CusKit",null,{"$f":"VLOOKUP($B$77, hdd_D,3, FALSE)","v":"TS1L1-HD300T"},{"$f":"VLOOKUP($B$77, hdd_D,5, FALSE)","v":"400-AJOU"},{"$f":"VLOOKUP($B$77, hdd_D,6, FALSE)*C77","v":0}]
[]
[null,"1.2TB 10K RPM SAS 12Gbps 2.5in Hot-plug Hard Drive,3.5in HYB CARR,CusKit",null,{"$f":"VLOOKUP($B$79, hdd_D,3, FALSE)","v":"TS1L1-HD1200T"},{"$f":"VLOOKUP($B$79, hdd_D,5, FALSE)","v":"400-AJPC"},{"$f":"VLOOKUP($B$79, hdd_D,6, FALSE)*C79","v":0}]
[]
[null,"DISCHI TOTALI",{"$f":"SUM(C75:C80)","v":2},{"$f":"IF(C81<=18,\"      OK\",\"     ERRORE:   Totale n° di dischi superiore al consentito\")","v":"      OK"}]
[]
[null,"Configurazione RAID"]
[null,"C3 - RAID 1 for H330 (2 HDDs)",1,null,{"$f":"VLOOKUP($B$84,  RAID_C1, 2, FALSE)","v":"[780-BBJK]"}]
[null,"Hot Spare for 300GB HDD","No"]
[null,"SCRIVERE QUI' LA CONFIGURAZIONE RAID RICHIESTA.\nT630 Tower Base\n",null,null,null,null,null,{"$f":"IF(B86=\"SCRIVERE QUI' LA CONFIGURAZIONE RAID RICHIESTA.\nT630 Tower Base\n\",\"ATTENZIONE COMPILARE IL CAMPO DELLA SCELTA RAID\", \"\")","v":"ATTENZIONE COMPILARE IL CAMPO DELLA SCELTA RAID"}]
[null,"Configurazione RAID HDD 1TB"]
[null,"",1,null,{"$f":"VLOOKUP($B$88,  RAID_C2, 2, FALSE)","v":""}]
[null,"Hot Spare for 1TB HDD","No"]
[]
[null,"Impostazioni del BIOS per la gestione dell'alimentazione"]
[null,"Performance BIOS Setting",1,null,"[384-BBBL]"]
[]
[null,"Raffreddamento"]
[null,"Fresh Air Cooling",1,null,"[384-BBDW]"]
[]
[null,"Alimentatore"]
[null,"Dual, Hot-plug, Redundant Power Supply (1+1), 750W, Titanium, 200-240VAC",1,null,"[450-ADWT]"]
[]
[null,"Cavi di alimentazione"]
[null,"Italian Spare Power Cord 220V",2,null,"[450-AAYN]"]
[]
[null,"TPM Module"]
[null,"PowerEdge Server FIPS TPM 2.0",1,null,"[461-AADM]"]
[]
[null,"Embedded Systems Management"]
[null,"iDrac8, Enterprise",1,null,"[385-BBHO]"]
[]
[null,"Adattatore di rete aggiuntivo"]
[null,"On-Board LOM 1GBE (Dual Port for Towers, Quad Port for Racks and Blades)",1,null,"[542-BBBP]"]
[]
[null,"Broadcom 5720 DP 1Gb Network Interface Card",1,null,"[540-BBCX]"]
[]
[null,"Modulo Doppia SD"]
[null,"None ",{"$f":"VLOOKUP($B$115,upsell_1, 2, FALSE)","v":0},{"$f":"VLOOKUP($B$115,upsell_1, 3, FALSE)","v":""},{"$f":"VLOOKUP($B$115,upsell_1, 4, FALSE)","v":""},{"$f":"VLOOKUP($B$115,upsell_1, 6, FALSE)","v":""},{"$f":"VLOOKUP($B$115,upsell_1, 7, FALSE)","v":0}]
[]
[null,"Additional Card for PCIe Slot 1 (CPU 1)"]
[null,"None",{"$f":"VLOOKUP($B$118,  PCI_C1, 2, FALSE)","v":""},{"$f":"VLOOKUP($B$118,  PCI_C1, 3, FALSE)","v":""},{"$f":"VLOOKUP($B$118,  PCI_C1, 5, FALSE)","v":""},{"$f":"VLOOKUP($B$118,  PCI_C1, 6, FALSE)","v":""},{"$f":"VLOOKUP($B$118,  PCI_C1, 7, FALSE)","v":0}]
[]
[null,"Additional Card for PCIe Slot 2 (CPU 1)"]
[null,"None",{"$f":"VLOOKUP($B$121,  PCI_C2, 2, FALSE)","v":""},{"$f":"VLOOKUP($B$121,  PCI_C2, 3, FALSE)","v":""},{"$f":"VLOOKUP($B$121,  PCI_C2, 5, FALSE)","v":""},{"$f":"VLOOKUP($B$121,  PCI_C2, 6, FALSE)","v":""},{"$f":"VLOOKUP($B$121,  PCI_C2, 7, FALSE)","v":0}]
[]
[null,"Additional Card for PCIe Slot 3 (CPU 2)"]
[null,"None",{"$f":"IF(B124=\"Aggiungere Secondo Processore\",\"\",(VLOOKUP(B124,PCI_C3, 2, FALSE)))","v":""},{"$f":"IF(B124=\"Aggiungere Secondo Processore\",\"\",(VLOOKUP(B124,  PCI_C3, 3, FALSE)))","v":""},{"$f":"VLOOKUP($B$124,  PCI_C3, 5, FALSE)","v":""},{"$f":"VLOOKUP($B$124,  PCI_C3, 6, FALSE)","v":""},{"$f":"VLOOKUP($B$124,  PCI_C3, 7, FALSE)","v":0}]
[]
[null,"Additional Card for PCIe Slot 4 (CPU 2)"]
[null,"None",{"$f":"IF(B127=\"Aggiungere Secondo Processore\",\"\",(VLOOKUP(B127,PCI_C4, 2, FALSE)))","v":""},{"$f":"IF(B127=\"Aggiungere Secondo Processore\",\"\",(VLOOKUP(B127,  PCI_C4, 3, FALSE)))","v":""},{"$f":"VLOOKUP($B$127,  PCI_C4, 5, FALSE)","v":""},{"$f":"VLOOKUP($B$127,  PCI_C4, 6, FALSE)","v":""},{"$f":"VLOOKUP($B$127,  PCI_C4, 7, FALSE)","v":0}]
[]
[null,"Additional Card for PCIe Slot 5 (CPU 2)"]
[null,"None",{"$f":"IF(B130=\"Aggiungere Secondo Processore\",\"\",(VLOOKUP(B130,PCI_C4, 2, FALSE)))","v":""},{"$f":"IF(B130=\"Aggiungere Secondo Processore\",\"\",(VLOOKUP(B130,  PCI_C4, 3, FALSE)))","v":""},{"$f":"VLOOKUP($B$130,  PCI_C5, 5, FALSE)","v":""},{"$f":"VLOOKUP($B$130,  PCI_C5, 6, FALSE)","v":""},{"$f":"VLOOKUP($B$130,  PCI_C5, 7, FALSE)","v":0}]
[]
[null,"Additional Card for PCIe Slot 6 (CPU 2)"]
[null,"None",{"$f":"IF(B133=\"Aggiungere Secondo Processore\",\"\",(VLOOKUP(B133,PCI_C4, 2, FALSE)))","v":""},{"$f":"IF(B133=\"Aggiungere Secondo Processore\",\"\",(VLOOKUP(B133,  PCI_C4, 3, FALSE)))","v":""},{"$f":"VLOOKUP($B$133,  PCI_C6, 5, FALSE)","v":""},{"$f":"VLOOKUP($B$133,  PCI_C6, 6, FALSE)","v":""},{"$f":"VLOOKUP($B$133,  PCI_C6, 7, FALSE)","v":0}]
[]
[null,"Pannello frontale"]
[null,"No Bezel",1,null,"[350-BBBW]"]
[]
[null,"Guide per rack"]
[null,"No Rack Rails, No Cable Management Arm, No Casters",1,null,"[770-BBCR]"]
[]
[null,"Unità ottica interna"]
[null,"No Internal Optical Drive",1,null,"[429-AAIQ][429-AAQS]"]
[]
[null,"Accessori per server"]
[null,"Redundant Fan Option",1,null,"[750-AAFF]"]
[]
[null,"PowerEdge SFP+, 10GbE SR/SX, Optical Tranceiver, LC Connector, for Intel and Broadcom,CusKit",{"$f":"(VLOOKUP(B121,PCI_C2,8,FALSE))+((VLOOKUP(B118,PCI_C1,8,FALSE)))+((VLOOKUP(B124,PCI_C3,8,FALSE)))+((VLOOKUP(B127,PCI_C4,8,FALSE)))+((VLOOKUP(B130,PCI_C5,8,FALSE)))+((VLOOKUP(B133,PCI_C6,8,FALSE)))","v":{"$error":"#VALUE!"}},null,"[407-BBQE]"]
[]
[null,"Opzione RDX"]
[null,"None",{"$f":"VLOOKUP($B$150,RDX, 2, FALSE)","v":0},{"$f":"VLOOKUP($B$150,RDX, 3, FALSE)","v":""},{"$f":"VLOOKUP($B$150,RDX, 4, FALSE)","v":""},{"$f":"VLOOKUP($B$150,RDX, 6, FALSE)","v":""},{"$f":"VLOOKUP($B$150,RDX, 7, FALSE)","v":0}]
[]
[null,"System Documentation"]
[null,"Electronic System Documentation and OpenManage DVD Kit, PowerEdge T630",1,null,"[343-BBDE]"]
[]
[null,"SHIPPING"]
[null,"PowerEdge T630 Shipping EMEA1 (English/French/German/Spanish/Russian/Hebrew)",1,null,"[340-AMBT]"]
[]
[null,"Order Information"]
[null,"Enterprise Order - EMEA",1,null,"[800-11671]"]
[]
[null,"Base warranty"]
[null,"3Yr Basic Warranty - Next Business Day - Minimum Warranty",1,null,"[709-12798][709-12799]"]
[]
[null,"Servizi di assitenza"]
[null,"Dell Channel Order - Service Info only",1,null,"[710-31085]"]
[]
[null,"Aggiornamenti della garanzia"]
[null,"None",{"$f":"VLOOKUP($B$168,  SO_C1, 2, FALSE)","v":""},{"$f":"VLOOKUP($B$168,  SO_C1, 3, FALSE)","v":""},{"$f":"VLOOKUP($B$168,  SO_C1, 5, FALSE)","v":""},{"$f":"VLOOKUP($B$168,  SO_C1, 6, FALSE)","v":""}]
[]
[null,"Protezione dei dati - Keep Your Hard Drive "]
[null,"None",{"$f":"VLOOKUP($B$171,  SO_C2, 2, FALSE)","v":""},{"$f":"VLOOKUP($B$171,  SO_C2, 3, FALSE)","v":""},{"$f":"VLOOKUP($B$171,  SO_C2,5, FALSE)","v":""},{"$f":"VLOOKUP($B$171,  SO_C2, 6, FALSE)","v":""}]
[]
[null,"Servizi di Installazione"]
[null,"No Installation Service Selected",1,null,"[683-11870]"]
[]
[null,"Channel only - Support Extension"]
[null,"Channel 39M Basic Warranty - Next Business Day",1,null,"[723-28783]"]
[]
[null,"Warranty Upgrades - Non-Std/Local POS"]
[null,"CSTM CONSIP - 39M Onsite Labor Support for CRU for Servers with Basic Warranty",1,null,"[681-24467]"]

{"sheet":"Lotto1 T630 1 (Tower) Prest","index":6,"n_rows":180,"n_cols":9,"rows_kept":180,"cut":false,"hidden":false,"merged":[[69,1,69,4],[85,7,86,8],[14,2,14,4],[4,0,4,4],[5,0,5,4],[6,0,7,5],[8,0,8,5],[57,1,57,4],[60,1,60,4],[35,1,35,4],[16,1,16,4],[17,2,17,4],[19,1,19,4],[20,2,20,4],[22,1,22,4],[23,2,23,4],[25,1,25,4],[26,2,26,4],[29,1,29,4],[30,2,30,4],[32,1,32,4],[49,1,49,4],[50,2,50,4],[52,1,52,4],[53,2,53,4],[55,1,55,4],[36,2,36,4],[38,1,38,4],[39,2,39,4],[45,1,45,4],[46,2,46,4],[72,1,72,4],[73,2,73,4],[82,2,82,4],[85,1,85,3],[70,2,70,4],[81,1,81,4],[115,1,115,4],[104,1,104,4],[86,2,86,4],[89,1,89,4],[90,2,90,4],[92,1,92,4],[93,2,93,4],[95,1,95,4],[96,2,96,4],[98,1,98,4],[99,2,99,4],[101,1,101,4],[143,2,143,4],[157,2,157,4],[159,1,159,4],[127,1,127,4],[105,2,105,4],[107,1,107,4],[108,2,108,4],[112,1,112,4],[116,2,116,4],[118,1,118,4],[119,2,119,4],[121,1,121,4],[122,2,122,4],[124,1,124,4],[125,2,125,4],[113,2,113,4],[136,1,136,4],[137,2,137,4],[139,1,139,4],[140,2,140,4],[142,1,142,4],[128,2,128,4],[130,1,130,4],[131,2,131,4],[133,1,133,4],[134,2,134,4],[148,2,148,4],[150,1,150,4],[165,1,165,4],[166,2,166,4],[147,1,147,4],[178,2,178,4],[180,1,180,4],[169,2,169,4],[171,1,171,4],[172,2,172,4],[174,1,174,4],[175,2,175,4],[177,1,177,4],[168,1,168,4],[151,2,151,4],[153,1,153,4],[154,2,154,4],[156,1,156,4],[160,2,160,4],[162,1,162,4],[163,2,163,4]]}
["IN ROSSO LE OPZIONI 20%"]
[]
[]
[]
["Tecnologie Server 1 Lotto 1"]
[]
["Components: \nServer DELL PowerEdge T630 (1CPU Intel® Xeon® E5-2650 v4, 64GB RDIMM, 2xHDD 300GB 10K RPM SAS 12Gbps 2.5in)",null,null,null,null,null,null,"Totale Server e Opzioni",{"$f":"F13*SRV_E","v":0}]
[null,null,null,null,null,null,null,"Totale Ulteriori Opzioni ",{"$f":"G12*SRV_E-(G69*SRV_E)+G69-(SRV_E*G66)+G66","v":0}]
[]
[null,null,null,null,null,null,null,"TOTALE CONVENZIONE",{"$f":"I8+I7","v":0}]
["PowerEdge T630","Category: Server",null,null,null,2214]
[null,"Quantity: ",null,null,null,{"$f":"SUM(F16:F181)","v":0},{"$f":"SUM(G16:G198)","v":0}]
[null,null,null,null,null,{"$f":"SUM(F11:F12)","v":2214}]
[]
[null,"Base"]
[null,"PowerEdge T630 for Intel v4 CPUs",1,null,"[210-ACWJ][329-BCZH]"]
[]
[null,"Configurazione dello chassis"]
[null,"Chassis with up to 8, 3.5\" Hard Drives, Tower Configuration",1,null,"[321-BBJP]"]
[]
[null,"Processore"]
[null,"Intel Xeon E5-2650 v4 2.2GHz,30M Cache,9.60GT/s QPI,Turbo,HT,12C/24T (105W) Max Mem 2400MHz",1,null,"[338-BJDL]"]
[]
[null,"Processore aggiuntivo"]
[null,"No Additional Processor",{"$f":"VLOOKUP($B$25, CPU_E, 2, FALSE)","v":0},{"$f":"VLOOKUP($B$25, CPU_E, 3, FALSE)","v":""},{"$f":"VLOOKUP($B$25, CPU_E, 5, FALSE)","v":"[374-BBBX]"},{"$f":"VLOOKUP(B25, CPU_E, 12, FALSE)","v":0}]
[]
[null,"Processor Thermal Configuration"]
[null,"1 CPU up to 105W",1,null,"[412-AADW]"]
[null,{"$f":"VLOOKUP($B$25, CPU_E, 6, FALSE)","v":""},{"$f":"VLOOKUP($B$25, CPU_E, 7, FALSE)","v":""},null,{"$f":"VLOOKUP($B$25, CPU_E, 8, FALSE)","v":""}]
[]
[null,"Tipo di configurazione memoria"]
[null,"Performance Optimized",1,null,"[370-AAIP]"]
[]
[null,"Total Memory in GB",null,{"$f":"IF(('Lotto1 T630R 1'!$D$13=0),\"\",'Lotto1 T630R 1'!#REF!)","v":""}]
[null,64]
[]
[null,"Tipo e velocità della memoria DIMM"]
[null,"2400MT/s RDIMMs",1,null,"[370-ACPH]"]
[]
[null,"Capacità di memoria"]
[null,"32GB RDIMM, 2400MT/s, Dual Rank, x4 Data Width",2,null,"[370-ACNS]"]
[]
[null,{"$f":"IF($B$25=\"No Additional Processor\",VLOOKUP($B$35, MEM_B1, 2, FALSE),VLOOKUP($B$35, MEM_B2, 2, FALSE))","v":""},{"$f":"IF($B$25=\"No Additional Processor\",VLOOKUP($B$35, MEM_B1, 3, FALSE),VLOOKUP($B$35, MEM_B2, 3, FALSE))","v":""},{"$f":"IF($B$25=\"No Additional Processor\",VLOOKUP($B$35, MEM_B1, 4, FALSE),VLOOKUP($B$35, MEM_B2, 4, FALSE))","v":""},{"$f":"IF($B$25=\"No Additional Processor\",VLOOKUP($B$35, MEM_B1, 6, FALSE),VLOOKUP($B$35, MEM_B2, 6, FALSE))","v":""},{"$f":"IF($B$25=\"No Additional Processor\",VLOOKUP($B$35, MEM_B1, 7, FALSE),VLOOKUP($B$35, MEM_B2, 7, FALSE))","v":""}]
[]
[null,{"$f":"IF($B$25=\"No Additional Processor\",VLOOKUP($B$35, MEM_B1, 11, FALSE),VLOOKUP($B$35, MEM_B2, 11, FALSE))","v":""},{"$f":"IF($B$25=\"No Additional Processor\",VLOOKUP($B$35, MEM_B1, 12, FALSE),VLOOKUP($B$35, MEM_B2, 12, FALSE))","v":""},{"$f":"IF($B$25=\"No Additional Processor\",VLOOKUP($B$35, MEM_B1, 13, FALSE),VLOOKUP($B$35, MEM_B2, 13, FALSE))","v":""},{"$f":"IF($B$25=\"No Additional Processor\",VLOOKUP($B$35, MEM_B1, 15, FALSE),VLOOKUP($B$35, MEM_B2, 15, FALSE))","v":""},{"$f":"IF($B$25=\"No Additional Processor\",VLOOKUP($B$35, MEM_B1, 16, FALSE),VLOOKUP($B$35, MEM_B2, 16, FALSE))","v":""}]
[]
[null,"Sistema operativo preinstallato"]
[null,"No Operating System",{"$f":"VLOOKUP($B$48, OS_C, 2, FALSE)","v":""},{"$f":"VLOOKUP($B$48, OS_C, 3, FALSE)","v":""},{"$f":"VLOOKUP($B$48, OS_C, 5, FALSE)","v":"[611-BBBF]"},{"$f":"VLOOKUP($B$48, OS_C, 6, FALSE)","v":""}]
[null,{"$f":"IF($B$25=\"No Additional Processor\",VLOOKUP($B$48, OS_C, 20, FALSE),VLOOKUP($B$48, OS_C2, 20, FALSE))","v":""},{"$f":"IF($B$25=\"No Additional Processor\",VLOOKUP($B$48, OS_C, 21, FALSE),VLOOKUP($B$48, OS_C2, 21, FALSE))","v":0},{"$f":"IF($B$25=\"No Additional Processor\",VLOOKUP($B$48, OS_C, 22, FALSE),VLOOKUP($B$48, OS_C2, 22, FALSE))","v":""},{"$f":"IF($B$25=\"No Additional Processor\",VLOOKUP($B$48, OS_C, 24, FALSE),VLOOKUP($B$48, OS_C2, 24, FALSE))","v":""},{"$f":"IF($B$25=\"No Additional Processor\",VLOOKUP($B$48, OS_C, 25, FALSE),VLOOKUP($B$48, OS_C2, 25, FALSE))","v":0}]
[]
[null,"OS Media Kits"]
[null,"No Media Required",1,null,"[605-BBFN]"]
[]
[null,"Client Access Licenses"]
[null,{"$f":"VLOOKUP($B$48, OS_A, 8, FALSE)","v":"None"},null,{"$f":"VLOOKUP($B$48, OS_A, 10, FALSE)","v":""},{"$f":"VLOOKUP($B$48, OS_A, 12, FALSE)","v":""},{"$f":"VLOOKUP($B$48, OS_A, 13, FALSE)*C55","v":0}]
[]
[null,{"$f":"VLOOKUP($B$48, OS_A, 14, FALSE)","v":"None"},null,{"$f":"VLOOKUP($B$48, OS_A, 16, FALSE)","v":""},{"$f":"VLOOKUP($B$48, OS_A, 18, FALSE)","v":""},{"$f":"VLOOKUP($B$48, OS_A, 19, FALSE)*C57","v":0}]
[]
[null,"Sistema operativo SUSE Linux Enterprise Server"]
[null,"None\n",{"$f":"VLOOKUP($B$60,SUSE, 2, FALSE)","v":0},{"$f":"VLOOKUP($B$60,SUSE, 3, FALSE)","v":""},{"$f":"VLOOKUP($B$60,SUSE, 5, FALSE)","v":""},null,{"$f":"VLOOKUP($B$60, SUSE, 6, FALSE)*C60","v":0}]
[]
[null,"Sistema operativo VMware"]
[null,"None",{"$f":"VLOOKUP($B$63,VMWARE, 2, FALSE)+C25","v":0},{"$f":"VLOOKUP($B$63,VMWARE, 3, FALSE)","v":""},{"$f":"VLOOKUP($B$63,VMWARE, 5, FALSE)","v":""},null,{"$f":"VLOOKUP($B$63, VMWARE, 6, FALSE)*C63","v":0}]
[]
[null,"VMware vCenter Server Standard"]
[null,"None",{"$f":"VLOOKUP($B$66,VMWARE2, 2, FALSE)","v":0},{"$f":"VLOOKUP($B$66,VMWARE2, 3, FALSE)","v":""},{"$f":"VLOOKUP($B$66,VMWARE2, 5, FALSE)","v":""},null,{"$f":"VLOOKUP($B$66, VMWARE2, 6, FALSE)*C66","v":0}]
[]
[null,"Essentials Plus Kit"]
[null,"None",{"$f":"IF(SRV_A<4,VLOOKUP($B$69,VMWARE1, 2, FALSE),0)","v":0},{"$f":"VLOOKUP($B$69,VMWARE1, 3, FALSE)","v":""},{"$f":"VLOOKUP($B$69,VMWARE1, 5, FALSE)","v":""},null,{"$f":"VLOOKUP($B$69, VMWARE1, 6, FALSE)*C69","v":0}]
[]
[null,"Controller RAID"]
[null,"PERC H730P Adapter RAID Controller, 2GB NV Cache",1,null,"[405-AACU]"]
[]
[null,"Dischi rigidi"]
[null,"300GB 10K RPM SAS 2.5in Hot-plug Hard Drive,3.5in HYB CARR",2,null,"[400-AJOZ]"]
[]
[null,"300GB 10K RPM SAS 2.5in Hot-plug Hard Drive,3.5in HYB CARR,CusKit",null,{"$f":"VLOOKUP($B$77, hdd_D,3, FALSE)","v":"TS1L1-HD300T"},{"$f":"VLOOKUP($B$77, hdd_D,5, FALSE)","v":"400-AJOU"},{"$f":"VLOOKUP($B$77, hdd_D,6, FALSE)*C77","v":0}]
[]
[null,"1.2TB 10K RPM SAS 12Gbps 2.5in Hot-plug Hard Drive,3.5in HYB CARR,CusKit",null,{"$f":"VLOOKUP($B$79, hdd_D,3, FALSE)","v":"TS1L1-HD1200T"},{"$f":"VLOOKUP($B$79, hdd_D,5, FALSE)","v":"400-AJPC"},{"$f":"VLOOKUP($B$79, hdd_D,6, FALSE)*C79","v":0}]
[]
[null,"DISCHI TOTALI",{"$f":"SUM(C75:C80)","v":2},{"$f":"IF(C81<=8,\"      OK\",\"     ERRORE:   Totale n° di dischi superiore al consentito\")","v":"      OK"}]
[]
[null,"Configurazione RAID"]
[null,"C3 - RAID 1 for H330 (2 HDDs)",1,null,{"$f":"VLOOKUP($B$84,  RAID_C1, 2, FALSE)","v":"[780-BBJK]"}]
[null,"Hot Spare for 300GB HDD","No"]
[null,"SCRIVERE QUI' LA CONFIGURAZIONE RAID RICHIESTA.\nT630 Tower Prestazionale\n",null,null,null,null,null,{"$f":"IF(B86=\"SCRIVERE QUI' LA CONFIGURAZIONE RAID RICHIESTA.\nT630 Tower Prestazionale\n\",\"ATTENZIONE COMPILARE IL CAMPO DELLA SCELTA RAID\", \"\")","v":"ATTENZIONE COMPILARE IL CAMPO DELLA SCELTA RAID"}]
[null,"Configurazione RAID HDD 1TB"]
[null,"",1,null,{"$f":"VLOOKUP($B$88,  RAID_C2, 2, FALSE)","v":""}]
[null,"Hot Spare for 1TB HDD","No"]
[]
[null,"Impostazioni del BIOS per la gestione dell'alimentazione"]
[null,"Performance BIOS Setting",1,null,"[384-BBBL]"]
[]
[null,"Raffreddamento"]
[null,"Fresh Air Cooling",1,null,"[384-BBDW]"]
[]
[null,"Alimentatore"]
[null,"Dual, Hot-plug, Redundant Power Supply (1+1), 750W, Titanium, 200-240VAC",1,null,"[450-ADWT]"]
[]
[null,"Cavi di alimentazione"]
[null,"Italian Spare Power Cord 220V",2,null,"[450-AAYN]"]
[]
[null,"TPM Module"]
[null,"PowerEdge Server FIPS TPM 2.0",1,null,"[461-AADM]"]
[]
[null,"Embedded Systems Management"]
[null,"iDrac8, Enterprise",1,null,"[385-BBHO]"]
[]
[null,"Adattatore di rete aggiuntivo"]
[null,"On-Board LOM 1GBE (Dual Port for Towers, Quad Port for Racks and Blades)",1,null,"[542-BBBP]"]
[]
[null,"Broadcom 5720 DP 1Gb Network Interface Card",1,null,"[540-BBCX]"]
[]
[null,"Modulo Doppia SD"]
[null,"None ",{"$f":"VLOOKUP($B$115,upsell_1, 2, FALSE)","v":0},{"$f":"VLOOKUP($B$115,upsell_1, 3, FALSE)","v":""},{"$f":"VLOOKUP($B$115,upsell_1, 4, FALSE)","v":""},{"$f":"VLOOKUP($B$115,upsell_1, 6, FALSE)","v":""},{"$f":"VLOOKUP($B$115,upsell_1, 7, FALSE)","v":0}]
[]
[null,"Additional Card for PCIe Slot 1 (CPU 1)"]
[null,"None",{"$f":"VLOOKUP($B$118,  PCI_C1, 2, FALSE)","v":""},{"$f":"VLOOKUP($B$118,  PCI_C1, 3, FALSE)","v":""},{"$f":"VLOOKUP($B$118,  PCI_C1, 5, FALSE)","v":""},{"$f":"VLOOKUP($B$118,  PCI_C1, 6, FALSE)","v":""},{"$f":"VLOOKUP($B$118,  PCI_C1, 7, FALSE)","v":0}]
[]
[null,"Additional Card for PCIe Slot 2 (CPU 1)"]
[null,"None",{"$f":"VLOOKUP($B$121,  PCI_C2, 2, FALSE)","v":""},{"$f":"VLOOKUP($B$121,  PCI_C2, 3, FALSE)","v":""},{"$f":"VLOOKUP($B$121,  PCI_C2, 5, FALSE)","v":""},{"$f":"VLOOKUP($B$121,  PCI_C2, 6, FALSE)","v":""},{"$f":"VLOOKUP($B$121,  PCI_C2, 7, FALSE)","v":0}]
[]
[null,"Additional Card for PCIe Slot 3 (CPU 2)"]
[null,"None",{"$f":"IF(B124=\"Aggiungere Secondo Processore\",\"\",(VLOOKUP(B124,PCI_C3, 2, FALSE)))","v":""},{"$f":"IF(B124=\"Aggiungere Secondo Processore\",\"\",(VLOOKUP(B124,  PCI_C3, 3, FALSE)))","v":""},{"$f":"VLOOKUP($B$124,  PCI_C3, 5, FALSE)","v":""},{"$f":"VLOOKUP($B$124,  PCI_C3, 6, FALSE)","v":""},{"$f":"VLOOKUP($B$124,  PCI_C3, 7, FALSE)","v":0}]
[]
[null,"Additional Card for PCIe Slot 4 (CPU 2)"]
[null,"None",{"$f":"IF(B127=\"Aggiungere Secondo Processore\",\"\",(VLOOKUP(B127,PCI_C4, 2, FALSE)))","v":""},{"$f":"IF(B127=\"Aggiungere Secondo Processore\",\"\",(VLOOKUP(B127,  PCI_C4, 3, FALSE)))","v":""},{"$f":"VLOOKUP($B$127,  PCI_C4, 5, FALSE)","v":""},{"$f":"VLOOKUP($B$127,  PCI_C4, 6, FALSE)","v":""},{"$f":"VLOOKUP($B$127,  PCI_C4, 7, FALSE)","v":0}]
[]
[null,"Additional Card for PCIe Slot 5 (CPU 2)"]
[null,"None",{"$f":"IF(B130=\"Aggiungere Secondo Processore\",\"\",(VLOOKUP(B130,PCI_C4, 2, FALSE)))","v":""},{"$f":"IF(B130=\"Aggiungere Secondo Processore\",\"\",(VLOOKUP(B130,  PCI_C4, 3, FALSE)))","v":""},{"$f":"VLOOKUP($B$130,  PCI_C5, 5, FALSE)","v":""},{"$f":"VLOOKUP($B$130,  PCI_C5, 6, FALSE)","v":""},{"$f":"VLOOKUP($B$130,  PCI_C5, 7, FALSE)","v":0}]
[]
[null,"Additional Card for PCIe Slot 6 (CPU 2)"]
[null,"None",{"$f":"IF(B133=\"Aggiungere Secondo Processore\",\"\",(VLOOKUP(B133,PCI_C4, 2, FALSE)))","v":""},{"$f":"IF(B133=\"Aggiungere Secondo Processore\",\"\",(VLOOKUP(B133,  PCI_C4, 3, FALSE)))","v":""},{"$f":"VLOOKUP($B$133,  PCI_C6, 5, FALSE)","v":""},{"$f":"VLOOKUP($B$133,  PCI_C6, 6, FALSE)","v":""},{"$f":"VLOOKUP($B$133,  PCI_C6, 7, FALSE)","v":0}]
[]
[null,"Pannello frontale"]
[null,"No Bezel",1,null,"[350-BBBW]"]
[]
[null,"Guide per rack"]
[null,"No Rack Rails, No Cable Management Arm, No Casters",1,null,"[770-BBCR]"]
[]
[null,"Unità ottica interna"]
[null,"No Internal Optical Drive",1,null,"[429-AAIQ][429-AAQS]"]
[]
[null,"Accessori per server"]
[null,"Redundant Fan Option",1,null,"[750-AAFF]"]
[]
[null,"PowerEdge SFP+, 10GbE SR/SX, Optical Tranceiver, LC Connector, for Intel and Broadcom,CusKit",{"$f":"(VLOOKUP(B121,PCI_C2,8,FALSE))+((VLOOKUP(B118,PCI_C1,8,FALSE)))+((VLOOKUP(B124,PCI_C3,8,FALSE)))+((VLOOKUP(B127,PCI_C4,8,FALSE)))+((VLOOKUP(B130,PCI_C5,8,FALSE)))+((VLOOKUP(B133,PCI_C6,8,FALSE)))","v":{"$error":"#VALUE!"}},null,"[407-BBQE]"]
[]
[null,"Opzione RDX"]
[null,"None",{"$f":"VLOOKUP($B$150,RDX, 2, FALSE)","v":0},{"$f":"VLOOKUP($B$150,RDX, 3, FALSE)","v":""},{"$f":"VLOOKUP($B$150,RDX, 4, FALSE)","v":""},{"$f":"VLOOKUP($B$150,RDX, 6, FALSE)","v":""},{"$f":"VLOOKUP($B$150,RDX, 7, FALSE)","v":0}]
[]
[null,"System Documentation"]
[null,"Electronic System Documentation and OpenManage DVD Kit, PowerEdge T630",1,null,"[343-BBDE]"]
[]
[null,"SHIPPING"]
[null,"PowerEdge T630 Shipping EMEA1 (English/French/German/Spanish/Russian/Hebrew)",1,null,"[340-AMBT]"]
[]
[null,"Order Information"]
[null,"Enterprise Order - EMEA",1,null,"[800-11671]"]
[]
[null,"Base warranty"]
[null,"3Yr Basic Warranty - Next Business Day - Minimum Warranty",1,null,"[709-12798][709-12799]"]
[]
[null,"Servizi di assitenza"]
[null,"Dell Channel Order - Service Info only",1,null,"[710-31085]"]
[]
[null,"Aggiornamenti della garanzia"]
[null,"None",{"$f":"VLOOKUP($B$168,  SO_C1, 2, FALSE)","v":""},{"$f":"VLOOKUP($B$168,  SO_C1, 3, FALSE)","v":""},{"$f":"VLOOKUP($B$168,  SO_C1, 5, FALSE)","v":""},{"$f":"VLOOKUP($B$168,  SO_C1, 6, FALSE)","v":""}]
[]
[null,"Protezione dei dati - Keep Your Hard Drive "]
[null,"None",{"$f":"VLOOKUP($B$171,  SO_C2, 2, FALSE)","v":""},{"$f":"VLOOKUP($B$171,  SO_C2, 3, FALSE)","v":""},{"$f":"VLOOKUP($B$171,  SO_C2,5, FALSE)","v":""},{"$f":"VLOOKUP($B$171,  SO_C2, 6, FALSE)","v":""}]
[]
[null,"Servizi di Installazione"]
[null,"No Installation Service Selected",1,null,"[683-11870]"]
[]
[null,"Channel only - Support Extension"]
[null,"Channel 39M Basic Warranty - Next Business Day",1,null,"[723-28783]"]
[]
[null,"Warranty Upgrades - Non-Std/Local POS"]
[null,"CSTM CONSIP - 39M Onsite Labor Support for CRU for Servers with Basic Warranty",1,null,"[681-24467]"]

{"sheet":"RACK, Accessori e Servizi","index":7,"n_rows":83,"n_cols":17,"rows_kept":83,"cut":false,"hidden":false,"merged":[[74,2,74,7],[78,2,78,7],[82,2,82,7],[73,2,73,4],[72,12,83,12],[54,2,54,6],[14,2,14,7],[29,2,29,7],[23,2,23,7],[26,2,26,7],[30,4,30,7],[17,2,17,7],[18,4,18,7],[20,2,20,7],[0,0,0,22],[1,3,1,8],[15,4,15,7],[24,4,24,7],[27,4,27,7],[12,13,30,17],[5,2,5,7],[7,2,7,7],[9,2,9,7],[12,12,30,12],[3,12,10,12],[10,4,10,7]]}
["IN ROSSO LE OPZIONI 20%"]
[null,null,null,"Indicare il numero delle Opzioni"]
[]
[null,null,null,null,null,null,null,null,null,null,null,null,"SERVIZI"]
[null,null,{"$f":"IF(SRV_A+SRV_B+SRV_C>=1,\"Servizi Specialistici\",\"\")","v":""}]
[null,null,{"$f":"IF(SRV_A+SRV_B+SRV_C>=1,\"Servizio Specialistico di System and Network Management per sistema opertivo Windows, erogato on site. (GG/Uomo)\",\"\")","v":""},null,null,null,null,null,null,null,{"$f":"IF(J6>=1,\"10L1-SO-WIN\",\"\")","v":""}]
[]
[null,null,{"$f":"IF(SRV_A+SRV_B+SRV_C>=1,\"Servizio Specialistico di System and Network Management per sistema opertivo Linux, erogato on site. (GG/Uomo)\",\"\")","v":""},null,null,null,null,null,null,null,{"$f":"IF(J8>=1,\"10L1-SO-LINUX\",\"\")","v":""}]
[]
[null,null,{"$f":"IF((SRV_A+SRV_AA+SRV_AAA+SRV_B+SRV_BB+SRV_BBB+SRV_C)>=5,\"Servizi specialistici sistemistici per aggiornare e prevenire malfunzionamenti. \n(Minimo 5 Server)\",\"\")","v":""},null,null,null,null,null,null,null,{"$f":"IF(J10>=1,\"10L1-SO-PREV\",\"\")","v":""}]
[]
[]
[null,null,null,null,null,null,null,null,null,null,null,null,"SERVER RACK"]
[null,null,{"$f":"IF(SRV_A+SRV_B1.1+SRV_B+SRV_C>=1,\"Rack (OpzRack)\",\"\")","v":""}]
[null,null,{"$f":"IF(SRV_A+SRV_B1.1+SRV_B+SRV_C>=1,\"Tecnosteel: armadio Rack 19'' 42U\",\"\")","v":""},null,null,null,null,null,null,null,{"$f":"IF(J15>=1,\"TS1L1-RACK\",\"\")","v":""}]
[]
[null,null,{"$f":"IF(SRV_A+SRV_B1.1+SRV_B+SRV_C>=1,\"PDU (OpzPDU32A)\",\"\")","v":""}]
[null,null,{"$f":"IF(SRV_A+SRV_B1.1+SRV_B+SRV_C>=1,\"PDU Vertical 20+4 outlets C13 with MCB - IEC60309 input\",\"\")","v":""},null,null,null,null,null,null,null,{"$f":"IF(J18>=1,\"TS1-646861\",\"\")","v":""}]
[]
[null,null,{"$f":"IF(SRV_A+SRV_B1.1+SRV_B+SRV_C>=1,\"PDU (OpzPDU_TRIFASE)\",\"\")","v":""}]
[null,null,{"$f":"IF(SRV_A+SRV_B1.1+SRV_B+SRV_C>=1,\"PDU Vertical  18+6 outlets (C13+C19)  with MCB and ammeter - IEC60309 input - 3 phase\",\"\")","v":""},null,null,null,null,null,null,null,{"$f":"IF(J21>=1,\"TS1-646875\",\"\")","v":""}]
[]
[null,null,{"$f":"IF(SRV_A+SRV_B1.1+SRV_B+SRV_C>=1,\"KVM (OpzGUIRack)\",\"\")","v":""}]
[null,null,{"$f":"IF(SRV_A+SRV_B1.1+SRV_B+SRV_C>=1,\"ORCA: 1U Rackmount Console 17'' with Italian Keyboard\",\"\")","v":""},null,null,null,null,null,null,null,{"$f":"IF(J24>=1,\"TS1L1-GUI\",\"\")","v":""}]
[]
[null,null,{"$f":"IF(SRV_A+SRV_B1.1+SRV_B+SRV_C>=1,\"KVM Option (OpzSWGUIRack)\",\"\")","v":""}]
[null,null,{"$f":"IF(SRV_A+SRV_B1.1+SRV_B+SRV_C>=1,\"Raritan: 16-port remote KVM switch with one remote user\",\"\")","v":""},null,null,null,null,null,null,null,{"$f":"IF(J27>=1,\"TS1L1-KVMIP\",\"\")","v":""}]
[]
[null,null,{"$f":"IF(SRV_A+SRV_B1.1+SRV_B+SRV_C>=1,\"Uninterrupted Power Supply (OpzUPS 3000VA)\",\"\")","v":""}]
[null,null,{"$f":"IF(SRV_A+SRV_B1.1+SRV_B+SRV_C>=1,\"Riello - UPS MSR3000EVO 3000VA 2U Rackmount (SNMP+USB+RS232)\",\"\")","v":""},null,null,null,null,null,null,null,{"$f":"IF(J30>=1,\"TS1L1-UPS\",\"\")","v":""}]
[]
[]
[null,null,null,"Totale-"]
[null,null,null,"RACK A","RACK B","RACK C","RACK D","RACK E","RACK F","RACK G","RACK H","RACK I","RACK J"]
[null,null,{"$f":"J15","v":0},{"$f":"IF(H55>0,IF(C35-H55=0,0,C35-H55),0)","v":0},{"$f":"IF(I55>0,IF(D35-I55=0,0,D35-I55),0)","v":0},0,0,0,0,0,0,0,0]
[]
[]
[null,null,null,"Server Modello 1",null,null,{"$f":"SRV_A","v":0}]
[null,null,null,"Server Modello 2",null,null,{"$f":"SRV_AA","v":0}]
[null,null,null,"Server Modello 3",null,null,{"$f":"SRV_AAA","v":0}]
[null,null,null,"Server Modello 4",null,null,{"$f":"SRV_B","v":0}]
[null,null,null,"Server Modello 5",null,null,{"$f":"SRV_BB","v":0}]
[null,null,null,"Server Modello 6",null,null,{"$f":"SRV_BBB","v":0}]
[]
[null,null,null,null,null,null,null,{"$f":"SUM(H5:H10)+H12+H87*2+H89*2","v":0},0,0,0,0,0,0,0,0,0]
[]
[]
[]
[]
[]
[]
[]
[null,null,"Rack ancora da configurare",null,null,{"$f":"J15-H55-I55-J55-K55-L55-M55-N55-O55-P55-Q55","v":0}]
[]
[null,null,"Indicare il numero di rack per questa configurazione"]
[]
[null,null,null,null,"Totali","da inserire",null,{"$f":"IF(C35>0,\"RACK A\",\"\")","v":""},{"$f":"IF(D35>0,\"RACK B\",\"\")","v":""},{"$f":"IF(E35>0,\"RACK C\",\"\")","v":""},{"$f":"IF(F35>0,\"RACK D\",\"\")","v":""},{"$f":"IF(G35>0,\"RACK E\",\"\")","v":""},{"$f":"IF(H35>0,\"RACK F\",\"\")","v":""},{"$f":"IF(I35>0,\"RACK G\",\"\")","v":""},{"$f":"IF(J35>0,\"RACK H\",\"\")","v":""},{"$f":"IF(K35>0,\"RACK I\",\"\")","v":""},{"$f":"IF(L35>0,\"RACK J\",\"\")","v":""}]
[]
[null,null,"Server Lotto1 R630 Conf.1",null,{"$f":"G38","v":0},{"$f":"(E59-(H59*$H$55)-(I59*$I$55)-(J59*$J$55)-(K59*$K$55)-(L59*$L$55)-(M59*$M$55)-(N59*$N$55)-(O59*$O$55)-(P59*$P$55)-(Q59*$Q$55))","v":0}]
[null,null,{"$f":"IF(G39>0,\"Server Lotto1 R630 Conf.2\",\"\")","v":""},null,0,0]
[null,null,{"$f":"IF(G40>0,\"Server Lotto1 R630 Conf.3\",\"\")","v":""},null,0,0]
[null,null,{"$f":"IF(G41>0,\"Server Lotto1 R730xd Conf.1\",\"\")","v":""},null,0,0]
[null,null,{"$f":"IF(G42>0,\"Server Lotto1 R730xd Conf.2\",\"\")","v":""},null,0,0]
[null,null,{"$f":"IF(G43>0,\"Server Lotto1 R730xd Conf.3\",\"\")","v":""},null,0,0]
[]
[null,null,{"$f":"IF(J24>0,\"OpzGUIRack Disponibili\",\" \")","v":" "},null,{"$f":"J24","v":0},{"$f":"J24-H66*H55-I66*I55-J66*J55-K66*K55-L66*L55-M66*M55-N66*N55-O66*O55-P66*P55-Q66*Q55","v":0}]
[]
[null,null,{"$f":"IF(J27>0,\"OpzSWGUIRack Disponibili\",\" \")","v":" "},null,{"$f":"J27","v":0},{"$f":"J27-H68*H55-I68*I55-J68*J55-K68*K55-L68*L55-M68*M55-N68*N55-O68*O55-P68*P55-Q68*Q55","v":0}]
[]
[null,null,{"$f":"IF(J30>0,\"OpzUPS 3000VA Disponibili\",\" \")","v":" "},null,{"$f":"J30","v":0},{"$f":"J30-H70*H55-I70*I55-J70*J55-K70*K55-L70*L55-M70*M55-N70*N55-O70*O55-P70*P55-Q70*Q55","v":0}]
[]
[]
[null,null,null,null,null,null,null,null,null,null,null,null,"SERVER TOWER"]
[null,null,{"$f":"IF((SRV_D+SRV_E)>=1,\"Uninterrupted Power Supply (UPS)\",\"\")","v":""}]
[null,null,{"$f":"IF((SRV_D+SRV_E)>=1,\"Riello - UPS MSR3000EVO 3000VA Tower (SNMP+USB+RS232)\",\"\")","v":""},null,null,null,null,null,null,null,{"$f":"IF(J75>=1,\"TS1L1-UPS-T\",\"\")","v":""}]
[]
[]
[null,null,{"$f":"IF((SRV_D+SRV_E)>=1,\"Keyboard Video Mouse\",\"\")","v":""}]
[null,null,{"$f":"IF((SRV_D+SRV_E)>=1,\"Dell: Kit Monitor 19'' + Mouse + Keyboard\",\"\")","v":""},null,null,null,null,null,null,null,{"$f":"IF(J79>=1,\"TS1L1-GUI-T\",\"\")","v":""}]
[]
[]
[null,null,{"$f":"IF(SRV_C>=1,\"RDX\",\"\")","v":""}]
[null,null,{"$f":"IF(SRV_C>=1,\"Unità di backup RDX (esterno) + 3 cartucce da 500GB\",\"\")","v":""},null,null,null,null,null,null,null,{"$f":"IF(J83>=1,\"10L1-RDX\",\"\")","v":""}]

{"sheet":"Riepilogo","index":8,"n_rows":508,"n_cols":58,"rows_kept":508,"cut":false,"hidden":false,"merged":[[149,2,149,5],[149,6,149,8],[149,9,149,16],[149,17,149,18],[149,19,149,20],[455,2,455,5],[455,9,455,12],[456,2,456,5],[456,9,456,12],[350,8,350,10],[350,15,350,17],[401,9,401,12],[401,16,401,19],[390,2,390,5],[390,9,390,12],[390,16,390,19],[473,2,473,5],[383,2,383,5],[384,2,384,5],[385,2,385,5],[387,2,387,5],[388,2,388,5],[389,2,389,5],[397,9,397,12],[397,16,397,19],[398,2,398,5],[398,9,398,12],[398,16,398,19],[399,2,399,5],[399,9,399,12],[399,16,399,19],[451,9,451,12],[474,2,474,5],[470,9,470,12],[471,9,471,12],[472,9,472,12],[473,9,473,12],[474,9,474,12],[409,2,409,5],[410,2,410,5],[411,2,411,5],[407,9,407,12],[408,9,408,12],[409,9,409,12],[410,9,410,12],[411,9,411,12],[407,16,407,19],[408,16,408,19],[409,16,409,19],[410,16,410,19],[411,16,411,19],[470,2,470,5],[471,2,471,5],[472,2,472,5],[437,9,437,12],[438,2,438,5],[441,2,441,5],[441,9,441,12],[442,2,442,5],[442,9,442,12],[443,2,443,5],[443,9,443,12],[448,9,448,12],[449,2,449,5],[452,2,452,5],[452,9,452,12],[181,2,181,5],[181,9,181,12],[375,2,375,5],[376,2,376,5],[377,2,377,5],[206,2,206,5],[206,9,206,12],[206,16,206,19],[272,2,272,5],[273,2,273,5],[274,2,274,5],[275,2,275,5],[276,2,276,5],[272,9,272,12],[273,9,273,12],[274,9,274,12],[275,9,275,12],[276,9,276,12],[272,16,272,19],[273,16,273,19],[274,16,274,19],[275,16,275,19],[276,16,276,19],[235,2,235,5],[235,9,235,12],[235,16,235,19],[236,16,236,19],[237,2,237,5],[237,9,237,12],[237,16,237,19],[241,16,241,19],[242,2,242,5],[69,9,69,16],[69,17,69,18],[243,2,243,5],[243,9,243,12],[243,16,243,19],[202,2,202,5],[202,9,202,12],[202,16,202,19],[203,2,203,5],[203,9,203,12],[203,16,203,19],[204,2,204,5],[204,9,204,12],[204,16,204,19],[205,2,205,5],[205,9,205,12],[205,16,205,19],[143,2,143,5],[143,6,143,8],[143,9,143,16],[143,17,143,18],[143,19,143,20],[144,2,144,5],[144,6,144,8],[144,9,144,16],[144,17,144,18],[144,19,144,20],[145,2,145,5],[145,6,145,8],[145,9,145,16],[145,17,145,18],[145,19,145,20],[68,2,68,5],[68,6,68,8],[68,9,68,16],[68,17,68,18],[181,16,181,19],[173,9,173,12],[174,9,174,12],[178,9,178,12],[309,16,309,19],[119,17,119,18],[119,19,119,20],[69,2,69,5],[69,6,69,8],[178,2,178,5],[178,16,178,19],[174,2,174,5],[175,2,175,5],[120,2,120,5],[120,6,120,8],[120,9,120,16],[120,17,120,18],[112,1,112,20],[115,17,115,18],[115,19,115,20],[85,6,85,8],[85,9,85,16],[85,17,85,18],[120,19,120,20],[117,19,117,20],[133,2,133,5],[133,6,133,8],[133,9,133,16],[76,6,76,8],[76,9,76,16],[74,6,74,8],[74,9,74,16],[69,19,69,20],[114,9,114,16],[114,17,114,18],[29,2,29,5],[29,6,29,8],[29,9,29,16],[29,17,29,18],[30,2,30,5],[30,6,30,8],[55,2,55,5],[55,6,55,8],[55,9,55,16],[55,17,55,18],[114,19,114,20],[67,2,67,5],[67,6,67,8],[67,9,67,16],[67,17,67,18],[62,2,62,5],[62,6,62,8],[62,9,62,16],[62,17,62,18],[39,17,39,18],[42,17,42,18],[45,17,45,18],[48,17,48,18],[51,17,51,18],[67,19,67,20],[184,2,184,5],[183,16,183,19],[180,9,180,12],[182,9,182,12],[68,19,68,20],[78,6,78,8],[78,9,78,16],[30,19,30,20],[55,19,55,20],[166,9,166,12],[170,9,170,12],[171,9,171,12],[172,9,172,12],[118,19,118,20],[121,2,121,5],[121,6,121,8],[121,9,121,16],[121,17,121,18],[119,2,119,5],[119,6,119,8],[166,16,166,19],[170,16,170,19],[167,9,167,12],[167,16,167,19],[83,2,83,5],[83,6,83,8],[171,16,171,19],[172,16,172,19],[78,17,78,18],[74,17,74,18],[74,19,74,20],[76,2,76,5],[114,2,114,5],[114,6,114,8],[115,9,115,16],[101,2,101,5],[70,6,70,8],[70,9,70,16],[28,9,28,16],[28,17,28,18],[28,19,28,20],[25,2,25,5],[25,6,25,8],[25,9,25,16],[25,17,25,18],[25,19,25,20],[121,19,121,20],[90,19,90,20],[91,2,91,5],[91,6,91,8],[91,9,91,16],[29,19,29,20],[118,2,118,5],[118,6,118,8],[118,9,118,16],[118,17,118,18],[85,2,85,5],[85,19,85,20],[95,19,95,20],[96,2,96,5],[96,6,96,8],[96,9,96,16],[184,9,184,12],[184,16,184,19],[173,2,173,5],[166,2,166,5],[170,2,170,5],[171,2,171,5],[172,2,172,5],[173,16,173,19],[174,16,174,19],[175,16,175,19],[175,9,175,12],[177,2,177,5],[182,2,182,5],[176,16,176,19],[179,2,179,5],[183,2,183,5],[179,16,179,19],[180,2,180,5],[177,9,177,12],[169,16,169,19],[176,2,176,5],[96,17,96,18],[96,19,96,20],[113,19,113,20],[116,2,116,5],[116,6,116,8],[116,9,116,16],[116,17,116,18],[116,19,116,20],[117,17,117,18],[113,2,113,5],[113,6,113,8],[113,9,113,16],[113,17,113,18],[117,2,117,5],[117,6,117,8],[117,9,117,16],[496,10,496,11],[496,12,496,13],[179,9,179,12],[321,2,321,5],[183,9,183,12],[307,9,307,12],[232,2,232,5],[232,9,232,12],[344,16,344,19],[345,16,345,19],[346,16,346,19],[347,16,347,19],[327,2,327,5],[236,2,236,5],[236,9,236,12],[254,2,254,5],[87,19,87,20],[88,2,88,5],[70,17,70,18],[70,19,70,20],[78,19,78,20],[86,1,86,20],[87,2,87,5],[87,6,87,8],[87,9,87,16],[95,9,95,16],[95,17,95,18],[83,17,83,18],[83,19,83,20],[81,19,81,20],[83,9,83,16],[94,9,94,16],[94,17,94,18],[94,19,94,20],[95,2,95,5],[95,6,95,8],[79,2,79,5],[79,6,79,8],[79,9,79,16],[79,17,79,18],[79,19,79,20],[82,17,82,18],[80,17,80,18],[81,2,81,5],[91,17,91,18],[87,17,87,18],[75,6,75,8],[75,9,75,16],[18,2,18,5],[18,6,18,8],[503,2,506,7],[503,14,506,19],[80,2,80,5],[499,3,500,18],[502,2,502,7],[502,14,502,19],[208,8,208,10],[208,1,208,3],[208,15,208,17],[496,14,496,15],[496,16,496,17],[306,2,306,5],[306,9,306,12],[306,16,306,19],[379,2,379,5],[496,18,496,19],[115,2,115,5],[115,6,115,8],[496,2,496,3],[496,4,496,5],[496,6,496,7],[496,8,496,9],[18,19,18,20],[19,2,19,5],[27,2,27,5],[27,6,27,8],[27,9,27,16],[27,17,27,18],[27,19,27,20],[19,6,19,8],[19,9,19,16],[19,17,19,18],[19,19,19,20],[24,19,24,20],[22,2,22,5],[22,6,22,8],[22,9,22,16],[22,17,22,18],[22,19,22,20],[23,2,23,5],[23,6,23,8],[23,19,23,20],[20,2,20,5],[20,6,20,8],[20,9,20,16],[20,17,20,18],[21,19,21,20],[23,9,23,16],[23,17,23,18],[18,9,18,16],[210,1,226,5],[244,2,244,5],[244,9,244,12],[444,9,444,12],[436,2,436,5],[436,9,436,12],[325,9,325,12],[350,1,350,3],[371,1,371,3],[373,2,373,5],[374,2,374,5],[406,9,406,12],[269,2,269,5],[269,9,269,12],[327,9,327,12],[334,2,334,5],[334,9,334,12],[321,9,321,12],[437,2,437,5],[242,9,242,12],[438,9,438,12],[439,2,439,5],[439,9,439,12],[348,2,348,5],[348,9,348,12],[277,2,277,5],[277,9,277,12],[314,2,314,5],[315,2,315,5],[319,2,319,5],[343,16,343,19],[254,9,254,12],[250,2,250,5],[250,9,250,12],[385,9,385,12],[386,9,386,12],[242,16,242,19],[348,16,348,19],[277,16,277,19],[169,9,169,12],[177,16,177,19],[136,9,136,16],[136,17,136,18],[126,19,126,20],[127,2,127,5],[127,6,127,8],[127,9,127,16],[127,17,127,18],[127,19,127,20],[141,17,141,18],[141,19,141,20],[136,19,136,20],[137,2,137,5],[128,2,128,5],[128,6,128,8],[128,9,128,16],[128,17,128,18],[128,19,128,20],[129,2,129,5],[133,17,133,18],[133,19,133,20],[147,2,147,5],[147,6,147,8],[147,9,147,16],[147,17,147,18],[147,19,147,20],[148,2,148,5],[148,6,148,8],[148,9,148,16],[148,17,148,18],[148,19,148,20],[59,17,59,18],[59,19,59,20],[15,2,15,5],[15,6,15,8],[15,9,15,16],[84,2,84,5],[84,6,84,8],[84,9,84,16],[45,6,45,8],[45,9,45,16],[48,2,48,5],[48,6,48,8],[48,9,48,16],[51,2,51,5],[51,6,51,8],[51,9,51,16],[97,2,97,5],[97,6,97,8],[97,9,97,16],[16,9,16,16],[28,2,28,5],[28,6,28,8],[58,2,58,5],[58,6,58,8],[58,9,58,16],[17,9,17,16],[30,9,30,16],[82,2,82,5],[82,6,82,8],[82,9,82,16],[80,6,80,8],[80,9,80,16],[21,9,21,16],[21,17,21,18],[66,9,66,16],[66,17,66,18],[78,2,78,5],[17,2,17,5],[17,6,17,8],[53,2,53,5],[53,6,53,8],[53,9,53,16],[18,17,18,18],[53,17,53,18],[56,2,56,5],[56,6,56,8],[58,17,58,18],[64,9,64,16],[39,2,39,5],[39,6,39,8],[39,9,39,16],[42,2,42,5],[42,6,42,8],[42,9,42,16],[45,2,45,5],[73,1,73,20],[74,2,74,5],[75,19,75,20],[58,19,58,20],[59,2,59,5],[59,6,59,8],[59,9,59,16],[63,17,63,18],[63,19,63,20],[60,2,60,5],[60,6,60,8],[14,19,14,20],[15,19,15,20],[16,17,16,18],[16,19,16,20],[31,1,31,20],[32,2,32,5],[32,6,32,8],[32,9,32,16],[32,17,32,18],[32,19,32,20],[26,6,26,8],[26,9,26,16],[26,17,26,18],[26,19,26,20],[26,2,26,5],[17,17,17,18],[17,19,17,20],[24,2,24,5],[24,6,24,8],[24,9,24,16],[24,17,24,18],[30,17,30,18],[15,17,15,18],[16,2,16,5],[16,6,16,8],[20,19,20,20],[21,2,21,5],[21,6,21,8],[39,19,39,20],[40,2,40,5],[63,2,63,5],[63,6,63,8],[62,19,62,20],[33,6,33,8],[33,9,33,16],[33,17,33,18],[33,19,33,20],[34,2,34,5],[34,6,34,8],[34,9,34,16],[34,17,34,18],[34,19,34,20],[35,2,35,5],[35,6,35,8],[35,9,35,16],[35,17,35,18],[35,19,35,20],[36,2,36,5],[36,6,36,8],[36,9,36,16],[37,2,37,5],[37,6,37,8],[56,9,56,16],[53,19,53,20],[54,2,54,5],[54,6,54,8],[54,9,54,16],[54,17,54,18],[54,19,54,20],[33,2,33,5],[56,19,56,20],[70,2,70,5],[60,9,60,16],[60,17,60,18],[60,19,60,20],[61,2,61,5],[61,6,61,8],[61,9,61,16],[61,17,61,18],[61,19,61,20],[12,17,12,18],[63,9,63,16],[12,19,12,20],[64,2,64,5],[64,6,64,8],[64,17,64,18],[43,17,43,18],[43,19,43,20],[44,2,44,5],[44,6,44,8],[44,9,44,16],[44,17,44,18],[44,19,44,20],[51,19,51,20],[46,2,46,5],[46,6,46,8],[11,1,11,20],[64,19,64,20],[13,1,13,20],[14,2,14,5],[14,6,14,8],[14,9,14,16],[14,17,14,18],[36,17,36,18],[37,9,37,16],[37,17,37,18],[37,19,37,20],[38,2,38,5],[38,6,38,8],[38,9,38,16],[38,17,38,18],[38,19,38,20],[0,17,1,20],[0,1,0,5],[0,6,0,14],[1,1,1,5],[1,6,1,7],[1,8,5,16],[2,1,2,5],[2,6,2,7],[3,1,3,5],[3,6,3,7],[4,1,4,7],[5,1,5,5],[5,6,5,7],[12,2,12,5],[12,6,12,8],[12,9,12,16],[82,19,82,20],[52,1,52,20],[56,17,56,18],[77,2,77,5],[77,6,77,8],[77,9,77,16],[77,17,77,18],[77,19,77,20],[57,2,57,5],[57,9,57,16],[57,17,57,18],[57,19,57,20],[57,6,57,8],[81,6,81,8],[81,9,81,16],[81,17,81,18],[234,16,234,19],[65,2,65,5],[65,6,65,8],[65,9,65,16],[76,17,76,18],[76,19,76,20],[66,2,66,5],[66,19,66,20],[75,17,75,18],[167,2,167,5],[66,6,66,8],[75,2,75,5],[119,9,119,16],[153,1,153,16],[153,17,153,20],[176,9,176,12],[157,3,158,18],[161,1,161,3],[161,8,161,10],[161,15,161,17],[163,2,163,5],[93,19,93,20],[94,2,94,5],[94,6,94,8],[90,2,90,5],[163,9,163,12],[163,16,163,19],[164,2,164,5],[164,9,164,12],[164,16,164,19],[165,2,165,5],[7,1,7,3],[7,4,7,8],[7,9,7,10],[7,11,7,14],[7,15,7,16],[7,17,7,20],[9,1,9,3],[9,4,9,8],[9,9,9,10],[9,11,9,14],[9,15,9,16],[9,17,9,20],[36,19,36,20],[42,19,42,20],[43,2,43,5],[43,6,43,8],[43,9,43,16],[322,16,322,19],[323,16,323,19],[180,16,180,19],[182,16,182,19],[126,2,126,5],[126,6,126,8],[126,9,126,16],[126,17,126,18],[84,17,84,18],[84,19,84,20],[80,19,80,20],[65,17,65,18],[65,19,65,20],[72,2,72,5],[72,6,72,8],[72,9,72,16],[72,17,72,18],[229,1,229,3],[229,8,229,10],[229,15,229,17],[231,2,231,5],[231,9,231,12],[231,16,231,19],[91,19,91,20],[92,2,92,5],[92,6,92,8],[151,17,151,20],[122,2,122,5],[122,6,122,8],[122,9,122,16],[122,17,122,18],[122,19,122,20],[123,2,123,5],[123,6,123,8],[123,9,123,16],[123,17,123,18],[123,19,123,20],[47,2,47,5],[47,6,47,8],[47,9,47,16],[47,17,47,18],[47,19,47,20],[308,16,308,19],[309,9,309,12],[310,2,310,5],[310,9,310,12],[310,16,310,19],[72,19,72,20],[71,2,71,5],[71,6,71,8],[71,9,71,16],[71,17,71,18],[71,19,71,20],[152,1,152,16],[152,17,152,20],[151,1,151,16],[124,1,124,20],[125,2,125,5],[125,6,125,8],[125,9,125,16],[125,17,125,18],[125,19,125,20],[146,2,146,5],[146,6,146,8],[146,9,146,16],[232,16,232,19],[233,2,233,5],[233,9,233,12],[233,16,233,19],[90,6,90,8],[98,6,98,8],[98,9,98,16],[98,17,98,18],[98,19,98,20],[99,1,99,20],[40,6,40,8],[40,9,40,16],[40,17,40,18],[40,19,40,20],[41,2,41,5],[41,6,41,8],[41,9,41,16],[41,17,41,18],[41,19,41,20],[48,19,48,20],[49,2,49,5],[49,6,49,8],[49,9,49,16],[49,17,49,18],[49,19,49,20],[50,2,50,5],[50,6,50,8],[50,9,50,16],[50,17,50,18],[50,19,50,20],[45,19,45,20],[46,9,46,16],[46,17,46,18],[46,19,46,20],[238,16,238,19],[239,2,239,5],[239,9,239,12],[239,16,239,19],[240,2,240,5],[240,9,240,12],[240,16,240,19],[88,6,88,8],[88,9,88,16],[88,17,88,18],[88,19,88,20],[89,2,89,5],[89,6,89,8],[89,9,89,16],[89,17,89,18],[89,19,89,20],[90,9,90,16],[90,17,90,18],[101,6,101,8],[101,9,101,16],[101,17,101,18],[101,19,101,20],[102,2,102,5],[102,6,102,8],[102,9,102,16],[92,9,92,16],[92,17,92,18],[92,19,92,20],[93,2,93,5],[93,6,93,8],[93,9,93,16],[93,17,93,18],[102,17,102,18],[102,19,102,20],[97,17,97,18],[97,19,97,20],[98,2,98,5],[105,2,105,5],[105,6,105,8],[105,9,105,16],[105,17,105,18],[105,19,105,20],[106,2,106,5],[106,6,106,8],[106,9,106,16],[106,17,106,18],[106,19,106,20],[103,2,103,5],[103,6,103,8],[103,9,103,16],[103,17,103,18],[103,19,103,20],[104,2,104,5],[104,6,104,8],[104,9,104,16],[104,17,104,18],[104,19,104,20],[100,2,100,5],[100,6,100,8],[100,9,100,16],[100,17,100,18],[100,19,100,20],[109,19,109,20],[110,2,110,5],[110,6,110,8],[110,9,110,16],[110,17,110,18],[110,19,110,20],[107,2,107,5],[107,6,107,8],[107,9,107,16],[107,17,107,18],[107,19,107,20],[108,2,108,5],[108,6,108,8],[108,9,108,16],[108,17,108,18],[108,19,108,20],[109,17,109,18],[109,2,109,5],[109,6,109,8],[109,9,109,16],[254,16,254,19],[279,1,279,3],[279,8,279,10],[279,15,279,17],[251,2,251,5],[251,9,251,12],[251,16,251,19],[252,2,252,5],[252,9,252,12],[252,16,252,19],[253,2,253,5],[253,9,253,12],[253,16,253,19],[307,16,307,19],[324,2,324,5],[325,2,325,5],[322,9,322,12],[313,2,313,5],[313,9,313,12],[313,16,313,19],[324,16,324,19],[325,16,325,19],[316,2,316,5],[317,2,317,5],[318,2,318,5],[316,9,316,12],[317,9,317,12],[318,9,318,12],[316,16,316,19],[317,16,317,19],[318,16,318,19],[309,2,309,5],[111,2,111,5],[111,6,111,8],[111,9,111,16],[111,17,111,18],[111,19,111,20],[386,2,386,5],[371,8,371,10],[373,9,373,12],[374,9,374,12],[375,9,375,12],[376,9,376,12],[377,9,377,12],[378,9,378,12],[379,9,379,12],[380,9,380,12],[381,9,381,12],[244,16,244,19],[245,2,245,5],[245,9,245,12],[245,16,245,19],[246,2,246,5],[246,9,246,12],[246,16,246,19],[241,2,241,5],[241,9,241,12],[250,16,250,19],[247,2,247,5],[247,9,247,12],[247,16,247,19],[248,2,248,5],[248,9,248,12],[382,9,382,12],[210,15,226,19],[434,1,434,3],[434,8,434,10],[371,15,371,17],[373,16,373,19],[374,16,374,19],[375,16,375,19],[376,16,376,19],[377,16,377,19],[378,16,378,19],[379,16,379,19],[380,16,380,19],[381,16,381,19],[382,16,382,19],[383,16,383,19],[384,16,384,19],[385,16,385,19],[386,16,386,19],[387,16,387,19],[388,16,388,19],[389,16,389,19],[413,15,413,17],[387,9,387,12],[388,9,388,12],[389,9,389,12],[413,8,413,10],[383,9,383,12],[384,9,384,12],[248,16,248,19],[249,2,249,5],[249,9,249,12],[249,16,249,19],[445,9,445,12],[446,2,446,5],[446,9,446,12],[413,1,413,3],[380,2,380,5],[381,2,381,5],[382,2,382,5],[210,8,226,12],[238,2,238,5],[238,9,238,12],[307,2,307,5]],"merged_total":1358,"flags":["merged_cut"]}
[null,"Amministrazione ",null,null,null,null,null,null,null,null,null,null,null,null,null,null,null,"CONFIGURATORE ELETTRONICO CONVENZIONE CONSIP \nTECNOLOGIE SERVER 1 LOTTO 1",null,null,null,1]
[null,"N° Identificativo Ordine ",null,null,null,null,null,null,{"$f":"IF(G4=R154,\"Configurazione OK\",U4)","v":"Configurazione OK"},null,null,null,null,null,null,null,null,null,null,null,null,1]
[null,"Data Ordine",null,null,null,null,null,null,null,null,null,null,null,null,null,null,null,null,null,null,null,1]
[null,"Tot Ordine Portale CONSIP IVA incl.",null,null,null,null,{"$f":"R154","v":0},null,null,null,null,null,null,null,null,null,null,null,null,null,"Nel \"Tot Ordine Portale CONSIP\" deve essere inserito l'importo totale risultante dall'ordinativo del portale CONSIP.\nQualora l'importo inserito corrisponde al valore ricalcolato dal configuratore viene attivato il pulsante \"Salva in formato PDF\" che permette di generare il file pdf da allegare all'ordinativo.",1]
[null,"LE CELLE IN GIALLO DEVO ESSERE COMPILATE OBBLIGATORIAMENTE",null,null,null,null,null,null,null,null,null,null,null,null,null,null,null,null,null,null,null,1]
[null,"Quantità Server Ordinati",null,null,null,null,{"$f":"IF(B54=\"\",0,B54)+IF(B15=\"\",0,B15)+IF(B75=\"\",0,B75)+IF(B33=\"\",0,B33)+IF(B88=\"\",0,B88)+IF(B101=\"\",0,B101)","v":0},null,null,null,null,null,null,null,null,null,null,null,null,"ver. 3.1",null,1]
[null,null,null,null,null,null,null,null,null,null,null,null,null,null,null,null,null,null,null,null,null,1]
[null,"Referente per la Consegna",null,null,null,null,null,null,null,"Telefono",null,null,null,null,null,"email",null,null,null,null,null,1]
[null,null,null,null,null,null,null,null,null,null,null,null,null,null,null,null,null,null,null,null,null,1]
[null,"Referente per l'installazione",null,null,null,null,null,null,null,"Telefono",null,null,null,null,null,"email",null,null,null,null,null,1]
[null,null,null,null,null,null,null,null,null,null,null,null,null,null,null,null,null,null,null,null,null,1]
[null,"ATTENZIONE: I CODICI PRODOTTO DELL'ORDINE CONSIP DEVONO ESSERE SPECULARI A QUELLI GENERATI DAL CONFIGURATORE.",null,null,null,null,null,null,null,null,null,null,null,null,null,null,null,null,null,null,null,1]
[null,"Qtà Totale Ordinata","Oggetto di fornitura",null,null,null,"Codice Prodotto",null,null,"Descrizione Sintetica (si faccia riferimento alla guida alla convenzione per la descrizione estesa e per le regole di acquisto delle opzioni)",null,null,null,null,null,null,null,"Costo Unitario",null,"Costo Complessivo",null,1]
[null,"RACK BASE (DELL POWEREDGE R630)",null,null,null,null,null,null,null,null,null,null,null,null,null,null,null,null,null,null,null,{"$f":"IF(B15>=\"\",0,1)","v":0},null,"Server1","Server2","Server3"]
[null,{"$f":"IF(AK15>=1,AK15,\"\")","v":""},{"$f":"IF(AK15>0,(VLOOKUP(G15,COD_A,2,FALSE)),\"\")","v":""},null,null,null,{"$f":"IF(AK15>=1,W15,\"\")","v":""},null,null,{"$f":"IF(AK15>0,(VLOOKUP(G15,COD_A,5,FALSE)),\"\")","v":""},null,null,null,null,null,null,null,{"$f":"IF(AK15>0,(VLOOKUP(G15,COD_A,3,FALSE)),\"\")","v":""},null,{"$f":"IF(B15=\"\",\"\",R15*B15)","v":""},null,{"$f":"IF(B15>=\"\",0,1)","v":0},"TS1L1-R630",{"$f":"SRV_A","v":0},{"$f":"SRV_AA","v":0},{"$f":"SRV_AAA","v":0},null,null,null,null,null,null,null,null,null,null,{"$f":"SUM(X15:AJ15)","v":0}]
[null,{"$f":"IF(AK16>=1,AK16,\"\")","v":""},"",null,null,null,"",null,null,"",null,null,null,null,null,null,null,"",null,{"$f":"IF(B16=\"\",\"\",R16*B16)","v":""},null,{"$f":"IF(B16>=\"\",0,1)","v":0},"TS1L1-CPU-R630",{"$f":"'Lotto1 R630 1'!$C$29","v":0},{"$f":"'Lotto1 R630 2'!$C$29","v":0},{"$f":"'Lotto1 R630 3'!$C$29","v":0},null,null,null,null,null,null,null,{"$f":"X16*$X$15","v":0},{"$f":"Y16*$Y$15","v":0},{"$f":"Z16*$Z$15","v":0},{"$f":"SUM(AH16:AJ16)","v":0}]
[null,{"$f":"IF(AK17>=1,AK17,\"\")","v":""},"",null,null,null,"",null,null,"",null,null,null,null,null,null,null,"",null,{"$f":"IF(B17=\"\",\"\",R17*B17)","v":""},null,0,"TS1L1-32GB",{"$f":"IF(MEM_A=\"\",0,MEM_A)","v":0},{"$f":"IF(MEM_AA=\"\",0,MEM_AA)","v":0},{"$f":"IF(MEM_AAA=\"\",0,MEM_AAA)","v":0},null,null,null,null,null,null,null,{"$f":"X17*$X$15","v":0},{"$f":"Y17*$Y$15","v":0},{"$f":"Z17*$Z$15","v":0},0]
[null,"","",null,null,null,"",null,null,"",null,null,null,null,null,null,null,"",null,"",null,0,null,{"$f":"IF(MEM_A32=\"\",0,MEM_A32)","v":0},{"$f":"IF(MEM_AA32=\"\",0,MEM_AA32)","v":0},{"$f":"IF(MEM_AAA32=\"\",0,MEM_AAA32)","v":0},null,null,null,null,null,null,null,{"$f":"X18*$X$15","v":0},{"$f":"Y18*$Y$15","v":0},{"$f":"Z18*$Z$15","v":0},0]
[null,"","",null,null,null,"",null,null,"",null,null,null,null,null,null,null,"",null,"",null,0,"TS1L1-1GB-L",{"$f":"COUNTIF($AU$19:$AU$20,W19)","v":0},{"$f":"COUNTIF($AV$19:$AV$20,W19)","v":0},{"$f":"COUNTIF($AW$19:$AW$20,W19)","v":0},null,null,null,null,null,null,null,{"$f":"X19*$X$15","v":0},{"$f":"Y19*$Y$15","v":0},{"$f":"Z19*$Z$15","v":0},0,null,null,"slot1",null,null,null,null,null,null,{"$f":"'Lotto1 R630 1'!$D$126","v":""},{"$f":"'Lotto1 R630 2'!$D$126","v":""},{"$f":"'Lotto1 R630 3'!$D$126","v":""}]
[null,"","",null,null,null,"",null,null,"",null,null,null,null,null,null,null,"",null,"",null,0,"TS1L1-1GB",0,0,0,null,null,null,null,null,null,null,{"$f":"X20*$X$15","v":0},{"$f":"Y20*$Y$15","v":0},{"$f":"Z20*$Z$15","v":0},0,null,null,"slot2",null,null,null,null,null,null,{"$f":"'Lotto1 R630 1'!$D$129","v":""},{"$f":"'Lotto1 R630 2'!$D$129","v":""},{"$f":"'Lotto1 R630 3'!$D$129","v":""}]
[null,"","",null,null,null,"",null,null,"",null,null,null,null,null,null,null,"",null,"",null,0,"TS1L1-10GB-L",0,0,0,null,null,null,null,null,null,null,{"$f":"X21*$X$15","v":0},{"$f":"Y21*$Y$15","v":0},{"$f":"Z21*$Z$15","v":0},0]
[null,"","",null,null,null,"",null,null,"",null,null,null,null,null,null,null,"",null,"",null,0,"TS1L1-10GB",0,0,0,null,null,null,null,null,null,null,0,0,0,0]
[null,"","",null,null,null,"",null,null,"",null,null,null,null,null,null,null,"",null,"",null,0,"TS1L1-CNA-L",0,0,0,null,null,null,null,null,null,null,0,0,0,0]
[null,"","",null,null,null,"",null,null,"",null,null,null,null,null,null,null,"",null,"",null,0,"TS1L1-CNA",0,0,0,null,null,null,null,null,null,null,{"$f":"X24*$X$15","v":0},0,0,0]
[null,"","",null,null,null,"",null,null,"",null,null,null,null,null,null,null,"",null,"",null,0,null,0,0,0,null,null,null,null,null,null,null,0,0,0,0]
[null,{"$f":"IF(AK26>=1,AK26,\"\")","v":""},"",null,null,null,"",null,null,"",null,null,null,null,null,null,null,"",null,"",null,0,"TS1L1-FC",0,0,0,null,null,null,null,null,null,null,0,0,0,0]
[null,"","",null,null,null,"",null,null,"",null,null,null,null,null,null,null,"",null,"",null,0,"TS1L1-HD300",{"$f":"HD300_A","v":0},{"$f":"HD300_AA","v":0},{"$f":"HD300_AAA","v":0},null,null,null,null,null,null,null,{"$f":"X27*$X$15","v":0},{"$f":"Y27*$Y$15","v":0},{"$f":"Z27*$Z$15","v":0},0]
[null,"","",null,null,null,"",null,null,"",null,null,null,null,null,null,null,"",null,"",null,0,"TS1L1-HD1200",{"$f":"HD1000_A","v":0},{"$f":"HD1000_AA","v":0},{"$f":"HD1000_AAA","v":0},null,null,null,null,null,null,null,{"$f":"X28*$X$15","v":0},{"$f":"Y28*$Y$15","v":0},{"$f":"Z28*$Z$15","v":0},0]
[null,"","",null,null,null,"",null,null,"",null,null,null,null,null,null,null,"",null,"",null,0,"TS1L1-4ANNI",{"$f":"IF('Lotto1 R630 1'!$D$159=W29,'Lotto1 R630 1'!$C$159,0)","v":0},{"$f":"IF('Lotto1 R630 2'!$D$159=W29,'Lotto1 R630 2'!$C$159,0)","v":0},{"$f":"IF('Lotto1 R630 3'!$D$159=W29,'Lotto1 R630 3'!$C$159,0)","v":0},null,null,null,null,null,null,null,{"$f":"X29*$X$15","v":0},{"$f":"Y29*$Y$15","v":0},{"$f":"Z29*$Z$15","v":0},0]
[null,"","",null,null,null,"",null,null,"",null,null,null,null,null,null,null,"",null,"",null,0,"TS1L1-5ANNI",{"$f":"IF('Lotto1 R630 1'!$D$159=W30,'Lotto1 R630 1'!$C$159,0)","v":0},{"$f":"IF('Lotto1 R630 2'!$D$159=W30,'Lotto1 R630 2'!$C$159,0)","v":0},{"$f":"IF('Lotto1 R630 3'!$D$159=W30,'Lotto1 R630 3'!$C$159,0)","v":0},null,null,null,null,null,null,null,{"$f":"X30*$X$15","v":0},{"$f":"Y30*$Y$15","v":0},{"$f":"Z30*$Z$15","v":0},0]
[null,"","",null,null,null,"",null,null,"",null,null,null,null,null,null,null,"",null,"",null,0,"10L1-SO-HDD",{"$f":"IF('Lotto1 R630 1'!$D$162=W31,'Lotto1 R630 1'!$C$162,0)","v":0},{"$f":"IF('Lotto1 R630 2'!$D$162=W31,'Lotto1 R630 2'!$C$162,0)","v":0},{"$f":"IF('Lotto1 R630 3'!$D$162=W31,'Lotto1 R630 3'!$C$162,0)","v":0},null,null,null,null,null,null,null,{"$f":"X31*$X$15","v":0},{"$f":"Y31*$Y$15","v":0},{"$f":"Z31*$Z$15","v":0},0,null,{"$f":"IF(X31=0,0,IF(X31+X30=2,5,IF(X31+X29=2,4,3)))","v":0},{"$f":"IF(Y31=0,0,IF(Y31+Y30=2,5,IF(Y31+Y29=2,4,3)))","v":0},null,null,null,null,null,null,{"$f":"IF(Z31=0,0,IF(Z31+Z30=2,5,IF(Z31+Z29=2,4,3)))","v":0},{"$f":"IF(AM31=5,$AV$86,IF(AM31=4,$AU$86,IF(AM31=3,$AN$86,\"\")))","v":""},{"$f":"IF(AN31=5,$AV$86,IF(AN31=4,$AU$86,IF(AN31=3,$AN$86,\"\")))","v":""},null,{"$f":"IF(AU31=5,$AV$86,IF(AU31=4,$AU$86,IF(AU31=3,$AN$86,\"\")))","v":""}]
[null,"SERVER RACK PRESTAZIONALE (DELL POWEREDGE R730)",null,null,null,null,null,null,null,null,null,null,null,null,null,null,null,null,null,null,null,{"$f":"IF(B33>=\"\",0,1)","v":0},"R730xd","Server1","Server2","Server3"]
[null,{"$f":"IF(AK33>=1,AK33,\"\")","v":""},{"$f":"IF(AK33>0,(VLOOKUP(G33,COD_B,2,FALSE)),\"\")","v":""},null,null,null,{"$f":"IF(AK33>=1,W33,\"\")","v":""},null,null,{"$f":"IF(AK33>0,(VLOOKUP(G33,COD_B,5,FALSE)),\"\")","v":""},null,null,null,null,null,null,null,{"$f":"IF(AK33>0,(VLOOKUP(G33,COD_B,3,FALSE)),\"\")","v":""},null,{"$f":"IF(B33=\"\",\"\",R33*B33)","v":""},null,{"$f":"IF(B33>=\"\",0,1)","v":0},"TS1L1-R730",{"$f":"SRV_B1.1","v":0},{"$f":"SRV_B1.2","v":0},{"$f":"SRV_B1.3","v":0},null,null,null,null,null,null,null,null,null,null,{"$f":"SUM(X33:AJ33)","v":0}]
[null,{"$f":"IF(AK34>=1,AK34,\"\")","v":""},"",null,null,null,"",null,null,"",null,null,null,null,null,null,null,"",null,"",null,0,"TS1L1-CPU-R730",{"$f":"'Lotto1 R730 1'!$C$29","v":0},{"$f":"'Lotto1 R730 2'!$C$29","v":0},{"$f":"'Lotto1 R730 3'!$C$29","v":0},null,null,null,null,null,null,null,{"$f":"X34*$X$33","v":0},{"$f":"Y34*$Y$33","v":0},{"$f":"Z34*$Z$33","v":0},{"$f":"SUM(AH34:AJ34)","v":0}]
[null,"","",null,null,null,"",null,null,"",null,null,null,null,null,null,null,"",null,"",null,0,"TS1L1-32GB",{"$f":"IF(MEM_B1.1=\"\",0,MEM_B1.1)","v":0},{"$f":"IF(MEM_B1.2=\"\",0,MEM_B1.2)","v":0},{"$f":"IF(MEM_B1.3=\"\",0,MEM_B1.3)","v":0},null,null,null,null,null,null,null,{"$f":"X35*$X$33","v":0},{"$f":"Y35*$Y$33","v":0},{"$f":"Z35*$Z$33","v":0},0]
[null,"","",null,null,null,"",null,null,"",null,null,null,null,null,null,null,"",null,"",null,0,null,{"$f":"IF(MEM_B321.1=\"\",0,MEM_B321.1)","v":0},{"$f":"IF(MEM_B321.2=\"\",0,MEM_B321.2)","v":0},{"$f":"IF(MEM_B321.3=\"\",0,MEM_B321.3)","v":0},null,null,null,null,null,null,null,{"$f":"X36*$X$33","v":0},{"$f":"Y36*$Y$33","v":0},{"$f":"Z36*$Z$33","v":0},0,null,null,null,null,null,null,null,null,null,"730 1","730 2","730 3"]
[null,"","",null,null,null,"",null,null,"",null,null,null,null,null,null,null,"",null,"",null,0,null,{"$f":"COUNTIF($AU$37:$AU$42,W37)","v":0},{"$f":"COUNTIF($AV$37:$AV$42,W37)","v":0},{"$f":"COUNTIF($AW$37:$AW$42,W37)","v":0},null,null,null,null,null,null,null,0,0,0,0,null,null,"slot1",null,null,null,null,null,null,{"$f":"'Lotto1 R730 1'!$D$126","v":""},{"$f":"'Lotto1 R730 2'!$D$126","v":""},{"$f":"'Lotto1 R730 3'!$D$126","v":""}]
[null,"","",null,null,null,"",null,null,"",null,null,null,null,null,null,null,"",null,"",null,0,"TS1L1-1GB-L",{"$f":"COUNTIF($AU$37:$AU$43,W38)","v":0},{"$f":"COUNTIF($AV$37:$AV$43,W38)","v":0},{"$f":"COUNTIF($AW$37:$AW$43,W38)","v":0},null,null,null,null,null,null,null,0,0,0,0,null,null,"slot2",null,null,null,null,null,null,{"$f":"'Lotto1 R730 1'!$D$129","v":""},{"$f":"'Lotto1 R730 2'!$D$129","v":""},{"$f":"'Lotto1 R730 3'!$D$129","v":""}]
[null,"","",null,null,null,"",null,null,"",null,null,null,null,null,null,null,"",null,"",null,0,"TS1L1-1GB",{"$f":"COUNTIF($AU$37:$AU$43,W39)","v":0},{"$f":"COUNTIF($AV$37:$AV$43,W39)","v":0},{"$f":"COUNTIF($AW$37:$AW$43,W39)","v":0},null,null,null,null,null,null,null,0,0,0,0,null,null,"slot3",null,null,null,null,null,null,{"$f":"'Lotto1 R730 1'!$D$132","v":""},{"$f":"'Lotto1 R730 2'!$D$132","v":""},{"$f":"'Lotto1 R730 3'!$D$132","v":""}]
[null,"","",null,null,null,"",null,null,"",null,null,null,null,null,null,null,"",null,"",null,0,"TS1L1-10GB-L",0,0,0,null,null,null,null,null,null,null,0,0,0,0,null,null,"slot4",null,null,null,null,null,null,{"$f":"'Lotto1 R730 1'!$D$135","v":""},{"$f":"'Lotto1 R730 2'!$D$135","v":""},{"$f":"'Lotto1 R730 3'!$D$135","v":""}]
[null,"","",null,null,null,"",null,null,"",null,null,null,null,null,null,null,"",null,"",null,0,"TS1L1-10GB",0,0,0,null,null,null,null,null,null,null,0,0,0,0,null,null,"slot5",null,null,null,null,null,null,{"$f":"'Lotto1 R730 1'!$D$138","v":""},{"$f":"'Lotto1 R730 2'!$D$138","v":""},{"$f":"'Lotto1 R730 3'!$D$138","v":""}]
[null,"","",null,null,null,"",null,null,"",null,null,null,null,null,null,null,"",null,"",null,0,"TS1L1-CNA-L",0,0,0,null,null,null,null,null,null,null,0,0,0,0,null,null,"slot6",null,null,null,null,null,null,{"$f":"'Lotto1 R730 1'!$D$141","v":""},{"$f":"'Lotto1 R730 2'!$D$141","v":""},{"$f":"'Lotto1 R730 3'!$D$141","v":""}]
[null,"","",null,null,null,"",null,null,"",null,null,null,null,null,null,null,"",null,"",null,0,"TS1L1-CNA",0,0,0,null,null,null,null,null,null,null,0,0,0,0,null,null,"slot7",null,null,null,null,null,null,{"$f":"'Lotto1 R730 1'!$D$144","v":""},{"$f":"'Lotto1 R730 2'!$D$144","v":""},{"$f":"'Lotto1 R730 3'!$D$144","v":""}]
[null,"","",null,null,null,"",null,null,"",null,null,null,null,null,null,null,"",null,"",null,0,"TS1L1-FC",0,0,0,null,null,null,null,null,null,null,0,0,0,0]
[null,"","",null,null,null,"",null,null,"",null,null,null,null,null,null,null,"",null,"",null,0,"TS1L1-HD300",{"$f":"HD300_B1.1","v":0},{"$f":"HD300_B1.2","v":0},{"$f":"HD300_B1.3","v":0},null,null,null,null,null,null,null,0,0,0,0]
[null,"","",null,null,null,"",null,null,"",null,null,null,null,null,null,null,"",null,"",null,0,"TS1L1-HD1200",{"$f":"HD1000_B1.1","v":0},{"$f":"HD1000_B1.2","v":0},{"$f":"HD1000_B1.3","v":0},null,null,null,null,null,null,null,0,0,0,0]
[null,"","",null,null,null,"",null,null,"",null,null,null,null,null,null,null,"",null,"",null,0,"TS1L1-HD1800",{"$f":"'Lotto1 R730 1'!$C$85","v":0},{"$f":"'Lotto1 R730 2'!$C$85","v":0},{"$f":"'Lotto1 R730 3'!$C$85","v":0},null,null,null,null,null,null,null,0,{"$f":"Y47*$Y$33","v":0},{"$f":"Z47*$Z$33","v":0},0]
[null,"","",null,null,null,"",null,null,"",null,null,null,null,null,null,null,"",null,"",null,0,"TS1L1-SSD800",{"$f":"'Lotto1 R730 1'!$C$87","v":0},{"$f":"'Lotto1 R730 2'!$C$87","v":0},{"$f":"'Lotto1 R730 3'!$C$87","v":0},null,null,null,null,null,null,null,0,0,0,0]
[null,"","",null,null,null,"",null,null,"",null,null,null,null,null,null,null,"",null,"",null,0,"TS1L1-SSD1920",{"$f":"'Lotto1 R730 1'!$C$89","v":0},{"$f":"'Lotto1 R730 2'!$C$89","v":0},{"$f":"'Lotto1 R730 3'!$C$89","v":0},null,null,null,null,null,null,null,0,0,0,0]
[null,"","",null,null,null,"",null,null,"",null,null,null,null,null,null,null,"",null,"",null,0,"TS1L1-4ANNI",{"$f":"IF('Lotto1 R730 1'!$D$171=$W$50,'Lotto1 R730 1'!$C$171,0)","v":0},{"$f":"IF('Lotto1 R730 2'!$D$171=$W$50,'Lotto1 R730 2'!$C$171,0)","v":0},{"$f":"IF('Lotto1 R730 3'!$D$171=$W$50,'Lotto1 R730 3'!$C$171,0)","v":0},null,null,null,null,null,null,null,0,0,0,0]
[null,"","",null,null,null,"",null,null,"",null,null,null,null,null,null,null,"",null,"",null,0,"TS1L1-5ANNI",{"$f":"IF('Lotto1 R730 1'!$D$171=$W$51,'Lotto1 R730 1'!$C$171,0)","v":0},{"$f":"IF('Lotto1 R730 2'!$D$171=$W$51,'Lotto1 R730 2'!$C$171,0)","v":0},{"$f":"IF('Lotto1 R730 3'!$D$171=$W$51,'Lotto1 R730 3'!$C$171,0)","v":0},null,null,null,null,null,null,null,0,0,0,0,null,"R730 1 HDDr"]
[null,"","",null,null,null,"",null,null,"",null,null,null,null,null,null,null,"",null,"",null,0,"10L1-SO-HDD",{"$f":"IF('Lotto1 R730 1'!$D$171=W52,'Lotto1 R730 1'!$C$171,0)","v":0},{"$f":"IF('Lotto1 R730 2'!$D$171=$W$73,'Lotto1 R730 2'!$C$171,0)","v":0},{"$f":"IF('Lotto1 R730 3'!$D$171=$W$73,'Lotto1 R730 3'!$C$171,0)","v":0},null,null,null,null,null,null,null,0,0,0,0,null,{"$f":"IF(X52=0,0,IF(X52+X51=2,5,IF(X52+X50=2,4,3)))","v":0},{"$f":"IF(Y52=0,0,IF(Y52+Y51=2,5,IF(Y52+Y50=2,4,3)))","v":0},null,null,null,null,null,null,{"$f":"IF(Z52=0,0,IF(Z52+Z51=2,5,IF(Z52+Z50=2,4,3)))","v":0},{"$f":"IF(AM52=5,$AV$86,IF(AM52=4,$AU$86,IF(AM52=3,$AN$86,\"\")))","v":""},{"$f":"IF(AN52=5,$AV$86,IF(AN52=4,$AU$86,IF(AN52=3,$AN$86,\"\")))","v":""},null,{"$f":"IF(AU52=5,$AV$86,IF(AU52=4,$AU$86,IF(AU52=3,$AN$86,\"\")))","v":""}]
[null,"SERVER RACK PRESTAZIONALE ALTERNATIVO (DELL POWEREDGE R730XD)",null,null,null,null,null,null,null,null,null,null,null,null,null,null,null,null,null,null,null,{"$f":"IF(B54>=\"\",0,1)","v":0},"R730xd","Server1","Server2","Server3"]
[null,{"$f":"IF(AK54>=1,AK54,\"\")","v":""},{"$f":"IF(AK54>0,(VLOOKUP(G54,COD_B,2,FALSE)),\"\")","v":""},null,null,null,{"$f":"IF(AK54>=1,W54,\"\")","v":""},null,null,{"$f":"IF(AK54>0,(VLOOKUP(G54,COD_B,5,FALSE)),\"\")","v":""},null,null,null,null,null,null,null,{"$f":"IF(AK54>0,(VLOOKUP(G54,COD_B,3,FALSE)),\"\")","v":""},null,{"$f":"IF(B54=\"\",\"\",R54*B54)","v":""},null,0,"TS1L1-R730XD",{"$f":"SRV_B","v":0},{"$f":"SRV_BB","v":0},{"$f":"SRV_BBB","v":0},null,null,null,null,null,null,null,null,null,null,{"$f":"SUM(X54:AJ54)","v":0}]
[null,{"$f":"IF(AK55>=1,AK55,\"\")","v":""},"",null,null,null,"",null,null,"",null,null,null,null,null,null,null,"",null,"",null,0,"TS1L1-CPU-R730X",{"$f":"'Lotto1 R730xd 1'!$C$29","v":0},{"$f":"'Lotto1 R730xd 2'!$C$29","v":0},{"$f":"'Lotto1 R730xd 3'!$C$29","v":0},null,null,null,null,null,null,null,{"$f":"X55*$X$54","v":0},{"$f":"Y55*$Y$54","v":0},{"$f":"Z55*$Z$54","v":0},{"$f":"SUM(AH55:AJ55)","v":0}]
[null,"","",null,null,null,"",null,null,"",null,null,null,null,null,null,null,"",null,{"$f":"IF(B56=\"\",\"\",R56*B56)","v":""},null,0,"TS1L1-32GB",{"$f":"IF(MEM_B=\"\",0,MEM_B)","v":0},{"$f":"IF(MEM_BB=\"\",0,MEM_BB)","v":0},{"$f":"IF(MEM_BBB=\"\",0,MEM_BBB)","v":0},null,null,null,null,null,null,null,{"$f":"X56*$X$54","v":0},{"$f":"Y56*$Y$54","v":0},{"$f":"Z56*$Z$54","v":0},0]
[null,"","",null,null,null,"",null,null,"",null,null,null,null,null,null,null,"",null,"",null,0,null,{"$f":"IF(MEM_B32=\"\",0,MEM_B32)","v":0},{"$f":"IF(MEM_BB32=\"\",0,MEM_BB32)","v":0},{"$f":"IF(MEM_BBB32=\"\",0,MEM_BBB32)","v":0},null,null,null,null,null,null,null,{"$f":"X57*$X$54","v":0},{"$f":"Y57*$Y$54","v":0},{"$f":"Z57*$Z$54","v":0},0]
[null,"","",null,null,null,"",null,null,"",null,null,null,null,null,null,null,"",null,"",null,0,null,{"$f":"COUNTIF($AU$58:$AU$63,W58)","v":0},{"$f":"COUNTIF($AV$58:$AV$63,W58)","v":0},{"$f":"COUNTIF($AW$58:$AW$63,W58)","v":0},null,null,null,null,null,null,null,{"$f":"X58*$X$54","v":0},{"$f":"Y58*$Y$54","v":0},{"$f":"Z58*$Z$54","v":0},0,null,null,"slot1",null,null,null,null,null,null,{"$f":"'Lotto1 R730xd 1'!$D$127","v":""},{"$f":"'Lotto1 R730xd 2'!$D$127","v":""},{"$f":"'Lotto1 R730xd 3'!$D$127","v":""}]
[null,"","",null,null,null,"",null,null,"",null,null,null,null,null,null,null,"",null,"",null,0,"TS1L1-1GB-L",0,0,0,null,null,null,null,null,null,null,{"$f":"X59*$X$54","v":0},{"$f":"Y59*$Y$54","v":0},{"$f":"Z59*$Z$54","v":0},0,null,null,"slot2",null,null,null,null,null,null,{"$f":"'Lotto1 R730xd 1'!$D$130","v":""},{"$f":"'Lotto1 R730xd 2'!$D$130","v":""},{"$f":"'Lotto1 R730xd 3'!$D$130","v":""}]
[null,"","",null,null,null,"",null,null,"",null,null,null,null,null,null,null,"",null,"",null,0,"TS1L1-1GB",0,0,0,null,null,null,null,null,null,null,0,0,0,0,null,null,"slot3",null,null,null,null,null,null,{"$f":"'Lotto1 R730xd 1'!$D$133","v":""},{"$f":"'Lotto1 R730xd 2'!$D$133","v":""},{"$f":"'Lotto1 R730xd 3'!$D$133","v":""}]
[null,"","",null,null,null,"",null,null,"",null,null,null,null,null,null,null,"",null,"",null,0,"TS1L1-10GB-L",0,0,0,null,null,null,null,null,null,null,0,0,0,0,null,null,"slot4",null,null,null,null,null,null,{"$f":"'Lotto1 R730xd 1'!$D$136","v":""},{"$f":"'Lotto1 R730xd 2'!$D$136","v":""},{"$f":"'Lotto1 R730xd 3'!$D$136","v":""}]
[null,"","",null,null,null,"",null,null,"",null,null,null,null,null,null,null,"",null,"",null,0,"TS1L1-10GB",0,0,0,null,null,null,null,null,null,null,0,0,0,0,null,null,"slot5",null,null,null,null,null,null,{"$f":"'Lotto1 R730xd 1'!$D$139","v":""},{"$f":"'Lotto1 R730xd 2'!$D$139","v":""},{"$f":"'Lotto1 R730xd 3'!$D$139","v":""}]
[null,"","",null,null,null,"",null,null,"",null,null,null,null,null,null,null,"",null,"",null,0,"TS1L1-CNA-L",0,0,0,null,null,null,null,null,null,null,0,0,0,0,null,null,"slot6",null,null,null,null,null,null,{"$f":"'Lotto1 R730xd 1'!$D$142","v":""},{"$f":"'Lotto1 R730xd 2'!$D$142","v":""},{"$f":"'Lotto1 R730xd 3'!$D$142","v":""}]
[null,"","",null,null,null,"",null,null,"",null,null,null,null,null,null,null,"",null,{"$f":"IF(B64=\"\",\"\",R64*B64)","v":""},null,0,"TS1L1-CNA",0,0,0,null,null,null,null,null,null,null,0,0,0,0]
[null,"","",null,null,null,"",null,null,"",null,null,null,null,null,null,null,"",null,"",null,0,"TS1L1-FC",0,0,0,null,null,null,null,null,null,null,0,0,0,0]
[null,"","",null,null,null,"",null,null,"",null,null,null,null,null,null,null,"",null,"",null,0,"TS1L1-HD300",{"$f":"HD300_B","v":0},{"$f":"HD300_BB","v":0},{"$f":"HD300_BBB","v":0},null,null,null,null,null,null,null,{"$f":"X66*$X$54","v":0},{"$f":"Y66*$Y$54","v":0},{"$f":"Z66*$Z$54","v":0},0]
[null,"","",null,null,null,"",null,null,"",null,null,null,null,null,null,null,"",null,"",null,0,"TS1L1-HD1200",{"$f":"HD1000_B","v":0},{"$f":"HD1000_BB","v":0},{"$f":"HD1000_BBB","v":0},null,null,null,null,null,null,null,0,0,0,0]
[null,"","",null,null,null,"",null,null,"",null,null,null,null,null,null,null,"",null,"",null,0,"TS1L1-HD1800",{"$f":"'Lotto1 R730xd 1'!$C$86","v":0},{"$f":"'Lotto1 R730xd 2'!$C$86","v":0},{"$f":"'Lotto1 R730xd 3'!$C$86","v":0},null,null,null,null,null,null,null,0,0,0,0]
[null,"","",null,null,null,"",null,null,"",null,null,null,null,null,null,null,"",null,"",null,0,"TS1L1-SSD800",{"$f":"'Lotto1 R730xd 1'!$C$88","v":0},{"$f":"'Lotto1 R730xd 2'!$C$88","v":0},{"$f":"'Lotto1 R730xd 3'!$C$88","v":0},null,null,null,null,null,null,null,0,0,0,0]
[null,"","",null,null,null,"",null,null,"",null,null,null,null,null,null,null,"",null,"",null,0,"TS1L1-SSD1920",{"$f":"'Lotto1 R730xd 1'!$C$90","v":0},{"$f":"'Lotto1 R730xd 2'!$C$90","v":0},{"$f":"'Lotto1 R730xd 3'!$C$90","v":0},null,null,null,null,null,null,null,0,0,0,0]
[null,"","",null,null,null,"",null,null,"",null,null,null,null,null,null,null,"",null,"",null,0,"TS1L1-4ANNI",{"$f":"IF('Lotto1 R730xd 1'!$D$169=$W$71,'Lotto1 R730xd 1'!$C$169,0)","v":0},{"$f":"IF('Lotto1 R730xd 2'!$D$169=$W$71,'Lotto1 R730xd 2'!$C$169,0)","v":0},{"$f":"IF('Lotto1 R730xd 3'!$D$169=$W$71,'Lotto1 R730xd 3'!$C$169,0)","v":0},null,null,null,null,null,null,null,0,0,0,0]
[null,"","",null,null,null,"",null,null,"",null,null,null,null,null,null,null,"",null,"",null,0,"TS1L1-5ANNI",{"$f":"IF('Lotto1 R730xd 1'!$D$169=$W$72,'Lotto1 R730xd 1'!$C$169,0)","v":0},{"$f":"IF('Lotto1 R730xd 2'!$D$169=$W$72,'Lotto1 R730xd 2'!$C$169,0)","v":0},{"$f":"IF('Lotto1 R730xd 3'!$D$169=$W$72,'Lotto1 R730xd 3'!$C$169,0)","v":0},null,null,null,null,null,null,null,0,0,0,0,null,"R730 1 HDDr"]
[null,"","",null,null,null,"",null,null,"",null,null,null,null,null,null,null,"",null,"",null,0,"10L1-SO-HDD",{"$f":"IF('Lotto1 R730xd 1'!$D$172=$W$73,'Lotto1 R730xd 1'!$C$172,0)","v":0},{"$f":"IF('Lotto1 R730xd 2'!$D$172=$W$73,'Lotto1 R730xd 2'!$C$172,0)","v":0},{"$f":"IF('Lotto1 R730xd 3'!$D$172=$W$73,'Lotto1 R730xd 3'!$C$172,0)","v":0},null,null,null,null,null,null,null,0,0,0,0,null,{"$f":"IF(X73=0,0,IF(X73+X72=2,5,IF(X73+X71=2,4,3)))","v":0},{"$f":"IF(Y73=0,0,IF(Y73+Y72=2,5,IF(Y73+Y71=2,4,3)))","v":0},null,null,null,null,null,null,{"$f":"IF(Z73=0,0,IF(Z73+Z72=2,5,IF(Z73+Z71=2,4,3)))","v":0},{"$f":"IF(AM73=5,$AV$86,IF(AM73=4,$AU$86,IF(AM73=3,$AN$86,\"\")))","v":""},{"$f":"IF(AN73=5,$AV$86,IF(AN73=4,$AU$86,IF(AN73=3,$AN$86,\"\")))","v":""},null,{"$f":"IF(AU73=5,$AV$86,IF(AU73=4,$AU$86,IF(AU73=3,$AN$86,\"\")))","v":""}]
[null,"RACK BASE ALTERNATIVO (DELL POWEREDGE T630)",null,null,null,null,null,null,null,null,null,null,null,null,null,null,null,null,null,null,null,{"$f":"IF(B75>=\"\",0,1)","v":0},null,"Server1","Server2","Server3"]
[null,{"$f":"IF(AK75>=1,AK75,\"\")","v":""},{"$f":"IF(AK75>0,(VLOOKUP(G75,COD_B,2,FALSE)),\"\")","v":""},null,null,null,{"$f":"IF(AK75>=1,W75,\"\")","v":""},null,null,{"$f":"IF(AK75>0,(VLOOKUP(G75,COD_B,5,FALSE)),\"\")","v":""},null,null,null,null,null,null,null,{"$f":"IF(AK75>0,(VLOOKUP(G75,COD_B,3,FALSE)),\"\")","v":""},null,{"$f":"IF(B75=\"\",\"\",R75*B75)","v":""},null,0,"TS1L1-T630R",{"$f":"SRV_C","v":0},{"$f":"SRV_CC","v":0},{"$f":"SRV_CCC","v":0},null,null,null,null,null,null,null,null,null,null,{"$f":"SUM(X75:AJ75)","v":0}]
[null,{"$f":"IF(AK76>=1,AK76,\"\")","v":""},"",null,null,null,{"$f":"IF(AK76>=1,W76,\"\")","v":""},null,null,"",null,null,null,null,null,null,null,"",null,{"$f":"IF(B76=\"\",\"\",R76*B76)","v":""},null,0,"TS1L1-CPU-T630R",{"$f":"'Lotto1 T630R 1'!$C$30","v":0},{"$f":"'Lotto1 T630R 2'!$C$30","v":0},{"$f":"'Lotto1 T630R 3'!$C$30","v":0},null,null,null,null,null,null,null,{"$f":"X76*$X$75","v":0},{"$f":"Y76*$Y$75","v":0},{"$f":"Z76*$Z$75","v":0},{"$f":"SUM(AH76:AJ76)","v":0}]
[null,"","",null,null,null,"",null,null,"",null,null,null,null,null,null,null,"",null,"",null,0,"TS1L1-32GB",{"$f":"IF(MEM_C=\"\",0,MEM_C)","v":0},{"$f":"IF(MEM_CC=\"\",0,MEM_CC)","v":0},{"$f":"IF(MEM_CCC=\"\",0,MEM_CCC)","v":0},null,null,null,null,null,null,null,{"$f":"X77*$X$75","v":0},{"$f":"Y77*$Y$75","v":0},{"$f":"Z77*$Z$75","v":0},0]
[null,"","",null,null,null,{"$f":"IF(AK78>=1,W78,\"\")","v":""},null,null,"",null,null,null,null,null,null,null,"",null,"",null,0,"TS1L1-10GB",{"$f":"COUNTIF($AU$79:$AU$84,W78)","v":0},{"$f":"COUNTIF(AV79:AV84,$W$78)","v":0},{"$f":"COUNTIF(AW79:AW84,$W$78)","v":0},null,null,null,null,null,null,null,{"$f":"X78*$X$75","v":0},0,0,0,null,null,null,null,null,null,null,null,null,"T630R 1","T630R 2","T630R 3"]
[null,"","",null,null,null,{"$f":"IF(AK79>=1,W79,\"\")","v":""},null,null,"",null,null,null,null,null,null,null,"",null,"",null,0,"TS1L1-1GB",{"$f":"COUNTIF($AU$79:$AU$84,W79)","v":0},{"$f":"COUNTIF($AV$79:$AV$84,W79)","v":0},{"$f":"COUNTIF($AW$79:$AW$84,W79)","v":0},null,null,null,null,null,null,null,{"$f":"X79*$X$75","v":0},0,0,0,null,null,"slot1",null,null,null,null,null,null,{"$f":"'Lotto1 T630R 1'!$D$129","v":""},{"$f":"'Lotto1 T630R 2'!$D$129","v":""},{"$f":"'Lotto1 T630R 3'!$D$129","v":""}]
[null,"","",null,null,null,{"$f":"IF(AK80>=1,W80,\"\")","v":""},null,null,"",null,null,null,null,null,null,null,"",null,"",null,0,"TS1L1-CNA",{"$f":"COUNTIF($AU$79:$AU$84,W80)","v":0},{"$f":"COUNTIF($AV$79:$AV$84,W80)","v":0},{"$f":"COUNTIF($AW$79:$AW$84,W80)","v":0},null,null,null,null,null,null,null,{"$f":"X80*$X$75","v":0},0,0,0,null,null,"slot2",null,null,null,null,null,null,{"$f":"'Lotto1 T630R 1'!$D$132","v":""},{"$f":"'Lotto1 T630R 2'!$D$132","v":""},{"$f":"'Lotto1 T630R 3'!$D$132","v":""}]
[null,"","",null,null,null,"",null,null,"",null,null,null,null,null,null,null,"",null,"",null,0,"TS1L1-FC",{"$f":"COUNTIF($AU$79:$AU$84,W81)","v":0},{"$f":"COUNTIF($AV$79:$AV$84,W81)","v":0},{"$f":"COUNTIF($AW$79:$AW$84,W81)","v":0},null,null,null,null,null,null,null,0,0,0,0,null,null,"slot3",null,null,null,null,null,null,{"$f":"'Lotto1 T630R 1'!$D$135","v":""},{"$f":"'Lotto1 T630R 2'!$D$135","v":""},{"$f":"'Lotto1 T630R 3'!$D$135","v":""}]
[null,"","",null,null,null,"",null,null,"",null,null,null,null,null,null,null,"",null,"",null,0,"TS1L1-HD300",{"$f":"HD300_C","v":0},{"$f":"HD300_CC","v":0},{"$f":"HD300_CCC","v":0},null,null,null,null,null,null,null,0,0,0,0,null,null,"slot4",null,null,null,null,null,null,{"$f":"'Lotto1 T630R 1'!$D$138","v":""},{"$f":"'Lotto1 T630R 2'!$D$138","v":""},{"$f":"'Lotto1 T630R 3'!$D$138","v":""}]
[null,"","",null,null,null,"",null,null,"",null,null,null,null,null,null,null,"",null,"",null,0,"TS1L1-HD1200",{"$f":"HD1000_c","v":0},{"$f":"HD1000_CC","v":0},{"$f":"HD1000_CCC","v":0},null,null,null,null,null,null,null,0,0,0,0,null,null,"slot5",null,null,null,null,null,null,{"$f":"'Lotto1 T630R 1'!$D$141","v":""},{"$f":"'Lotto1 T630R 2'!$D$141","v":""},{"$f":"'Lotto1 T630R 3'!$D$141","v":""}]
[null,"","",null,null,null,"",null,null,"",null,null,null,null,null,null,null,"",null,"",null,0,"TS1L1-4ANNI",{"$f":"IF('Lotto1 T630R 1'!$D$176=W84,'Lotto1 T630R 1'!$C$176,0)","v":0},{"$f":"IF('Lotto1 T630R 2'!$D$176=W84,'Lotto1 T630R 2'!$C$176,0)","v":0},{"$f":"IF('Lotto1 T630R 3'!$D$176=W84,'Lotto1 T630R 3'!$C$176,0)","v":0},null,null,null,null,null,null,null,0,0,0,0,null,null,"slot6",null,null,null,null,null,null,{"$f":"'Lotto1 T630R 1'!$D$144","v":""},{"$f":"'Lotto1 T630R 2'!$D$144","v":""},{"$f":"'Lotto1 T630R 3'!$D$144","v":""}]
[null,"","",null,null,null,"",null,null,"",null,null,null,null,null,null,null,"",null,"",null,0,"TS1L1-5ANNI",{"$f":"IF('Lotto1 T630R 1'!$D$176=W85,'Lotto1 T630R 1'!$C$176,0)","v":0},{"$f":"IF('Lotto1 T630R 2'!$D$176=W85,'Lotto1 T630R 2'!$C$176,0)","v":0},{"$f":"IF('Lotto1 T630R 3'!$D$176=W85,'Lotto1 T630R 3'!$C$176,0)","v":0},null,null,null,null,null,null,null,0,0,0,0]
[null,"","",null,null,null,"",null,null,"",null,null,null,null,null,null,null,"",null,"",null,0,"10L1-SO-HDD",{"$f":"IF('Lotto1 T630R 1'!$D$179=W86,'Lotto1 T630R 1'!$C$179,0)","v":0},{"$f":"IF(X86=0,0,IF(X85+X86=2,5,IF(X86+X84=2,4,3)))","v":0},null,null,null,null,null,null,null,null,0,0,0,0,{"$f":"IF(Y86=5,$AV$86,IF(Y86=4,$AU$86,IF(Y86=3,$AN$86,\"\")))","v":""},null,"10L1-SO-HDD3",null,null,null,null,null,null,"10L1-SO-HDD4","10L1-SO-HDD5"]
[null,"TOWER BASE (DELL POWEREDGE T630)",null,null,null,null,null,null,null,null,null,null,null,null,null,null,null,null,null,null,null,{"$f":"IF(B88>=\"\",0,1)","v":0}]
[null,{"$f":"IF(AK88>=1,AK88,\"\")","v":""},{"$f":"IF(AK88>0,(VLOOKUP(G88,COD_C,2,FALSE)),\"\")","v":""},null,null,null,{"$f":"IF(AK88>=1,W88,\"\")","v":""},null,null,{"$f":"IF(AK88>0,(VLOOKUP(G88,COD_C,5,FALSE)),\"\")","v":""},null,null,null,null,null,null,null,{"$f":"IF(AK88>0,(VLOOKUP(G88,COD_C,3,FALSE)),\"\")","v":""},null,{"$f":"IF(B88=\"\",\"\",R88*B88)","v":""},null,{"$f":"IF(B88>=\"\",0,1)","v":0},"TS1L1-T630",{"$f":"SRV_D","v":0},null,null,null,null,null,null,null,null,null,null,null,null,{"$f":"SUM(X88:AJ88)","v":0}]
[null,{"$f":"IF(AK89>=1,AK89,\"\")","v":""},"",null,null,null,"",null,null,"",null,null,null,null,null,null,null,"",null,"",null,0,"TS1L1-CPU-T630",{"$f":"'Lotto1 T630 1 (Tower)'!$C$25","v":0},null,null,null,null,null,null,null,null,null,{"$f":"X89*$X$88","v":0},null,null,{"$f":"SUM(AH89:AJ89)","v":0}]
[null,"","",null,null,null,"",null,null,"",null,null,null,null,null,null,null,"",null,"",null,0,"TS1L1-32GB",{"$f":"IF(MEM_D=\"\",0,MEM_D)","v":0},null,null,null,null,null,null,null,null,null,{"$f":"X90*$X$88","v":0},null,null,0]
[null,"","",null,null,null,"",null,null,"",null,null,null,null,null,null,null,"",null,"",null,0,"10L1-32GB-U",{"$f":"IF(MEM_D32=\"\",0,MEM_D32)","v":0},null,null,null,null,null,null,null,null,null,0,null,null,0,null,null,null,null,null,null,null,null,null,"T630 1","T630 2","T630 3"]
[null,"","",null,null,null,"",null,null,"",null,null,null,null,null,null,null,"",null,"",null,0,"TS1L1-1GB",{"$f":"COUNTIF($AU$92:$AU$97,W92)","v":0},null,null,null,null,null,null,null,null,null,0,null,null,0,null,null,"slot1",null,null,null,null,null,null,{"$f":"'Lotto1 T630 1 (Tower)'!$D$118","v":""}]
[null,"","",null,null,null,"",null,null,"",null,null,null,null,null,null,null,"",null,"",null,0,"TS1L1-10GB",{"$f":"COUNTIF($AU$92:$AU$97,W93)","v":0},null,null,null,null,null,null,null,null,null,0,null,null,0,null,null,"slot2",null,null,null,null,null,null,{"$f":"'Lotto1 T630 1 (Tower)'!$D$121","v":""}]
[null,"","",null,null,null,"",null,null,"",null,null,null,null,null,null,null,"",null,"",null,0,"TS1L1-FC",{"$f":"COUNTIF($AU$92:$AU$97,W94)","v":0},null,null,null,null,null,null,null,null,null,0,null,null,0,null,null,"slot3",null,null,null,null,null,null,{"$f":"'Lotto1 T630 1 (Tower)'!$D$124","v":""}]
[null,"","",null,null,null,"",null,null,"",null,null,null,null,null,null,null,"",null,"",null,0,"TS1L1-HD300T",{"$f":"HD300_D","v":0},null,null,null,null,null,null,null,null,null,0,null,null,0,null,null,"slot4",null,null,null,null,null,null,{"$f":"'Lotto1 T630 1 (Tower)'!$D$127","v":""}]
[null,"","",null,null,null,"",null,null,"",null,null,null,null,null,null,null,"",null,"",null,0,"TS1L1-HD1200T",{"$f":"HD1000_D","v":0},null,null,null,null,null,null,null,null,null,0,null,null,0,null,null,"slot5",null,null,null,null,null,null,{"$f":"'Lotto1 T630 1 (Tower)'!$D$130","v":""}]
[null,"","",null,null,null,"",null,null,"",null,null,null,null,null,null,null,"",null,"",null,0,"TS1L1-4ANNI",{"$f":"IF('Lotto1 T630 1 (Tower)'!D168=W97,'Lotto1 T630 1 (Tower)'!C168,0)","v":0},null,null,null,null,null,null,null,null,null,0,null,null,0,null,null,"slot6",null,null,null,null,null,null,{"$f":"'Lotto1 T630 1 (Tower)'!$D$133","v":""}]
[null,"","",null,null,null,"",null,null,"",null,null,null,null,null,null,null,"",null,"",null,0,"TS1L1-5ANNI",{"$f":"IF('Lotto1 T630 1 (Tower)'!D168=W98,'Lotto1 T630 1 (Tower)'!C168,0)","v":0},null,null,null,null,null,null,null,null,null,0,null,null,0]
[null,"","",null,null,null,"",null,null,"",null,null,null,null,null,null,null,"",null,"",null,0,"10L1-SO-HDD",{"$f":"IF('Lotto1 T630R 1'!$D$179=W99,'Lotto1 T630R 1'!$C$179,0)","v":0},{"$f":"IF(X99=0,0,IF(X98+X99=2,5,IF(X99+X97=2,4,3)))","v":0},null,null,null,null,null,null,null,null,{"$f":"X99*$X$75","v":0},null,null,0,{"$f":"IF(Y99=5,$AV$86,IF(Y99=4,$AU$86,IF(Y99=3,$AN$86,\"\")))","v":""},null,"10L1-SO-HDD3",null,null,null,null,null,null,"10L1-SO-HDD4","10L1-SO-HDD5"]
[null,"TOWER PRESTAZIONALE (DELL POWEREDGE T630)",null,null,null,null,null,null,null,null,null,null,null,null,null,null,null,null,null,null,null,{"$f":"IF(B101>=\"\",0,1)","v":0}]
[null,{"$f":"IF(AK101>=1,AK101,\"\")","v":""},{"$f":"IF(AK101>0,(VLOOKUP(G101,COD_C,2,FALSE)),\"\")","v":""},null,null,null,{"$f":"IF(AK101>=1,W101,\"\")","v":""},null,null,{"$f":"IF(AK101>0,(VLOOKUP(G101,COD_C,5,FALSE)),\"\")","v":""},null,null,null,null,null,null,null,{"$f":"IF(AK101>0,(VLOOKUP(G101,COD_C,3,FALSE)),\"\")","v":""},null,{"$f":"IF(B101=\"\",\"\",R101*B101)","v":""},null,{"$f":"IF(B101>=\"\",0,1)","v":0},"TS1L1-T630P",{"$f":"SRV_E","v":0},null,null,null,null,null,null,null,null,null,null,null,null,{"$f":"SUM(X101:AJ101)","v":0}]
[null,{"$f":"IF(AK102>=1,AK102,\"\")","v":""},"",null,null,null,"",null,null,"",null,null,null,null,null,null,null,"",null,"",null,0,"TS1L1-CPU-T630P",{"$f":"'Lotto1 T630 1 (Tower) Prest'!$C$25","v":0},null,null,null,null,null,null,null,null,null,{"$f":"X102*$X$101","v":0},null,null,{"$f":"SUM(AH102:AJ102)","v":0}]
[null,"","",null,null,null,"",null,null,"",null,null,null,null,null,null,null,"",null,"",null,0,"TS1L1-32GB",{"$f":"IF(MEM_E=\"\",0,MEM_E)","v":0},null,null,null,null,null,null,null,null,null,{"$f":"X103*$X$101","v":0},null,null,0]
[null,"","",null,null,null,"",null,null,"",null,null,null,null,null,null,null,"",null,"",null,0,"10L1-32GB-U",{"$f":"IF(MEM_E32=\"\",0,MEM_E32)","v":0},null,null,null,null,null,null,null,null,null,0,null,null,0,null,null,null,null,null,null,null,null,null,"T630 1","T630 2","T630 3"]
[null,"","",null,null,null,"",null,null,"",null,null,null,null,null,null,null,"",null,"",null,0,"TS1L1-1GB",{"$f":"COUNTIF($AU$105:$AU$110,W105)","v":0},null,null,null,null,null,null,null,null,null,0,null,null,0,null,null,"slot1",null,null,null,null,null,null,{"$f":"'Lotto1 T630 1 (Tower) Prest'!$D$118","v":""}]
[null,"","",null,null,null,"",null,null,"",null,null,null,null,null,null,null,"",null,"",null,0,"TS1L1-10GB",{"$f":"COUNTIF($AU$105:$AU$110,W106)","v":0},null,null,null,null,null,null,null,null,null,0,null,null,0,null,null,"slot2",null,null,null,null,null,null,{"$f":"'Lotto1 T630 1 (Tower) Prest'!$D$121","v":""}]
[null,"","",null,null,null,"",null,null,"",null,null,null,null,null,null,null,"",null,"",null,0,"TS1L1-FC",{"$f":"COUNTIF($AU$105:$AU$110,W107)","v":0},null,null,null,null,null,null,null,null,null,0,null,null,0,null,null,"slot3",null,null,null,null,null,null,{"$f":"'Lotto1 T630 1 (Tower) Prest'!$D$124","v":""}]
[null,"","",null,null,null,"",null,null,"",null,null,null,null,null,null,null,"",null,"",null,0,"TS1L1-HD300T",{"$f":"HD300_E","v":0},null,null,null,null,null,null,null,null,null,0,null,null,0,null,null,"slot4",null,null,null,null,null,null,{"$f":"'Lotto1 T630 1 (Tower) Prest'!$D$127","v":""}]
[null,"","",null,null,null,"",null,null,"",null,null,null,null,null,null,null,"",null,"",null,0,"TS1L1-HD1200T",{"$f":"HD1000_E","v":0},null,null,null,null,null,null,null,null,null,0,null,null,0,null,null,"slot5",null,null,null,null,null,null,{"$f":"'Lotto1 T630 1 (Tower) Prest'!$D$130","v":""}]
[null,"","",null,null,null,"",null,null,"",null,null,null,null,null,null,null,"",null,"",null,0,"TS1L1-4ANNI",{"$f":"IF('Lotto1 T630 1 (Tower) Prest'!D168=W110,'Lotto1 T630 1 (Tower) Prest'!C168,0)","v":0},null,null,null,null,null,null,null,null,null,0,null,null,0,null,null,"slot6",null,null,null,null,null,null,{"$f":"'Lotto1 T630 1 (Tower) Prest'!$D$133","v":""}]
[null,"","",null,null,null,"",null,null,"",null,null,null,null,null,null,null,"",null,"",null,0,"TS1L1-5ANNI",{"$f":"IF('Lotto1 T630 1 (Tower) Prest'!D168=W111,'Lotto1 T630 1 (Tower) Prest'!C168,0)","v":0},null,null,null,null,null,null,null,null,null,0,null,null,0]
[null,"","",null,null,null,"",null,null,"",null,null,null,null,null,null,null,"",null,"",null,0,"10L1-SO-HDD",{"$f":"IF('Lotto1 T630R 1'!$D$179=W112,'Lotto1 T630R 1'!$C$179,0)","v":0},{"$f":"IF(X112=0,0,IF(X111+X112=2,5,IF(X112+X110=2,4,3)))","v":0},null,null,null,null,null,null,null,null,{"$f":"X112*$X$75","v":0},null,null,0,{"$f":"IF(Y112=5,$AV$86,IF(Y112=4,$AU$86,IF(Y112=3,$AN$86,\"\")))","v":""},null,"10L1-SO-HDD3",null,null,null,null,null,null,"10L1-SO-HDD4","10L1-SO-HDD5"]
[null,"OPZIONI COMUNI",null,null,null,null,null,null,null,null,null,null,null,null,null,null,null,null,null,null,null,{"$f":"IF(SUM(V114:V124)=0,0,1)","v":0},null,"R630 1","R630 2","R630 3","T630R 1","T630R 2","T630R 3","R730 1","R730 2","R730 3","R730xd 1","R730xd 2","R730xd 3","T630","T630P","R630 1","R630 2","R630 3","T630R",null,null,"R730 1","R730 2","R730 3","R730xd 1","R730xd 2","R730xd 3","T630","T630P","R630","T630R","R730","R730xd","T630","T630P","Totale"]
[null,{"$f":"IF(BF114=0,\"\",BF114)","v":""},{"$f":"IF(BF114=\"\",\"\",(VLOOKUP(G114,COD_A,2,FALSE)))","v":""},null,null,null,{"$f":"IF(BF114>0,W114,\"\")","v":""},null,null,{"$f":"IF(BF114>0,(VLOOKUP(G114,COD_A,5,FALSE)),\"\")","v":""},null,null,null,null,null,null,null,{"$f":"IF(BF114>0,(VLOOKUP(G114,COD_A,3,FALSE)),\"\")","v":""},null,{"$f":"IF(B114=\"\",\"\",R114*B114)","v":""},null,0,"TS1L1-WIN1",{"$f":"IF('Lotto1 R630 1'!$D$52=W114,1,0)","v":0},{"$f":"IF('Lotto1 R630 2'!$D$52=W114,1,0)","v":0},{"$f":"IF('Lotto1 R630 3'!$D$52=W114,1,0)","v":0},{"$f":"IF('Lotto1 T630R 1'!$D$53=$W$114,1,0)","v":0},{"$f":"IF('Lotto1 T630R 2'!$D$53=$W$114,1,0)","v":0},{"$f":"IF('Lotto1 T630R 3'!$D$53=$W$114,1,0)","v":0},{"$f":"IF('Lotto1 R730 1'!$D$52=W114,1,0)","v":0},{"$f":"IF('Lotto1 R730 2'!$D$52=$W$114,1,0)","v":0},{"$f":"IF('Lotto1 R730 3'!$D$52=W114,1,0)","v":0},{"$f":"IF('Lotto1 R730xd 1'!$D$52=W114,1,0)","v":0},{"$f":"IF('Lotto1 R730xd 2'!$D$52=$W$114,1,0)","v":0},{"$f":"IF('Lotto1 R730xd 3'!$D$52=W114,1,0)","v":0},{"$f":"IF('Lotto1 T630 1 (Tower)'!$D$48=W114,1,0)","v":0},{"$f":"IF('Lotto1 T630 1 (Tower) Prest'!$D$48=W114,1,0)","v":0},{"$f":"X114*$X$15","v":0},{"$f":"Y114*$Y$15","v":0},{"$f":"Z114*$Z$15","v":0},{"$f":"AA114*$X$75","v":0},{"$f":"AB114*$Y$75","v":0},{"$f":"AC114*$Z$75","v":0},{"$f":"AD114*$X$33","v":0},{"$f":"AE114*$Y$33","v":0},{"$f":"AF114*$Z$33","v":0},{"$f":"AG114*$X$54","v":0},{"$f":"AH114*$Y$54","v":0},{"$f":"AI114*$Z$54","v":0},{"$f":"AJ114*$X$88","v":0},{"$f":"AK114*$X$101","v":0},{"$f":"SUM(X114:Z114)","v":0},{"$f":"SUM(AA114:AC114)","v":0},{"$f":"SUM(AD114:AF114)","v":0},{"$f":"SUM(AG114:AI114)","v":0},{"$f":"AX114","v":0},0,{"$f":"SUM(AL114:AY114)","v":0}]
[null,{"$f":"IF(BF115=0,\"\",BF115)","v":""},{"$f":"IF(BF115=\"\",\"\",(VLOOKUP(G115,COD_A,2,FALSE)))","v":""},null,null,null,{"$f":"IF(BF115>0,W115,\"\")","v":""},null,null,{"$f":"IF(BF115>0,(VLOOKUP(G115,COD_A,5,FALSE)),\"\")","v":""},null,null,null,null,null,null,null,{"$f":"IF(BF115>0,(VLOOKUP(G115,COD_A,3,FALSE)),\"\")","v":""},null,"",null,0,"TS1L1-WIN2CORE",{"$f":"IF('Lotto1 R630 1'!C53,2,0)","v":0},{"$f":"IF('Lotto1 R630 2'!C53,2,0)","v":0},{"$f":"IF('Lotto1 R630 3'!C53,2,0)","v":0},{"$f":"IF('Lotto1 T630R 1'!$C$54,2,0)","v":0},{"$f":"IF('Lotto1 T630R 2'!$C$54,2,0)","v":0},{"$f":"IF('Lotto1 T630R 3'!$C$54,2,0)","v":0},{"$f":"IF('Lotto1 R730 1'!$C$53,6,0)","v":0},{"$f":"IF('Lotto1 R730 2'!$C$53,6,0)","v":0},{"$f":"IF('Lotto1 R730 3'!$C$53,6,0)","v":0},{"$f":"IF('Lotto1 R730xd 1'!$C$53,6,0)","v":0},{"$f":"IF('Lotto1 R730xd 2'!$C$53,6,0)","v":0},{"$f":"IF('Lotto1 R730xd 3'!$C$53,6,0)","v":0},{"$f":"IF('Lotto1 T630 1 (Tower)'!C49,2,0)","v":0},{"$f":"IF('Lotto1 T630 1 (Tower) Prest'!C49,4,0)","v":0},{"$f":"X115*$X$15","v":0},{"$f":"Y115*$Y$15","v":0},{"$f":"Z115*$Z$15","v":0},{"$f":"AA115*$X$75","v":0},{"$f":"AB115*$Y$75","v":0},{"$f":"AC115*$Z$75","v":0},{"$f":"AD115*$X$33","v":0},{"$f":"AE115*$Y$33","v":0},{"$f":"AF115*$Z$33","v":0},{"$f":"AG115*$X$54","v":0},{"$f":"AH115*$Y$54","v":0},{"$f":"AI115*$Z$54","v":0},{"$f":"AJ115*$X$88","v":0},{"$f":"AK115*$X$101","v":0},{"$f":"SUM(X115:Z115)","v":0},{"$f":"SUM(AA115:AC115)","v":0},{"$f":"SUM(AD115:AF115)","v":0},{"$f":"SUM(AG115:AI115)","v":0},0,0,{"$f":"SUM(AL115:AY115)","v":0}]
[null,{"$f":"IF(BF116=0,\"\",BF116)","v":""},{"$f":"IF(BF116=\"\",\"\",(VLOOKUP(G116,COD_A,2,FALSE)))","v":""},null,null,null,{"$f":"IF(BF116>0,W116,\"\")","v":""},null,null,{"$f":"IF(BF116>0,(VLOOKUP(G116,COD_A,5,FALSE)),\"\")","v":""},null,null,null,null,null,null,null,{"$f":"IF(BF116>0,(VLOOKUP(G116,COD_A,3,FALSE)),\"\")","v":""},null,"",null,0,"TS1L1-LINUX",{"$f":"IF('Lotto1 R630 1'!$D$52=W116,1,0)","v":0},{"$f":"IF('Lotto1 R630 2'!$D$52=W116,1,0)","v":0},{"$f":"IF('Lotto1 R630 3'!$D$52=W116,1,0)","v":0},{"$f":"IF('Lotto1 T630R 1'!$D$53=$W$116,1,0)","v":0},{"$f":"IF('Lotto1 T630R 2'!$D$53=$W$116,1,0)","v":0},{"$f":"IF('Lotto1 T630R 3'!$D$53=$W$116,1,0)","v":0},{"$f":"IF('Lotto1 R730 1'!$D$52=W116,1,0)","v":0},{"$f":"IF('Lotto1 R730 2'!$D$52=W116,1,0)","v":0},{"$f":"IF('Lotto1 R730 3'!$D$52=W116,1,0)","v":0},{"$f":"IF('Lotto1 R730xd 1'!$D$52=W116,1,0)","v":0},{"$f":"IF('Lotto1 R730xd 2'!$D$52=W116,1,0)","v":0},{"$f":"IF('Lotto1 R730xd 3'!$D$52=W116,1,0)","v":0},{"$f":"IF('Lotto1 T630 1 (Tower)'!$D$48=W116,1,0)","v":0},{"$f":"IF('Lotto1 T630 1 (Tower) Prest'!$D$48=W116,1,0)","v":0},{"$f":"X116*$X$15","v":0},{"$f":"Y116*$Y$15","v":0},{"$f":"Z116*$Z$15","v":0},{"$f":"AA116*$X$75","v":0},{"$f":"AB116*$Y$75","v":0},{"$f":"AC116*$Z$75","v":0},{"$f":"AD116*$X$33","v":0},{"$f":"AE116*$Y$33","v":0},{"$f":"AF116*$Z$33","v":0},{"$f":"AG116*$X$54","v":0},{"$f":"AH116*$Y$54","v":0},{"$f":"AI116*$Z$54","v":0},{"$f":"AJ116*$X$88","v":0},{"$f":"AK116*$X$101","v":0},{"$f":"SUM(X116:Z116)","v":0},{"$f":"SUM(AA116:AC116)","v":0},{"$f":"SUM(AD116:AF116)","v":0},{"$f":"SUM(AG116:AI116)","v":0},0,0,{"$f":"SUM(AL116:AY116)","v":0}]
[null,{"$f":"IF(BF117=0,\"\",BF117)","v":""},{"$f":"IF(BF117=\"\",\"\",(VLOOKUP(G117,COD_A,2,FALSE)))","v":""},null,null,null,{"$f":"IF(BF117>0,W117,\"\")","v":""},null,null,{"$f":"IF(BF117>0,(VLOOKUP(G117,COD_A,5,FALSE)),\"\")","v":""},null,null,null,null,null,null,null,{"$f":"IF(BF117>0,(VLOOKUP(G117,COD_A,3,FALSE)),\"\")","v":""},null,"",null,0,"TS1L1-CALUSER",{"$f":"'Lotto1 R630 1'!$C$59","v":0},{"$f":"'Lotto1 R630 2'!$C$59","v":0},{"$f":"'Lotto1 R630 3'!$C$59","v":0},{"$f":"'Lotto1 T630R 1'!$C$60","v":0},{"$f":"'Lotto1 T630R 2'!$C$60","v":0},{"$f":"'Lotto1 T630R 3'!$C$60","v":0},{"$f":"'Lotto1 R730 1'!$C$59","v":0},{"$f":"'Lotto1 R730 2'!$C$59","v":0},{"$f":"'Lotto1 R730 3'!$C$59","v":0},{"$f":"'Lotto1 R730xd 1'!$C$60","v":0},{"$f":"'Lotto1 R730xd 2'!$C$60","v":0},{"$f":"'Lotto1 R730xd 3'!$C$60","v":0},{"$f":"'Lotto1 T630 1 (Tower)'!$C$55","v":0},{"$f":"'Lotto1 T630 1 (Tower) Prest'!$C$55","v":0},{"$f":"X117*$X$15","v":0},{"$f":"Y117*$Y$15","v":0},{"$f":"Z117*$Z$15","v":0},{"$f":"AA117*$X$75","v":0},{"$f":"AB117*$Y$75","v":0},{"$f":"AC117*$Z$75","v":0},{"$f":"AD117*$X$33","v":0},{"$f":"AE117*$Y$33","v":0},{"$f":"AF117*$Z$33","v":0},{"$f":"AG117*$X$54","v":0},{"$f":"AH117*$Y$54","v":0},{"$f":"AI117*$Z$54","v":0},{"$f":"AJ117*$X$88","v":0},{"$f":"AK117*$X$101","v":0},{"$f":"SUM(X117:Z117)","v":0},{"$f":"SUM(AA117:AC117)","v":0},{"$f":"SUM(AD117:AF117)","v":0},{"$f":"SUM(AG117:AI117)","v":0},0,0,{"$f":"SUM(AL117:AY117)","v":0}]
[null,{"$f":"IF(BF118=0,\"\",BF118)","v":""},{"$f":"IF(BF118=\"\",\"\",(VLOOKUP(G118,COD_A,2,FALSE)))","v":""},null,null,null,{"$f":"IF(BF118>0,W118,\"\")","v":""},null,null,{"$f":"IF(BF118>0,(VLOOKUP(G118,COD_A,5,FALSE)),\"\")","v":""},null,null,null,null,null,null,null,{"$f":"IF(BF118>0,(VLOOKUP(G118,COD_A,3,FALSE)),\"\")","v":""},null,"",null,0,"TS1L1-CALDEV",{"$f":"'Lotto1 R630 1'!$C$61","v":0},{"$f":"'Lotto1 R630 2'!$C$61","v":0},{"$f":"'Lotto1 R630 3'!$C$61","v":0},{"$f":"'Lotto1 T630R 1'!$C$62","v":0},{"$f":"'Lotto1 T630R 2'!$C$62","v":0},{"$f":"'Lotto1 T630R 3'!$C$62","v":0},{"$f":"'Lotto1 R730 1'!$C$61","v":0},{"$f":"'Lotto1 R730 2'!$C$61","v":0},{"$f":"'Lotto1 R730 3'!$C$61","v":0},{"$f":"'Lotto1 R730xd 1'!$C$62","v":0},{"$f":"'Lotto1 R730xd 2'!$C$62","v":0},{"$f":"'Lotto1 R730xd 3'!$C$62","v":0},{"$f":"'Lotto1 T630 1 (Tower)'!$C$57","v":0},{"$f":"'Lotto1 T630 1 (Tower) Prest'!$C$57","v":0},{"$f":"X118*$X$15","v":0},{"$f":"Y118*$Y$15","v":0},{"$f":"Z118*$Z$15","v":0},{"$f":"AA118*$X$75","v":0},{"$f":"AB118*$Y$75","v":0},{"$f":"AC118*$Z$75","v":0},{"$f":"AD118*$X$33","v":0},{"$f":"AE118*$Y$33","v":0},{"$f":"AF118*$Z$33","v":0},{"$f":"AG118*$X$54","v":0},{"$f":"AH118*$Y$54","v":0},{"$f":"AI118*$Z$54","v":0},{"$f":"AJ118*$X$88","v":0},{"$f":"AK118*$X$101","v":0},{"$f":"SUM(X118:Z118)","v":0},{"$f":"SUM(AA118:AC118)","v":0},{"$f":"SUM(AD118:AF118)","v":0},{"$f":"SUM(AG118:AI118)","v":0},0,0,{"$f":"SUM(AL118:AY118)","v":0}]
[null,{"$f":"IF('RACK, Accessori e Servizi'!J15=0,\"\",'RACK, Accessori e Servizi'!J15)","v":""},{"$f":"IF(B119>0,(VLOOKUP(G119,COD_A,2,FALSE)),\"\")","v":""},null,null,null,{"$f":"IF('RACK, Accessori e Servizi'!J15>0,'RACK, Accessori e Servizi'!K15,\"\")","v":""},null,null,{"$f":"IF(B119>0,(VLOOKUP(G119,COD_A,5,FALSE)),\"\")","v":""},null,null,null,null,null,null,null,{"$f":"IF(B119>0,(VLOOKUP(G119,COD_A,3,FALSE)),\"\")","v":""},null,"",null,0]
[null,{"$f":"IF('RACK, Accessori e Servizi'!J24=0,\"\",'RACK, Accessori e Servizi'!J24)","v":""},{"$f":"IF(B120>0,(VLOOKUP(G120,COD_A,2,FALSE)),\"\")","v":""},null,null,null,{"$f":"IF('RACK, Accessori e Servizi'!J24>0,'RACK, Accessori e Servizi'!K24,\"\")","v":""},null,null,{"$f":"IF(B120>0,(VLOOKUP(G120,COD_A,5,FALSE)),\"\")","v":""},null,null,null,null,null,null,null,{"$f":"IF(B120>0,(VLOOKUP(G120,COD_A,3,FALSE)),\"\")","v":""},null,"",null,0]
[null,{"$f":"IF('RACK, Accessori e Servizi'!J27=0,\"\",'RACK, Accessori e Servizi'!J27)","v":""},{"$f":"IF(B121>0,(VLOOKUP(G121,COD_A,2,FALSE)),\"\")","v":""},null,null,null,{"$f":"IF('RACK, Accessori e Servizi'!J27>0,'RACK, Accessori e Servizi'!K27,\"\")","v":""},null,null,{"$f":"IF(B121>0,(VLOOKUP(G121,COD_A,5,FALSE)),\"\")","v":""},null,null,null,null,null,null,null,{"$f":"IF(B121>0,(VLOOKUP(G121,COD_A,3,FALSE)),\"\")","v":""},null,"",null,0]
[null,{"$f":"IF('RACK, Accessori e Servizi'!J30=0,\"\",'RACK, Accessori e Servizi'!J30)","v":""},{"$f":"IF(B122>0,(VLOOKUP(G122,COD_A,2,FALSE)),\"\")","v":""},null,null,null,{"$f":"IF('RACK, Accessori e Servizi'!J30>0,'RACK, Accessori e Servizi'!K30,\"\")","v":""},null,null,{"$f":"IF(B122>0,(VLOOKUP(G122,COD_A,5,FALSE)),\"\")","v":""},null,null,null,null,null,null,null,{"$f":"IF(B122>0,(VLOOKUP(G122,COD_A,3,FALSE)),\"\")","v":""},null,"",null,0]
[null,{"$f":"IF('RACK, Accessori e Servizi'!J75=0,\"\",'RACK, Accessori e Servizi'!J75)","v":""},{"$f":"IF(B123>0,(VLOOKUP(G123,COD_C,2,FALSE)),\"\")","v":""},null,null,null,{"$f":"IF('RACK, Accessori e Servizi'!J75>0,'RACK, Accessori e Servizi'!K75,\"\")","v":""},null,null,{"$f":"IF(B123>0,(VLOOKUP(G123,COD_C,5,FALSE)),\"\")","v":""},null,null,null,null,null,null,null,{"$f":"IF(B123>0,(VLOOKUP(G123,COD_C,3,FALSE)),\"\")","v":""},null,"",null,0]
[null,{"$f":"IF('RACK, Accessori e Servizi'!J79=0,\"\",'RACK, Accessori e Servizi'!J79)","v":""},{"$f":"IF(B124>0,(VLOOKUP(G124,COD_C,2,FALSE)),\"\")","v":""},null,null,null,{"$f":"IF('RACK, Accessori e Servizi'!J79>0,'RACK, Accessori e Servizi'!K79,\"\")","v":""},null,null,{"$f":"IF(B124>0,(VLOOKUP(G124,COD_C,5,FALSE)),\"\")","v":""},null,null,null,null,null,null,null,{"$f":"IF(B124>0,(VLOOKUP(G124,COD_C,3,FALSE)),\"\")","v":""},null,"",null,0]
[null,"ULTERIORI OPZIONI",null,null,null,null,null,null,null,null,null,null,null,null,null,null,null,null,null,null,null,{"$f":"IF(SUM(V126:V143)=0,0,1)","v":0},null,"R630 1","R630 2","R630 3","T630R 1","T630R 2","T630R 3","R730 1","R730 2","R730 3","R730xd 1","R730xd 2","R730xd 3","T630","T630P","R630 1","R630 2","R630 3","T630R",null,null,"R730 1","R730 2","R730 3","R730xd 1","R730xd 2","R730xd 3","T630","T630P","R630","T630R","R730","R730xd","T630","T630P","Totale"]
[null,{"$f":"IF(BF126>=1,BF126,\"\")","v":""},{"$f":"IF(BF126>0,(VLOOKUP(G126,COD_B,2,FALSE)),\"\")","v":""},null,null,null,{"$f":"IF(BF126>=1,W126,\"\")","v":""},null,null,{"$f":"IF(BF126>0,(VLOOKUP(G126,COD_B,5,FALSE)),\"\")","v":""},null,null,null,null,null,null,null,{"$f":"IF(BF126>0,(VLOOKUP(G126,COD_B,3,FALSE)),\"\")","v":""},null,{"$f":"IF(B126=\"\",\"\",R126*B126)","v":""},null,0,"TS1L1-HD1800",{"$f":"'Lotto1 R630 1'!$C$85","v":0},{"$f":"'Lotto1 R630 2'!$C$85","v":0},{"$f":"'Lotto1 R630 3'!$C$85","v":0},{"$f":"'Lotto1 T630R 1'!$C$86","v":0},{"$f":"'Lotto1 T630R 2'!$C$86","v":0},{"$f":"'Lotto1 T630R 3'!$C$86","v":0},null,null,null,null,null,null,null,null,{"$f":"X126*$X$15","v":0},{"$f":"Y126*$Y$15","v":0},{"$f":"Z126*$Z$15","v":0},{"$f":"AA126*$X$75","v":0},{"$f":"AB126*$Y$75","v":0},{"$f":"AC126*$Z$75","v":0},{"$f":"AD126*$X$33","v":0},{"$f":"AE126*$Y$33","v":0},{"$f":"AF126*$Z$33","v":0},{"$f":"AG126*$X$54","v":0},{"$f":"AH126*$Y$54","v":0},{"$f":"AI126*$Z$54","v":0},{"$f":"AJ126*$X$88","v":0},{"$f":"AK126*$X$101","v":0},{"$f":"SUM(X126:Z126)","v":0},{"$f":"SUM(AA126:AC126)","v":0},{"$f":"SUM(AD126:AF126)","v":0},{"$f":"SUM(AG126:AI126)","v":0},{"$f":"AX126","v":0},0,{"$f":"SUM(AL126:AY126)","v":0}]
[null,{"$f":"IF(BF127>=1,BF127,\"\")","v":""},"",null,null,null,{"$f":"IF(BF127>=1,W127,\"\")","v":""},null,null,"",null,null,null,null,null,null,null,"",null,{"$f":"IF(B127=\"\",\"\",R127*B127)","v":""},null,{"$f":"IF(B127>=\"\",0,1)","v":0},"TS1L1-SSD800",{"$f":"'Lotto1 R630 1'!$C$87","v":0},{"$f":"'Lotto1 R630 2'!$C$87","v":0},{"$f":"'Lotto1 R630 3'!$C$87","v":0},{"$f":"'Lotto1 T630R 1'!$C$88","v":0},{"$f":"'Lotto1 T630R 2'!$C$88","v":0},{"$f":"'Lotto1 T630R 3'!$C$88","v":0},null,null,null,null,null,null,null,null,{"$f":"X127*$X$15","v":0},{"$f":"Y127*$Y$15","v":0},{"$f":"Z127*$Z$15","v":0},{"$f":"AA127*$X$75","v":0},{"$f":"AB127*$Y$75","v":0},{"$f":"AC127*$Z$75","v":0},{"$f":"AD127*$X$33","v":0},{"$f":"AE127*$Y$33","v":0},{"$f":"AF127*$Z$33","v":0},{"$f":"AG127*$X$54","v":0},{"$f":"AH127*$Y$54","v":0},{"$f":"AI127*$Z$54","v":0},{"$f":"AJ127*$X$88","v":0},{"$f":"AK127*$X$101","v":0},{"$f":"SUM(X127:Z127)","v":0},{"$f":"SUM(AA127:AC127)","v":0},{"$f":"SUM(AD127:AF127)","v":0},{"$f":"SUM(AG127:AI127)","v":0},0,0,{"$f":"SUM(AL127:AY127)","v":0}]
[null,"","",null,null,null,"",null,null,"",null,null,null,null,null,null,null,"",null,"",null,0,"TS1L1-SSD1920",{"$f":"'Lotto1 R630 1'!$C$89","v":0},{"$f":"'Lotto1 R630 2'!$C$89","v":0},{"$f":"'Lotto1 R630 3'!$C$89","v":0},{"$f":"'Lotto1 T630R 1'!$C$90","v":0},{"$f":"'Lotto1 T630R 2'!$C$90","v":0},{"$f":"'Lotto1 T630R 3'!$C$90","v":0},null,null,null,null,null,null,null,null,{"$f":"X128*$X$15","v":0},{"$f":"Y128*$Y$15","v":0},{"$f":"Z128*$Z$15","v":0},{"$f":"AA128*$X$75","v":0},{"$f":"AB128*$Y$75","v":0},{"$f":"AC128*$Z$75","v":0},{"$f":"AD128*$X$33","v":0},{"$f":"AE128*$Y$33","v":0},{"$f":"AF128*$Z$33","v":0},{"$f":"AG128*$X$54","v":0},{"$f":"AH128*$Y$54","v":0},{"$f":"AI128*$Z$54","v":0},{"$f":"AJ128*$X$88","v":0},{"$f":"AK128*$X$101","v":0},{"$f":"SUM(X128:Z128)","v":0},{"$f":"SUM(AA128:AC128)","v":0},{"$f":"SUM(AD128:AF128)","v":0},{"$f":"SUM(AG128:AI128)","v":0},0,0,{"$f":"SUM(AL128:AY128)","v":0}]
[null,"","",null,null,null,"",null,null,"",null,null,null,null,null,null,null,"",null,"",null,0,"S1-IDSDM16GB",{"$f":"'Lotto1 R630 1'!$C$123","v":0},{"$f":"'Lotto1 R630 2'!$C$123","v":0},{"$f":"'Lotto1 R630 3'!$C$123","v":0},{"$f":"'Lotto1 T630R 1'!$C$121","v":0},{"$f":"'Lotto1 T630R 2'!$C$121","v":0},{"$f":"'Lotto1 T630R 3'!$C$121","v":0},{"$f":"'Lotto1 R730 1'!$C$123","v":0},{"$f":"'Lotto1 R730 2'!$C$123","v":0},{"$f":"'Lotto1 R730 3'!$C$123","v":0},{"$f":"'Lotto1 R730xd 1'!C124","v":0},{"$f":"'Lotto1 R730xd 2'!$C$124","v":0},{"$f":"'Lotto1 R730xd 3'!$C$124","v":0},{"$f":"'Lotto1 T630 1 (Tower)'!C115","v":0},{"$f":"'Lotto1 T630 1 (Tower) Prest'!C115","v":0},{"$f":"X129*$X$15","v":0},{"$f":"Y129*$Y$15","v":0},{"$f":"Z129*$Z$15","v":0},{"$f":"AA129*$X$75","v":0},{"$f":"AB129*$Y$75","v":0},{"$f":"AC129*$Z$75","v":0},{"$f":"AD129*$X$33","v":0},{"$f":"AE129*$Y$33","v":0},{"$f":"AF129*$Z$33","v":0},{"$f":"AG129*$X$54","v":0},{"$f":"AH129*$Y$54","v":0},{"$f":"AI129*$Z$54","v":0},{"$f":"AJ129*$X$88","v":0},{"$f":"AK129*$X$101","v":0},{"$f":"SUM(X129:Z129)","v":0},{"$f":"SUM(AA129:AC129)","v":0},{"$f":"SUM(AD129:AF129)","v":0},{"$f":"SUM(AG129:AI129)","v":0},0,0,{"$f":"SUM(AL129:AY129)","v":0}]
[null,"","",null,null,null,"",null,null,"",null,null,null,null,null,null,null,"",null,"",null,0,"S1-405-AAES",{"$f":"COUNTIF($AU$19:$AU$20,$W$130)","v":0},{"$f":"COUNTIF($AV$19:$AV$20,$W130)","v":0},{"$f":"COUNTIF($AW$19:$AW$20,$W130)","v":0},{"$f":"COUNTIF($AU$79:$AU$84,W130)","v":0},{"$f":"COUNTIF($AV$79:$AV$84,W130)","v":0},{"$f":"COUNTIF($AW$79:$AW$84,W130)","v":0},{"$f":"COUNTIF($AU$37:$AU$43,$W130)","v":0},{"$f":"COUNTIF($AV$37:$AV$43,$W130)","v":0},{"$f":"COUNTIF($AW$37:$AW$43,$W130)","v":0},{"$f":"COUNTIF($AU$58:$AU$63,W130)","v":0},{"$f":"COUNTIF($AV$58:$AV$63,W130)","v":0},{"$f":"COUNTIF($AW$58:$AW$63,W130)","v":0},{"$f":"COUNTIF($AU$92:$AU$97,W130)","v":0},{"$f":"COUNTIF($AU$105:$AU$110,$W130)","v":0},{"$f":"X130*$X$15","v":0},{"$f":"Y130*$Y$15","v":0},{"$f":"Z130*$Z$15","v":0},{"$f":"AA130*$X$75","v":0},{"$f":"AB130*$Y$75","v":0},{"$f":"AC130*$Z$75","v":0},{"$f":"AD130*$X$33","v":0},{"$f":"AE130*$Y$33","v":0},{"$f":"AF130*$Z$33","v":0},{"$f":"AG130*$X$54","v":0},{"$f":"AH130*$Y$54","v":0},{"$f":"AI130*$Z$54","v":0},{"$f":"AJ130*$X$88","v":0},{"$f":"AK130*$X$101","v":0},{"$f":"SUM(X130:Z130)","v":0},{"$f":"SUM(AA130:AC130)","v":0},{"$f":"SUM(AD130:AF130)","v":0},{"$f":"SUM(AG130:AI130)","v":0},0,0,{"$f":"SUM(AL130:AY130)","v":0}]
[null,"","",null,null,null,"",null,null,"",null,null,null,null,null,null,null,"",null,"",null,0,"S1-405-AAER",{"$f":"COUNTIF($AU$19:$AU$20,$W$131)","v":0},{"$f":"COUNTIF($AV$19:$AV$20,$W131)","v":0},{"$f":"COUNTIF($AW$19:$AW$20,$W131)","v":0},{"$f":"COUNTIF($AU$79:$AU$84,W131)","v":0},{"$f":"COUNTIF($AV$79:$AV$84,W131)","v":0},{"$f":"COUNTIF($AW$79:$AW$84,W131)","v":0},{"$f":"COUNTIF($AU$37:$AU$43,$W131)","v":0},{"$f":"COUNTIF($AV$37:$AV$43,$W131)","v":0},{"$f":"COUNTIF($AW$37:$AW$43,$W131)","v":0},{"$f":"COUNTIF($AU$58:$AU$63,W131)","v":0},{"$f":"COUNTIF($AV$58:$AV$63,W131)","v":0},{"$f":"COUNTIF($AW$58:$AW$63,W131)","v":0},{"$f":"COUNTIF($AU$92:$AU$97,W131)","v":0},{"$f":"COUNTIF($AU$105:$AU$110,$W131)","v":0},{"$f":"X131*$X$15","v":0},{"$f":"Y131*$Y$15","v":0},{"$f":"Z131*$Z$15","v":0},{"$f":"AA131*$X$75","v":0},{"$f":"AB131*$Y$75","v":0},{"$f":"AC131*$Z$75","v":0},{"$f":"AD131*$X$33","v":0},{"$f":"AE131*$Y$33","v":0},{"$f":"AF131*$Z$33","v":0},{"$f":"AG131*$X$54","v":0},{"$f":"AH131*$Y$54","v":0},{"$f":"AI131*$Z$54","v":0},{"$f":"AJ131*$X$88","v":0},{"$f":"AK131*$X$101","v":0},{"$f":"SUM(X131:Z131)","v":0},{"$f":"SUM(AA131:AC131)","v":0},{"$f":"SUM(AD131:AF131)","v":0},{"$f":"SUM(AG131:AI131)","v":0},{"$f":"AX131","v":0},{"$f":"AY131","v":0},{"$f":"SUM(AL131:AY131)","v":0}]
[null,"","",null,null,null,"",null,null,"",null,null,null,null,null,null,null,"",null,"",null,0,"S1-540-BBIU",{"$f":"COUNTIF($AU$19:$AU$20,$W$132)","v":0},0,0,0,0,0,0,0,0,0,0,0,0,0,0,0,0,0,0,0,0,0,0,0,0,0,0,0,0,0,0,0,0,0,0]
[null,"",{"$f":"IF(BF133>0,(VLOOKUP(G133,COD_B,2,FALSE)),\"\")","v":""},null,null,null,"",null,null,"",null,null,null,null,null,null,null,"",null,"",null,0,"S1-406-BBEK",{"$f":"COUNTIF($AU$19:$AU$20,$W$133)","v":0},0,0,0,0,0,0,0,0,0,0,0,0,0,0,0,0,0,0,0,0,0,0,0,0,0,0,0,0,0,0,0,0,0,0]
[null,"",{"$f":"IF(BF134>0,(VLOOKUP(G134,COD_B,2,FALSE)),\"\")","v":""},null,null,null,{"$f":"IF(BF134>=1,W134,\"\")","v":""},null,null,{"$f":"IF(BF134>0,(VLOOKUP(G134,COD_B,5,FALSE)),\"\")","v":""},null,null,null,null,null,null,null,{"$f":"IF(BF134>0,(VLOOKUP(G134,COD_B,3,FALSE)),\"\")","v":""},null,{"$f":"IF(B134=\"\",\"\",R134*B134)","v":""},null,0,"TS1L1-540-BBIW",{"$f":"COUNTIF($AU$19:$AU$20,$W$134)","v":0},0,0,{"$f":"COUNTIF($AU$79:$AU$84,W134)","v":0},{"$f":"COUNTIF($AV$79:$AV$84,W134)","v":0},{"$f":"COUNTIF($AW$79:$AW$84,W134)","v":0},0,0,0,{"$f":"COUNTIF($AU$58:$AU$63,W134)","v":0},{"$f":"COUNTIF($AV$58:$AV$63,W134)","v":0},{"$f":"COUNTIF($AW$58:$AW$63,W134)","v":0},{"$f":"COUNTIF($AU$92:$AU$97,W134)","v":0},0,{"$f":"X134*$X$15","v":0},{"$f":"Y134*$Y$15","v":0},{"$f":"Z134*$Z$15","v":0},{"$f":"AA134*$X$75","v":0},{"$f":"AB134*$Y$75","v":0},{"$f":"AC134*$Z$75","v":0},{"$f":"AD134*$X$33","v":0},{"$f":"AE134*$Y$33","v":0},{"$f":"AF134*$Z$33","v":0},{"$f":"AG134*$X$54","v":0},{"$f":"AH134*$Y$54","v":0},{"$f":"AI134*$Z$54","v":0},{"$f":"AJ134*$X$88","v":0},{"$f":"AK134*$X$101","v":0},{"$f":"SUM(X134:Z134)","v":0},{"$f":"SUM(AA134:AC134)","v":0},{"$f":"SUM(AD134:AF134)","v":0},{"$f":"SUM(AG134:AI134)","v":0},{"$f":"AX134","v":0},{"$f":"AY134","v":0},{"$f":"SUM(AL134:AY134)","v":0}]
[null,"","",null,null,null,"",null,null,"",null,null,null,null,null,null,null,"",null,"",null,0,"S1-RDXCC",null,null,null,null,null,null,null,null,null,null,null,null,{"$f":"'Lotto1 T630 1 (Tower)'!C150","v":0},{"$f":"'Lotto1 T630 1 (Tower) Prest'!C150","v":0},0,0,0,0,0,0,0,0,0,0,0,0,0,0,0,0,0,0,0,0,0]
[null,"","",null,null,null,"",null,null,"",null,null,null,null,null,null,null,"",null,"",null,0,"TS1-874-006887",{"$f":"IF('Lotto1 R630 1'!$D$64=Riepilogo!$W$136,'Lotto1 R630 1'!$C$64,0)","v":0},{"$f":"IF('Lotto1 R630 2'!$D$64=Riepilogo!$W136,'Lotto1 R630 2'!$C$64,0)","v":0},{"$f":"IF('Lotto1 R630 3'!$D$64=Riepilogo!$W136,'Lotto1 R630 3'!$C$64,0)","v":0},{"$f":"IF('Lotto1 T630R 1'!$D$65=Riepilogo!$W$136,'Lotto1 T630R 1'!$C$65,0)","v":0},{"$f":"IF('Lotto1 T630R 2'!$D$65=Riepilogo!W136,'Lotto1 T630R 2'!$C$65,0)","v":0},{"$f":"IF('Lotto1 T630R 3'!$D$65=Riepilogo!W136,'Lotto1 T630R 3'!$C$65,0)","v":0},{"$f":"IF('Lotto1 R730 1'!$D$64=Riepilogo!$W136,'Lotto1 R730 1'!$C$64,0)","v":0},{"$f":"IF('Lotto1 R730 2'!$D$64=Riepilogo!$W136,'Lotto1 R730 2'!$C$64,0)","v":0},{"$f":"IF('Lotto1 R730 3'!$D$64=Riepilogo!$W136,'Lotto1 R730 3'!$C$64,0)","v":0},{"$f":"IF('Lotto1 R730xd 1'!$D$65=Riepilogo!$W136,'Lotto1 R730xd 1'!$C$65,0)","v":0},{"$f":"IF('Lotto1 R730xd 2'!$D$65=Riepilogo!$W136,'Lotto1 R730xd 2'!$C$65,0)","v":0},{"$f":"IF('Lotto1 R730xd 3'!$D$65=Riepilogo!$W136,'Lotto1 R730xd 3'!$C$65,0)","v":0},{"$f":"IF('Lotto1 T630 1 (Tower)'!$D$60=Riepilogo!$W136,'Lotto1 T630 1 (Tower)'!$C$60,0)","v":0},{"$f":"IF('Lotto1 T630 1 (Tower) Prest'!$D$60=Riepilogo!$W136,'Lotto1 T630 1 (Tower) Prest'!$C$60,0)","v":0},0,0,0,0,0,0,0,0,0,0,0,0,0,0,0,0,0,0,0,0,0]
[null,"","",null,null,null,"",null,null,"",null,null,null,null,null,null,null,"",null,"",null,0,"TS1-874-006898",{"$f":"IF('Lotto1 R630 1'!$D$64=Riepilogo!$W$137,'Lotto1 R630 1'!$C$64,0)","v":0},{"$f":"IF('Lotto1 R630 2'!$D$64=Riepilogo!$W137,'Lotto1 R630 2'!$C$64,0)","v":0},{"$f":"IF('Lotto1 R630 3'!$D$64=Riepilogo!$W137,'Lotto1 R630 3'!$C$64,0)","v":0},{"$f":"IF('Lotto1 T630R 1'!$D$65=Riepilogo!W137,'Lotto1 T630R 1'!$C$65,0)","v":0},{"$f":"IF('Lotto1 T630R 2'!$D$65=Riepilogo!W137,'Lotto1 T630R 2'!$C$65,0)","v":0},{"$f":"IF('Lotto1 T630R 3'!$D$65=Riepilogo!W137,'Lotto1 T630R 3'!$C$65,0)","v":0},{"$f":"IF('Lotto1 R730 1'!$D$64=Riepilogo!$W137,'Lotto1 R730 1'!$C$64,0)","v":0},{"$f":"IF('Lotto1 R730 2'!$D$64=Riepilogo!$W137,'Lotto1 R730 2'!$C$64,0)","v":0},{"$f":"IF('Lotto1 R730 3'!$D$64=Riepilogo!$W137,'Lotto1 R730 3'!$C$64,0)","v":0},{"$f":"IF('Lotto1 R730xd 1'!$D$65=Riepilogo!$W137,'Lotto1 R730xd 1'!$C$65,0)","v":0},{"$f":"IF('Lotto1 R730xd 2'!$D$65=Riepilogo!$W137,'Lotto1 R730xd 2'!$C$65,0)","v":0},{"$f":"IF('Lotto1 R730xd 3'!$D$65=Riepilogo!$W137,'Lotto1 R730xd 3'!$C$65,0)","v":0},{"$f":"IF('Lotto1 T630 1 (Tower)'!$D$60=Riepilogo!$W137,'Lotto1 T630 1 (Tower)'!$C$60,0)","v":0},{"$f":"IF('Lotto1 T630 1 (Tower) Prest'!$D$60=Riepilogo!$W137,'Lotto1 T630 1 (Tower) Prest'!$C$60,0)","v":0},0,0,0,0,0,0,0,0,0,0,0,0,0,0,0,0,0,0,0,0,0]
[null,"","",null,null,null,"",null,null,"",null,null,null,null,null,null,null,"",null,"",null,0,"TS1-874-006888",{"$f":"IF('Lotto1 R630 1'!$D$64=Riepilogo!$W$138,'Lotto1 R630 1'!$C$64,0)","v":0},{"$f":"IF('Lotto1 R630 2'!$D$64=Riepilogo!$W138,'Lotto1 R630 2'!$C$64,0)","v":0},{"$f":"IF('Lotto1 R630 3'!$D$64=Riepilogo!$W138,'Lotto1 R630 3'!$C$64,0)","v":0},{"$f":"IF('Lotto1 T630R 1'!$D$65=Riepilogo!W138,'Lotto1 T630R 1'!$C$65,0)","v":0},{"$f":"IF('Lotto1 T630R 2'!$D$65=Riepilogo!W138,'Lotto1 T630R 2'!$C$65,0)","v":0},{"$f":"IF('Lotto1 T630R 3'!$D$65=Riepilogo!W138,'Lotto1 T630R 3'!$C$65,0)","v":0},{"$f":"IF('Lotto1 R730 1'!$D$64=Riepilogo!$W138,'Lotto1 R730 1'!$C$64,0)","v":0},{"$f":"IF('Lotto1 R730 2'!$D$64=Riepilogo!$W138,'Lotto1 R730 2'!$C$64,0)","v":0},{"$f":"IF('Lotto1 R730 3'!$D$64=Riepilogo!$W138,'Lotto1 R730 3'!$C$64,0)","v":0},{"$f":"IF('Lotto1 R730xd 1'!$D$65=Riepilogo!$W138,'Lotto1 R730xd 1'!$C$65,0)","v":0},{"$f":"IF('Lotto1 R730xd 2'!$D$65=Riepilogo!$W138,'Lotto1 R730xd 2'!$C$65,0)","v":0},{"$f":"IF('Lotto1 R730xd 3'!$D$65=Riepilogo!$W138,'Lotto1 R730xd 3'!$C$65,0)","v":0},{"$f":"IF('Lotto1 T630 1 (Tower)'!$D$60=Riepilogo!$W138,'Lotto1 T630 1 (Tower)'!$C$60,0)","v":0},{"$f":"IF('Lotto1 T630 1 (Tower) Prest'!$D$60=Riepilogo!$W138,'Lotto1 T630 1 (Tower) Prest'!$C$60,0)","v":0},0,0,0,0,0,0,0,0,0,0,0,0,0,0,0,0,0,0,0,0,0]
[null,"","",null,null,null,"",null,null,"",null,null,null,null,null,null,null,"",null,"",null,0,"TS1-874-006902",{"$f":"IF('Lotto1 R630 1'!$D$64=Riepilogo!$W$139,'Lotto1 R630 1'!$C$64,0)","v":0},{"$f":"IF('Lotto1 R630 2'!$D$64=Riepilogo!$W139,'Lotto1 R630 2'!$C$64,0)","v":0},{"$f":"IF('Lotto1 R630 3'!$D$64=Riepilogo!$W139,'Lotto1 R630 3'!$C$64,0)","v":0},{"$f":"IF('Lotto1 T630R 1'!$D$65=Riepilogo!W139,'Lotto1 T630R 1'!$C$65,0)","v":0},{"$f":"IF('Lotto1 T630R 2'!$D$65=Riepilogo!W139,'Lotto1 T630R 2'!$C$65,0)","v":0},{"$f":"IF('Lotto1 T630R 3'!$D$65=Riepilogo!W139,'Lotto1 T630R 3'!$C$65,0)","v":0},{"$f":"IF('Lotto1 R730 1'!$D$64=Riepilogo!$W139,'Lotto1 R730 1'!$C$64,0)","v":0},{"$f":"IF('Lotto1 R730 2'!$D$64=Riepilogo!$W139,'Lotto1 R730 2'!$C$64,0)","v":0},{"$f":"IF('Lotto1 R730 3'!$D$64=Riepilogo!$W139,'Lotto1 R730 3'!$C$64,0)","v":0},{"$f":"IF('Lotto1 R730xd 1'!$D$65=Riepilogo!$W139,'Lotto1 R730xd 1'!$C$65,0)","v":0},{"$f":"IF('Lotto1 R730xd 2'!$D$65=Riepilogo!$W139,'Lotto1 R730xd 2'!$C$65,0)","v":0},{"$f":"IF('Lotto1 R730xd 3'!$D$65=Riepilogo!$W139,'Lotto1 R730xd 3'!$C$65,0)","v":0},{"$f":"IF('Lotto1 T630 1 (Tower)'!$D$60=Riepilogo!$W139,'Lotto1 T630 1 (Tower)'!$C$60,0)","v":0},{"$f":"IF('Lotto1 T630 1 (Tower) Prest'!$D$60=Riepilogo!$W139,'Lotto1 T630 1 (Tower) Prest'!$C$60,0)","v":0},0,0,0,0,0,0,0,0,0,0,0,0,0,0,0,0,0,0,0,0,0]
[null,"","",null,null,null,"",null,null,"",null,null,null,null,null,null,null,"",null,"",null,0,"TS1-874-006883",{"$f":"IF('Lotto1 R630 1'!$D$64=Riepilogo!$W$140,'Lotto1 R630 1'!$C$64,0)","v":0},{"$f":"IF('Lotto1 R630 2'!$D$64=Riepilogo!$W140,'Lotto1 R630 2'!$C$64,0)","v":0},{"$f":"IF('Lotto1 R630 3'!$D$64=Riepilogo!$W140,'Lotto1 R630 3'!$C$64,0)","v":0},{"$f":"IF('Lotto1 T630R 1'!$D$65=Riepilogo!W140,'Lotto1 T630R 1'!$C$65,0)","v":0},{"$f":"IF('Lotto1 T630R 2'!$D$65=Riepilogo!W140,'Lotto1 T630R 2'!$C$65,0)","v":0},{"$f":"IF('Lotto1 T630R 3'!$D$65=Riepilogo!W140,'Lotto1 T630R 3'!$C$65,0)","v":0},{"$f":"IF('Lotto1 R730 1'!$D$64=Riepilogo!$W140,'Lotto1 R730 1'!$C$64,0)","v":0},{"$f":"IF('Lotto1 R730 2'!$D$64=Riepilogo!$W140,'Lotto1 R730 2'!$C$64,0)","v":0},{"$f":"IF('Lotto1 R730 3'!$D$64=Riepilogo!$W140,'Lotto1 R730 3'!$C$64,0)","v":0},{"$f":"IF('Lotto1 R730xd 1'!$D$65=Riepilogo!$W140,'Lotto1 R730xd 1'!$C$65,0)","v":0},{"$f":"IF('Lotto1 R730xd 2'!$D$65=Riepilogo!$W140,'Lotto1 R730xd 2'!$C$65,0)","v":0},{"$f":"IF('Lotto1 R730xd 3'!$D$65=Riepilogo!$W140,'Lotto1 R730xd 3'!$C$65,0)","v":0},{"$f":"IF('Lotto1 T630 1 (Tower)'!$D$60=Riepilogo!$W140,'Lotto1 T630 1 (Tower)'!$C$60,0)","v":0},{"$f":"IF('Lotto1 T630 1 (Tower) Prest'!$D$60=Riepilogo!$W140,'Lotto1 T630 1 (Tower) Prest'!$C$60,0)","v":0},0,0,0,0,0,0,0,0,0,0,0,0,0,0,0,0,0,0,0,0,0]
[null,"","",null,null,null,"",null,null,"",null,null,null,null,null,null,null,"",null,"",null,0,"TS1-874-006894",{"$f":"IF('Lotto1 R630 1'!$D$64=Riepilogo!$W$141,'Lotto1 R630 1'!$C$64,0)","v":0},{"$f":"IF('Lotto1 R630 2'!$D$64=Riepilogo!$W141,'Lotto1 R630 2'!$C$64,0)","v":0},{"$f":"IF('Lotto1 R630 3'!$D$64=Riepilogo!$W141,'Lotto1 R630 3'!$C$64,0)","v":0},{"$f":"IF('Lotto1 T630R 1'!$D$65=Riepilogo!W141,'Lotto1 T630R 1'!$C$65,0)","v":0},{"$f":"IF('Lotto1 T630R 2'!$D$65=Riepilogo!W141,'Lotto1 T630R 2'!$C$65,0)","v":0},{"$f":"IF('Lotto1 T630R 3'!$D$65=Riepilogo!W141,'Lotto1 T630R 3'!$C$65,0)","v":0},{"$f":"IF('Lotto1 R730 1'!$D$64=Riepilogo!$W141,'Lotto1 R730 1'!$C$64,0)","v":0},{"$f":"IF('Lotto1 R730 2'!$D$64=Riepilogo!$W141,'Lotto1 R730 2'!$C$64,0)","v":0},{"$f":"IF('Lotto1 R730 3'!$D$64=Riepilogo!$W141,'Lotto1 R730 3'!$C$64,0)","v":0},{"$f":"IF('Lotto1 R730xd 1'!$D$65=Riepilogo!$W141,'Lotto1 R730xd 1'!$C$65,0)","v":0},{"$f":"IF('Lotto1 R730xd 2'!$D$65=Riepilogo!$W141,'Lotto1 R730xd 2'!$C$65,0)","v":0},{"$f":"IF('Lotto1 R730xd 3'!$D$65=Riepilogo!$W141,'Lotto1 R730xd 3'!$C$65,0)","v":0},{"$f":"IF('Lotto1 T630 1 (Tower)'!$D$60=Riepilogo!$W141,'Lotto1 T630 1 (Tower)'!$C$60,0)","v":0},{"$f":"IF('Lotto1 T630 1 (Tower) Prest'!$D$60=Riepilogo!$W141,'Lotto1 T630 1 (Tower) Prest'!$C$60,0)","v":0},0,0,0,0,0,0,0,0,0,0,0,0,0,0,0,0,0,0,0,0,0]
[null,"","",null,null,null,"",null,null,"",null,null,null,null,null,null,null,"",null,"",null,0,"TS1-874-006884",{"$f":"IF('Lotto1 R630 1'!$D$64=Riepilogo!$W$142,'Lotto1 R630 1'!$C$64,0)","v":0},{"$f":"IF('Lotto1 R630 2'!$D$64=Riepilogo!$W142,'Lotto1 R630 2'!$C$64,0)","v":0},{"$f":"IF('Lotto1 R630 3'!$D$64=Riepilogo!$W142,'Lotto1 R630 3'!$C$64,0)","v":0},{"$f":"IF('Lotto1 T630R 1'!$D$65=Riepilogo!W142,'Lotto1 T630R 1'!$C$65,0)","v":0},{"$f":"IF('Lotto1 T630R 2'!$D$65=Riepilogo!W142,'Lotto1 T630R 2'!$C$65,0)","v":0},{"$f":"IF('Lotto1 T630R 3'!$D$65=Riepilogo!W142,'Lotto1 T630R 3'!$C$65,0)","v":0},{"$f":"IF('Lotto1 R730 1'!$D$64=Riepilogo!$W142,'Lotto1 R730 1'!$C$64,0)","v":0},{"$f":"IF('Lotto1 R730 2'!$D$64=Riepilogo!$W142,'Lotto1 R730 2'!$C$64,0)","v":0},{"$f":"IF('Lotto1 R730 3'!$D$64=Riepilogo!$W142,'Lotto1 R730 3'!$C$64,0)","v":0},{"$f":"IF('Lotto1 R730xd 1'!$D$65=Riepilogo!$W142,'Lotto1 R730xd 1'!$C$65,0)","v":0},{"$f":"IF('Lotto1 R730xd 2'!$D$65=Riepilogo!$W142,'Lotto1 R730xd 2'!$C$65,0)","v":0},{"$f":"IF('Lotto1 R730xd 3'!$D$65=Riepilogo!$W142,'Lotto1 R730xd 3'!$C$65,0)","v":0},{"$f":"IF('Lotto1 T630 1 (Tower)'!$D$60=Riepilogo!$W142,'Lotto1 T630 1 (Tower)'!$C$60,0)","v":0},{"$f":"IF('Lotto1 T630 1 (Tower) Prest'!$D$60=Riepilogo!$W142,'Lotto1 T630 1 (Tower) Prest'!$C$60,0)","v":0},0,0,0,0,0,0,0,0,0,0,0,0,0,0,0,0,0,0,0,0,0]
[null,"","",null,null,null,"",null,null,"",null,null,null,null,null,null,null,{"$f":"IF(BF143>0,(VLOOKUP(G143,COD_B,3,FALSE)),\"\")","v":""},null,"",null,0,"TS1-874-006895",{"$f":"IF('Lotto1 R630 1'!$D$64=Riepilogo!$W$143,'Lotto1 R630 1'!$C$64,0)","v":0},{"$f":"IF('Lotto1 R630 2'!$D$64=Riepilogo!$W143,'Lotto1 R630 2'!$C$64,0)","v":0},{"$f":"IF('Lotto1 R630 3'!$D$64=Riepilogo!$W143,'Lotto1 R630 3'!$C$64,0)","v":0},{"$f":"IF('Lotto1 T630R 1'!$D$65=Riepilogo!W143,'Lotto1 T630R 1'!$C$65,0)","v":0},{"$f":"IF('Lotto1 T630R 2'!$D$65=Riepilogo!W143,'Lotto1 T630R 2'!$C$65,0)","v":0},{"$f":"IF('Lotto1 T630R 3'!$D$65=Riepilogo!W143,'Lotto1 T630R 3'!$C$65,0)","v":0},{"$f":"IF('Lotto1 R730 1'!$D$64=Riepilogo!$W143,'Lotto1 R730 1'!$C$64,0)","v":0},{"$f":"IF('Lotto1 R730 2'!$D$64=Riepilogo!$W143,'Lotto1 R730 2'!$C$64,0)","v":0},{"$f":"IF('Lotto1 R730 3'!$D$64=Riepilogo!$W143,'Lotto1 R730 3'!$C$64,0)","v":0},{"$f":"IF('Lotto1 R730xd 1'!$D$65=Riepilogo!$W143,'Lotto1 R730xd 1'!$C$65,0)","v":0},{"$f":"IF('Lotto1 R730xd 2'!$D$65=Riepilogo!$W143,'Lotto1 R730xd 2'!$C$65,0)","v":0},{"$f":"IF('Lotto1 R730xd 3'!$D$65=Riepilogo!$W143,'Lotto1 R730xd 3'!$C$65,0)","v":0},{"$f":"IF('Lotto1 T630 1 (Tower)'!$D$60=Riepilogo!$W143,'Lotto1 T630 1 (Tower)'!$C$60,0)","v":0},{"$f":"IF('Lotto1 T630 1 (Tower) Prest'!$D$60=Riepilogo!$W143,'Lotto1 T630 1 (Tower) Prest'!$C$60,0)","v":0},0,0,0,0,0,0,0,0,0,0,0,0,0,0,0,0,0,0,0,0,0]
[null,"",{"$f":"IF(BF144>0,(VLOOKUP(G144,COD_B,2,FALSE)),\"\")","v":""},null,null,null,{"$f":"IF(BF144>=1,W144,\"\")","v":""},null,null,{"$f":"IF(BF144>0,(VLOOKUP(G144,COD_B,5,FALSE)),\"\")","v":""},null,null,null,null,null,null,null,"",null,{"$f":"IF(B144=\"\",\"\",R144*B144)","v":""},null,0,"TS1-210-AHRT",{"$f":"IF('Lotto1 R630 1'!$D$67=Riepilogo!$W$144,'Lotto1 R630 1'!$C$67,0)","v":0},{"$f":"IF('Lotto1 R630 2'!$D$67=Riepilogo!$W$144,'Lotto1 R630 2'!$C$67,0)","v":0},{"$f":"IF('Lotto1 R630 3'!$D$67=Riepilogo!$W$144,'Lotto1 R630 3'!$C$67,0)","v":0},{"$f":"IF('Lotto1 T630R 1'!$D$68=Riepilogo!W144,'Lotto1 T630R 1'!$C$68,0)","v":0},{"$f":"IF('Lotto1 T630R 2'!$D$68=Riepilogo!W144,'Lotto1 T630R 2'!$C$68,0)","v":0},{"$f":"IF('Lotto1 T630R 3'!$D$68=Riepilogo!W144,'Lotto1 T630R 3'!$C$68,0)","v":0},{"$f":"IF('Lotto1 R730 1'!$D$67=Riepilogo!$W144,'Lotto1 R730 1'!$C$67,0)","v":0},{"$f":"IF('Lotto1 R730 2'!$D$67=Riepilogo!$W144,'Lotto1 R730 2'!$C$67,0)","v":0},{"$f":"IF('Lotto1 R730 3'!$D$67=Riepilogo!$W144,'Lotto1 R730 3'!$C$67,0)","v":0},{"$f":"IF('Lotto1 R730xd 1'!$D$68=Riepilogo!$W144,'Lotto1 R730xd 1'!$C$68,0)","v":0},{"$f":"IF('Lotto1 R730xd 2'!$D$68=Riepilogo!$W144,'Lotto1 R730xd 2'!$C$68,0)","v":0},{"$f":"IF('Lotto1 R730xd 3'!$D$68=Riepilogo!$W144,'Lotto1 R730xd 3'!$C$68,0)","v":0},{"$f":"IF('Lotto1 T630 1 (Tower)'!$D$63=Riepilogo!$W144,'Lotto1 T630 1 (Tower)'!$C$63,0)","v":0},{"$f":"IF('Lotto1 T630 1 (Tower) Prest'!$D$63=Riepilogo!$W144,'Lotto1 T630 1 (Tower) Prest'!$C$63,0)","v":0},{"$f":"X144*$X$15","v":0},{"$f":"Y144*$Y$15","v":0},{"$f":"Z144*$Z$15","v":0},{"$f":"AA144*$X$75","v":0},{"$f":"AB144*$Y$75","v":0},{"$f":"AC144*$Z$75","v":0},{"$f":"AD144*$X$33","v":0},{"$f":"AE144*$Y$33","v":0},{"$f":"AF144*$Z$33","v":0},{"$f":"AG144*$X$54","v":0},{"$f":"AH144*$Y$54","v":0},{"$f":"AI144*$Z$54","v":0},{"$f":"AJ144*$X$88","v":0},{"$f":"AK144*$X$101","v":0},{"$f":"SUM(X144:Z144)","v":0},{"$f":"SUM(AA144:AC144)","v":0},{"$f":"SUM(AD144:AF144)","v":0},{"$f":"SUM(AG144:AI144)","v":0},{"$f":"AX144","v":0},{"$f":"AY144","v":0},{"$f":"SUM(AL144:AY144)","v":0}]
[null,"","",null,null,null,"",null,null,{"$f":"IF(BF145>0,(VLOOKUP(G145,COD_B,5,FALSE)),\"\")","v":""},null,null,null,null,null,null,null,"",null,"",null,0,"TS1-210-AHRP",{"$f":"IF('Lotto1 R630 1'!$D$67=Riepilogo!$W$145,'Lotto1 R630 1'!$C$67,0)","v":0},{"$f":"IF('Lotto1 R630 2'!$D$67=Riepilogo!$W$145,'Lotto1 R630 2'!$C$67,0)","v":0},{"$f":"IF('Lotto1 R630 3'!$D$67=Riepilogo!$W$145,'Lotto1 R630 3'!$C$67,0)","v":0},{"$f":"IF('Lotto1 T630R 1'!$D$68=Riepilogo!W145,'Lotto1 T630R 1'!$C$68,0)","v":0},{"$f":"IF('Lotto1 T630R 1'!$D$68=Riepilogo!W145,'Lotto1 T630R 1'!$C$68,0)","v":0},{"$f":"IF('Lotto1 T630R 1'!$D$68=Riepilogo!W145,'Lotto1 T630R 1'!$C$68,0)","v":0},{"$f":"IF('Lotto1 R730 1'!$D$67=Riepilogo!$W145,'Lotto1 R730 1'!$C$67,0)","v":0},{"$f":"IF('Lotto1 R730 2'!$D$67=Riepilogo!$W145,'Lotto1 R730 2'!$C$67,0)","v":0},{"$f":"IF('Lotto1 R730 3'!$D$67=Riepilogo!$W145,'Lotto1 R730 3'!$C$67,0)","v":0},{"$f":"IF('Lotto1 R730xd 1'!$D$68=Riepilogo!$W145,'Lotto1 R730xd 1'!$C$68,0)","v":0},{"$f":"IF('Lotto1 R730xd 2'!$D$68=Riepilogo!$W145,'Lotto1 R730xd 2'!$C$68,0)","v":0},{"$f":"IF('Lotto1 R730xd 3'!$D$68=Riepilogo!$W145,'Lotto1 R730xd 3'!$C$68,0)","v":0},{"$f":"IF('Lotto1 T630 1 (Tower)'!$D$63=Riepilogo!$W145,'Lotto1 T630 1 (Tower)'!$C$63,0)","v":0},{"$f":"IF('Lotto1 T630 1 (Tower) Prest'!$D$63=Riepilogo!$W145,'Lotto1 T630 1 (Tower) Prest'!$C$63,0)","v":0},0,0,0,0,0,0,0,0,0,0,0,0,0,0,0,0,0,0,0,0,0]
[null,"","",null,null,null,"",null,null,"",null,null,null,null,null,null,null,"",null,"",null,0,"TS1-210-AHRF",{"$f":"'Lotto1 R630 1'!$C$70","v":0},{"$f":"'Lotto1 R630 2'!$C$70","v":0},{"$f":"'Lotto1 R630 3'!$C$70","v":0},{"$f":"'Lotto1 T630R 1'!$C$71","v":0},{"$f":"'Lotto1 T630R 2'!$C$71","v":0},{"$f":"'Lotto1 T630R 3'!$C$71","v":0},{"$f":"'Lotto1 R730 1'!$C$70","v":0},{"$f":"'Lotto1 R730 2'!$C$70","v":0},{"$f":"'Lotto1 R730 3'!$C$70","v":0},{"$f":"'Lotto1 R730xd 1'!$C$71","v":0},{"$f":"'Lotto1 R730xd 2'!$C$71","v":0},{"$f":"'Lotto1 R730xd 3'!$C$71","v":0},{"$f":"'Lotto1 T630 1 (Tower)'!C66","v":0},{"$f":"'Lotto1 T630 1 (Tower) Prest'!C66","v":0},{"$f":"X146","v":0},{"$f":"Y146","v":0},0,0,0,0,0,0,0,0,0,0,0,0,{"$f":"SUM(X146:Z146)","v":0},{"$f":"SUM(AA146:AC146)","v":0},{"$f":"SUM(AD146:AF146)","v":0},{"$f":"SUM(AG146:AI146)","v":0},{"$f":"AX146","v":0},{"$f":"AY146","v":0},{"$f":"SUM(AL146:AY146)","v":0}]
[null,"","",null,null,null,"",null,null,"",null,null,null,null,null,null,null,"",null,"",null,0,"TS1-210-AIKY",{"$f":"'Lotto1 R630 1'!$C$73","v":0},{"$f":"'Lotto1 R630 2'!$C$73","v":0},{"$f":"'Lotto1 R630 3'!$C$73","v":0},{"$f":"'Lotto1 T630R 1'!$C$74","v":0},{"$f":"'Lotto1 T630R 2'!$C$74","v":0},{"$f":"'Lotto1 T630R 3'!$C$74","v":0},{"$f":"'Lotto1 R730 1'!$C$73","v":0},{"$f":"'Lotto1 R730 2'!$C$73","v":0},{"$f":"'Lotto1 R730 3'!$C$73","v":0},{"$f":"'Lotto1 R730xd 1'!$C$74","v":0},{"$f":"'Lotto1 R730xd 2'!$C$74","v":0},{"$f":"'Lotto1 R730xd 3'!$C$74","v":0},{"$f":"'Lotto1 T630 1 (Tower)'!C69","v":0},{"$f":"'Lotto1 T630 1 (Tower) Prest'!C69","v":0},{"$f":"X147","v":0},0,0,0,0,0,0,0,0,0,0,0,0,0,0,0,0,0,0,0,0]
[null,"",{"$f":"IF(BF148>0,(VLOOKUP(G148,COD_B,2,FALSE)),\"\")","v":""},null,null,null,{"$f":"IF(BF148>=1,W148,\"\")","v":""},null,null,{"$f":"IF(BF148>0,(VLOOKUP(G148,COD_B,5,FALSE)),\"\")","v":""},null,null,null,null,null,null,null,{"$f":"IF(BF148>0,(VLOOKUP(G148,COD_B,3,FALSE)),\"\")","v":""},null,{"$f":"IF(B148=\"\",\"\",R148*B148)","v":""},null,0,"S1-405-AAJW",null,null,null,null,null,null,{"$f":"'Lotto1 R730 1'!C76","v":0},{"$f":"'Lotto1 R730 2'!C76","v":0},{"$f":"'Lotto1 R730 3'!C76","v":0},{"$f":"'Lotto1 R730xd 1'!C77","v":0},{"$f":"'Lotto1 R730xd 2'!C77","v":0},{"$f":"'Lotto1 R730xd 3'!C77","v":0},null,null,{"$f":"X148*$X$15","v":0},{"$f":"Y148*$Y$15","v":0},{"$f":"Z148*$Z$15","v":0},{"$f":"AA148*$X$75","v":0},{"$f":"AB148*$Y$75","v":0},{"$f":"AC148*$Z$75","v":0},{"$f":"AD148*$X$33","v":0},{"$f":"AE148*$Y$33","v":0},{"$f":"AF148*$Z$33","v":0},{"$f":"AG148*$X$54","v":0},{"$f":"AH148*$Y$54","v":0},{"$f":"AI148*$Z$54","v":0},{"$f":"AJ148*$X$88","v":0},{"$f":"AK148*$X$101","v":0},0,0,0,0,0,0,0]
[null,{"$f":"IF('RACK, Accessori e Servizi'!J18=0,\"\",'RACK, Accessori e Servizi'!J18)","v":""},{"$f":"IF(B149=\"\",\"\",(VLOOKUP(G149,COD_B,2,FALSE)))","v":""},null,null,null,{"$f":"IF('RACK, Accessori e Servizi'!J18>0,'RACK, Accessori e Servizi'!K18,\"\")","v":""},null,null,{"$f":"IF(B149=\"\",\"\",(VLOOKUP(G149,COD_B,5,FALSE)))","v":""},null,null,null,null,null,null,null,{"$f":"IF(B149=\"\",\"\",(VLOOKUP(G149,COD_B,3,FALSE)))","v":""},null,"",null,0]
[null,{"$f":"IF('RACK, Accessori e Servizi'!J21=0,\"\",'RACK, Accessori e Servizi'!J21)","v":""},{"$f":"IF(B150=\"\",\"\",(VLOOKUP(G150,COD_B,2,FALSE)))","v":""},null,null,null,{"$f":"IF('RACK, Accessori e Servizi'!J21>0,'RACK, Accessori e Servizi'!K21,\"\")","v":""},null,null,{"$f":"IF(B150=\"\",\"\",(VLOOKUP(G150,COD_B,5,FALSE)))","v":""},null,null,null,null,null,null,null,{"$f":"IF(B150=\"\",\"\",(VLOOKUP(G150,COD_B,3,FALSE)))","v":""},null,{"$f":"IF(B150=\"\",\"\",R150*B150)","v":""},null,0]
[null,"TOTALE ULTERIORI OPZIONI (I.V.A. Esclusa)",null,null,null,null,null,null,null,null,null,null,null,null,null,null,null,{"$f":"SUM(T126:U150)","v":0},null,null,null,{"$f":"IF(R151>0,1,0)","v":0}]
[null,"TOTALE COSTO (I.V.A. Esclusa)",null,null,null,null,null,null,null,null,null,null,null,null,null,null,null,{"$f":"SUM(T15:U124)","v":0},null,null,null,1]
[null,"I.V.A.",null,null,null,null,null,null,null,null,null,null,null,null,null,null,null,{"$f":"(R152+R151)*22%","v":0},null,null,null,1]
[null,"TOTALE ORDINE",null,null,null,null,null,null,null,null,null,null,null,null,null,null,null,{"$f":"SUM(R151:U153)","v":0},null,null,null,1]
[null,null,null,null,null,null,null,null,null,null,null,null,null,null,null,null,null,null,null,null,null,1]
[null,null,null,null,null,null,null,null,null,null,null,null,null,null,null,null,null,null,null,null,null,1]
[null,null,null,null,null,null,null,null,null,null,null,null,null,null,null,null,null,null,null,null,null,1]
[null,null,null,{"$f":"IF(G6>0,\"DETTAGLIO CONFIGURAZIONI SERVER LOTTO 1 \",\"\")","v":""},null,null,null,null,null,null,null,null,null,null,null,null,null,null,null,null,null,1]
[null,null,null,null,null,null,null,null,null,null,null,null,null,null,null,null,null,null,null,null,null,1]
[null,null,null,null,null,null,null,null,null,null,null,null,null,null,null,null,null,null,null,null,null,1]
[null,null,null,null,null,null,null,null,null,null,null,null,null,null,null,null,null,null,null,null,null,{"$f":"IF($B$15>=\"\",0,1)","v":0}]
[null,"PowerEdge R630 Conf.1",null,null,{"$f":"SRV_A","v":0},"Server",null,null,"PowerEdge R630 Conf.2",null,null,{"$f":"SRV_AA","v":0},"Server",null,null,"PowerEdge R630 Conf.3",null,null,{"$f":"SRV_AAA","v":0},"Server",null,{"$f":"IF($B$15>=\"\",0,1)","v":0}]
[null,null,null,null,null,null,null,null,null,null,null,null,null,null,null,null,null,null,null,null,null,{"$f":"IF($B$15>=\"\",0,1)","v":0}]
[null,{"$f":"IF(SRV_A>0,\"1\",\"-\")","v":"-"},{"$f":"IF(B164=\"-\",\"-\",CONCATENATE(MID($C$15,1,21),\" - \",$G$15))","v":"-"},null,null,null,null,null,{"$f":"IF(SRV_AA>0,\"1\",\"-\")","v":"-"},{"$f":"IF(I164=\"-\",\"-\",CONCATENATE(MID($C$15,1,21),\" - \",$G$15))","v":"-"},null,null,null,null,null,{"$f":"IF(SRV_AAA>0,\"1\",\"-\")","v":"-"},{"$f":"IF(P164=\"-\",\"-\",CONCATENATE(MID($C$15,1,21),\" - \",$G$15))","v":"-"},null,null,null,null,{"$f":"IF((Y164+X164+W164)>0,1,0)","v":0},{"$f":"IF(B164=\"-\",0,B164)","v":0},{"$f":"IF(I164=\"-\",0,I164)","v":0},{"$f":"IF(P164=\"-\",0,P164)","v":0}]
[null,{"$f":"IF(X16=0,\"-\",X16)","v":"-"},{"$f":"IF(B165=\"-\",\"-\",CONCATENATE(MID($C$16,1,21),\" - \",$G$16))","v":"-"},null,null,null,null,null,{"$f":"IF(Y16=0,\"-\",Y16)","v":"-"},{"$f":"IF(I165=\"-\",\"-\",CONCATENATE(MID(C16,1,21),\" - \",G16))","v":"-"},null,null,null,null,null,{"$f":"IF(Z16=0,\"-\",Z16)","v":"-"},{"$f":"IF(P165=\"-\",\"-\",CONCATENATE(MID(C16,1,21),\" - \",G16))","v":"-"},null,null,null,null,{"$f":"IF((Y165+X165+W165)>0,1,0)","v":0},{"$f":"IF(B165=\"-\",0,B165)","v":0},{"$f":"IF(I165=\"-\",0,I165)","v":0},{"$f":"IF(P165=\"-\",0,P165)","v":0}]
[null,"-",{"$f":"IF(B166=\"-\",\"-\",CONCATENATE(MID($C$17,1,21),\" - \",$G$17))","v":"-"},null,null,null,null,null,"-","-",null,null,null,null,null,"-","-",null,null,null,null,0,0,0,0]
[null,"-",{"$f":"IF(B167=\"-\",\"-\",CONCATENATE(MID($C$18,1,21),\" - \",$G$18))","v":"-"},null,null,null,null,null,"-","-",null,null,null,null,null,"-","-",null,null,null,null,0,0,0,0]
[null,"-",{"$f":"IF(B168=\"-\",\"-\",CONCATENATE(MID(C19,1,21),\" - \",G19))","v":"-"},null,null,null,null,null,"-","-",null,null,null,null,null,"-","-",null,null,null,null,0,0,0,0]
[null,"-","-",null,null,null,null,null,"-","-",null,null,null,null,null,"-","-",null,null,null,null,0,0,0,0]
[null,"-","-",null,null,null,null,null,"-","-",null,null,null,null,null,"-","-",null,null,null,null,0,0,0,0]
[null,"-","-",null,null,null,null,null,"-","-",null,null,null,null,null,"-","-",null,null,null,null,0,0,0,0]
[null,"-","-",null,null,null,null,null,"-","-",null,null,null,null,null,"-","-",null,null,null,null,0,0,0,0]
[null,"-","-",null,null,null,null,null,"-","-",null,null,null,null,null,"-","-",null,null,null,null,0,0,0,0]
[null,"-","-",null,null,null,null,null,"-","-",null,null,null,null,null,"-","-",null,null,null,null,0,0,0,0]
[null,"-","-",null,null,null,null,null,"-","-",null,null,null,null,null,"-","-",null,null,null,null,0,0,0,0]
[null,"-","-",null,null,null,null,null,"-","-",null,null,null,null,null,"-","-",null,null,null,null,0,0,0,0]
[null,"-","-",null,null,null,null,null,"-","-",null,null,null,null,null,"-","-",null,null,null,null,0,0,0,0]
[null,"-",{"$f":"IF(B178=\"-\",\"-\",CONCATENATE(\"TS1L1-4Y-R630 - \",MID($C$29,1,21),\" - \",$G$29))","v":"-"},null,null,null,null,null,"-",{"$f":"IF(I178=\"-\",\"-\",CONCATENATE(\"TS1L1-4Y-R630 - \",MID($C$29,1,21),\" - \",$G$29))","v":"-"},null,null,null,null,null,"-",{"$f":"IF(P178=\"-\",\"-\",CONCATENATE(\"TS1L1-4Y-R630 - \",MID($C$29,1,21),\" - \",$G$29))","v":"-"},null,null,null,null,0,0,0,0]
[null,"-",{"$f":"IF(B179=\"-\",\"-\",CONCATENATE(\"TS1L1-5Y-R630 - \",MID($C$30,1,21),\" - \",$G$30))","v":"-"},null,null,null,null,null,"-",{"$f":"IF(I179=\"-\",\"-\",CONCATENATE(\"TS1L1-5Y-R630 - \",MID($C$30,1,21),\" - \",$G$30))","v":"-"},null,null,null,null,null,"-",{"$f":"IF(P179=\"-\",\"-\",CONCATENATE(\"TS1L1-5Y-R630 - \",MID($C$30,1,21),\" - \",$G$30))","v":"-"},null,null,null,null,0,0,0,0]
[null,"-",{"$f":"IF(B180=\"-\",\"-\",CONCATENATE(MID(C31,1,21),\" - \",AV31))","v":"-"},null,null,null,null,null,"-",{"$f":"IF(I180=\"-\",\"-\",CONCATENATE(MID(C31,1,21),\" - \",AW31))","v":"-"},null,null,null,null,null,"-",{"$f":"IF(P180=\"-\",\"-\",CONCATENATE(MID(C31,1,21),\" - \",AY31))","v":"-"},null,null,null,null,0,0,0,0]
[null,{"$f":"IF(X114=0,\"-\",X114)","v":"-"},{"$f":"IF(B181=\"-\",\"-\",CONCATENATE(MID(C114,1,21),\" - \",G114))","v":"-"},null,null,null,null,null,{"$f":"IF(Y114=0,\"-\",Y114)","v":"-"},{"$f":"IF(I181=\"-\",\"-\",CONCATENATE(MID(C114,1,21),\" - \",G114))","v":"-"},null,null,null,null,null,{"$f":"IF(Z114=0,\"-\",Z114)","v":"-"},{"$f":"IF(P181=\"-\",\"-\",CONCATENATE(MID(C114,1,21),\" - \",G114))","v":"-"},null,null,null,null,0,0,0,0]
[null,{"$f":"IF(X115=0,\"-\",X115)","v":"-"},{"$f":"IF(B182=\"-\",\"-\",CONCATENATE(MID(C115,1,21),\" - \",G115))","v":"-"},null,null,null,null,null,{"$f":"IF(Y115=0,\"-\",Y115)","v":"-"},{"$f":"IF(I182=\"-\",\"-\",CONCATENATE(MID(C115,1,21),\" - \",G115))","v":"-"},null,null,null,null,null,{"$f":"IF(Z115=0,\"-\",Z115)","v":"-"},{"$f":"IF(P182=\"-\",\"-\",CONCATENATE(MID(C115,1,21),\" - \",G115))","v":"-"},null,null,null,null,0,0,0,0]
[null,{"$f":"IF(X116=0,\"-\",X116)","v":"-"},{"$f":"IF(B183=\"-\",\"-\",CONCATENATE(MID(C116,1,21),\" - \",G116))","v":"-"},null,null,null,null,null,{"$f":"IF(Y116=0,\"-\",Y116)","v":"-"},{"$f":"IF(I183=\"-\",\"-\",CONCATENATE(MID(C116,1,21),\" - \",G116))","v":"-"},null,null,null,null,null,{"$f":"IF(Z116=0,\"-\",Z116)","v":"-"},{"$f":"IF(P183=\"-\",\"-\",CONCATENATE(MID(C116,1,21),\" - \",G116))","v":"-"},null,null,null,null,0,0,0,0]
[null,{"$f":"IF(X117=0,\"-\",X117)","v":"-"},{"$f":"IF(B184=\"-\",\"-\",CONCATENATE(MID(C117,1,21),\" - \",G117))","v":"-"},null,null,null,null,null,{"$f":"IF(Y117=0,\"-\",Y117)","v":"-"},{"$f":"IF(I184=\"-\",\"-\",CONCATENATE(MID(C117,1,21),\" - \",G117))","v":"-"},null,null,null,null,null,{"$f":"IF(Z117=0,\"-\",Z117)","v":"-"},{"$f":"IF(P184=\"-\",\"-\",CONCATENATE(MID(C117,1,21),\" - \",G117))","v":"-"},null,null,null,null,0,0,0,0]
[null,{"$f":"IF(X118=0,\"-\",X118)","v":"-"},{"$f":"IF(B185=\"-\",\"-\",CONCATENATE(MID(C118,1,21),\" - \",G118))","v":"-"},null,null,null,null,null,{"$f":"IF(Y118=0,\"-\",Y118)","v":"-"},{"$f":"IF(I185=\"-\",\"-\",CONCATENATE(MID(C118,1,21),\" - \",G118))","v":"-"},null,null,null,null,null,{"$f":"IF(Z118=0,\"-\",Z118)","v":"-"},{"$f":"IF(P185=\"-\",\"-\",CONCATENATE(MID(C118,1,21),\" - \",G118))","v":"-"},null,null,null,null,0,0,0,0]
[null,{"$f":"IF(X126=0,\"-\",X126)","v":"-"},{"$f":"IF(B186=\"-\",\"-\",CONCATENATE(MID(C126,1,21),\" - \",G126))","v":"-"},null,null,null,null,null,{"$f":"IF(Y126=0,\"-\",Y126)","v":"-"},{"$f":"IF(I186=\"-\",\"-\",CONCATENATE(MID(C126,1,21),\" - \",G126))","v":"-"},null,null,null,null,null,{"$f":"IF(Z126=0,\"-\",Z126)","v":"-"},{"$f":"IF(P186=\"-\",\"-\",CONCATENATE(MID(C126,1,21),\" - \",G126))","v":"-"},null,null,null,null,0,0,0,0]
[null,"-","-",null,null,null,null,null,"-","-",null,null,null,null,null,"-","-",null,null,null,null,0,0,0,0]
[null,"-","-",null,null,null,null,null,"-","-",null,null,null,null,null,"-","-",null,null,null,null,0,0,0,0]
[null,"-","-",null,null,null,null,null,"-","-",null,null,null,null,null,"-","-",null,null,null,null,0,0,0,0]
[null,"-","-",null,null,null,null,null,"-","-",null,null,null,null,null,"-","-",null,null,null,null,0,0,0,0]
[null,"-","-",null,null,null,null,null,"-","-",null,null,null,null,null,"-","-",null,null,null,null,0,0,0,0]
[null,"-","-",null,null,null,null,null,"-","-",null,null,null,null,null,"-","-",null,null,null,null,0,0,0,0]
[null,"-","-",null,null,null,null,null,"-","-",null,null,null,null,null,"-","-",null,null,null,null,0,0,0,0]
[null,"-","-",null,null,null,null,null,"-","-",null,null,null,null,null,"-","-",null,null,null,null,0,0,0,0]
[null,"-","-",null,null,null,null,null,"-","-",null,null,null,null,null,"-","-",null,null,null,null,0,0,0,0]
[null,"-","-",null,null,null,null,null,"-","-",null,null,null,null,null,"-","-",null,null,null,null,0,0,0,0]
[null,"-","-",null,null,null,null,null,"-","-",null,null,null,null,null,"-","-",null,null,null,null,0,0,0,0]
[null,"-","-",null,null,null,null,null,"-","-",null,null,null,null,null,"-","-",null,null,null,null,0,0,0,0]
[null,"-","-",null,null,null,null,null,"-","-",null,null,null,null,null,"-","-",null,null,null,null,0,0,0,0]
[null,"-","-",null,null,null,null,null,"-","-",null,null,null,null,null,"-","-",null,null,null,null,0,0,0,0]
[null,"-","-",null,null,null,null,null,"-","-",null,null,null,null,null,"-","-",null,null,null,null,0,0,0,0]
[null,"-","-",null,null,null,null,null,"-","-",null,null,null,null,null,"-","-",null,null,null,null,0,0,0,0]
[null,"-","-",null,null,null,null,null,"-","-",null,null,null,null,null,"-","-",null,null,null,null,{"$f":"IF((Y203+X203+W203)>0,1,0)","v":0},{"$f":"IF(B203=\"-\",0,B203)","v":0},{"$f":"IF(I203=\"-\",0,I203)","v":0},{"$f":"IF(P203=\"-\",0,P203)","v":0}]
[null,"-","-",null,null,null,null,null,"-","-",null,null,null,null,null,"-","-",null,null,null,null,0,0,0,0]
[null,"-","-",null,null,null,null,null,"-","-",null,null,null,null,null,"-","-",null,null,null,null,0,0,0,0]
[null,"-","-",null,null,null,null,null,"-","-",null,null,null,null,null,"-","-",null,null,null,null,0,0,0,0]
[null,"-","-",null,null,null,null,null,"-","-",null,null,null,null,null,"-","-",null,null,null,null,0,0,0,0]
[null,null,null,null,null,null,null,null,null,null,null,null,null,null,null,null,null,null,null,null,null,{"$f":"IF($B$15>=\"\",0,1)","v":0}]
[null,"Configurazione RAID",null,null,null,null,null,null,"Configurazione RAID",null,null,null,null,null,null,"Configurazione RAID",null,null,null,null,null,0]
[null,null,null,null,null,null,null,null,null,null,null,null,null,null,null,null,null,null,null,null,null,0]
[null,{"$f":"'Lotto1 R630 1'!$B$96","v":"SCRIVERE QUI' LA CONFIGURAZIONE RAID RICHIESTA.\nR630 1\n"},null,null,null,null,null,null,{"$f":"'Lotto1 R630 2'!$B$96","v":"SCRIVERE QUI' LA CONFIGURAZIONE RAID RICHIESTA.\nR630 2\n"},null,null,null,null,null,null,{"$f":"'Lotto1 R630 3'!$B$96","v":"SCRIVERE QUI' LA CONFIGURAZIONE RAID RICHIESTA.\nR630 3\n"},null,null,null,null,null,0]
[null,null,null,null,null,null,null,null,null,null,null,null,null,null,null,null,null,null,null,null,null,0]
[null,null,null,null,null,null,null,null,null,null,null,null,null,null,null,null,null,null,null,null,null,0]
[null,null,null,null,null,null,null,null,null,null,null,null,null,null,null,null,null,null,null,null,null,0]
[null,null,null,null,null,null,null,null,null,null,null,null,null,null,null,null,null,null,null,null,null,0]
[null,null,null,null,null,null,null,null,null,null,null,null,null,null,null,null,null,null,null,null,null,0]
[null,null,null,null,null,null,null,null,null,null,null,null,null,null,null,null,null,null,null,null,null,0]
[null,null,null,null,null,null,null,null,null,null,null,null,null,null,null,null,null,null,null,null,null,0]
[null,null,null,null,null,null,null,null,null,null,null,null,null,null,null,null,null,null,null,null,null,0]
[null,null,null,null,null,null,null,null,null,null,null,null,null,null,null,null,null,null,null,null,null,0]
[null,null,null,null,null,null,null,null,null,null,null,null,null,null,null,null,null,null,null,null,null,0]
[null,null,null,null,null,null,null,null,null,null,null,null,null,null,null,null,null,null,null,null,null,0]
[null,null,null,null,null,null,null,null,null,null,null,null,null,null,null,null,null,null,null,null,null,0]
[null,null,null,null,null,null,null,null,null,null,null,null,null,null,null,null,null,null,null,null,null,0]
[null,null,null,null,null,null,null,null,null,null,null,null,null,null,null,null,null,null,null,null,null,0]
[null,null,null,null,null,null,null,null,null,null,null,null,null,null,null,null,null,null,null,null,null,0]
[null,null,null,null,null,null,null,null,null,null,null,null,null,null,null,null,null,null,null,null,null,0]
[null,null,null,null,null,null,null,null,null,null,null,null,null,null,null,null,null,null,null,null,null,0]
[null,null,null,null,null,null,null,null,null,null,null,null,null,null,null,null,null,null,null,null,null,{"$f":"IF($B$33>=\"\",0,1)","v":0}]
[null,"PowerEdge 730 Conf.1",null,null,{"$f":"SRV_B1.1","v":0},"Server",null,null,"PowerEdge 730 Conf.2",null,null,{"$f":"SRV_B1.2","v":0},"Server",null,null,"PowerEdge 730 Conf.3",null,null,{"$f":"SRV_B1.3","v":0},"Server",null,{"$f":"IF($B$33>=\"\",0,1)","v":0}]
[null,null,null,null,null,null,null,null,null,null,null,null,null,null,null,null,null,null,null,null,null,{"$f":"IF($B$33>=\"\",0,1)","v":0}]
[null,{"$f":"IF(SRV_B1.1>0,\"1\",\"-\")","v":"-"},{"$f":"IF(B232=\"-\",\"-\",CONCATENATE(MID(C33,1,24),\" - \",G33))","v":"-"},null,null,null,null,null,{"$f":"IF(SRV_B1.2>0,\"1\",\"-\")","v":"-"},{"$f":"IF(I232=\"-\",\"-\",CONCATENATE(MID(C33,1,24),\" - \",G33))","v":"-"},null,null,null,null,null,{"$f":"IF(SRV_B1.3>0,\"1\",\"-\")","v":"-"},{"$f":"IF(P232=\"-\",\"-\",CONCATENATE(MID(C33,1,24),\" - \",G33))","v":"-"},null,null,null,null,{"$f":"IF((Y232+X232+W232)>0,1,0)","v":0},{"$f":"IF(B232=\"-\",0,B232)","v":0},{"$f":"IF(I232=\"-\",0,I232)","v":0},{"$f":"IF(P232=\"-\",0,P232)","v":0}]
[null,{"$f":"IF(X34=0,\"-\",X34)","v":"-"},"-",null,null,null,null,null,{"$f":"IF(Y34=0,\"-\",Y34)","v":"-"},"-",null,null,null,null,null,{"$f":"IF(Z34=0,\"-\",Z34)","v":"-"},"-",null,null,null,null,{"$f":"IF((Y233+X233+W233)>0,1,0)","v":0},{"$f":"IF(B233=\"-\",0,B233)","v":0},{"$f":"IF(I233=\"-\",0,I233)","v":0},{"$f":"IF(P233=\"-\",0,P233)","v":0}]
[null,"-","-",null,null,null,null,null,"-","-",null,null,null,null,null,"-","-",null,null,null,null,0,0,0,0]
[null,"-","-",null,null,null,null,null,"-","-",null,null,null,null,null,"-","-",null,null,null,null,0,0,0,0]
[null,"-","-",null,null,null,null,null,"-","-",null,null,null,null,null,"-","-",null,null,null,null,0,0,0,0]
[null,"-","-",null,null,null,null,null,"-","-",null,null,null,null,null,"-","-",null,null,null,null,0,0,0,0]
[null,"-","-",null,null,null,null,null,"-","-",null,null,null,null,null,"-","-",null,null,null,null,0,0,0,0]
[null,"-","-",null,null,null,null,null,"-","-",null,null,null,null,null,"-","-",null,null,null,null,0,0,0,0]
[null,"-","-",null,null,null,null,null,"-","-",null,null,null,null,null,"-","-",null,null,null,null,0,0,0,0]
[null,"-","-",null,null,null,null,null,"-","-",null,null,null,null,null,"-","-",null,null,null,null,0,0,0,0]
[null,"-","-",null,null,null,null,null,"-","-",null,null,null,null,null,"-","-",null,null,null,null,0,0,0,0]
[null,"-","-",null,null,null,null,null,"-","-",null,null,null,null,null,"-","-",null,null,null,null,0,0,0,0]
[null,"-","-",null,null,null,null,null,"-","-",null,null,null,null,null,"-","-",null,null,null,null,0,0,0,0]
[null,"-","-",null,null,null,null,null,"-","-",null,null,null,null,null,"-","-",null,null,null,null,0,0,0,0]
[null,"-","-",null,null,null,null,null,"-","-",null,null,null,null,null,"-","-",null,null,null,null,0,0,0,0]
[null,"-","-",null,null,null,null,null,"-","-",null,null,null,null,null,"-","-",null,null,null,null,0,0,0,0]
[null,"-","-",null,null,null,null,null,"-","-",null,null,null,null,null,"-","-",null,null,null,null,0,0,0,0]
[null,"-",{"$f":"IF(B249=\"-\",\"-\",CONCATENATE(\"TS1L1-4Y-R730 - \",MID($C$50,1,24),\" - \",$G$50))","v":"-"},null,null,null,null,null,"-",{"$f":"IF(I249=\"-\",\"-\",CONCATENATE(\"TS1L1-4Y-R730 - \",MID($C$50,1,24),\" - \",$G$50))","v":"-"},null,null,null,null,null,"-",{"$f":"IF(P249=\"-\",\"-\",CONCATENATE(\"TS1L1-4Y-R730 - \",MID($C$50,1,24),\" - \",$G$50))","v":"-"},null,null,null,null,0,0,0,0]
[null,"-",{"$f":"IF(B250=\"-\",\"-\",CONCATENATE(\"TS1L1-5Y-R730 - \",MID($C$51,1,24),\" - \",$G$51))","v":"-"},null,null,null,null,null,"-",{"$f":"IF(I250=\"-\",\"-\",CONCATENATE(\"TS1L1-5Y-R730 - \",MID($C$51,1,24),\" - \",$G$51))","v":"-"},null,null,null,null,null,"-",{"$f":"IF(P250=\"-\",\"-\",CONCATENATE(\"TS1L1-5Y-R730 - \",MID($C$51,1,24),\" - \",$G$51))","v":"-"},null,null,null,null,0,0,0,0]
[null,"-",{"$f":"IF(B251=\"-\",\"-\",CONCATENATE(MID(C52,1,24),\" - \",G52))","v":"-"},null,null,null,null,null,"-",{"$f":"IF(I251=\"-\",\"-\",CONCATENATE(MID(C52,1,24),\" - \",G52))","v":"-"},null,null,null,null,null,"-",{"$f":"IF(P251=\"-\",\"-\",CONCATENATE(MID(C52,1,24),\" - \",G52))","v":"-"},null,null,null,null,0,0,0,0]
[null,{"$f":"IF(AD114=0,\"-\",AD114)","v":"-"},{"$f":"IF(B252=\"-\",\"-\",CONCATENATE(MID(C114,1,21),\" - \",G114))","v":"-"},null,null,null,null,null,{"$f":"IF(AE114=0,\"-\",AE114)","v":"-"},{"$f":"IF(I252=\"-\",\"-\",CONCATENATE(MID(C114,1,21),\" - \",G114))","v":"-"},null,null,null,null,null,{"$f":"IF(AF114=0,\"-\",AF114)","v":"-"},{"$f":"IF(P252=\"-\",\"-\",CONCATENATE(MID(C114,1,21),\" - \",G114))","v":"-"},null,null,null,null,0,0,0,0]
[null,{"$f":"IF(AD115=0,\"-\",AD115)","v":"-"},{"$f":"IF(B253=\"-\",\"-\",CONCATENATE(MID(C115,1,21),\" - \",G115))","v":"-"},null,null,null,null,null,{"$f":"IF(AE115=0,\"-\",AE115)","v":"-"},{"$f":"IF(I253=\"-\",\"-\",CONCATENATE(MID(C115,1,21),\" - \",G115))","v":"-"},null,null,null,null,null,{"$f":"IF(AF115=0,\"-\",AF115)","v":"-"},{"$f":"IF(P253=\"-\",\"-\",CONCATENATE(MID(C115,1,21),\" - \",G115))","v":"-"},null,null,null,null,0,0,0,0]
[null,{"$f":"IF(AD116=0,\"-\",AD116)","v":"-"},{"$f":"IF(B254=\"-\",\"-\",CONCATENATE(MID(C116,1,21),\" - \",G116))","v":"-"},null,null,null,null,null,{"$f":"IF(AE116=0,\"-\",AE116)","v":"-"},{"$f":"IF(I254=\"-\",\"-\",CONCATENATE(MID(C116,1,21),\" - \",G116))","v":"-"},null,null,null,null,null,{"$f":"IF(AF116=0,\"-\",AF116)","v":"-"},{"$f":"IF(P254=\"-\",\"-\",CONCATENATE(MID(C116,1,21),\" - \",G116))","v":"-"},null,null,null,null,0,{"$f":"IF(B254=\"-\",0,B254)","v":0},{"$f":"IF(I254=\"-\",0,I254)","v":0},{"$f":"IF(P254=\"-\",0,P254)","v":0}]
[null,{"$f":"IF(AD117=0,\"-\",AD117)","v":"-"},{"$f":"IF(B255=\"-\",\"-\",CONCATENATE(MID(C117,1,21),\" - \",G117))","v":"-"},null,null,null,null,null,{"$f":"IF(AE117=0,\"-\",AE117)","v":"-"},{"$f":"IF(I255=\"-\",\"-\",CONCATENATE(MID(C117,1,21),\" - \",G117))","v":"-"},null,null,null,null,null,{"$f":"IF(AF117=0,\"-\",AF117)","v":"-"},{"$f":"IF(P255=\"-\",\"-\",CONCATENATE(MID(C117,1,21),\" - \",G117))","v":"-"},null,null,null,null,0,{"$f":"IF(B255=\"-\",0,B255)","v":0},{"$f":"IF(I255=\"-\",0,I255)","v":0},{"$f":"IF(P255=\"-\",0,P255)","v":0}]
[null,{"$f":"IF(AD126=0,\"-\",AD126)","v":"-"},{"$f":"IF(B256=\"-\",\"-\",CONCATENATE(MID(C126,1,21),\" - \",G126))","v":"-"},null,null,null,null,null,{"$f":"IF(AE126=0,\"-\",AE126)","v":"-"},{"$f":"IF(I256=\"-\",\"-\",CONCATENATE(MID(C126,1,21),\" - \",G126))","v":"-"},null,null,null,null,null,{"$f":"IF(AF126=0,\"-\",AF126)","v":"-"},{"$f":"IF(P256=\"-\",\"-\",CONCATENATE(MID(C126,1,21),\" - \",G126))","v":"-"},null,null,null,null,0,{"$f":"IF(B256=\"-\",0,B256)","v":0},{"$f":"IF(I256=\"-\",0,I256)","v":0},{"$f":"IF(P256=\"-\",0,P256)","v":0}]
[null,"-","-",null,null,null,null,null,"-","-",null,null,null,null,null,"-","-",null,null,null,null,0,0,0,0]
[null,"-","-",null,null,null,null,null,"-","-",null,null,null,null,null,"-","-",null,null,null,null,0,0,0,0]
[null,"-","-",null,null,null,null,null,"-","-",null,null,null,null,null,"-","-",null,null,null,null,0,0,0,0]
[null,"-","-",null,null,null,null,null,"-","-",null,null,null,null,null,"-","-",null,null,null,null,0,0,0,0]
[null,"-","-",null,null,null,null,null,"-","-",null,null,null,null,null,"-","-",null,null,null,null,0,0,0,0]
[null,"-","-",null,null,null,null,null,"-","-",null,null,null,null,null,"-","-",null,null,null,null,0,0,0,0]
[null,"-","-",null,null,null,null,null,"-","-",null,null,null,null,null,"-","-",null,null,null,null,0,0,0,0]
[null,"-","-",null,null,null,null,null,"-","-",null,null,null,null,null,"-","-",null,null,null,null,0,0,0,0]
[null,"-","-",null,null,null,null,null,"-","-",null,null,null,null,null,"-","-",null,null,null,null,0,0,0,0]
[null,"-","-",null,null,null,null,null,"-","-",null,null,null,null,null,"-","-",null,null,null,null,0,0,0,0]
[null,"-","-",null,null,null,null,null,"-","-",null,null,null,null,null,"-","-",null,null,null,null,0,0,0,0]
[null,"-","-",null,null,null,null,null,"-","-",null,null,null,null,null,"-","-",null,null,null,null,0,0,0,0]
[null,"-","-",null,null,null,null,null,"-","-",null,null,null,null,null,"-","-",null,null,null,null,0,0,0,0]
[null,"-","-",null,null,null,null,null,"-","-",null,null,null,null,null,"-","-",null,null,null,null,0,0,0,0]
[null,"-","-",null,null,null,null,null,"-","-",null,null,null,null,null,"-","-",null,null,null,null,0,0,0,0]
[null,"-","-",null,null,null,null,null,"-","-",null,null,null,null,null,"-","-",null,null,null,null,0,0,0,0]
[null,"-","-",null,null,null,null,null,"-",{"$f":"IF(I273=\"-\",\"-\",CONCATENATE(MID(C143,1,21),\" - \",G143))","v":"-"},null,null,null,null,null,"-","-",null,null,null,null,{"$f":"IF((Y273+X273+W273)>0,1,0)","v":0},{"$f":"IF(B273=\"-\",0,B273)","v":0},{"$f":"IF(I273=\"-\",0,I273)","v":0},{"$f":"IF(P273=\"-\",0,P273)","v":0}]
[null,"-","-",null,null,null,null,null,"-",{"$f":"IF(I274=\"-\",\"-\",CONCATENATE(MID(C144,1,21),\" - \",G144))","v":"-"},null,null,null,null,null,"-","-",null,null,null,null,0,0,0,0]
[null,"-","-",null,null,null,null,null,"-",{"$f":"IF(I275=\"-\",\"-\",CONCATENATE(MID(C145,1,21),\" - \",G145))","v":"-"},null,null,null,null,null,"-","-",null,null,null,null,0,0,0,0]
[null,"-","-",null,null,null,null,null,"-",{"$f":"IF(I276=\"-\",\"-\",CONCATENATE(MID(C146,1,21),\" - \",G146))","v":"-"},null,null,null,null,null,"-","-",null,null,null,null,0,0,0,0]
[null,"-",{"$f":"IF(B277=\"-\",\"-\",CONCATENATE(MID(C147,1,21),\" - \",G147))","v":"-"},null,null,null,null,null,"-",{"$f":"IF(I277=\"-\",\"-\",CONCATENATE(MID(C147,1,21),\" - \",G147))","v":"-"},null,null,null,null,null,"-","-",null,null,null,null,0,0,0,0]
[null,"-",{"$f":"IF(B278=\"-\",\"-\",CONCATENATE(MID(C148,1,21),\" - \",G148))","v":"-"},null,null,null,null,null,"-",{"$f":"IF(I278=\"-\",\"-\",CONCATENATE(MID(C148,1,21),\" - \",G148))","v":"-"},null,null,null,null,null,"-","-",null,null,null,null,{"$f":"IF((Y278+X278+W278)>0,1,0)","v":0},{"$f":"IF(B278=\"-\",0,B278)","v":0},{"$f":"IF(I278=\"-\",0,I278)","v":0},{"$f":"IF(P278=\"-\",0,P278)","v":0}]
[null,null,null,null,null,null,null,null,null,null,null,null,null,null,null,null,null,null,null,null,null,{"$f":"IF($B$33>=\"\",0,1)","v":0}]
[null,"Configurazione RAID",null,null,null,null,null,null,"Configurazione RAID",null,null,null,null,null,null,"Configurazione RAID",null,null,null,null,null,0]
[null,null,null,null,null,null,null,null,null,null,null,null,null,null,null,null,null,null,null,null,null,0]
[null,{"$f":"'Lotto1 R730 1'!$B$96","v":"SCRIVERE QUI' LA CONFIGURAZIONE RAID RICHIESTA.\nR730 1\n"},null,null,null,null,null,null,{"$f":"'Lotto1 R730 2'!$B$96","v":"SCRIVERE QUI' LA CONFIGURAZIONE RAID RICHIESTA.\nR730 2\n"},null,null,null,null,null,null,{"$f":"'Lotto1 R730 3'!$B$96","v":"SCRIVERE QUI' LA CONFIGURAZIONE RAID RICHIESTA.\nR730 3\n"},null,null,null,null,null,0]
[null,null,null,null,null,null,null,null,null,null,null,null,null,null,null,null,null,null,null,null,null,0]
[null,null,null,null,null,null,null,null,null,null,null,null,null,null,null,null,null,null,null,null,null,0]
[null,null,null,null,null,null,null,null,null,null,null,null,null,null,null,null,null,null,null,null,null,0]
[null,null,null,null,null,null,null,null,null,null,null,null,null,null,null,null,null,null,null,null,null,0]
[null,null,null,null,null,null,null,null,null,null,null,null,null,null,null,null,null,null,null,null,null,0]
[null,null,null,null,null,null,null,null,null,null,null,null,null,null,null,null,null,null,null,null,null,0]
[null,null,null,null,null,null,null,null,null,null,null,null,null,null,null,null,null,null,null,null,null,0]
[null,null,null,null,null,null,null,null,null,null,null,null,null,null,null,null,null,null,null,null,null,0]
[null,null,null,null,null,null,null,null,null,null,null,null,null,null,null,null,null,null,null,null,null,0]
[null,null,null,null,null,null,null,null,null,null,null,null,null,null,null,null,null,null,null,null,null,0]
[null,null,null,null,null,null,null,null,null,null,null,null,null,null,null,null,null,null,null,null,null,0]
[null,null,null,null,null,null,null,null,null,null,null,null,null,null,null,null,null,null,null,null,null,0]
[null,null,null,null,null,null,null,null,null,null,null,null,null,null,null,null,null,null,null,null,null,0]
[null,null,null,null,null,null,null,null,null,null,null,null,null,null,null,null,null,null,null,null,null,0]
[null,null,null,null,null,null,null,null,null,null,null,null,null,null,null,null,null,null,null,null,null,0]
[null,null,null,null,null,null,null,null,null,null,null,null,null,null,null,null,null,null,null,null,null,0]
[null,null,null,null,null,null,null,null,null,null,null,null,null,null,null,null,null,null,null,null,null,0]
[null,null,null,null,null,null,null,null,null,null,null,null,null,null,null,null,null,null,null,null,null,{"$f":"IF($B$54>=\"\",0,1)","v":0}]
[null,"PowerEdge 730xd Conf.1",null,null,{"$f":"SRV_B","v":0},"Server",null,null,"PowerEdge 730xd Conf.2",null,null,{"$f":"SRV_BB","v":0},"Server",null,null,"PowerEdge 730xd Conf.3",null,null,{"$f":"SRV_BBB","v":0},"Server",null,{"$f":"IF($B$54>=\"\",0,1)","v":0}]
[null,null,null,null,null,null,null,null,null,null,null,null,null,null,null,null,null,null,null,null,null,{"$f":"IF($B$54>=\"\",0,1)","v":0}]
[null,{"$f":"IF(SRV_B>0,\"1\",\"-\")","v":"-"},{"$f":"IF(B303=\"-\",\"-\",CONCATENATE(MID(C54,1,24),\" - \",G54))","v":"-"},null,null,null,null,null,{"$f":"IF(SRV_BB>0,\"1\",\"-\")","v":"-"},{"$f":"IF(I303=\"-\",\"-\",CONCATENATE(MID(C54,1,24),\" - \",G54))","v":"-"},null,null,null,null,null,{"$f":"IF(SRV_BBB>0,\"1\",\"-\")","v":"-"},{"$f":"IF(P303=\"-\",\"-\",CONCATENATE(MID(C54,1,24),\" - \",G54))","v":"-"},null,null,null,null,{"$f":"IF((Y303+X303+W303)>0,1,0)","v":0},{"$f":"IF(B303=\"-\",0,B303)","v":0},{"$f":"IF(I303=\"-\",0,I303)","v":0},{"$f":"IF(P303=\"-\",0,P303)","v":0}]
[null,{"$f":"IF(X55=0,\"-\",X55)","v":"-"},"-",null,null,null,null,null,{"$f":"IF(Y55=0,\"-\",Y55)","v":"-"},"-",null,null,null,null,null,{"$f":"IF(Z55=0,\"-\",Z55)","v":"-"},"-",null,null,null,null,{"$f":"IF((Y304+X304+W304)>0,1,0)","v":0},{"$f":"IF(B304=\"-\",0,B304)","v":0},{"$f":"IF(I304=\"-\",0,I304)","v":0},{"$f":"IF(P304=\"-\",0,P304)","v":0}]
[null,"-","-",null,null,null,null,null,"-","-",null,null,null,null,null,"-","-",null,null,null,null,0,0,0,0]
[null,"-","-",null,null,null,null,null,"-","-",null,null,null,null,null,"-","-",null,null,null,null,0,0,0,0]
[null,"-","-",null,null,null,null,null,"-","-",null,null,null,null,null,"-","-",null,null,null,null,0,0,0,0]
[null,"-","-",null,null,null,null,null,"-","-",null,null,null,null,null,"-","-",null,null,null,null,0,0,0,0]
[null,"-","-",null,null,null,null,null,"-","-",null,null,null,null,null,"-","-",null,null,null,null,0,0,0,0]
[null,"-","-",null,null,null,null,null,"-","-",null,null,null,null,null,"-","-",null,null,null,null,0,0,0,0]
[null,"-","-",null,null,null,null,null,"-","-",null,null,null,null,null,"-","-",null,null,null,null,0,0,0,0]
[null,"-","-",null,null,null,null,null,"-","-",null,null,null,null,null,"-","-",null,null,null,null,0,0,0,0]
[null,"-","-",null,null,null,null,null,"-","-",null,null,null,null,null,"-","-",null,null,null,null,0,0,0,0]
[null,"-","-",null,null,null,null,null,"-","-",null,null,null,null,null,"-","-",null,null,null,null,0,0,0,0]
[null,"-","-",null,null,null,null,null,"-","-",null,null,null,null,null,"-","-",null,null,null,null,0,0,0,0]
[null,"-","-",null,null,null,null,null,"-","-",null,null,null,null,null,"-","-",null,null,null,null,0,0,0,0]
[null,"-","-",null,null,null,null,null,"-","-",null,null,null,null,null,"-","-",null,null,null,null,0,0,0,0]
[null,"-","-",null,null,null,null,null,"-","-",null,null,null,null,null,"-","-",null,null,null,null,0,0,0,0]
[null,"-","-",null,null,null,null,null,"-","-",null,null,null,null,null,"-","-",null,null,null,null,0,0,0,0]
[null,"-",{"$f":"IF(B320=\"-\",\"-\",CONCATENATE(\"TS1L1-4Y-R730XD - \",MID($C$71,1,24),\" - \",$G$71))","v":"-"},null,null,null,null,null,"-",{"$f":"IF(I320=\"-\",\"-\",CONCATENATE(\"TS1L1-4Y-R730XD - \",MID($C$71,1,24),\" - \",$G$71))","v":"-"},null,null,null,null,null,"-",{"$f":"IF(P320=\"-\",\"-\",CONCATENATE(\"TS1L1-4Y-R730XD - \",MID($C$71,1,24),\" - \",$G$71))","v":"-"},null,null,null,null,0,0,0,0]
[null,"-",{"$f":"IF(B321=\"-\",\"-\",CONCATENATE(\"TS1L1-5Y-R730XD - \",MID($C$72,1,24),\" - \",$G$72))","v":"-"},null,null,null,null,null,"-",{"$f":"IF(I321=\"-\",\"-\",CONCATENATE(\"TS1L1-5Y-R730XD - \",MID($C$72,1,24),\" - \",$G$72))","v":"-"},null,null,null,null,null,"-",{"$f":"IF(P321=\"-\",\"-\",CONCATENATE(\"TS1L1-5Y-R730XD - \",MID($C$72,1,24),\" - \",$G$72))","v":"-"},null,null,null,null,0,0,0,0]
[null,"-",{"$f":"IF(B322=\"-\",\"-\",CONCATENATE(MID(C73,1,24),\" - \",AV73))","v":"-"},null,null,null,null,null,"-",{"$f":"IF(I322=\"-\",\"-\",CONCATENATE(MID(C73,1,24),\" - \",AW73))","v":"-"},null,null,null,null,null,"-",{"$f":"IF(P322=\"-\",\"-\",CONCATENATE(MID(C73,1,24),\" - \",AY73))","v":"-"},null,null,null,null,0,0,0,0]
[null,{"$f":"IF(AG114=0,\"-\",AG114)","v":"-"},{"$f":"IF(B323=\"-\",\"-\",CONCATENATE(MID(C114,1,21),\" - \",G114))","v":"-"},null,null,null,null,null,{"$f":"IF(AH114=0,\"-\",AH114)","v":"-"},{"$f":"IF(I323=\"-\",\"-\",CONCATENATE(MID(C114,1,21),\" - \",G114))","v":"-"},null,null,null,null,null,{"$f":"IF(AI114=0,\"-\",AI114)","v":"-"},{"$f":"IF(P323=\"-\",\"-\",CONCATENATE(MID(C114,1,21),\" - \",G114))","v":"-"},null,null,null,null,0,0,0,0]
[null,{"$f":"IF(AG115=0,\"-\",AG115)","v":"-"},{"$f":"IF(B324=\"-\",\"-\",CONCATENATE(MID(C115,1,21),\" - \",G115))","v":"-"},null,null,null,null,null,{"$f":"IF(AH115=0,\"-\",AH115)","v":"-"},{"$f":"IF(I324=\"-\",\"-\",CONCATENATE(MID(C115,1,21),\" - \",G115))","v":"-"},null,null,null,null,null,{"$f":"IF(AI115=0,\"-\",AI115)","v":"-"},{"$f":"IF(P324=\"-\",\"-\",CONCATENATE(MID(C115,1,21),\" - \",G115))","v":"-"},null,null,null,null,0,0,0,0]
[null,{"$f":"IF(AG116=0,\"-\",AG116)","v":"-"},{"$f":"IF(B325=\"-\",\"-\",CONCATENATE(MID(C116,1,21),\" - \",G116))","v":"-"},null,null,null,null,null,{"$f":"IF(AH116=0,\"-\",AH116)","v":"-"},{"$f":"IF(I325=\"-\",\"-\",CONCATENATE(MID(C116,1,21),\" - \",G116))","v":"-"},null,null,null,null,null,{"$f":"IF(AI116=0,\"-\",AI116)","v":"-"},{"$f":"IF(P325=\"-\",\"-\",CONCATENATE(MID(C116,1,21),\" - \",G116))","v":"-"},null,null,null,null,0,0,0,0]
[null,{"$f":"IF(AG118=0,\"-\",AG118)","v":"-"},{"$f":"IF(B326=\"-\",\"-\",CONCATENATE(MID(C118,1,21),\" - \",G118))","v":"-"},null,null,null,null,null,{"$f":"IF(AH118=0,\"-\",AH118)","v":"-"},{"$f":"IF(I326=\"-\",\"-\",CONCATENATE(MID(C118,1,21),\" - \",G118))","v":"-"},null,null,null,null,null,{"$f":"IF(AI118=0,\"-\",AI118)","v":"-"},{"$f":"IF(P326=\"-\",\"-\",CONCATENATE(MID(C118,1,21),\" - \",G118))","v":"-"},null,null,null,null,0,0,0,0]
[null,{"$f":"IF(AG126=0,\"-\",AG126)","v":"-"},{"$f":"IF(B327=\"-\",\"-\",CONCATENATE(MID(C126,1,21),\" - \",G126))","v":"-"},null,null,null,null,null,{"$f":"IF(AH126=0,\"-\",AH126)","v":"-"},{"$f":"IF(I327=\"-\",\"-\",CONCATENATE(MID(C126,1,21),\" - \",G126))","v":"-"},null,null,null,null,null,{"$f":"IF(AI126=0,\"-\",AI126)","v":"-"},{"$f":"IF(P327=\"-\",\"-\",CONCATENATE(MID(C126,1,21),\" - \",G126))","v":"-"},null,null,null,null,0,0,0,0]
[null,"-","-",null,null,null,null,null,"-","-",null,null,null,null,null,"-","-",null,null,null,null,0,0,0,0]
[null,"-","-",null,null,null,null,null,"-","-",null,null,null,null,null,"-","-",null,null,null,null,0,0,0,0]
[null,"-","-",null,null,null,null,null,"-","-",null,null,null,null,null,"-","-",null,null,null,null,0,0,0,0]
[null,"-","-",null,null,null,null,null,"-","-",null,null,null,null,null,"-","-",null,null,null,null,0,0,0,0]
[null,"-","-",null,null,null,null,null,"-","-",null,null,null,null,null,"-","-",null,null,null,null,0,0,0,0]
[null,"-","-",null,null,null,null,null,"-","-",null,null,null,null,null,"-","-",null,null,null,null,0,0,0,0]
[null,"-","-",null,null,null,null,null,"-","-",null,null,null,null,null,"-","-",null,null,null,null,0,0,0,0]
[null,"-","-",null,null,null,null,null,"-","-",null,null,null,null,null,"-","-",null,null,null,null,0,0,0,0]
[null,"-","-",null,null,null,null,null,"-","-",null,null,null,null,null,"-","-",null,null,null,null,0,0,0,0]
[null,"-","-",null,null,null,null,null,"-","-",null,null,null,null,null,"-","-",null,null,null,null,0,0,0,0]
[null,"-","-",null,null,null,null,null,"-","-",null,null,null,null,null,"-","-",null,null,null,null,0,0,0,0]
[null,"-","-",null,null,null,null,null,"-","-",null,null,null,null,null,"-","-",null,null,null,null,0,0,0,0]
[null,"-","-",null,null,null,null,null,"-","-",null,null,null,null,null,"-","-",null,null,null,null,0,0,0,0]
[null,"-","-",null,null,null,null,null,"-","-",null,null,null,null,null,"-","-",null,null,null,null,0,0,0,0]
[null,"-","-",null,null,null,null,null,"-","-",null,null,null,null,null,"-","-",null,null,null,null,0,0,0,0]
[null,"-","-",null,null,null,null,null,"-","-",null,null,null,null,null,"-","-",null,null,null,null,0,0,0,0]
[null,"-","-",null,null,null,null,null,"-","-",null,null,null,null,null,"-","-",null,null,null,null,{"$f":"IF((Y344+X344+W344)>0,1,0)","v":0},{"$f":"IF(B344=\"-\",0,B344)","v":0},{"$f":"IF(I344=\"-\",0,I344)","v":0},{"$f":"IF(P344=\"-\",0,P344)","v":0}]
[null,"-","-",null,null,null,null,null,"-","-",null,null,null,null,null,"-","-",null,null,null,null,0,0,0,0]
[null,"-","-",null,null,null,null,null,"-","-",null,null,null,null,null,"-","-",null,null,null,null,0,0,0,0]
[null,"-","-",null,null,null,null,null,"-","-",null,null,null,null,null,"-","-",null,null,null,null,0,0,0,0]
[null,"-","-",null,null,null,null,null,"-","-",null,null,null,null,null,"-","-",null,null,null,null,0,0,0,0]
[null,"-","-",null,null,null,null,null,"-","-",null,null,null,null,null,"-","-",null,null,null,null,{"$f":"IF((Y349+X349+W349)>0,1,0)","v":0},{"$f":"IF(B349=\"-\",0,B349)","v":0},{"$f":"IF(I349=\"-\",0,I349)","v":0},{"$f":"IF(P349=\"-\",0,P349)","v":0}]
[null,null,null,null,null,null,null,null,null,null,null,null,null,null,null,null,null,null,null,null,null,{"$f":"IF($B$54>=\"\",0,1)","v":0}]
[null,"Configurazione RAID",null,null,null,null,null,null,"Configurazione RAID",null,null,null,null,null,null,"Configurazione RAID",null,null,null,null,null,0]
[null,null,null,null,null,null,null,null,null,null,null,null,null,null,null,null,null,null,null,null,null,0]
[null,{"$f":"'Lotto1 R730xd 1'!$B$97","v":"SCRIVERE QUI' LA CONFIGURAZIONE RAID RICHIESTA.\nR730XD 1\n"},null,null,null,null,null,null,{"$f":"'Lotto1 R730xd 2'!$B$97","v":"SCRIVERE QUI' LA CONFIGURAZIONE RAID RICHIESTA.\nR730XD 2\n"},null,null,null,null,null,null,{"$f":"'Lotto1 R730xd 3'!$B$97","v":"SCRIVERE QUI' LA CONFIGURAZIONE RAID RICHIESTA.\nR730XD 3\n"},null,null,null,null,null,0]
[null,null,null,null,null,null,null,null,null,null,null,null,null,null,null,null,null,null,null,null,null,0]
[null,null,null,null,null,null,null,null,null,null,null,null,null,null,null,null,null,null,null,null,null,0]
[null,null,null,null,null,null,null,null,null,null,null,null,null,null,null,null,null,null,null,null,null,0]
[null,null,null,null,null,null,null,null,null,null,null,null,null,null,null,null,null,null,null,null,null,0]
[null,null,null,null,null,null,null,null,null,null,null,null,null,null,null,null,null,null,null,null,null,0]
[null,null,null,null,null,null,null,null,null,null,null,null,null,null,null,null,null,null,null,null,null,0]
[null,null,null,null,null,null,null,null,null,null,null,null,null,null,null,null,null,null,null,null,null,0]
[null,null,null,null,null,null,null,null,null,null,null,null,null,null,null,null,null,null,null,null,null,0]
[null,null,null,null,null,null,null,null,null,null,null,null,null,null,null,null,null,null,null,null,null,0]
[null,null,null,null,null,null,null,null,null,null,null,null,null,null,null,null,null,null,null,null,null,0]
[null,null,null,null,null,null,null,null,null,null,null,null,null,null,null,null,null,null,null,null,null,0]
[null,null,null,null,null,null,null,null,null,null,null,null,null,null,null,null,null,null,null,null,null,0]
[null,null,null,null,null,null,null,null,null,null,null,null,null,null,null,null,null,null,null,null,null,0]
[null,null,null,null,null,null,null,null,null,null,null,null,null,null,null,null,null,null,null,null,null,0]
[null,null,null,null,null,null,null,null,null,null,null,null,null,null,null,null,null,null,null,null,null,0]
[null,null,null,null,null,null,null,null,null,null,null,null,null,null,null,null,null,null,null,null,null,0]
[null,null,null,null,null,null,null,null,null,null,null,null,null,null,null,null,null,null,null,null,null,0]
[null,null,null,null,null,null,null,null,null,null,null,null,null,null,null,null,null,null,null,null,null,{"$f":"IF($B$75>=\"\",0,1)","v":0}]
[null,"PowerEdge T630 Rack Conf.1",null,null,{"$f":"SRV_C","v":0},"Server",null,null,"PowerEdge T630 Rack Conf.2",null,null,{"$f":"SRV_CC","v":0},"Server",null,null,"PowerEdge T630 Rack Conf.3",null,null,{"$f":"SRV_CCC","v":0},"Server",null,{"$f":"IF($B$75>=\"\",0,1)","v":0}]
[null,null,null,null,null,null,null,null,null,null,null,null,null,null,null,null,null,null,null,null,null,{"$f":"IF($B$75>=\"\",0,1)","v":0}]
[null,{"$f":"IF(SRV_C>0,\"1\",\"-\")","v":"-"},{"$f":"IF(B374=\"-\",\"-\",CONCATENATE(MID($C$75,1,24),\" - \",$G$75))","v":"-"},null,null,null,null,null,{"$f":"IF(SRV_CC>0,\"1\",\"-\")","v":"-"},{"$f":"IF(I374=\"-\",\"-\",CONCATENATE(MID($C$75,1,24),\" - \",$G$75))","v":"-"},null,null,null,null,null,{"$f":"IF(SRV_CCC>0,\"1\",\"-\")","v":"-"},{"$f":"IF(P374=\"-\",\"-\",CONCATENATE(MID($C$75,1,24),\" - \",$G$75))","v":"-"},null,null,null,null,{"$f":"IF((Y374+X374+W374)>0,1,0)","v":0},{"$f":"IF(B374=\"-\",0,B374)","v":0},{"$f":"IF(I374=\"-\",0,I374)","v":0},{"$f":"IF(P374=\"-\",0,P374)","v":0}]
[null,{"$f":"IF(X76=0,\"-\",X76)","v":"-"},{"$f":"IF(B375=\"-\",\"-\",CONCATENATE(MID($C$76,1,24),\" - \",$G$76))","v":"-"},null,null,null,null,null,{"$f":"IF(Y76=0,\"-\",Y76)","v":"-"},{"$f":"IF(I375=\"-\",\"-\",CONCATENATE(MID($C$76,1,24),\" - \",$G$76))","v":"-"},null,null,null,null,null,{"$f":"IF(Z76=0,\"-\",Z76)","v":"-"},{"$f":"IF(P375=\"-\",\"-\",CONCATENATE(MID($C$76,1,24),\" - \",$G$76))","v":"-"},null,null,null,null,{"$f":"IF((Y375+X375+W375)>0,1,0)","v":0},{"$f":"IF(B375=\"-\",0,B375)","v":0},{"$f":"IF(I375=\"-\",0,I375)","v":0},{"$f":"IF(P375=\"-\",0,P375)","v":0}]
[null,"-",{"$f":"IF(B376=\"-\",\"-\",CONCATENATE(MID($C$77,1,24),\" - \",$G$77))","v":"-"},null,null,null,null,null,"-",{"$f":"IF(I376=\"-\",\"-\",CONCATENATE(MID($C$77,1,24),\" - \",$G$77))","v":"-"},null,null,null,null,null,"-",{"$f":"IF(P376=\"-\",\"-\",CONCATENATE(MID($C$77,1,24),\" - \",$G$77))","v":"-"},null,null,null,null,0,0,0,0]
[null,"-",{"$f":"IF(B377=\"-\",\"-\",CONCATENATE(MID($C$78,1,24),\" - \",$G$78))","v":"-"},null,null,null,null,null,"-",{"$f":"IF(I377=\"-\",\"-\",CONCATENATE(MID($C$78,1,24),\" - \",$G$78))","v":"-"},null,null,null,null,null,"-",{"$f":"IF(P377=\"-\",\"-\",CONCATENATE(MID($C$78,1,24),\" - \",$G$78))","v":"-"},null,null,null,null,0,0,0,0]
[null,"-",{"$f":"IF(B378=\"-\",\"-\",CONCATENATE(MID($C$79,1,24),\" - \",$G$79))","v":"-"},null,null,null,null,null,"-",{"$f":"IF(I378=\"-\",\"-\",CONCATENATE(MID($C$79,1,24),\" - \",$G$79))","v":"-"},null,null,null,null,null,"-",{"$f":"IF(P378=\"-\",\"-\",CONCATENATE(MID($C$79,1,24),\" - \",$G$79))","v":"-"},null,null,null,null,0,0,0,0]
[null,"-",{"$f":"IF(B379=\"-\",\"-\",CONCATENATE(MID($C$80,1,24),\" - \",$G$80))","v":"-"},null,null,null,null,null,"-",{"$f":"IF(I379=\"-\",\"-\",CONCATENATE(MID($C$80,1,24),\" - \",$G$80))","v":"-"},null,null,null,null,null,"-",{"$f":"IF(P379=\"-\",\"-\",CONCATENATE(MID($C$80,1,24),\" - \",$G$80))","v":"-"},null,null,null,null,0,0,0,0]
[null,"-",{"$f":"IF(B380=\"-\",\"-\",CONCATENATE(MID($C$81,1,24),\" - \",$G$81))","v":"-"},null,null,null,null,null,"-",{"$f":"IF(I380=\"-\",\"-\",CONCATENATE(MID($C$81,1,24),\" - \",$G$81))","v":"-"},null,null,null,null,null,"-",{"$f":"IF(P380=\"-\",\"-\",CONCATENATE(MID($C$81,1,24),\" - \",$G$81))","v":"-"},null,null,null,null,0,0,0,0]
[null,"-",{"$f":"IF(B381=\"-\",\"-\",CONCATENATE(MID($C$82,1,24),\" - \",$G$82))","v":"-"},null,null,null,null,null,"-",{"$f":"IF(I381=\"-\",\"-\",CONCATENATE(MID($C$82,1,24),\" - \",$G$82))","v":"-"},null,null,null,null,null,"-",{"$f":"IF(P381=\"-\",\"-\",CONCATENATE(MID($C$82,1,24),\" - \",$G$82))","v":"-"},null,null,null,null,0,0,0,0]
[null,"-",{"$f":"IF(B382=\"-\",\"-\",CONCATENATE(MID($C$83,1,24),\" - \",$G$83))","v":"-"},null,null,null,null,null,"-",{"$f":"IF(I382=\"-\",\"-\",CONCATENATE(MID($C$83,1,24),\" - \",$G$83))","v":"-"},null,null,null,null,null,"-",{"$f":"IF(P382=\"-\",\"-\",CONCATENATE(MID($C$83,1,24),\" - \",$G$83))","v":"-"},null,null,null,null,0,{"$f":"IF(B382=\"-\",0,B382)","v":0},{"$f":"IF(I382=\"-\",0,I382)","v":0},{"$f":"IF(P382=\"-\",0,P382)","v":0}]
[null,"-",{"$f":"IF(B383=\"-\",\"-\",CONCATENATE(\"TS1L1-4Y-T630 - \",MID($C$84,1,24),\" - \",$G$84))","v":"-"},null,null,null,null,null,"-",{"$f":"IF(I383=\"-\",\"-\",CONCATENATE(\"TS1L1-4Y-T630 - \",MID($C$84,1,24),\" - \",$G$84))","v":"-"},null,null,null,null,null,"-",{"$f":"IF(P383=\"-\",\"-\",CONCATENATE(\"TS1L1-4Y-T630 - \",MID($C$84,1,24),\" - \",$G$84))","v":"-"},null,null,null,null,0,0,0,0]
[null,"-",{"$f":"IF(B384=\"-\",\"-\",CONCATENATE(\"TS1L1-5Y-T630 - \",MID($C$85,1,24),\" - \",$G$85))","v":"-"},null,null,null,null,null,"-",{"$f":"IF(I384=\"-\",\"-\",CONCATENATE(\"TS1L1-5Y-T630 - \",MID($C$85,1,24),\" - \",$G$85))","v":"-"},null,null,null,null,null,"-",{"$f":"IF(P384=\"-\",\"-\",CONCATENATE(\"TS1L1-5Y-T630 - \",MID($C$85,1,24),\" - \",$G$85))","v":"-"},null,null,null,null,0,0,0,0]
[null,"-",{"$f":"IF(B385=\"-\",\"-\",CONCATENATE(MID($C$86,1,24),\" - \",$G$86))","v":"-"},null,null,null,null,null,"-",{"$f":"IF(I385=\"-\",\"-\",CONCATENATE(MID($C$86,1,24),\" - \",$G$86))","v":"-"},null,null,null,null,null,"-",{"$f":"IF(P385=\"-\",\"-\",CONCATENATE(MID($C$86,1,24),\" - \",$G$86))","v":"-"},null,null,null,null,0,0,0,0]
[null,{"$f":"IF(AA114=0,\"-\",AA114)","v":"-"},{"$f":"IF(B386=\"-\",\"-\",CONCATENATE(MID($C$114,1,24),\" - \",$G$114))","v":"-"},null,null,null,null,null,{"$f":"IF(AB114=0,\"-\",AB114)","v":"-"},{"$f":"IF(I386=\"-\",\"-\",CONCATENATE(MID($C$114,1,24),\" - \",$G$114))","v":"-"},null,null,null,null,null,{"$f":"IF(AC114=0,\"-\",AC114)","v":"-"},{"$f":"IF(P386=\"-\",\"-\",CONCATENATE(MID($C$114,1,24),\" - \",$G$114))","v":"-"},null,null,null,null,0,0,0,0]
[null,{"$f":"IF(AA115=0,\"-\",AA115)","v":"-"},{"$f":"IF(B387=\"-\",\"-\",CONCATENATE(MID($C$115,1,24),\" - \",$G$115))","v":"-"},null,null,null,null,null,{"$f":"IF(AB115=0,\"-\",AB115)","v":"-"},{"$f":"IF(I387=\"-\",\"-\",CONCATENATE(MID($C$115,1,24),\" - \",$G$115))","v":"-"},null,null,null,null,null,{"$f":"IF(AC115=0,\"-\",AC115)","v":"-"},{"$f":"IF(P387=\"-\",\"-\",CONCATENATE(MID($C$115,1,24),\" - \",$G$115))","v":"-"},null,null,null,null,0,0,0,0]
[null,{"$f":"IF(AA116=0,\"-\",AA116)","v":"-"},{"$f":"IF(B388=\"-\",\"-\",CONCATENATE(MID($C$116,1,24),\" - \",$G$116))","v":"-"},null,null,null,null,null,{"$f":"IF(AB116=0,\"-\",AB116)","v":"-"},{"$f":"IF(I388=\"-\",\"-\",CONCATENATE(MID($C$116,1,24),\" - \",$G$116))","v":"-"},null,null,null,null,null,{"$f":"IF(AC116=0,\"-\",AC116)","v":"-"},{"$f":"IF(P388=\"-\",\"-\",CONCATENATE(MID($C$116,1,24),\" - \",$G$116))","v":"-"},null,null,null,null,0,0,0,0]
[null,{"$f":"IF(AA117=0,\"-\",AA117)","v":"-"},{"$f":"IF(B389=\"-\",\"-\",CONCATENATE(MID($C$117,1,24),\" - \",$G$117))","v":"-"},null,null,null,null,null,{"$f":"IF(AB117=0,\"-\",AB117)","v":"-"},{"$f":"IF(I389=\"-\",\"-\",CONCATENATE(MID($C$117,1,24),\" - \",$G$117))","v":"-"},null,null,null,null,null,{"$f":"IF(AC117=0,\"-\",AC117)","v":"-"},{"$f":"IF(P389=\"-\",\"-\",CONCATENATE(MID($C$117,1,24),\" - \",$G$117))","v":"-"},null,null,null,null,0,0,0,0]
[null,{"$f":"IF(AA118=0,\"-\",AA118)","v":"-"},{"$f":"IF(B390=\"-\",\"-\",CONCATENATE(MID($C$118,1,24),\" - \",$G$118))","v":"-"},null,null,null,null,null,{"$f":"IF(AB118=0,\"-\",AB118)","v":"-"},{"$f":"IF(I390=\"-\",\"-\",CONCATENATE(MID($C$118,1,24),\" - \",$G$118))","v":"-"},null,null,null,null,null,{"$f":"IF(AC118=0,\"-\",AC118)","v":"-"},{"$f":"IF(P390=\"-\",\"-\",CONCATENATE(MID($C$118,1,24),\" - \",$G$118))","v":"-"},null,null,null,null,0,0,0,0]
[null,{"$f":"IF(AA126=0,\"-\",AA126)","v":"-"},{"$f":"IF(B391=\"-\",\"-\",CONCATENATE(MID(C126,1,21),\" - \",G126))","v":"-"},null,null,null,null,null,{"$f":"IF(AB126=0,\"-\",AB126)","v":"-"},{"$f":"IF(I391=\"-\",\"-\",CONCATENATE(MID(C126,1,21),\" - \",G126))","v":"-"},null,null,null,null,null,{"$f":"IF(AC126=0,\"-\",AC126)","v":"-"},{"$f":"IF(P391=\"-\",\"-\",CONCATENATE(MID(C126,1,21),\" - \",G126))","v":"-"},null,null,null,null,0,0,0,0]
[null,"-","-",null,null,null,null,null,"-","-",null,null,null,null,null,"-","-",null,null,null,null,0,0,0,0]
[null,"-","-",null,null,null,null,null,"-","-",null,null,null,null,null,"-","-",null,null,null,null,0,0,0,0]
[null,"-","-",null,null,null,null,null,"-","-",null,null,null,null,null,"-","-",null,null,null,null,0,0,0,0]
[null,"-","-",null,null,null,null,null,"-","-",null,null,null,null,null,"-","-",null,null,null,null,0,0,0,0]
[null,"-","-",null,null,null,null,null,"-","-",null,null,null,null,null,"-","-",null,null,null,null,0,0,0,0]
[null,"-","-",null,null,null,null,null,"-","-",null,null,null,null,null,"-","-",null,null,null,null,0,0,0,0]
[null,"-","-",null,null,null,null,null,"-","-",null,null,null,null,null,"-","-",null,null,null,null,0,0,0,0]
[null,"-","-",null,null,null,null,null,"-","-",null,null,null,null,null,"-","-",null,null,null,null,0,0,0,0]
[null,"-","-",null,null,null,null,null,"-","-",null,null,null,null,null,"-","-",null,null,null,null,0,0,0,0]
[null,"-","-",null,null,null,null,null,"-","-",null,null,null,null,null,"-","-",null,null,null,null,0,0,0,0]
[null,"-","-",null,null,null,null,null,"-","-",null,null,null,null,null,"-","-",null,null,null,null,0,0,0,0]
[null,"-","-",null,null,null,null,null,"-","-",null,null,null,null,null,"-","-",null,null,null,null,0,0,0,0]
[null,"-","-",null,null,null,null,null,"-","-",null,null,null,null,null,"-","-",null,null,null,null,0,0,0,0]
[null,"-","-",null,null,null,null,null,"-","-",null,null,null,null,null,"-","-",null,null,null,null,0,0,0,0]
[null,"-","-",null,null,null,null,null,"-","-",null,null,null,null,null,"-","-",null,null,null,null,0,0,0,0]
[null,"-","-",null,null,null,null,null,"-","-",null,null,null,null,null,"-","-",null,null,null,null,0,0,0,0]
[null,"-","-",null,null,null,null,null,"-","-",null,null,null,null,null,"-","-",null,null,null,null,{"$f":"IF((Y408+X408+W408)>0,1,0)","v":0},{"$f":"IF(B408=\"-\",0,B408)","v":0},{"$f":"IF(I408=\"-\",0,I408)","v":0},{"$f":"IF(P408=\"-\",0,P408)","v":0}]
[null,"-","-",null,null,null,null,null,"-","-",null,null,null,null,null,"-","-",null,null,null,null,0,0,0,0]
[null,"-","-",null,null,null,null,null,"-","-",null,null,null,null,null,"-","-",null,null,null,null,0,0,0,0]
[null,"-","-",null,null,null,null,null,"-","-",null,null,null,null,null,"-","-",null,null,null,null,0,0,0,0]
[null,"-","-",null,null,null,null,null,"-","-",null,null,null,null,null,"-","-",null,null,null,null,0,0,0,0]
[null,null,null,null,null,null,null,null,null,null,null,null,null,null,null,null,null,null,null,null,null,{"$f":"IF($B$75>=\"\",0,1)","v":0}]
[null,"Configurazione RAID",null,null,null,null,null,null,"Configurazione RAID",null,null,null,null,null,null,"Configurazione RAID",null,null,null,null,null,0]
[null,null,null,null,null,null,null,null,null,null,null,null,null,null,null,null,null,null,null,null,null,0]
[null,{"$f":"'Lotto1 T630R 1'!$B$97","v":"SCRIVERE QUI' LA CONFIGURAZIONE RAID RICHIESTA.\nT630 1\n"},null,null,null,null,null,null,{"$f":"'Lotto1 T630R 2'!$B$97","v":"SCRIVERE QUI' LA CONFIGURAZIONE RAID RICHIESTA.\nT630 2\n"},null,null,null,null,null,null,{"$f":"'Lotto1 T630R 3'!$B$97","v":"SCRIVERE QUI' LA CONFIGURAZIONE RAID RICHIESTA.\nT630 3\n"},null,null,null,null,null,0]
[null,null,null,null,null,null,null,null,null,null,null,null,null,null,null,null,null,null,null,null,null,0]
[null,null,null,null,null,null,null,null,null,null,null,null,null,null,null,null,null,null,null,null,null,0]
[null,null,null,null,null,null,null,null,null,null,null,null,null,null,null,null,null,null,null,null,null,0]
[null,null,null,null,null,null,null,null,null,null,null,null,null,null,null,null,null,null,null,null,null,0]
[null,null,null,null,null,null,null,null,null,null,null,null,null,null,null,null,null,null,null,null,null,0]
[null,null,null,null,null,null,null,null,null,null,null,null,null,null,null,null,null,null,null,null,null,0]
[null,null,null,null,null,null,null,null,null,null,null,null,null,null,null,null,null,null,null,null,null,0]
[null,null,null,null,null,null,null,null,null,null,null,null,null,null,null,null,null,null,null,null,null,0]
[null,null,null,null,null,null,null,null,null,null,null,null,null,null,null,null,null,null,null,null,null,0]
[null,null,null,null,null,null,null,null,null,null,null,null,null,null,null,null,null,null,null,null,null,0]
[null,null,null,null,null,null,null,null,null,null,null,null,null,null,null,null,null,null,null,null,null,0]
[null,null,null,null,null,null,null,null,null,null,null,null,null,null,null,null,null,null,null,null,null,0]
[null,null,null,null,null,null,null,null,null,null,null,null,null,null,null,null,null,null,null,null,null,0]
[null,null,null,null,null,null,null,null,null,null,null,null,null,null,null,null,null,null,null,null,null,0]
[null,null,null,null,null,null,null,null,null,null,null,null,null,null,null,null,null,null,null,null,null,0]
[null,null,null,null,null,null,null,null,null,null,null,null,null,null,null,null,null,null,null,null,null,0]
[null,null,null,null,null,null,null,null,null,null,null,null,null,null,null,null,null,null,null,null,null,0]
[null,null,null,null,null,null,null,null,null,null,null,null,null,null,null,null,null,null,null,null,null,{"$f":"$W$434+$X$434","v":0},{"$f":"IF($B$88>=\"\",0,1)","v":0},{"$f":"IF($B$101>=\"\",0,1)","v":0}]
[null,"PowerEdge T630 Tower Base",null,null,{"$f":"SRV_D","v":0},"Server",null,null,"PowerEdge T630 Tower Prest",null,null,{"$f":"SRV_E","v":0},"Server",null,null,null,null,null,null,null,null,{"$f":"$W$434+$X$434","v":0}]
[null,null,null,null,null,null,null,null,null,null,null,null,null,null,null,null,null,null,null,null,null,{"$f":"$W$434+$X$434","v":0}]
[null,{"$f":"IF(SRV_D>0,\"1\",\"-\")","v":"-"},{"$f":"IF(B437=\"-\",\"-\",CONCATENATE(MID(C88,1,24),\" - \",G88))","v":"-"},null,null,null,null,null,{"$f":"IF(SRV_E>0,\"1\",\"-\")","v":"-"},{"$f":"IF(I437=\"-\",\"-\",CONCATENATE(MID(C101,1,24),\" - \",G101))","v":"-"},null,null,null,null,null,null,null,null,null,null,null,{"$f":"IF((Y437+X437+W437)>0,1,0)","v":0},{"$f":"IF(B437=\"-\",0,B437)","v":0},{"$f":"IF(I437=\"-\",0,I437)","v":0},{"$f":"IF(P437=\"-\",0,P437)","v":0}]
[null,{"$f":"IF(X89=0,\"-\",X89)","v":"-"},"-",null,null,null,null,null,{"$f":"IF(X102=0,\"-\",X102)","v":"-"},"-",null,null,null,null,null,null,null,null,null,null,null,{"$f":"IF((Y438+X438+W438)>0,1,0)","v":0},{"$f":"IF(B438=\"-\",0,B438)","v":0},{"$f":"IF(I438=\"-\",0,I438)","v":0},{"$f":"IF(P438=\"-\",0,P438)","v":0}]
[null,"-","-",null,null,null,null,null,"-","-",null,null,null,null,null,null,null,null,null,null,null,0,0,0,0]
[null,"-","-",null,null,null,null,null,"-","-",null,null,null,null,null,null,null,null,null,null,null,0,0,0,0]
[null,"-","-",null,null,null,null,null,"-","-",null,null,null,null,null,null,null,null,null,null,null,0,0,0,0]
[null,"-","-",null,null,null,null,null,"-","-",null,null,null,null,null,null,null,null,null,null,null,0,0,0,0]
[null,"-","-",null,null,null,null,null,"-","-",null,null,null,null,null,null,null,null,null,null,null,0,0,0,0]
[null,"-","-",null,null,null,null,null,"-","-",null,null,null,null,null,null,null,null,null,null,null,0,{"$f":"IF(B444=\"-\",0,B444)","v":0},{"$f":"IF(I444=\"-\",0,I444)","v":0},{"$f":"IF(P444=\"-\",0,P444)","v":0}]
[null,"-","-",null,null,null,null,null,"-","-",null,null,null,null,null,null,null,null,null,null,null,0,0,0,0]
[null,"-",{"$f":"IF(B446=\"-\",\"-\",CONCATENATE(\"TS1L1-4Y-T630 - \",MID(C97,1,24),\" - \",G97))","v":"-"},null,null,null,null,null,"-",{"$f":"IF(I446=\"-\",\"-\",CONCATENATE(\"TS1L1-4Y-T630 - \",MID(C110,1,24),\" - \",G110))","v":"-"},null,null,null,null,null,null,null,null,null,null,null,0,0,0,0]
[null,"-",{"$f":"IF(B447=\"-\",\"-\",CONCATENATE(\"TS1L1-5Y-T630 - \",MID(C98,1,24),\" - \",G98))","v":"-"},null,null,null,null,null,"-",{"$f":"IF(I447=\"-\",\"-\",CONCATENATE(\"TS1L1-5Y-T630 - \",MID(C111,1,24),\" - \",G111))","v":"-"},null,null,null,null,null,null,null,null,null,null,null,0,0,0,0]
[null,"-",{"$f":"IF(B448=\"-\",\"-\",CONCATENATE(MID(C99,1,24),\" - \",G99))","v":"-"},null,null,null,null,null,"-",{"$f":"IF(I448=\"-\",\"-\",CONCATENATE(MID(C112,1,24),\" - \",G112))","v":"-"},null,null,null,null,null,null,null,null,null,null,null,0,0,0,0]
[null,{"$f":"IF(AJ114=0,\"-\",AJ114)","v":"-"},{"$f":"IF(B449=\"-\",\"-\",CONCATENATE(MID($C$114,1,24),\" - \",$G$114))","v":"-"},null,null,null,null,null,{"$f":"IF(AK114=0,\"-\",AK114)","v":"-"},{"$f":"IF(I449=\"-\",\"-\",CONCATENATE(MID($C$114,1,24),\" - \",$G$114))","v":"-"},null,null,null,null,null,null,null,null,null,null,null,0,0,0,0]
[null,{"$f":"IF(AJ115=0,\"-\",AJ115)","v":"-"},{"$f":"IF(B450=\"-\",\"-\",CONCATENATE(MID($C$115,1,24),\" - \",$G$115))","v":"-"},null,null,null,null,null,{"$f":"IF(AK115=0,\"-\",AK115)","v":"-"},{"$f":"IF(I450=\"-\",\"-\",CONCATENATE(MID($C$115,1,24),\" - \",$G$115))","v":"-"},null,null,null,null,null,null,null,null,null,null,null,0,0,0,0]
[null,{"$f":"IF(AJ116=0,\"-\",AJ116)","v":"-"},{"$f":"IF(B451=\"-\",\"-\",CONCATENATE(MID($C$116,1,24),\" - \",$G$116))","v":"-"},null,null,null,null,null,{"$f":"IF(AK116=0,\"-\",AK116)","v":"-"},{"$f":"IF(I451=\"-\",\"-\",CONCATENATE(MID($C$116,1,24),\" - \",$G$116))","v":"-"},null,null,null,null,null,null,null,null,null,null,null,0,0,0,0]
[null,{"$f":"IF(AJ117=0,\"-\",AJ117)","v":"-"},{"$f":"IF(B452=\"-\",\"-\",CONCATENATE(MID($C$117,1,24),\" - \",$G$117))","v":"-"},null,null,null,null,null,{"$f":"IF(AK117=0,\"-\",AK117)","v":"-"},{"$f":"IF(I452=\"-\",\"-\",CONCATENATE(MID($C$117,1,24),\" - \",$G$117))","v":"-"},null,null,null,null,null,null,null,null,null,null,null,0,0,0,0]
[null,{"$f":"IF(AJ118=0,\"-\",AJ118)","v":"-"},{"$f":"IF(B453=\"-\",\"-\",CONCATENATE(MID($C$118,1,24),\" - \",$G$118))","v":"-"},null,null,null,null,null,{"$f":"IF(AK118=0,\"-\",AK118)","v":"-"},{"$f":"IF(I453=\"-\",\"-\",CONCATENATE(MID($C$118,1,24),\" - \",$G$118))","v":"-"},null,null,null,null,null,null,null,null,null,null,null,0,0,0,0]
[null,{"$f":"IF(AJ126=0,\"-\",AJ126)","v":"-"},{"$f":"IF(B454=\"-\",\"-\",CONCATENATE(MID(C126,1,21),\" - \",G126))","v":"-"},null,null,null,null,null,{"$f":"IF(AK126=0,\"-\",AK126)","v":"-"},{"$f":"IF(I454=\"-\",\"-\",CONCATENATE(MID(C126,1,21),\" - \",G126))","v":"-"},null,null,null,null,null,null,null,null,null,null,null,0,0,0,0]
[null,"-","-",null,null,null,null,null,"-","-",null,null,null,null,null,null,null,null,null,null,null,0,0,0,0]
[null,"-","-",null,null,null,null,null,"-","-",null,null,null,null,null,null,null,null,null,null,null,0,0,0,0]
[null,"-","-",null,null,null,null,null,"-","-",null,null,null,null,null,null,null,null,null,null,null,0,0,0,0]
[null,"-","-",null,null,null,null,null,"-","-",null,null,null,null,null,null,null,null,null,null,null,0,0,0,0]
[null,"-","-",null,null,null,null,null,"-","-",null,null,null,null,null,null,null,null,null,null,null,0,0,0,0]
[null,"-","-",null,null,null,null,null,"-","-",null,null,null,null,null,null,null,null,null,null,null,0,0,0,0]
[null,"-","-",null,null,null,null,null,"-","-",null,null,null,null,null,null,null,null,null,null,null,0,0,0,0]
[null,"-","-",null,null,null,null,null,"-","-",null,null,null,null,null,null,null,null,null,null,null,0,0,0,0]
[null,"-","-",null,null,null,null,null,"-","-",null,null,null,null,null,null,null,null,null,null,null,0,0,0,0]
[null,"-","-",null,null,null,null,null,"-","-",null,null,null,null,null,null,null,null,null,null,null,0,0,0,0]
[null,"-","-",null,null,null,null,null,"-","-",null,null,null,null,null,null,null,null,null,null,null,0,0,0,0]
[null,"-","-",null,null,null,null,null,"-","-",null,null,null,null,null,null,null,null,null,null,null,0,0,0,0]
[null,"-","-",null,null,null,null,null,"-","-",null,null,null,null,null,null,null,null,null,null,null,0,0,0,0]
[null,"-","-",null,null,null,null,null,"-","-",null,null,null,null,null,null,null,null,null,null,null,0,0,0,0]
[null,"-","-",null,null,null,null,null,"-","-",null,null,null,null,null,null,null,null,null,null,null,0,0,0,0]
[null,"-","-",null,null,null,null,null,"-","-",null,null,null,null,null,null,null,null,null,null,null,0,0,0,0]
[null,"-","-",null,null,null,null,null,"-","-",null,null,null,null,null,null,null,null,null,null,null,{"$f":"IF((Y471+X471+W471)>0,1,0)","v":0},{"$f":"IF(B471=\"-\",0,B471)","v":0},{"$f":"IF(I471=\"-\",0,I471)","v":0},{"$f":"IF(P471=\"-\",0,P471)","v":0}]
[null,"-","-",null,null,null,null,null,"-","-",null,null,null,null,null,null,null,null,null,null,null,0,0,0,0]
[null,"-","-",null,null,null,null,null,"-","-",null,null,null,null,null,null,null,null,null,null,null,0,0,0,0]
[null,"-","-",null,null,null,null,null,"-","-",null,null,null,null,null,null,null,null,null,null,null,0,0,0,0]
[null,"-","-",null,null,null,null,null,"-","-",null,null,null,null,null,null,null,null,null,null,null,0,0,0,0]
[null,null,null,null,null,null,null,null,null,null,null,null,null,null,null,null,null,null,null,null,null,{"$f":"$W$434+$X$434","v":0}]
[null,"Configurazione RAID",null,null,null,null,null,null,"Configurazione RAID",null,null,null,null,null,null,null,null,null,null,null,null,0]
[null,null,null,null,null,null,null,null,null,null,null,null,null,null,null,null,null,null,null,null,null,0]
[null,{"$f":"'Lotto1 T630 1 (Tower)'!$B$86","v":"SCRIVERE QUI' LA CONFIGURAZIONE RAID RICHIESTA.\nT630 Tower Base\n"},null,null,null,null,null,null,{"$f":"'Lotto1 T630 1 (Tower) Prest'!$B$86","v":"SCRIVERE QUI' LA CONFIGURAZIONE RAID RICHIESTA.\nT630 Tower Prestazionale\n"},null,null,null,null,null,null,null,null,null,null,null,null,0]
[null,null,null,null,null,null,null,null,null,null,null,null,null,null,null,null,null,null,null,null,null,0]
[null,null,null,null,null,null,null,null,null,null,null,null,null,null,null,null,null,null,null,null,null,0]
[null,null,null,null,null,null,null,null,null,null,null,null,null,null,null,null,null,null,null,null,null,0]
[null,null,null,null,null,null,null,null,null,null,null,null,null,null,null,null,null,null,null,null,null,0]
[null,null,null,null,null,null,null,null,null,null,null,null,null,null,null,null,null,null,null,null,null,0]
[null,null,null,null,null,null,null,null,null,null,null,null,null,null,null,null,null,null,null,null,null,0]
[null,null,null,null,null,null,null,null,null,null,null,null,null,null,null,null,null,null,null,null,null,0]
[null,null,null,null,null,null,null,null,null,null,null,null,null,null,null,null,null,null,null,null,null,0]
[null,null,null,null,null,null,null,null,null,null,null,null,null,null,null,null,null,null,null,null,null,0]
[null,null,null,null,null,null,null,null,null,null,null,null,null,null,null,null,null,null,null,null,null,0]
[null,null,null,null,null,null,null,null,null,null,null,null,null,null,null,null,null,null,null,null,null,0]
[null,null,null,null,null,null,null,null,null,null,null,null,null,null,null,null,null,null,null,null,null,0]
[null,null,null,null,null,null,null,null,null,null,null,null,null,null,null,null,null,null,null,null,null,0]
[null,null,null,null,null,null,null,null,null,null,null,null,null,null,null,null,null,null,null,null,null,0]
[null,null,null,null,null,null,null,null,null,null,null,null,null,null,null,null,null,null,null,null,null,0]
[null,null,null,null,null,null,null,null,null,null,null,null,null,null,null,null,null,null,null,null,null,0]
[null,null,null,null,null,null,null,null,null,null,null,null,null,null,null,null,null,null,null,null,null,0]
[null,null,null,null,null,null,null,null,null,null,null,null,null,null,null,null,null,null,null,null,null,1]
[null,null,null,null,null,null,null,null,null,null,null,null,null,null,null,null,null,null,null,null,null,1]
[null,null,null,{"$f":"MID(C497,13,5)","v":""},null,{"$f":"MID(E497,13,5)","v":""},null,"",null,"",null,"",null,"",null,"",null,"",null,"",null,1]
[null,null,null,"AREA RISERVATA AL FORNITORE",null,null,null,null,null,null,null,null,null,null,null,null,null,null,null,null,null,1]
[null,null,null,null,null,null,null,null,null,null,null,null,null,null,null,null,null,null,null,null,null,1]
[null,null,null,null,null,null,null,null,null,null,null,null,null,null,null,null,null,null,null,null,null,1]
[null,null,"VERIFICA STAGING",null,null,null,null,null,null,null,null,null,null,null,"VERIFICA INSTALLATORE",null,null,null,null,null,null,1]
[null,null,null,null,null,null,null,null,null,null,null,null,null,null,null,null,null,null,null,null,null,1]
[null,null,null,null,null,null,null,null,null,null,null,null,null,null,null,null,null,null,null,null,null,1]
[null,null,null,null,null,null,null,null,null,null,null,null,null,null,null,null,null,null,null,null,null,1]
[null,null,null,null,null,null,null,null,null,null,null,null,null,null,null,null,null,null,null,null,null,1]
[null,null,null,null,null,null,null,null,null,null,null,null,null,null,null,null,null,null,null,null,null,1]

{"sheet":"Lotto1 R630 2","index":9,"n_rows":171,"n_cols":9,"rows_kept":171,"cut":false,"hidden":false,"merged":[[27,2,27,4],[4,0,4,4],[5,0,5,4],[10,0,11,5],[12,0,12,5],[18,2,18,4],[20,1,20,4],[21,2,21,4],[23,1,23,4],[24,2,24,4],[26,1,26,4],[53,1,53,4],[29,1,29,4],[30,2,30,4],[33,1,33,4],[34,2,34,4],[36,1,36,4],[39,1,39,4],[40,2,40,4],[42,1,42,4],[43,2,43,4],[49,1,49,4],[50,2,50,4],[54,2,54,4],[56,1,56,4],[57,2,57,4],[59,1,59,4],[61,1,61,4],[74,2,74,4],[64,1,64,4],[95,1,95,3],[73,1,73,4],[95,7,96,8],[103,2,103,4],[76,1,76,4],[77,2,77,4],[91,1,91,4],[92,2,92,4],[96,2,96,4],[99,1,99,4],[100,2,100,4],[102,1,102,4],[123,1,123,4],[105,1,105,4],[106,2,106,4],[108,1,108,4],[109,2,109,4],[111,1,111,4],[114,1,114,4],[115,2,115,4],[117,1,117,4],[118,2,118,4],[120,1,120,4],[121,2,121,4],[141,1,141,4],[124,2,124,4],[126,1,126,4],[127,2,127,4],[129,1,129,4],[130,2,130,4],[132,1,132,4],[133,2,133,4],[135,1,135,4],[136,2,136,4],[138,1,138,4],[139,2,139,4],[159,1,159,4],[142,2,142,4],[144,1,144,4],[145,2,145,4],[147,1,147,4],[148,2,148,4],[150,1,150,4],[151,2,151,4],[153,1,153,4],[154,2,154,4],[156,1,156,4],[157,2,157,4],[169,2,169,4],[171,1,171,4],[160,2,160,4],[162,1,162,4],[163,2,163,4],[165,1,165,4],[166,2,166,4],[168,1,168,4]]}
["IN ROSSO LE OPZIONI 20%"]
[]
[]
[]
["Tecnologie Server 1 Lotto 1"]
[]
[null,null,null,null,null,null,null,"Totale Server e Opzioni",{"$f":"G16*SRV_AA","v":0}]
[null,null,null,null,null,null,null,"Totale Ulteriori Opzioni ",{"$f":"G17*SRV_AA-(G73*SRV_AA)+G73-(SRV_AA*G70)+G70","v":0}]
[]
[null,null,null,null,null,null,null,"TOTALE CONVENZIONE",{"$f":"I8+I7","v":0}]
["Components: \nServer DELL PowerEdge R630 (1CPU Intel® Xeon® E5-2640 v4, 32GB RDIMM, 2xHDD 300GB 10K RPM SAS 12Gbps 2.5in)"]
[]
[]
[]
["PowerEdge R630","Category: Server"]
[null,"Quantity: ",null,null,null,1720,{"$f":"SUM(F16:F172)","v":1720}]
[null,null,null,null,null,null,{"$f":"SUM(G19:G172)","v":0}]
[]
[null,"Base"]
[null,"PowerEdge R630 for Intel v4 CPUs, 8HDD",1,null,"[210-ACXS][329-BCZI]"]
[]
[null,"Configurazione dello chassis"]
[null,"Chassis with up to 8, 2.5\" Hard Drives, up to 2 PCIe Slots (With Optional Riser)",1,null,"[321-BBKJ]"]
[]
[null,"Processore"]
[null,"Intel Xeon E5-2640 v4 2.4GHz 25M Cache 8.0GT/s QPI Turbo HT 10C/20T (90W) Max Mem 2133MHz",1,null,"[338-BJDL]"]
[]
[null,"Processore aggiuntivo"]
[null,"No Additional Processor",{"$f":"VLOOKUP($B$29, CPU_A, 2, FALSE)","v":0},{"$f":"VLOOKUP($B$29, CPU_A, 3, FALSE)","v":""},{"$f":"VLOOKUP($B$29, CPU_A, 5, FALSE)","v":"[374-BBBX]"},{"$f":"VLOOKUP(B29, CPU_A, 12, FALSE)","v":0}]
[]
[null,"Processor Thermal Configuration"]
[null,"1 CPU up to 120W",1,null,"[370-ABWN][412-AAEE]"]
[null,{"$f":"VLOOKUP($B$29, CPU_A, 6, FALSE)","v":""},{"$f":"VLOOKUP($B$29, CPU_A, 7, FALSE)","v":""},null,{"$f":"VLOOKUP($B$29, CPU_A, 8, FALSE)","v":""}]
[]
[null,"Tipo di configurazione memoria"]
[null,"Performance Optimized",1,null,"[370-AAIP]"]
[]
[null,"Memoria Totale in GB",{"$f":"IF(F29=728,IF(B39=32,\"ATTENZIONE: AUMENTARE LA RAM\",\"\"),\"\")","v":""}]
[null,32]
[]
[null,"Tipo e velocità della memoria DIMM"]
[null,"2400MT/s RDIMMs",1,null,"[370-ACPH]"]
[]
[null,"Capacità di memoria"]
[null,{"$f":"IF($B$29=\"No Additional Processor\",VLOOKUP($B$39, MEM_A1, 8, FALSE),VLOOKUP($B$39, MEM_A2, 8, FALSE))","v":"32GB RDIMM, 2400MT/s, Dual Rank, x4 Data Width"},{"$f":"IF($B$29=\"No Additional Processor\",VLOOKUP($B$39, MEM_A1, 9, FALSE),VLOOKUP($B$39, MEM_A2, 9, FALSE))","v":1},null,{"$f":"IF($B$29=\"No Additional Processor\",VLOOKUP($B$39, MEM_A1, 10, FALSE),VLOOKUP($B$39, MEM_A2, 10, FALSE))","v":"[370-ACNS]"}]
[]
[null,{"$f":"IF($B$29=\"No Additional Processor\",VLOOKUP($B$39, MEM_A1, 2, FALSE),VLOOKUP($B$39, MEM_A2, 2, FALSE))","v":""},{"$f":"IF($B$29=\"No Additional Processor\",VLOOKUP($B$39, MEM_A1, 3, FALSE),VLOOKUP($B$39, MEM_A2, 3, FALSE))","v":""},{"$f":"IF($B$29=\"No Additional Processor\",VLOOKUP($B$39, MEM_A1, 4, FALSE),VLOOKUP($B$39, MEM_A2, 4, FALSE))","v":""},{"$f":"IF($B$29=\"No Additional Processor\",VLOOKUP($B$39, MEM_A1, 6, FALSE),VLOOKUP($B$39, MEM_A2, 6, FALSE))","v":""},{"$f":"IF($B$29=\"No Additional Processor\",VLOOKUP($B$39, MEM_A1, 7, FALSE),VLOOKUP($B$39, MEM_A2, 7, FALSE))","v":""}]
[]
[null,{"$f":"IF($B$29=\"No Additional Processor\",VLOOKUP($B$39, MEM_A1, 11, FALSE),VLOOKUP($B$39, MEM_A2, 11, FALSE))","v":""},{"$f":"IF($B$29=\"No Additional Processor\",VLOOKUP($B$39, MEM_A1, 12, FALSE),VLOOKUP($B$39, MEM_A2, 12, FALSE))","v":""},{"$f":"IF($B$29=\"No Additional Processor\",VLOOKUP($B$39, MEM_A1, 13, FALSE),VLOOKUP($B$39, MEM_A2, 13, FALSE))","v":""},{"$f":"IF($B$29=\"No Additional Processor\",VLOOKUP($B$39, MEM_A1, 15, FALSE),VLOOKUP($B$39, MEM_A2, 15, FALSE))","v":""},{"$f":"IF($B$29=\"No Additional Processor\",VLOOKUP($B$39, MEM_A1, 16, FALSE),VLOOKUP($B$39, MEM_A2, 16, FALSE))","v":""}]
[]
[null,"Sistema operativo preinstallato"]
[null,"No Operating System",{"$f":"VLOOKUP($B$52, OS_A, 2, FALSE)","v":""},{"$f":"VLOOKUP($B$52, OS_A, 3, FALSE)","v":""},{"$f":"VLOOKUP($B$52, OS_A, 5, FALSE)","v":"[611-BBBF]"},{"$f":"VLOOKUP($B$52, OS_A, 6, FALSE)","v":""}]
[null,{"$f":"IF($B$29=\"No Additional Processor\",VLOOKUP($B$52, OS_A, 20, FALSE),VLOOKUP($B$52, OS_A2, 20, FALSE))","v":""},{"$f":"IF($B$29=\"No Additional Processor\",VLOOKUP($B$52, OS_A, 21, FALSE),VLOOKUP($B$52, OS_A2, 21, FALSE))","v":0},{"$f":"IF($B$29=\"No Additional Processor\",VLOOKUP($B$52, OS_A, 22, FALSE),VLOOKUP($B$52, OS_A2, 22, FALSE))","v":""},{"$f":"IF($B$29=\"No Additional Processor\",VLOOKUP($B$52, OS_A, 24, FALSE),VLOOKUP($B$52, OS_A2, 24, FALSE))","v":""},{"$f":"IF($B$29=\"No Additional Processor\",VLOOKUP($B$52, OS_A, 25, FALSE),VLOOKUP($B$52, OS_A2, 25, FALSE))","v":""}]
[]
[null,"OS Media Kits"]
[null,"No Media Required",1,null,"[605-BBFN]"]
[]
[null,"Client Access Licenses"]
[null,{"$f":"VLOOKUP($B$52, OS_A, 8, FALSE)","v":"None"},null,{"$f":"VLOOKUP($B$52, OS_A, 10, FALSE)","v":""},{"$f":"VLOOKUP($B$52, OS_A, 12, FALSE)","v":""},{"$f":"VLOOKUP($B$52, OS_A, 13, FALSE)*C59","v":0}]
[]
[null,{"$f":"VLOOKUP($B$52, OS_A, 14, FALSE)","v":"None"},null,{"$f":"VLOOKUP($B$52, OS_A, 16, FALSE)","v":""},{"$f":"VLOOKUP($B$52, OS_A, 18, FALSE)","v":""},{"$f":"VLOOKUP($B$52, OS_A, 19, FALSE)*C61","v":0}]
[]
[null,"Sistema operativo SUSE Linux Enterprise Server"]
[null,"None\n",{"$f":"VLOOKUP($B$64,SUSE, 2, FALSE)","v":0},{"$f":"VLOOKUP($B$64,SUSE, 3, FALSE)","v":""},{"$f":"VLOOKUP($B$64,SUSE, 5, FALSE)","v":""},null,{"$f":"VLOOKUP($B$64, SUSE, 6, FALSE)*C64","v":0}]
[]
[null,"Sistema operativo VMware"]
[null,"None",{"$f":"VLOOKUP($B$67,VMWARE, 2, FALSE)+C29","v":0},{"$f":"VLOOKUP($B$67,VMWARE, 3, FALSE)","v":""},{"$f":"VLOOKUP($B$67,VMWARE, 5, FALSE)","v":""},null,{"$f":"VLOOKUP($B$67, VMWARE, 6, FALSE)*C67","v":0}]
[]
[null,"VMware vCenter Server Standard"]
[null,"None",{"$f":"VLOOKUP($B$70,VMWARE2, 2, FALSE)","v":0},{"$f":"VLOOKUP($B$70,VMWARE2, 3, FALSE)","v":""},{"$f":"VLOOKUP($B$70,VMWARE2, 5, FALSE)","v":""},null,{"$f":"VLOOKUP($B$70, VMWARE2, 6, FALSE)*C70","v":0}]
[]
[null,"Essentials Plus Kit"]
[null,"None",{"$f":"IF(SRV_A<4,VLOOKUP($B$73,VMWARE1, 2, FALSE),0)","v":0},{"$f":"VLOOKUP($B$73,VMWARE1, 3, FALSE)","v":""},{"$f":"VLOOKUP($B$73,VMWARE1, 5, FALSE)","v":""},null,{"$f":"VLOOKUP($B$73, VMWARE1, 6, FALSE)*C73","v":0}]
[]
[null,"Controller RAID"]
[null,"PERC H730 Integrated RAID Controller, 1GB Cache",1,null,"[405-AAEG]"]
[]
[null,"Dischi rigidi (numero massimo totale 8)"]
[null,"300GB 10K RPM SAS 12Gbps 2.5in Hot-plug Hard Drive",2,null,"[400-AJPK]"]
[]
[null,"300GB 10K RPM SAS 12Gbps 2.5in Hot-plug Hard Drive,CusKit",null,{"$f":"VLOOKUP($B$81, HDD_A,3, FALSE)","v":"TS1L1-HD300"},{"$f":"VLOOKUP($B$81, HDD_A,5, FALSE)","v":"[400-AJOQ]"},{"$f":"VLOOKUP($B$81, HDD_A,6, FALSE)*C81","v":0}]
[]
[null,"1.2TB 10K RPM SAS 12Gbps 2.5in Hot-plug Hard Drive,CusKit",null,{"$f":"VLOOKUP($B$83, HDD_A,3, FALSE)","v":"TS1L1-HD1200"},{"$f":"VLOOKUP($B$83, HDD_A,5, FALSE)","v":"[400-AJPD]"},{"$f":"VLOOKUP($B$83, HDD_A,6, FALSE)*C83","v":0}]
[]
[null,"1.8TB 10K RPM SAS 12Gbps 512e 2.5in Hot-plug Hard Drive,CusKit",null,"TS1L1-HD1800","[400-AJQP]",null,{"$f":"VLOOKUP($B$85, HDD_B,6, FALSE)*C85","v":0}]
[]
[null,"960GB Solid State Drive SAS Mix Use MLC 2.5in Hot-plug Drive, PX04SV, Cus Kit",null,"TS1L1-SSD800","[400-ANNX]",null,{"$f":"VLOOKUP($B$87, HDD_B,6, FALSE)*C87","v":0}]
[]
[null,"1.92TB Solid State Drive SAS Mix Use MLC 2.5in Hot-plug Drive, PX04SV, Cus Kit",null,"TS1L1-SSD1920","[400-ANMN]",null,{"$f":"VLOOKUP($B$89, HDD_B,6, FALSE)*C89","v":0}]
[]
[null,"DISCHI TOTALI",{"$f":"SUM(C79:C90)","v":2},{"$f":"IF(C91<=8,\"      OK\",\"     ERRORE:   Totale n° di dischi superiore al consentito\")","v":"      OK"}]
[]
[null,"Configurazione RAID"]
[null,"C3 - RAID 1 for H330 (2 HDDs)",1,null,{"$f":"VLOOKUP($B$94,  RAID_A1, 2, FALSE)","v":"[780-BBJK]"}]
[null,"Hot Spare for 300GB HDD","No"]
[null,"SCRIVERE QUI' LA CONFIGURAZIONE RAID RICHIESTA.\nR630 2\n",null,null,null,null,null,{"$f":"IF(B96=\"SCRIVERE QUI' LA CONFIGURAZIONE RAID RICHIESTA.\nR630 2\n\",\"ATTENZIONE COMPILARE IL CAMPO DELLA SCELTA RAID\", \"\")","v":"ATTENZIONE COMPILARE IL CAMPO DELLA SCELTA RAID"}]
[null,"Configurazione RAID HDD 1TB"]
[null,"",1,null,{"$f":"VLOOKUP($B$98,  RAID_A2, 2, FALSE)","v":""}]
[null,"Hot Spare for 1TB HDD","No"]
[]
[null,"Impostazioni del BIOS per la gestione dell'alimentazione"]
[null,"Performance BIOS Setting",1,null,"[384-BBBL]"]
[]
[null,"Alimentatore"]
[null,"Dual, Hot-plug, Redundant Power Supply (1+1), 750W, Titanium, 200-240VAC",{"$f":"VLOOKUP(B105,upsell_1, 2, FALSE)","v":1},{"$f":"VLOOKUP(B105,upsell_1, 3, FALSE)","v":""},{"$f":"VLOOKUP(B105,upsell_1, 5, FALSE)","v":"[450-ADWT]"},{"$f":"VLOOKUP(B105,upsell_1, 6, FALSE)","v":0},{"$f":"VLOOKUP(B105,upsell_1, 7, FALSE)","v":0}]
[]
[null,"Cavi di alimentazione"]
[null,"Rack Power Cord 2M (C13/C14 12A)",2,null,"[450-AADY]"]
[]
[null,"PCIe Riser"]
[null,{"$f":"VLOOKUP(B29, CPU_A, 9, FALSE)","v":"Riser with up to 1, x8 PCIe Slots + 1, x16 PCIe Slots for x8, 2 PCIe Chassis with 1 Processor"},{"$f":"VLOOKUP($B$29, CPU_A, 10, FALSE)","v":1},null,{"$f":"VLOOKUP($B$29, CPU_A, 11, FALSE)","v":"[330-BBCS]"}]
[]
[null,"TPM Module"]
[null,"PowerEdge Server FIPS TPM 2.0",1,null,"[461-AADM]"]
[]
[null,"Embedded Systems Management"]
[null,"iDRAC8 Enterprise, integrated Dell Remote Access Controller, Enterprise",1,null,"[385-BBHO]"]
[]
[null,"Adattatore di rete"]
[null,"Broadcom 5720 QP 1Gb Network Daughter Card",{"$f":"VLOOKUP($B$120,upsell_1, 2, FALSE)","v":1},{"$f":"VLOOKUP($B$120,upsell_1, 3, FALSE)","v":""},{"$f":"VLOOKUP($B$120,upsell_1, 5, FALSE)","v":"[540-BBBW]"},{"$f":"VLOOKUP($B$120,upsell_1, 6, FALSE)","v":""},{"$f":"VLOOKUP($B$120,upsell_1, 7, FALSE)","v":0}]
[]
[null,"Modulo Doppia SD"]
[null,"None ",{"$f":"VLOOKUP($B$123,upsell_1, 2, FALSE)","v":0},{"$f":"VLOOKUP($B$123,upsell_1, 3, FALSE)","v":""},{"$f":"VLOOKUP($B$123,upsell_1, 4, FALSE)","v":""},{"$f":"VLOOKUP($B$123,upsell_1, 6, FALSE)","v":""},{"$f":"VLOOKUP($B$123,upsell_1, 7, FALSE)","v":0}]
[]
[null,"Additional Card for PCIe Slot 1 (Low Profile)"]
[null,"None",{"$f":"VLOOKUP($B$126,  PCI_A1, 2, FALSE)","v":""},{"$f":"VLOOKUP($B$126,  PCI_A1, 3, FALSE)","v":""},{"$f":"VLOOKUP($B$126,  PCI_A1, 5, FALSE)","v":""},{"$f":"VLOOKUP($B$126,  PCI_A1, 6, FALSE)","v":""},{"$f":"VLOOKUP($B$126,  PCI_A1, 7, FALSE)","v":0}]
[]
[null,"Additional Card for PCIe Slot 2 (Full height)"]
[null,"None",{"$f":"VLOOKUP($B$129,  PCI_A2, 2, FALSE)","v":""},{"$f":"VLOOKUP($B$129,  PCI_A2, 3, FALSE)","v":""},{"$f":"VLOOKUP($B$129,  PCI_A2, 5, FALSE)","v":""},{"$f":"VLOOKUP($B$129,  PCI_A2, 6, FALSE)","v":""},{"$f":"VLOOKUP($B$129,  PCI_A2, 7, FALSE)","v":0}]
[]
[null,"Pannello frontale"]
[null,"No Bezel Option",{"$f":"VLOOKUP(B132,upsell_1, 2, FALSE)","v":1},{"$f":"VLOOKUP(B132,upsell_1, 3, FALSE)","v":""},{"$f":"VLOOKUP(B132,upsell_1, 5, FALSE)","v":"[350-BBBW]"},{"$f":"VLOOKUP(B132,upsell_1, 6, FALSE)","v":0},{"$f":"VLOOKUP(B132,upsell_1, 7, FALSE)","v":0}]
[]
[null,"Guide per rack"]
[null,"ReadyRails™ Sliding Rails Without Cable Management Arm",{"$f":"VLOOKUP(B135,upsell_1, 2, FALSE)","v":1},{"$f":"VLOOKUP(B135,upsell_1, 3, FALSE)","v":""},{"$f":"VLOOKUP(B135,upsell_1, 5, FALSE)","v":"[770-BBBC]"},{"$f":"VLOOKUP(B135,upsell_1, 6, FALSE)","v":0},{"$f":"VLOOKUP(B135,upsell_1, 7, FALSE)","v":0}]
[]
[null,"Unità ottica interna"]
[null,"No Internal Optical Drive for 8 HDD Chassis",1,"","","[429-AAQN]",""]
[]
[null,"Accessori Server"]
[null,"PowerEdge SFP+, 10GbE SR/SX, Optical Tranceiver, LC Connector, for Intel and Broadcom,CusKit",{"$f":"(VLOOKUP(B129,PCI_A2,9,FALSE))+((VLOOKUP(B126,PCI_A1,9,FALSE)))","v":0},null,"[407-BBQE]"]
[]
[null,"Sistema documentazione"]
[null,"Electronic System Documentation and OpenManage DVD Kit",1,null,"[343-BBDK]"]
[]
[null,"SHIPPING"]
[null,"R630 Shipping - 8 Drive Chassis, EMEA1 (English/French/German/Spanish/Russian/Hebrew)",1,null,"[340-AMIN]"]
[]
[null,"Order Information"]
[null,"PowerEdge Order - EMEA",1,null,"[800-11671]"]
[]
[null,"Base warranty"]
[null,"3Yr Basic Warranty - Next Business Day - Minimum Warranty",1,null,"[709-12767][709-12768]"]
[]
[null,"Servizi di assitenza"]
[null,"Dell Channel Order - Service Info only",1,null,"[710-31085]"]
[]
[null,"Estenzione di Garanzia"]
[null,"None",{"$f":"VLOOKUP($B$159,  SO_A1, 2, FALSE)","v":""},{"$f":"VLOOKUP($B$159,  SO_A1, 3, FALSE)","v":""},{"$f":"VLOOKUP($B$159,  SO_A1, 5, FALSE)","v":""},{"$f":"VLOOKUP($B$159,  SO_A1, 6, FALSE)","v":""}]
[]
[null,"Protezione dei dati - Keep Your Hard Drive "]
[null,"None",{"$f":"VLOOKUP($B$162,  SO_A2, 2, FALSE)","v":""},{"$f":"VLOOKUP($B$162,  SO_A2, 3, FALSE)","v":""},{"$f":"VLOOKUP($B$162,  SO_A2,5, FALSE)","v":""},{"$f":"VLOOKUP($B$162,  SO_A2, 6, FALSE)","v":""}]
[]
[null,"Servizi di Installazione"]
[null,"No Installation Service Selected",1,null,"[683-11870]"]
[]
[null,"Channel only - Support Extension"]
[null,"Channel 39M Basic Warranty - Next Business Day",1,null,"[723-28776]"]
[]
[null,"Warranty Upgrades - Non-Std/Local POS"]
[null,"CSTM CONSIP - 39M Onsite Labor Support for CRU for Servers with Basic Warranty",1,null,"[681-24467]"]

{"sheet":"Lotto1 R630 3","index":10,"n_rows":171,"n_cols":9,"rows_kept":171,"cut":false,"hidden":false,"merged":[[27,2,27,4],[4,0,4,4],[5,0,5,4],[10,0,11,5],[12,0,12,5],[18,2,18,4],[20,1,20,4],[21,2,21,4],[23,1,23,4],[24,2,24,4],[26,1,26,4],[53,1,53,4],[29,1,29,4],[30,2,30,4],[33,1,33,4],[34,2,34,4],[36,1,36,4],[39,1,39,4],[40,2,40,4],[42,1,42,4],[43,2,43,4],[49,1,49,4],[50,2,50,4],[54,2,54,4],[56,1,56,4],[57,2,57,4],[59,1,59,4],[61,1,61,4],[74,2,74,4],[64,1,64,4],[73,1,73,4],[95,7,96,8],[103,2,103,4],[76,1,76,4],[77,2,77,4],[91,1,91,4],[92,2,92,4],[96,2,96,4],[95,1,95,3],[99,1,99,4],[100,2,100,4],[102,1,102,4],[123,1,123,4],[105,1,105,4],[106,2,106,4],[108,1,108,4],[109,2,109,4],[111,1,111,4],[114,1,114,4],[115,2,115,4],[117,1,117,4],[118,2,118,4],[120,1,120,4],[121,2,121,4],[141,1,141,4],[124,2,124,4],[126,1,126,4],[127,2,127,4],[129,1,129,4],[130,2,130,4],[132,1,132,4],[133,2,133,4],[135,1,135,4],[136,2,136,4],[138,1,138,4],[139,2,139,4],[159,1,159,4],[142,2,142,4],[144,1,144,4],[145,2,145,4],[147,1,147,4],[148,2,148,4],[150,1,150,4],[151,2,151,4],[153,1,153,4],[154,2,154,4],[156,1,156,4],[157,2,157,4],[169,2,169,4],[171,1,171,4],[160,2,160,4],[162,1,162,4],[163,2,163,4],[165,1,165,4],[166,2,166,4],[168,1,168,4]]}
["IN ROSSO LE OPZIONI 20%"]
[]
[]
[]
["Tecnologie Server 1 Lotto 1"]
[]
[null,null,null,null,null,null,null,"Totale Server e Opzioni",{"$f":"G16*SRV_AAA","v":0}]
[null,null,null,null,null,null,null,"Totale Ulteriori Opzioni ",{"$f":"G17*SRV_AAA-(G73*SRV_AAA)+G73-(SRV_AAA*G70)+G70","v":0}]
[]
[null,null,null,null,null,null,null,"TOTALE CONVENZIONE",{"$f":"I8+I7","v":0}]
["Components: \nServer DELL PowerEdge R630 (1CPU Intel® Xeon® E5-2640 v4, 32GB RDIMM, 2xHDD 300GB 10K RPM SAS 12Gbps 2.5in)"]
[]
[]
[]
["PowerEdge R630","Category: Server"]
[null,"Quantity: ",null,null,null,1720,{"$f":"SUM(F16:F172)","v":1720}]
[null,null,null,null,null,null,{"$f":"SUM(G19:G172)","v":0}]
[]
[null,"Base"]
[null,"PowerEdge R630 for Intel v4 CPUs, 8HDD",1,null,"[210-ACXS][329-BCZI]"]
[]
[null,"Configurazione dello chassis"]
[null,"Chassis with up to 8, 2.5\" Hard Drives, up to 2 PCIe Slots (With Optional Riser)",1,null,"[321-BBKJ]"]
[]
[null,"Processore"]
[null,"Intel Xeon E5-2640 v4 2.4GHz 25M Cache 8.0GT/s QPI Turbo HT 10C/20T (90W) Max Mem 2133MHz",1,null,"[338-BJDL]"]
[]
[null,"Processore aggiuntivo"]
[null,"No Additional Processor",{"$f":"VLOOKUP($B$29, CPU_A, 2, FALSE)","v":0},{"$f":"VLOOKUP($B$29, CPU_A, 3, FALSE)","v":""},{"$f":"VLOOKUP($B$29, CPU_A, 5, FALSE)","v":"[374-BBBX]"},{"$f":"VLOOKUP(B29, CPU_A, 12, FALSE)","v":0}]
[]
[null,"Processor Thermal Configuration"]
[null,"1 CPU up to 120W",1,null,"[370-ABWN][412-AAEE]"]
[null,{"$f":"VLOOKUP($B$29, CPU_A, 6, FALSE)","v":""},{"$f":"VLOOKUP($B$29, CPU_A, 7, FALSE)","v":""},null,{"$f":"VLOOKUP($B$29, CPU_A, 8, FALSE)","v":""}]
[]
[null,"Tipo di configurazione memoria"]
[null,"Performance Optimized",1,null,"[370-AAIP]"]
[]
[null,"Memoria Totale in GB",{"$f":"IF(F29=728,IF(B39=32,\"ATTENZIONE: AUMENTARE LA RAM\",\"\"),\"\")","v":""}]
[null,32]
[]
[null,"Tipo e velocità della memoria DIMM"]
[null,"2400MT/s RDIMMs",1,null,"[370-ACPH]"]
[]
[null,"Capacità di memoria"]
[null,{"$f":"IF($B$29=\"No Additional Processor\",VLOOKUP($B$39, MEM_A1, 8, FALSE),VLOOKUP($B$39, MEM_A2, 8, FALSE))","v":"32GB RDIMM, 2400MT/s, Dual Rank, x4 Data Width"},{"$f":"IF($B$29=\"No Additional Processor\",VLOOKUP($B$39, MEM_A1, 9, FALSE),VLOOKUP($B$39, MEM_A2, 9, FALSE))","v":1},null,{"$f":"IF($B$29=\"No Additional Processor\",VLOOKUP($B$39, MEM_A1, 10, FALSE),VLOOKUP($B$39, MEM_A2, 10, FALSE))","v":"[370-ACNS]"}]
[]
[null,{"$f":"IF($B$29=\"No Additional Processor\",VLOOKUP($B$39, MEM_A1, 2, FALSE),VLOOKUP($B$39, MEM_A2, 2, FALSE))","v":""},{"$f":"IF($B$29=\"No Additional Processor\",VLOOKUP($B$39, MEM_A1, 3, FALSE),VLOOKUP($B$39, MEM_A2, 3, FALSE))","v":""},{"$f":"IF($B$29=\"No Additional Processor\",VLOOKUP($B$39, MEM_A1, 4, FALSE),VLOOKUP($B$39, MEM_A2, 4, FALSE))","v":""},{"$f":"IF($B$29=\"No Additional Processor\",VLOOKUP($B$39, MEM_A1, 6, FALSE),VLOOKUP($B$39, MEM_A2, 6, FALSE))","v":""},{"$f":"IF($B$29=\"No Additional Processor\",VLOOKUP($B$39, MEM_A1, 7, FALSE),VLOOKUP($B$39, MEM_A2, 7, FALSE))","v":""}]
[]
[null,{"$f":"IF($B$29=\"No Additional Processor\",VLOOKUP($B$39, MEM_A1, 11, FALSE),VLOOKUP($B$39, MEM_A2, 11, FALSE))","v":""},{"$f":"IF($B$29=\"No Additional Processor\",VLOOKUP($B$39, MEM_A1, 12, FALSE),VLOOKUP($B$39, MEM_A2, 12, FALSE))","v":""},{"$f":"IF($B$29=\"No Additional Processor\",VLOOKUP($B$39, MEM_A1, 13, FALSE),VLOOKUP($B$39, MEM_A2, 13, FALSE))","v":""},{"$f":"IF($B$29=\"No Additional Processor\",VLOOKUP($B$39, MEM_A1, 15, FALSE),VLOOKUP($B$39, MEM_A2, 15, FALSE))","v":""},{"$f":"IF($B$29=\"No Additional Processor\",VLOOKUP($B$39, MEM_A1, 16, FALSE),VLOOKUP($B$39, MEM_A2, 16, FALSE))","v":""}]
[]
[null,"Sistema operativo preinstallato"]
[null,"No Operating System",{"$f":"VLOOKUP($B$52, OS_A, 2, FALSE)","v":""},{"$f":"VLOOKUP($B$52, OS_A, 3, FALSE)","v":""},{"$f":"VLOOKUP($B$52, OS_A, 5, FALSE)","v":"[611-BBBF]"},{"$f":"VLOOKUP($B$52, OS_A, 6, FALSE)","v":""}]
[null,{"$f":"IF($B$29=\"No Additional Processor\",VLOOKUP($B$52, OS_A, 20, FALSE),VLOOKUP($B$52, OS_A2, 20, FALSE))","v":""},{"$f":"IF($B$29=\"No Additional Processor\",VLOOKUP($B$52, OS_A, 21, FALSE),VLOOKUP($B$52, OS_A2, 21, FALSE))","v":0},{"$f":"IF($B$29=\"No Additional Processor\",VLOOKUP($B$52, OS_A, 22, FALSE),VLOOKUP($B$52, OS_A2, 22, FALSE))","v":""},{"$f":"IF($B$29=\"No Additional Processor\",VLOOKUP($B$52, OS_A, 24, FALSE),VLOOKUP($B$52, OS_A2, 24, FALSE))","v":""},{"$f":"IF($B$29=\"No Additional Processor\",VLOOKUP($B$52, OS_A, 25, FALSE),VLOOKUP($B$52, OS_A2, 25, FALSE))","v":""}]
[]
[null,"OS Media Kits"]
[null,"No Media Required",1,null,"[605-BBFN]"]
[]
[null,"Client Access Licenses"]
[null,{"$f":"VLOOKUP($B$52, OS_A, 8, FALSE)","v":"None"},null,{"$f":"VLOOKUP($B$52, OS_A, 10, FALSE)","v":""},{"$f":"VLOOKUP($B$52, OS_A, 12, FALSE)","v":""},{"$f":"VLOOKUP($B$52, OS_A, 13, FALSE)*C59","v":0}]
[]
[null,{"$f":"VLOOKUP($B$52, OS_A, 14, FALSE)","v":"None"},null,{"$f":"VLOOKUP($B$52, OS_A, 16, FALSE)","v":""},{"$f":"VLOOKUP($B$52, OS_A, 18, FALSE)","v":""},{"$f":"VLOOKUP($B$52, OS_A, 19, FALSE)*C61","v":0}]
[]
[null,"Sistema operativo SUSE Linux Enterprise Server"]
[null,"None\n",{"$f":"VLOOKUP($B$64,SUSE, 2, FALSE)","v":0},{"$f":"VLOOKUP($B$64,SUSE, 3, FALSE)","v":""},{"$f":"VLOOKUP($B$64,SUSE, 5, FALSE)","v":""},null,{"$f":"VLOOKUP($B$64, SUSE, 6, FALSE)*C64","v":0}]
[]
[null,"Sistema operativo VMware"]
[null,"None",{"$f":"VLOOKUP($B$67,VMWARE, 2, FALSE)+C29","v":0},{"$f":"VLOOKUP($B$67,VMWARE, 3, FALSE)","v":""},{"$f":"VLOOKUP($B$67,VMWARE, 5, FALSE)","v":""},null,{"$f":"VLOOKUP($B$67, VMWARE, 6, FALSE)*C67","v":0}]
[]
[null,"VMware vCenter Server Standard"]
[null,"None",{"$f":"VLOOKUP($B$70,VMWARE2, 2, FALSE)","v":0},{"$f":"VLOOKUP($B$70,VMWARE2, 3, FALSE)","v":""},{"$f":"VLOOKUP($B$70,VMWARE2, 5, FALSE)","v":""},null,{"$f":"VLOOKUP($B$70, VMWARE2, 6, FALSE)*C70","v":0}]
[]
[null,"Essentials Plus Kit"]
[null,"None",{"$f":"IF(SRV_A<4,VLOOKUP($B$73,VMWARE1, 2, FALSE),0)","v":0},{"$f":"VLOOKUP($B$73,VMWARE1, 3, FALSE)","v":""},{"$f":"VLOOKUP($B$73,VMWARE1, 5, FALSE)","v":""},null,{"$f":"VLOOKUP($B$73, VMWARE1, 6, FALSE)*C73","v":0}]
[]
[null,"Controller RAID"]
[null,"PERC H730 Integrated RAID Controller, 1GB Cache",1,null,"[405-AAEG]"]
[]
[null,"Dischi rigidi (numero massimo totale 8)"]
[null,"300GB 10K RPM SAS 12Gbps 2.5in Hot-plug Hard Drive",2,null,"[400-AJPK]"]
[]
[null,"300GB 10K RPM SAS 12Gbps 2.5in Hot-plug Hard Drive,CusKit",null,{"$f":"VLOOKUP($B$81, HDD_A,3, FALSE)","v":"TS1L1-HD300"},{"$f":"VLOOKUP($B$81, HDD_A,5, FALSE)","v":"[400-AJOQ]"},{"$f":"VLOOKUP($B$81, HDD_A,6, FALSE)*C81","v":0}]
[]
[null,"1.2TB 10K RPM SAS 12Gbps 2.5in Hot-plug Hard Drive,CusKit",null,{"$f":"VLOOKUP($B$83, HDD_A,3, FALSE)","v":"TS1L1-HD1200"},{"$f":"VLOOKUP($B$83, HDD_A,5, FALSE)","v":"[400-AJPD]"},{"$f":"VLOOKUP($B$83, HDD_A,6, FALSE)*C83","v":0}]
[]
[null,"1.8TB 10K RPM SAS 12Gbps 512e 2.5in Hot-plug Hard Drive,CusKit",null,"TS1L1-HD1800","[400-AJQP]",null,{"$f":"VLOOKUP($B$85, HDD_B,6, FALSE)*C85","v":0}]
[]
[null,"960GB Solid State Drive SAS Mix Use MLC 2.5in Hot-plug Drive, PX04SV, Cus Kit",null,"TS1L1-SSD800","[400-ANNX]",null,{"$f":"VLOOKUP($B$87, HDD_B,6, FALSE)*C87","v":0}]
[]
[null,"1.92TB Solid State Drive SAS Mix Use MLC 2.5in Hot-plug Drive, PX04SV, Cus Kit",null,"TS1L1-SSD1920","[400-ANMN]",null,{"$f":"VLOOKUP($B$89, HDD_B,6, FALSE)*C89","v":0}]
[]
[null,"DISCHI TOTALI",{"$f":"SUM(C79:C90)","v":2},{"$f":"IF(C91<=8,\"      OK\",\"     ERRORE:   Totale n° di dischi superiore al consentito\")","v":"      OK"}]
[]
[null,"Configurazione RAID"]
[null,"C3 - RAID 1 for H330 (2 HDDs)",1,null,{"$f":"VLOOKUP($B$94,  RAID_A1, 2, FALSE)","v":"[780-BBJK]"}]
[null,"Hot Spare for 300GB HDD","No"]
[null,"SCRIVERE QUI' LA CONFIGURAZIONE RAID RICHIESTA.\nR630 3\n",null,null,null,null,null,{"$f":"IF(B96=\"SCRIVERE QUI' LA CONFIGURAZIONE RAID RICHIESTA.\nR630 3\n\",\"ATTENZIONE COMPILARE IL CAMPO DELLA SCELTA RAID\", \"\")","v":"ATTENZIONE COMPILARE IL CAMPO DELLA SCELTA RAID"}]
[null,"Configurazione RAID HDD 1TB"]
[null,"",1,null,{"$f":"VLOOKUP($B$98,  RAID_A2, 2, FALSE)","v":""}]
[null,"Hot Spare for 1TB HDD","No"]
[]
[null,"Impostazioni del BIOS per la gestione dell'alimentazione"]
[null,"Performance BIOS Setting",1,null,"[384-BBBL]"]
[]
[null,"Alimentatore"]
[null,"Dual, Hot-plug, Redundant Power Supply (1+1), 750W, Titanium, 200-240VAC",{"$f":"VLOOKUP(B105,upsell_1, 2, FALSE)","v":1},{"$f":"VLOOKUP(B105,upsell_1, 3, FALSE)","v":""},{"$f":"VLOOKUP(B105,upsell_1, 5, FALSE)","v":"[450-ADWT]"},{"$f":"VLOOKUP(B105,upsell_1, 6, FALSE)","v":0},{"$f":"VLOOKUP(B105,upsell_1, 7, FALSE)","v":0}]
[]
[null,"Cavi di alimentazione"]
[null,"Rack Power Cord 2M (C13/C14 12A)",2,null,"[450-AADY]"]
[]
[null,"PCIe Riser"]
[null,{"$f":"VLOOKUP(B29, CPU_A, 9, FALSE)","v":"Riser with up to 1, x8 PCIe Slots + 1, x16 PCIe Slots for x8, 2 PCIe Chassis with 1 Processor"},{"$f":"VLOOKUP($B$29, CPU_A, 10, FALSE)","v":1},null,{"$f":"VLOOKUP($B$29, CPU_A, 11, FALSE)","v":"[330-BBCS]"}]
[]
[null,"TPM Module"]
[null,"PowerEdge Server FIPS TPM 2.0",1,null,"[461-AADM]"]
[]
[null,"Embedded Systems Management"]
[null,"iDRAC8 Enterprise, integrated Dell Remote Access Controller, Enterprise",1,null,"[385-BBHO]"]
[]
[null,"Adattatore di rete"]
[null,"Broadcom 5720 QP 1Gb Network Daughter Card",{"$f":"VLOOKUP($B$120,upsell_1, 2, FALSE)","v":1},{"$f":"VLOOKUP($B$120,upsell_1, 3, FALSE)","v":""},{"$f":"VLOOKUP($B$120,upsell_1, 5, FALSE)","v":"[540-BBBW]"},{"$f":"VLOOKUP($B$120,upsell_1, 6, FALSE)","v":""},{"$f":"VLOOKUP($B$120,upsell_1, 7, FALSE)","v":0}]
[]
[null,"Modulo Doppia SD"]
[null,"None ",{"$f":"VLOOKUP($B$123,upsell_1, 2, FALSE)","v":0},{"$f":"VLOOKUP($B$123,upsell_1, 3, FALSE)","v":""},{"$f":"VLOOKUP($B$123,upsell_1, 4, FALSE)","v":""},{"$f":"VLOOKUP($B$123,upsell_1, 6, FALSE)","v":""},{"$f":"VLOOKUP($B$123,upsell_1, 7, FALSE)","v":0}]
[]
[null,"Additional Card for PCIe Slot 1 (Low Profile)"]
[null,"None",{"$f":"VLOOKUP($B$126,  PCI_A1, 2, FALSE)","v":""},{"$f":"VLOOKUP($B$126,  PCI_A1, 3, FALSE)","v":""},{"$f":"VLOOKUP($B$126,  PCI_A1, 5, FALSE)","v":""},{"$f":"VLOOKUP($B$126,  PCI_A1, 6, FALSE)","v":""},{"$f":"VLOOKUP($B$126,  PCI_A1, 7, FALSE)","v":0}]
[]
[null,"Additional Card for PCIe Slot 2 (Full height)"]
[null,"None",{"$f":"VLOOKUP($B$129,  PCI_A2, 2, FALSE)","v":""},{"$f":"VLOOKUP($B$129,  PCI_A2, 3, FALSE)","v":""},{"$f":"VLOOKUP($B$129,  PCI_A2, 5, FALSE)","v":""},{"$f":"VLOOKUP($B$129,  PCI_A2, 6, FALSE)","v":""},{"$f":"VLOOKUP($B$129,  PCI_A2, 7, FALSE)","v":0}]
[]
[null,"Pannello frontale"]
[null,"No Bezel Option",{"$f":"VLOOKUP(B132,upsell_1, 2, FALSE)","v":1},{"$f":"VLOOKUP(B132,upsell_1, 3, FALSE)","v":""},{"$f":"VLOOKUP(B132,upsell_1, 5, FALSE)","v":"[350-BBBW]"},{"$f":"VLOOKUP(B132,upsell_1, 6, FALSE)","v":0},{"$f":"VLOOKUP(B132,upsell_1, 7, FALSE)","v":0}]
[]
[null,"Guide per rack"]
[null,"ReadyRails™ Sliding Rails Without Cable Management Arm",{"$f":"VLOOKUP(B135,upsell_1, 2, FALSE)","v":1},{"$f":"VLOOKUP(B135,upsell_1, 3, FALSE)","v":""},{"$f":"VLOOKUP(B135,upsell_1, 5, FALSE)","v":"[770-BBBC]"},{"$f":"VLOOKUP(B135,upsell_1, 6, FALSE)","v":0},{"$f":"VLOOKUP(B135,upsell_1, 7, FALSE)","v":0}]
[]
[null,"Unità ottica interna"]
[null,"No Internal Optical Drive for 8 HDD Chassis",1,"","","[429-AAQN]",""]
[]
[null,"Accessori Server"]
[null,"PowerEdge SFP+, 10GbE SR/SX, Optical Tranceiver, LC Connector, for Intel and Broadcom,CusKit",{"$f":"(VLOOKUP(B129,PCI_A2,9,FALSE))+((VLOOKUP(B126,PCI_A1,9,FALSE)))","v":0},null,"[407-BBQE]"]
[]
[null,"Sistema documentazione"]
[null,"Electronic System Documentation and OpenManage DVD Kit",1,null,"[343-BBDK]"]
[]
[null,"SHIPPING"]
[null,"R630 Shipping - 8 Drive Chassis, EMEA1 (English/French/German/Spanish/Russian/Hebrew)",1,null,"[340-AMIN]"]
[]
[null,"Order Information"]
[null,"PowerEdge Order - EMEA",1,null,"[800-11671]"]
[]
[null,"Base warranty"]
[null,"3Yr Basic Warranty - Next Business Day - Minimum Warranty",1,null,"[709-12767][709-12768]"]
[]
[null,"Servizi di assitenza"]
[null,"Dell Channel Order - Service Info only",1,null,"[710-31085]"]
[]
[null,"Estenzione di Garanzia"]
[null,"None",{"$f":"VLOOKUP($B$159,  SO_A1, 2, FALSE)","v":""},{"$f":"VLOOKUP($B$159,  SO_A1, 3, FALSE)","v":""},{"$f":"VLOOKUP($B$159,  SO_A1, 5, FALSE)","v":""},{"$f":"VLOOKUP($B$159,  SO_A1, 6, FALSE)","v":""}]
[]
[null,"Protezione dei dati - Keep Your Hard Drive "]
[null,"None",{"$f":"VLOOKUP($B$162,  SO_A2, 2, FALSE)","v":""},{"$f":"VLOOKUP($B$162,  SO_A2, 3, FALSE)","v":""},{"$f":"VLOOKUP($B$162,  SO_A2,5, FALSE)","v":""},{"$f":"VLOOKUP($B$162,  SO_A2, 6, FALSE)","v":""}]
[]
[null,"Servizi di Installazione"]
[null,"No Installation Service Selected",1,null,"[683-11870]"]
[]
[null,"Channel only - Support Extension"]
[null,"Channel 39M Basic Warranty - Next Business Day",1,null,"[723-28776]"]
[]
[null,"Warranty Upgrades - Non-Std/Local POS"]
[null,"CSTM CONSIP - 39M Onsite Labor Support for CRU for Servers with Basic Warranty",1,null,"[681-24467]"]

{"sheet":"Lotto1 T630R 2","index":11,"n_rows":188,"n_cols":9,"rows_kept":188,"cut":false,"hidden":false,"merged":[[19,2,19,4],[4,0,4,4],[10,0,10,4],[11,0,12,5],[13,0,13,5],[40,1,40,4],[21,1,21,4],[22,2,22,4],[24,1,24,4],[25,2,25,4],[27,1,27,4],[28,2,28,4],[30,1,30,4],[31,2,31,4],[34,1,34,4],[35,2,35,4],[37,1,37,4],[75,2,75,4],[41,2,41,4],[43,1,43,4],[44,2,44,4],[50,1,50,4],[51,2,51,4],[54,1,54,4],[55,2,55,4],[57,1,57,4],[58,2,58,4],[60,1,60,4],[62,1,62,4],[65,1,65,4],[74,1,74,4],[77,1,77,4],[78,2,78,4],[92,1,92,4],[93,2,93,4],[96,1,96,3],[106,1,106,4],[107,2,107,4],[109,1,109,4],[110,2,110,4],[112,1,112,4],[97,2,97,4],[100,1,100,4],[101,2,101,4],[103,1,103,4],[104,2,104,4],[96,7,97,8],[138,1,138,4],[116,2,116,4],[118,1,118,4],[122,2,122,4],[126,1,126,4],[127,2,127,4],[129,1,129,4],[130,2,130,4],[132,1,132,4],[133,2,133,4],[135,1,135,4],[136,2,136,4],[119,2,119,4],[121,1,121,4],[115,1,115,4],[158,1,158,4],[139,2,139,4],[141,1,141,4],[142,2,142,4],[144,1,144,4],[145,2,145,4],[147,1,147,4],[148,2,148,4],[150,1,150,4],[151,2,151,4],[153,1,153,4],[154,2,154,4],[176,1,176,4],[159,2,159,4],[161,1,161,4],[162,2,162,4],[164,1,164,4],[165,2,165,4],[167,1,167,4],[168,2,168,4],[170,1,170,4],[171,2,171,4],[173,1,173,4],[174,2,174,4],[186,2,186,4],[188,1,188,4],[177,2,177,4],[179,1,179,4],[180,2,180,4],[182,1,182,4],[183,2,183,4],[185,1,185,4]]}
["IN ROSSO LE OPZIONI 20%"]
[]
[]
[]
["Tecnologie Server 1 Lotto 1"]
[]
[null,null,null,null,null,null,null,"Totale Server e Opzioni",{"$f":"F18*SRV_CC","v":0}]
[null,null,null,null,null,null,null,"Totale Ulteriori Opzioni ",{"$f":"G17*SRV_CC-(G74*SRV_CC)+G74-(SRV_CC*G71)+G71","v":0}]
[]
[null,null,null,null,null,null,null,"TOTALE CONVENZIONE",{"$f":"I8+I7","v":0}]
[null,null,null,null,null,{"$f":"F18*C17","v":0}]
["Components: \nServer DELL PowerEdge T630 (1CPU Intel® Xeon® E5-2640 v4, 32GB RDIMM, 2xHDD 300GB 10K RPM SAS 12Gbps 2.5in)"]
[]
[]
[]
["PowerEdge T630","Category: Server",null,null,null,{"$f":"1720","v":1720}]
[null,"Quantity: ",null,null,null,{"$f":"SUM(F21:F189)","v":0}]
[null,null,null,null,null,{"$f":"SUM(F16:F17)","v":1720}]
[]
[null,"Base"]
[null,"PowerEdge T630 for Intel v4 CPUs",1,null,"[210-ACWJ][329-BCZH]"]
[]
[null,"Configurazione dello chassis"]
[null,"Chassis with up to 16, 2.5\" Hard Drives, Rack Configuration",1,null,"[321-BBJW]"]
[]
[null,"Processore"]
[null,"Intel Xeon E5-2640 v4 2.4GHz 25M Cache 8.0GT/s QPI Turbo HT 10C/20T (90W) Max Mem 2133MHz",1,null,"[338-BJDL]"]
[]
[null,"Processore aggiuntivo"]
[null,"No Additional Processor",{"$f":"VLOOKUP($B$30, CPU_C, 2, FALSE)","v":0},{"$f":"VLOOKUP($B$30, CPU_C, 3, FALSE)","v":""},{"$f":"VLOOKUP($B$30, CPU_C, 5, FALSE)","v":"[374-BBBX]"},{"$f":"VLOOKUP(B30, CPU_C, 12, FALSE)","v":0}]
[]
[null,"Processor Thermal Configuration"]
[null,"1 CPU up to 105W",1,null,"[412-AADW]"]
[null,{"$f":"VLOOKUP($B$30, CPU_C, 6, FALSE)","v":""},{"$f":"VLOOKUP($B$30, CPU_C, 7, FALSE)","v":""},null,{"$f":"VLOOKUP($B$30, CPU_C, 8, FALSE)","v":""}]
[]
[null,"Tipo di configurazione memoria"]
[null,"Performance Optimized",1,null,"[370-AAIP]"]
[]
[null,"Total Memory in GB",{"$f":"IF(F30=728,IF(B40=32,\"ATTENZIONE: AUMENTARE LA RAM\",\"\"),\"\")","v":""}]
[null,32]
[]
[null,"Tipo e velocità della memoria DIMM"]
[null,"2400MT/s RDIMMs",1,null,"[370-ACPH]"]
[]
[null,"Capacità di memoria"]
[null,"32GB RDIMM, 2400MT/s, Dual Rank, x4 Data Width",1,null,"[370-ACNS]"]
[]
[null,{"$f":"IF($B$30=\"No Additional Processor\",VLOOKUP($B$40, MEM_A1, 2, FALSE),VLOOKUP($B$40, MEM_A2, 2, FALSE))","v":""},{"$f":"IF($B$30=\"No Additional Processor\",VLOOKUP($B$40, MEM_A1, 3, FALSE),VLOOKUP($B$40, MEM_A2, 3, FALSE))","v":""},{"$f":"IF($B$30=\"No Additional Processor\",VLOOKUP($B$40, MEM_A1, 4, FALSE),VLOOKUP($B$40, MEM_A2, 4, FALSE))","v":""},{"$f":"IF($B$30=\"No Additional Processor\",VLOOKUP($B$40, MEM_A1, 6, FALSE),VLOOKUP($B$40, MEM_A2, 6, FALSE))","v":""},{"$f":"IF($B$30=\"No Additional Processor\",VLOOKUP($B$40, MEM_A1, 7, FALSE),VLOOKUP($B$40, MEM_A2, 7, FALSE))","v":""}]
[]
[null,{"$f":"IF($B$30=\"No Additional Processor\",VLOOKUP($B$40, MEM_A1, 11, FALSE),VLOOKUP($B$40, MEM_A2, 11, FALSE))","v":""},{"$f":"IF($B$30=\"No Additional Processor\",VLOOKUP($B$40, MEM_A1, 12, FALSE),VLOOKUP($B$40, MEM_A2, 12, FALSE))","v":""},{"$f":"IF($B$30=\"No Additional Processor\",VLOOKUP($B$40, MEM_A1, 13, FALSE),VLOOKUP($B$40, MEM_A2, 13, FALSE))","v":""},{"$f":"IF($B$30=\"No Additional Processor\",VLOOKUP($B$40, MEM_A1, 15, FALSE),VLOOKUP($B$40, MEM_A2, 15, FALSE))","v":""},{"$f":"IF($B$30=\"No Additional Processor\",VLOOKUP($B$40, MEM_A1, 16, FALSE),VLOOKUP($B$40, MEM_A2, 16, FALSE))","v":""}]
[]
[null,"Sistema operativo preinstallato"]
[null,"No Operating System",{"$f":"VLOOKUP($B$53, OS_A, 2, FALSE)","v":""},{"$f":"VLOOKUP($B$53, OS_A, 3, FALSE)","v":""},{"$f":"VLOOKUP($B$53, OS_A, 5, FALSE)","v":"[611-BBBF]"},{"$f":"VLOOKUP($B$53, OS_A, 6, FALSE)","v":""}]
[null,{"$f":"IF($B$34=\"No Additional Processor\",VLOOKUP($B$53, OS_A, 20, FALSE),VLOOKUP($B$53, OS_A2, 20, FALSE))","v":""},{"$f":"IF($B$34=\"No Additional Processor\",VLOOKUP($B$53, OS_A, 21, FALSE),VLOOKUP($B$53, OS_A2, 21, FALSE))","v":0},{"$f":"IF($B$34=\"No Additional Processor\",VLOOKUP($B$53, OS_A, 22, FALSE),VLOOKUP($B$53, OS_A2, 22, FALSE))","v":""},{"$f":"IF($B$34=\"No Additional Processor\",VLOOKUP($B$53, OS_A, 24, FALSE),VLOOKUP($B$53, OS_A2, 24, FALSE))","v":""},{"$f":"IF($B$34=\"No Additional Processor\",VLOOKUP($B$53, OS_A, 25, FALSE),VLOOKUP($B$53, OS_A2, 25, FALSE))","v":0}]
[]
[null,"OS Media Kits"]
[null,"No Media Required",1,null,"[605-BBFN]"]
[]
[null,"Client Access Licenses"]
[null,{"$f":"VLOOKUP($B$53, OS_A, 8, FALSE)","v":"None"},null,{"$f":"VLOOKUP($B$53, OS_A, 10, FALSE)","v":""},{"$f":"VLOOKUP($B$53, OS_A, 12, FALSE)","v":""},{"$f":"VLOOKUP($B$53, OS_A, 13, FALSE)*C60","v":0}]
[]
[null,{"$f":"VLOOKUP($B$53, OS_A, 14, FALSE)","v":"None"},null,{"$f":"VLOOKUP($B$53, OS_A, 16, FALSE)","v":""},{"$f":"VLOOKUP($B$53, OS_A, 18, FALSE)","v":""},{"$f":"VLOOKUP($B$53, OS_A, 19, FALSE)*C62","v":0}]
[]
[null,"Sistema operativo SUSE Linux Enterprise Server"]
[null,"None\n",{"$f":"VLOOKUP($B$65,SUSE, 2, FALSE)","v":0},{"$f":"VLOOKUP($B$65,SUSE, 3, FALSE)","v":""},{"$f":"VLOOKUP($B$65,SUSE, 5, FALSE)","v":""},null,{"$f":"VLOOKUP($B$65, SUSE, 6, FALSE)*C65","v":0}]
[]
[null,"Sistema operativo VMware"]
[null,"None",{"$f":"VLOOKUP($B$68,VMWARE, 2, FALSE)+C30","v":0},{"$f":"VLOOKUP($B$68,VMWARE, 3, FALSE)","v":""},{"$f":"VLOOKUP($B$68,VMWARE, 5, FALSE)","v":""},null,{"$f":"VLOOKUP($B$68, VMWARE, 6, FALSE)*C68","v":0}]
[]
[null,"VMware vCenter Server Standard"]
[null,"None",{"$f":"VLOOKUP($B$71,VMWARE2, 2, FALSE)","v":0},{"$f":"VLOOKUP($B$71,VMWARE2, 3, FALSE)","v":""},{"$f":"VLOOKUP($B$71,VMWARE2, 5, FALSE)","v":""},null,{"$f":"VLOOKUP($B$71, VMWARE2, 6, FALSE)*C71","v":0}]
[]
[null,"Essentials Plus Kit"]
[null,"None",{"$f":"IF(SRV_A<4,VLOOKUP($B$74,VMWARE1, 2, FALSE),0)","v":0},{"$f":"VLOOKUP($B$74,VMWARE1, 3, FALSE)","v":""},{"$f":"VLOOKUP($B$74,VMWARE1, 5, FALSE)","v":""},null,{"$f":"VLOOKUP($B$74, VMWARE1, 6, FALSE)*C74","v":0}]
[]
[null,"Controller RAID"]
[null,"PERC H730P Adapter RAID Controller, 2GB NV Cache",1,null,"[405-AACU]"]
[]
[null,"Dischi rigidi"]
[null,"300GB 10K RPM SAS 12Gbps 2.5in Hot-plug Hard Drive",2,null,"[400-AJPK]"]
[]
[null,"300GB 10K RPM SAS 12Gbps 2.5in Hot-plug Hard Drive,CusKit",null,{"$f":"VLOOKUP($B$82, HDD_C,3, FALSE)","v":"TS1L1-HD300"},{"$f":"VLOOKUP($B$82, HDD_C,5, FALSE)","v":"400-AJOQ"},{"$f":"VLOOKUP($B$82, HDD_C,6, FALSE)*C82","v":0}]
[]
[null,"1.2TB 10K RPM SAS 12Gbps 2.5in Hot-plug Hard Drive,CusKit",null,{"$f":"VLOOKUP($B$84, HDD_C,3, FALSE)","v":"TS1L1-HD1200"},{"$f":"VLOOKUP($B$84, HDD_C,5, FALSE)","v":"400-AJPD"},{"$f":"VLOOKUP($B$84, HDD_C,6, FALSE)*C84","v":0}]
[]
[null,"1.8TB 10K RPM SAS 12Gbps 512e 2.5in Hot-plug Hard Drive,CusKit",null,"TS1L1-HD1800","[400-AJQP]",null,{"$f":"VLOOKUP($B$86, HDD_B,6, FALSE)*C86","v":0}]
[]
[null,"960GB Solid State Drive SAS Mix Use MLC 2.5in Hot-plug Drive, PX04SV, Cus Kit",null,"TS1L1-SSD800","[400-ANNX]",null,{"$f":"VLOOKUP($B$88, HDD_B,6, FALSE)*C88","v":0}]
[]
[null,"1.92TB Solid State Drive SAS Mix Use MLC 2.5in Hot-plug Drive, PX04SV, Cus Kit",null,"TS1L1-SSD1920","[400-ANMN]",null,{"$f":"VLOOKUP($B$90, HDD_B,6, FALSE)*C90","v":0}]
[]
[null,"DISCHI TOTALI",{"$f":"SUM(C80:C91)","v":2},{"$f":"IF(C92<=16,\"      OK\",\"     ERRORE:   Totale n° di dischi superiore al consentito\")","v":"      OK"}]
[]
[null,"Configurazione RAID"]
[null,"C3 - RAID 1 for H330 (2 HDDs)",1,null,{"$f":"VLOOKUP($B$95,  RAID_C1, 2, FALSE)","v":"[780-BBJK]"}]
[null,"Hot Spare for 300GB HDD","No"]
[null,"SCRIVERE QUI' LA CONFIGURAZIONE RAID RICHIESTA.\nT630 2\n",null,null,null,null,null,{"$f":"IF(B97=\"SCRIVERE QUI' LA CONFIGURAZIONE RAID RICHIESTA.\nT630 2\n\",\"ATTENZIONE COMPILARE IL CAMPO DELLA SCELTA RAID\", \"\")","v":"ATTENZIONE COMPILARE IL CAMPO DELLA SCELTA RAID"}]
[null,"Configurazione RAID HDD 1TB"]
[null,"",1,null,{"$f":"VLOOKUP($B$99,  RAID_C2, 2, FALSE)","v":""}]
[null,"Hot Spare for 1TB HDD","No"]
[]
[null,"Impostazioni del BIOS per la gestione dell'alimentazione"]
[null,"Performance BIOS Setting",1,null,"[384-BBBL]"]
[]
[null,"Raffreddamento"]
[null,"Fresh Air Cooling",1,null,"[384-BBDW]"]
[]
[null,"Alimentatore"]
[null,"Dual, Hot-plug, Redundant Power Supply (1+1), 750W, Titanium, 200-240VAC",1,null,"[450-ADWT]"]
[]
[null,"Cavi di alimentazione"]
[null,"C13 to C14, PDU Style, 10 AMP, 6.5 Feet (2m), Power Cord",2,null,"[450-AADY]"]
[]
[null,"TPM Module"]
[null,"PowerEdge Server FIPS TPM 2.0",1,null,"[461-AADM]"]
[]
[null,"Embedded Systems Management"]
[null,"iDrac8, Enterprise",1,null,"[385-BBHO]"]
[]
[null,"Modulo Doppia SD"]
[null,"None ",{"$f":"VLOOKUP($B$121,upsell_1, 2, FALSE)","v":0},{"$f":"VLOOKUP($B$121,upsell_1, 3, FALSE)","v":""},{"$f":"VLOOKUP($B$121,upsell_1, 4, FALSE)","v":""},{"$f":"VLOOKUP($B$121,upsell_1, 6, FALSE)","v":""},{"$f":"VLOOKUP($B$121,upsell_1, 7, FALSE)","v":0}]
[]
[null,"Adattatore di rete aggiuntivo"]
[null,"On-Board LOM 1GBE (Dual Port for Towers, Quad Port for Racks and Blades)",1,null,"[542-BBBP]"]
[]
[null,"Broadcom 5720 DP 1Gb Network Interface Card",1,null,"[540-BBCX]"]
[]
[null,"Additional Card for PCIe Slot 2 (CPU 1)"]
[null,"None",{"$f":"VLOOKUP($B$129,  PCI_C1, 2, FALSE)","v":""},{"$f":"VLOOKUP($B$129,  PCI_C1, 3, FALSE)","v":""},{"$f":"VLOOKUP($B$129,  PCI_C1, 5, FALSE)","v":""},{"$f":"VLOOKUP($B$129,  PCI_C1, 6, FALSE)","v":""},{"$f":"VLOOKUP($B$129,  PCI_C1, 7, FALSE)","v":0}]
[]
[null,"Additional Card for PCIe Slot 3 (CPU 1)"]
[null,"None",{"$f":"VLOOKUP($B$132,  PCI_C2, 2, FALSE)","v":""},{"$f":"VLOOKUP($B$132,  PCI_C2, 3, FALSE)","v":""},{"$f":"VLOOKUP($B$132,  PCI_C2, 5, FALSE)","v":""},{"$f":"VLOOKUP($B$132,  PCI_C2, 6, FALSE)","v":""},{"$f":"VLOOKUP($B$132,  PCI_C2, 7, FALSE)","v":0}]
[]
[null,"Additional Card for PCIe Slot 4 (CPU 2)"]
[null,"None",{"$f":"IF(B135=\"Aggiungere Secondo Processore\",\"\",(VLOOKUP(B135,PCI_C3, 2, FALSE)))","v":""},{"$f":"IF(B135=\"Aggiungere Secondo Processore\",\"\",(VLOOKUP(B135,  PCI_C3, 3, FALSE)))","v":""},{"$f":"VLOOKUP($B$135,  PCI_C3, 5, FALSE)","v":""},{"$f":"VLOOKUP($B$135,  PCI_C3, 6, FALSE)","v":""},{"$f":"VLOOKUP($B$135,  PCI_C3, 7, FALSE)","v":0}]
[]
[null,"Additional Card for PCIe Slot 5 (CPU 2)"]
[null,"None",{"$f":"IF(B138=\"Aggiungere Secondo Processore\",\"\",(VLOOKUP(B138,PCI_C4, 2, FALSE)))","v":""},{"$f":"IF(B138=\"Aggiungere Secondo Processore\",\"\",(VLOOKUP(B138,  PCI_C4, 3, FALSE)))","v":""},{"$f":"VLOOKUP($B$138,  PCI_C4, 5, FALSE)","v":""},{"$f":"VLOOKUP($B$138,  PCI_C4, 6, FALSE)","v":""},{"$f":"VLOOKUP($B$138,  PCI_C4, 7, FALSE)","v":0}]
[]
[null,"Additional Card for PCIe Slot 6 (CPU 2)"]
[null,"None",{"$f":"IF(B141=\"Aggiungere Secondo Processore\",\"\",(VLOOKUP(B141,PCI_C4, 2, FALSE)))","v":""},{"$f":"IF(B141=\"Aggiungere Secondo Processore\",\"\",(VLOOKUP(B141,  PCI_C4, 3, FALSE)))","v":""},{"$f":"VLOOKUP($B$141,  PCI_C5, 5, FALSE)","v":""},{"$f":"VLOOKUP($B$141,  PCI_C5, 6, FALSE)","v":""},{"$f":"VLOOKUP($B$141,  PCI_C4, 7, FALSE)","v":0}]
[]
[null,"Additional Card for PCIe Slot 7 (CPU 2)"]
[null,"None",{"$f":"IF(B144=\"Aggiungere Secondo Processore\",\"\",(VLOOKUP(B144,PCI_C4, 2, FALSE)))","v":""},{"$f":"IF(B144=\"Aggiungere Secondo Processore\",\"\",(VLOOKUP(B144,  PCI_C4, 3, FALSE)))","v":""},{"$f":"VLOOKUP($B$144,  PCI_C6, 5, FALSE)","v":""},{"$f":"VLOOKUP($B$144,  PCI_C6, 6, FALSE)","v":""},{"$f":"VLOOKUP($B$144,  PCI_C6, 7, FALSE)","v":0}]
[]
[null,"Pannello frontale"]
[null,"No Bezel",1,null,"[350-BBBW]"]
[]
[null,"Guide per rack"]
[null,"Ready Rails Sliding Rails",1,null,"[770-BBJI]"]
[]
[null,"Unità ottica interna"]
[null,"No Internal Optical Drive, 2.5in Chassis",1,null,"[429-AAIQ][429-AAQS]"]
[]
[null,"Accessori per server"]
[null,"Redundant Fan Option",1,null,"[750-AAFF]"]
[]
[null,"PowerEdge SFP+, 10GbE SR/SX, Optical Tranceiver, LC Connector, for Intel and Broadcom,CusKit",{"$f":"(VLOOKUP(B132,PCI_C2,8,FALSE))+((VLOOKUP(B129,PCI_C1,8,FALSE)))+((VLOOKUP(B135,PCI_C3,8,FALSE)))+((VLOOKUP(B138,PCI_C4,8,FALSE)))+((VLOOKUP(B141,PCI_C5,8,FALSE)))+((VLOOKUP(B144,PCI_C6,8,FALSE)))","v":{"$error":"#VALUE!"}},null,"[407-BBQE]"]
[]
[null,"System Documentation"]
[null,"Electronic System Documentation and OpenManage DVD Kit, PowerEdge T630",1,null,"[343-BBDE]"]
[]
[null,"SHIPPING"]
[null,"PowerEdge T630 Shipping EMEA1 (English/French/German/Spanish/Russian/Hebrew)",1,null,"[340-AMBT]"]
[]
[null,"Order Information"]
[null,"Enterprise Order - EMEA",1,null,"[800-11671]"]
[]
[null,"Base warranty"]
[null,"3Yr Basic Warranty - Next Business Day - Minimum Warranty",1,null,"[709-12798][709-12799]"]
[]
[null,"Servizi di assitenza"]
[null,"Dell Channel Order - Service Info only",1,null,"[710-31085]"]
[]
[null,"Aggiornamenti della garanzia"]
[null,"None",{"$f":"VLOOKUP($B$176,  SO_C1, 2, FALSE)","v":""},{"$f":"VLOOKUP($B$176,  SO_C1, 3, FALSE)","v":""},{"$f":"VLOOKUP($B$176,  SO_C1, 5, FALSE)","v":""},{"$f":"VLOOKUP($B$176,  SO_C1, 6, FALSE)","v":""}]
[]
[null,"Protezione dei dati - Keep Your Hard Drive "]
[null,"None",{"$f":"VLOOKUP($B$179,  SO_C2, 2, FALSE)","v":""},{"$f":"VLOOKUP($B$179,  SO_C2, 3, FALSE)","v":""},{"$f":"VLOOKUP($B$179,  SO_C2,5, FALSE)","v":""},{"$f":"VLOOKUP($B$179,  SO_C2, 6, FALSE)","v":""}]
[]
[null,"Servizi di Installazione"]
[null,"No Installation Service Selected",1,null,"[683-11870]"]
[]
[null,"Channel only - Support Extension"]
[null,"Channel 39M Basic Warranty - Next Business Day",1,null,"[723-28783]"]
[]
[null,"Warranty Upgrades - Non-Std/Local POS"]
[null,"CSTM CONSIP - 39M Onsite Labor Support for CRU for Servers with Basic Warranty",1,null,"[681-24467]"]

{"sheet":"Lotto1 T630R 3","index":12,"n_rows":188,"n_cols":9,"rows_kept":188,"cut":false,"hidden":false,"merged":[[96,7,97,8],[19,2,19,4],[4,0,4,4],[10,0,10,4],[11,0,12,5],[13,0,13,5],[40,1,40,4],[21,1,21,4],[22,2,22,4],[24,1,24,4],[25,2,25,4],[27,1,27,4],[28,2,28,4],[30,1,30,4],[31,2,31,4],[34,1,34,4],[35,2,35,4],[37,1,37,4],[75,2,75,4],[41,2,41,4],[43,1,43,4],[44,2,44,4],[50,1,50,4],[51,2,51,4],[54,1,54,4],[55,2,55,4],[57,1,57,4],[58,2,58,4],[60,1,60,4],[62,1,62,4],[65,1,65,4],[74,1,74,4],[77,1,77,4],[78,2,78,4],[92,1,92,4],[93,2,93,4],[96,1,96,3],[115,1,115,4],[97,2,97,4],[100,1,100,4],[101,2,101,4],[103,1,103,4],[104,2,104,4],[106,1,106,4],[107,2,107,4],[109,1,109,4],[110,2,110,4],[112,1,112,4],[138,1,138,4],[116,2,116,4],[118,1,118,4],[122,2,122,4],[126,1,126,4],[127,2,127,4],[129,1,129,4],[130,2,130,4],[132,1,132,4],[133,2,133,4],[135,1,135,4],[136,2,136,4],[119,2,119,4],[121,1,121,4],[158,1,158,4],[139,2,139,4],[141,1,141,4],[142,2,142,4],[144,1,144,4],[145,2,145,4],[147,1,147,4],[148,2,148,4],[150,1,150,4],[151,2,151,4],[153,1,153,4],[154,2,154,4],[176,1,176,4],[159,2,159,4],[161,1,161,4],[162,2,162,4],[164,1,164,4],[165,2,165,4],[167,1,167,4],[168,2,168,4],[170,1,170,4],[171,2,171,4],[173,1,173,4],[174,2,174,4],[186,2,186,4],[188,1,188,4],[177,2,177,4],[179,1,179,4],[180,2,180,4],[182,1,182,4],[183,2,183,4],[185,1,185,4]]}
["IN ROSSO LE OPZIONI 20%"]
[]
[]
[]
["Tecnologie Server 1 Lotto 1"]
[]
[null,null,null,null,null,null,null,"Totale Server e Opzioni",{"$f":"F18*SRV_CCC","v":0}]
[null,null,null,null,null,null,null,"Totale Ulteriori Opzioni ",{"$f":"G17*SRV_CCC-(G74*SRV_CCC)+G74-(SRV_CCC*G71)+G71","v":0}]
[]
[null,null,null,null,null,null,null,"TOTALE CONVENZIONE",{"$f":"I8+I7","v":0}]
[null,null,null,null,null,{"$f":"F18*C17","v":0}]
["Components: \nServer DELL PowerEdge T630 (1CPU Intel® Xeon® E5-2640 v4, 32GB RDIMM, 2xHDD 300GB 10K RPM SAS 12Gbps 2.5in)"]
[]
[]
[]
["PowerEdge T630","Category: Server",null,null,null,{"$f":"1720","v":1720}]
[null,"Quantity: ",null,null,null,{"$f":"SUM(F21:F189)","v":0}]
[null,null,null,null,null,{"$f":"SUM(F16:F17)","v":1720}]
[]
[null,"Base"]
[null,"PowerEdge T630 for Intel v4 CPUs",1,null,"[210-ACWJ][329-BCZH]"]
[]
[null,"Configurazione dello chassis"]
[null,"Chassis with up to 16, 2.5\" Hard Drives, Rack Configuration",1,null,"[321-BBJW]"]
[]
[null,"Processore"]
[null,"Intel Xeon E5-2640 v4 2.4GHz 25M Cache 8.0GT/s QPI Turbo HT 10C/20T (90W) Max Mem 2133MHz",1,null,"[338-BJDL]"]
[]
[null,"Processore aggiuntivo"]
[null,"No Additional Processor",{"$f":"VLOOKUP($B$30, CPU_C, 2, FALSE)","v":0},{"$f":"VLOOKUP($B$30, CPU_C, 3, FALSE)","v":""},{"$f":"VLOOKUP($B$30, CPU_C, 5, FALSE)","v":"[374-BBBX]"},{"$f":"VLOOKUP(B30, CPU_C, 12, FALSE)","v":0}]
[]
[null,"Processor Thermal Configuration"]
[null,"1 CPU up to 105W",1,null,"[412-AADW]"]
[null,{"$f":"VLOOKUP($B$30, CPU_C, 6, FALSE)","v":""},{"$f":"VLOOKUP($B$30, CPU_C, 7, FALSE)","v":""},null,{"$f":"VLOOKUP($B$30, CPU_C, 8, FALSE)","v":""}]
[]
[null,"Tipo di configurazione memoria"]
[null,"Performance Optimized",1,null,"[370-AAIP]"]
[]
[null,"Total Memory in GB",{"$f":"IF(F30=728,IF(B40=32,\"ATTENZIONE: AUMENTARE LA RAM\",\"\"),\"\")","v":""}]
[null,32]
[]
[null,"Tipo e velocità della memoria DIMM"]
[null,"2400MT/s RDIMMs",1,null,"[370-ACPH]"]
[]
[null,"Capacità di memoria"]
[null,"32GB RDIMM, 2400MT/s, Dual Rank, x4 Data Width",1,null,"[370-ACNS]"]
[]
[null,{"$f":"IF($B$30=\"No Additional Processor\",VLOOKUP($B$40, MEM_A1, 2, FALSE),VLOOKUP($B$40, MEM_A2, 2, FALSE))","v":""},{"$f":"IF($B$30=\"No Additional Processor\",VLOOKUP($B$40, MEM_A1, 3, FALSE),VLOOKUP($B$40, MEM_A2, 3, FALSE))","v":""},{"$f":"IF($B$30=\"No Additional Processor\",VLOOKUP($B$40, MEM_A1, 4, FALSE),VLOOKUP($B$40, MEM_A2, 4, FALSE))","v":""},{"$f":"IF($B$30=\"No Additional Processor\",VLOOKUP($B$40, MEM_A1, 6, FALSE),VLOOKUP($B$40, MEM_A2, 6, FALSE))","v":""},{"$f":"IF($B$30=\"No Additional Processor\",VLOOKUP($B$40, MEM_A1, 7, FALSE),VLOOKUP($B$40, MEM_A2, 7, FALSE))","v":""}]
[]
[null,{"$f":"IF($B$30=\"No Additional Processor\",VLOOKUP($B$40, MEM_A1, 11, FALSE),VLOOKUP($B$40, MEM_A2, 11, FALSE))","v":""},{"$f":"IF($B$30=\"No Additional Processor\",VLOOKUP($B$40, MEM_A1, 12, FALSE),VLOOKUP($B$40, MEM_A2, 12, FALSE))","v":""},{"$f":"IF($B$30=\"No Additional Processor\",VLOOKUP($B$40, MEM_A1, 13, FALSE),VLOOKUP($B$40, MEM_A2, 13, FALSE))","v":""},{"$f":"IF($B$30=\"No Additional Processor\",VLOOKUP($B$40, MEM_A1, 15, FALSE),VLOOKUP($B$40, MEM_A2, 15, FALSE))","v":""},{"$f":"IF($B$30=\"No Additional Processor\",VLOOKUP($B$40, MEM_A1, 16, FALSE),VLOOKUP($B$40, MEM_A2, 16, FALSE))","v":""}]
[]
[null,"Sistema operativo preinstallato"]
[null,"No Operating System",{"$f":"VLOOKUP($B$53, OS_A, 2, FALSE)","v":""},{"$f":"VLOOKUP($B$53, OS_A, 3, FALSE)","v":""},{"$f":"VLOOKUP($B$53, OS_A, 5, FALSE)","v":"[611-BBBF]"},{"$f":"VLOOKUP($B$53, OS_A, 6, FALSE)","v":""}]
[null,{"$f":"IF($B$34=\"No Additional Processor\",VLOOKUP($B$53, OS_A, 20, FALSE),VLOOKUP($B$53, OS_A2, 20, FALSE))","v":""},{"$f":"IF($B$34=\"No Additional Processor\",VLOOKUP($B$53, OS_A, 21, FALSE),VLOOKUP($B$53, OS_A2, 21, FALSE))","v":0},{"$f":"IF($B$34=\"No Additional Processor\",VLOOKUP($B$53, OS_A, 22, FALSE),VLOOKUP($B$53, OS_A2, 22, FALSE))","v":""},{"$f":"IF($B$34=\"No Additional Processor\",VLOOKUP($B$53, OS_A, 24, FALSE),VLOOKUP($B$53, OS_A2, 24, FALSE))","v":""},{"$f":"IF($B$34=\"No Additional Processor\",VLOOKUP($B$53, OS_A, 25, FALSE),VLOOKUP($B$53, OS_A2, 25, FALSE))","v":0}]
[]
[null,"OS Media Kits"]
[null,"No Media Required",1,null,"[605-BBFN]"]
[]
[null,"Client Access Licenses"]
[null,{"$f":"VLOOKUP($B$53, OS_A, 8, FALSE)","v":"None"},null,{"$f":"VLOOKUP($B$53, OS_A, 10, FALSE)","v":""},{"$f":"VLOOKUP($B$53, OS_A, 12, FALSE)","v":""},{"$f":"VLOOKUP($B$53, OS_A, 13, FALSE)*C60","v":0}]
[]
[null,{"$f":"VLOOKUP($B$53, OS_A, 14, FALSE)","v":"None"},null,{"$f":"VLOOKUP($B$53, OS_A, 16, FALSE)","v":""},{"$f":"VLOOKUP($B$53, OS_A, 18, FALSE)","v":""},{"$f":"VLOOKUP($B$53, OS_A, 19, FALSE)*C62","v":0}]
[]
[null,"Sistema operativo SUSE Linux Enterprise Server"]
[null,"None\n",{"$f":"VLOOKUP($B$65,SUSE, 2, FALSE)","v":0},{"$f":"VLOOKUP($B$65,SUSE, 3, FALSE)","v":""},{"$f":"VLOOKUP($B$65,SUSE, 5, FALSE)","v":""},null,{"$f":"VLOOKUP($B$65, SUSE, 6, FALSE)*C65","v":0}]
[]
[null,"Sistema operativo VMware"]
[null,"None",{"$f":"VLOOKUP($B$68,VMWARE, 2, FALSE)+C30","v":0},{"$f":"VLOOKUP($B$68,VMWARE, 3, FALSE)","v":""},{"$f":"VLOOKUP($B$68,VMWARE, 5, FALSE)","v":""},null,{"$f":"VLOOKUP($B$68, VMWARE, 6, FALSE)*C68","v":0}]
[]
[null,"VMware vCenter Server Standard"]
[null,"None",{"$f":"VLOOKUP($B$71,VMWARE2, 2, FALSE)","v":0},{"$f":"VLOOKUP($B$71,VMWARE2, 3, FALSE)","v":""},{"$f":"VLOOKUP($B$71,VMWARE2, 5, FALSE)","v":""},null,{"$f":"VLOOKUP($B$71, VMWARE2, 6, FALSE)*C71","v":0}]
[]
[null,"Essentials Plus Kit"]
[null,"None",{"$f":"IF(SRV_A<4,VLOOKUP($B$74,VMWARE1, 2, FALSE),0)","v":0},{"$f":"VLOOKUP($B$74,VMWARE1, 3, FALSE)","v":""},{"$f":"VLOOKUP($B$74,VMWARE1, 5, FALSE)","v":""},null,{"$f":"VLOOKUP($B$74, VMWARE1, 6, FALSE)*C74","v":0}]
[]
[null,"Controller RAID"]
[null,"PERC H730P Adapter RAID Controller, 2GB NV Cache",1,null,"[405-AACU]"]
[]
[null,"Dischi rigidi"]
[null,"300GB 10K RPM SAS 12Gbps 2.5in Hot-plug Hard Drive",2,null,"[400-AJPK]"]
[]
[null,"300GB 10K RPM SAS 12Gbps 2.5in Hot-plug Hard Drive,CusKit",null,{"$f":"VLOOKUP($B$82, HDD_C,3, FALSE)","v":"TS1L1-HD300"},{"$f":"VLOOKUP($B$82, HDD_C,5, FALSE)","v":"400-AJOQ"},{"$f":"VLOOKUP($B$82, HDD_C,6, FALSE)*C82","v":0}]
[]
[null,"1.2TB 10K RPM SAS 12Gbps 2.5in Hot-plug Hard Drive,CusKit",null,{"$f":"VLOOKUP($B$84, HDD_C,3, FALSE)","v":"TS1L1-HD1200"},{"$f":"VLOOKUP($B$84, HDD_C,5, FALSE)","v":"400-AJPD"},{"$f":"VLOOKUP($B$84, HDD_C,6, FALSE)*C84","v":0}]
[]
[null,"1.8TB 10K RPM SAS 12Gbps 512e 2.5in Hot-plug Hard Drive,CusKit",null,"TS1L1-HD1800","[400-AJQP]",null,{"$f":"VLOOKUP($B$86, HDD_B,6, FALSE)*C86","v":0}]
[]
[null,"960GB Solid State Drive SAS Mix Use MLC 2.5in Hot-plug Drive, PX04SV, Cus Kit",null,"TS1L1-SSD800","[400-ANNX]",null,{"$f":"VLOOKUP($B$88, HDD_B,6, FALSE)*C88","v":0}]
[]
[null,"1.92TB Solid State Drive SAS Mix Use MLC 2.5in Hot-plug Drive, PX04SV, Cus Kit",null,"TS1L1-SSD1920","[400-ANMN]",null,{"$f":"VLOOKUP($B$90, HDD_B,6, FALSE)*C90","v":0}]
[]
[null,"DISCHI TOTALI",{"$f":"SUM(C80:C91)","v":2},{"$f":"IF(C92<=16,\"      OK\",\"     ERRORE:   Totale n° di dischi superiore al consentito\")","v":"      OK"}]
[]
[null,"Configurazione RAID"]
[null,"C3 - RAID 1 for H330 (2 HDDs)",1,null,{"$f":"VLOOKUP($B$95,  RAID_C1, 2, FALSE)","v":"[780-BBJK]"}]
[null,"Hot Spare for 300GB HDD","No"]
[null,"SCRIVERE QUI' LA CONFIGURAZIONE RAID RICHIESTA.\nT630 3\n",null,null,null,null,null,{"$f":"IF(B97=\"SCRIVERE QUI' LA CONFIGURAZIONE RAID RICHIESTA.\nT630 3\n\",\"ATTENZIONE COMPILARE IL CAMPO DELLA SCELTA RAID\", \"\")","v":"ATTENZIONE COMPILARE IL CAMPO DELLA SCELTA RAID"}]
[null,"Configurazione RAID HDD 1TB"]
[null,"",1,null,{"$f":"VLOOKUP($B$99,  RAID_C2, 2, FALSE)","v":""}]
[null,"Hot Spare for 1TB HDD","No"]
[]
[null,"Impostazioni del BIOS per la gestione dell'alimentazione"]
[null,"Performance BIOS Setting",1,null,"[384-BBBL]"]
[]
[null,"Raffreddamento"]
[null,"Fresh Air Cooling",1,null,"[384-BBDW]"]
[]
[null,"Alimentatore"]
[null,"Dual, Hot-plug, Redundant Power Supply (1+1), 750W, Titanium, 200-240VAC",1,null,"[450-ADWT]"]
[]
[null,"Cavi di alimentazione"]
[null,"C13 to C14, PDU Style, 10 AMP, 6.5 Feet (2m), Power Cord",2,null,"[450-AADY]"]
[]
[null,"TPM Module"]
[null,"PowerEdge Server FIPS TPM 2.0",1,null,"[461-AADM]"]
[]
[null,"Embedded Systems Management"]
[null,"iDrac8, Enterprise",1,null,"[385-BBHO]"]
[]
[null,"Modulo Doppia SD"]
[null,"None ",{"$f":"VLOOKUP($B$121,upsell_1, 2, FALSE)","v":0},{"$f":"VLOOKUP($B$121,upsell_1, 3, FALSE)","v":""},{"$f":"VLOOKUP($B$121,upsell_1, 4, FALSE)","v":""},{"$f":"VLOOKUP($B$121,upsell_1, 6, FALSE)","v":""},{"$f":"VLOOKUP($B$121,upsell_1, 7, FALSE)","v":0}]
[]
[null,"Adattatore di rete aggiuntivo"]
[null,"On-Board LOM 1GBE (Dual Port for Towers, Quad Port for Racks and Blades)",1,null,"[542-BBBP]"]
[]
[null,"Broadcom 5720 DP 1Gb Network Interface Card",1,null,"[540-BBCX]"]
[]
[null,"Additional Card for PCIe Slot 2 (CPU 1)"]
[null,"None",{"$f":"VLOOKUP($B$129,  PCI_C1, 2, FALSE)","v":""},{"$f":"VLOOKUP($B$129,  PCI_C1, 3, FALSE)","v":""},{"$f":"VLOOKUP($B$129,  PCI_C1, 5, FALSE)","v":""},{"$f":"VLOOKUP($B$129,  PCI_C1, 6, FALSE)","v":""},{"$f":"VLOOKUP($B$129,  PCI_C1, 7, FALSE)","v":0}]
[]
[null,"Additional Card for PCIe Slot 3 (CPU 1)"]
[null,"None",{"$f":"VLOOKUP($B$132,  PCI_C2, 2, FALSE)","v":""},{"$f":"VLOOKUP($B$132,  PCI_C2, 3, FALSE)","v":""},{"$f":"VLOOKUP($B$132,  PCI_C2, 5, FALSE)","v":""},{"$f":"VLOOKUP($B$132,  PCI_C2, 6, FALSE)","v":""},{"$f":"VLOOKUP($B$132,  PCI_C2, 7, FALSE)","v":0}]
[]
[null,"Additional Card for PCIe Slot 4 (CPU 2)"]
[null,"None",{"$f":"IF(B135=\"Aggiungere Secondo Processore\",\"\",(VLOOKUP(B135,PCI_C3, 2, FALSE)))","v":""},{"$f":"IF(B135=\"Aggiungere Secondo Processore\",\"\",(VLOOKUP(B135,  PCI_C3, 3, FALSE)))","v":""},{"$f":"VLOOKUP($B$135,  PCI_C3, 5, FALSE)","v":""},{"$f":"VLOOKUP($B$135,  PCI_C3, 6, FALSE)","v":""},{"$f":"VLOOKUP($B$135,  PCI_C3, 7, FALSE)","v":0}]
[]
[null,"Additional Card for PCIe Slot 5 (CPU 2)"]
[null,"None",{"$f":"IF(B138=\"Aggiungere Secondo Processore\",\"\",(VLOOKUP(B138,PCI_C4, 2, FALSE)))","v":""},{"$f":"IF(B138=\"Aggiungere Secondo Processore\",\"\",(VLOOKUP(B138,  PCI_C4, 3, FALSE)))","v":""},{"$f":"VLOOKUP($B$138,  PCI_C4, 5, FALSE)","v":""},{"$f":"VLOOKUP($B$138,  PCI_C4, 6, FALSE)","v":""},{"$f":"VLOOKUP($B$138,  PCI_C4, 7, FALSE)","v":0}]
[]
[null,"Additional Card for PCIe Slot 6 (CPU 2)"]
[null,"None",{"$f":"IF(B141=\"Aggiungere Secondo Processore\",\"\",(VLOOKUP(B141,PCI_C4, 2, FALSE)))","v":""},{"$f":"IF(B141=\"Aggiungere Secondo Processore\",\"\",(VLOOKUP(B141,  PCI_C4, 3, FALSE)))","v":""},{"$f":"VLOOKUP($B$141,  PCI_C5, 5, FALSE)","v":""},{"$f":"VLOOKUP($B$141,  PCI_C5, 6, FALSE)","v":""},{"$f":"VLOOKUP($B$141,  PCI_C4, 7, FALSE)","v":0}]
[]
[null,"Additional Card for PCIe Slot 7 (CPU 2)"]
[null,"None",{"$f":"IF(B144=\"Aggiungere Secondo Processore\",\"\",(VLOOKUP(B144,PCI_C4, 2, FALSE)))","v":""},{"$f":"IF(B144=\"Aggiungere Secondo Processore\",\"\",(VLOOKUP(B144,  PCI_C4, 3, FALSE)))","v":""},{"$f":"VLOOKUP($B$144,  PCI_C6, 5, FALSE)","v":""},{"$f":"VLOOKUP($B$144,  PCI_C6, 6, FALSE)","v":""},{"$f":"VLOOKUP($B$144,  PCI_C6, 7, FALSE)","v":0}]
[]
[null,"Pannello frontale"]
[null,"No Bezel",1,null,"[350-BBBW]"]
[]
[null,"Guide per rack"]
[null,"Ready Rails Sliding Rails",1,null,"[770-BBJI]"]
[]
[null,"Unità ottica interna"]
[null,"No Internal Optical Drive, 2.5in Chassis",1,null,"[429-AAIQ][429-AAQS]"]
[]
[null,"Accessori per server"]
[null,"Redundant Fan Option",1,null,"[750-AAFF]"]
[]
[null,"PowerEdge SFP+, 10GbE SR/SX, Optical Tranceiver, LC Connector, for Intel and Broadcom,CusKit",{"$f":"(VLOOKUP(B132,PCI_C2,8,FALSE))+((VLOOKUP(B129,PCI_C1,8,FALSE)))+((VLOOKUP(B135,PCI_C3,8,FALSE)))+((VLOOKUP(B138,PCI_C4,8,FALSE)))+((VLOOKUP(B141,PCI_C5,8,FALSE)))+((VLOOKUP(B144,PCI_C6,8,FALSE)))","v":{"$error":"#VALUE!"}},null,"[407-BBQE]"]
[]
[null,"System Documentation"]
[null,"Electronic System Documentation and OpenManage DVD Kit, PowerEdge T630",1,null,"[343-BBDE]"]
[]
[null,"SHIPPING"]
[null,"PowerEdge T630 Shipping EMEA1 (English/French/German/Spanish/Russian/Hebrew)",1,null,"[340-AMBT]"]
[]
[null,"Order Information"]
[null,"Enterprise Order - EMEA",1,null,"[800-11671]"]
[]
[null,"Base warranty"]
[null,"3Yr Basic Warranty - Next Business Day - Minimum Warranty",1,null,"[709-12798][709-12799]"]
[]
[null,"Servizi di assitenza"]
[null,"Dell Channel Order - Service Info only",1,null,"[710-31085]"]
[]
[null,"Aggiornamenti della garanzia"]
[null,"None",{"$f":"VLOOKUP($B$176,  SO_C1, 2, FALSE)","v":""},{"$f":"VLOOKUP($B$176,  SO_C1, 3, FALSE)","v":""},{"$f":"VLOOKUP($B$176,  SO_C1, 5, FALSE)","v":""},{"$f":"VLOOKUP($B$176,  SO_C1, 6, FALSE)","v":""}]
[]
[null,"Protezione dei dati - Keep Your Hard Drive "]
[null,"None",{"$f":"VLOOKUP($B$179,  SO_C2, 2, FALSE)","v":""},{"$f":"VLOOKUP($B$179,  SO_C2, 3, FALSE)","v":""},{"$f":"VLOOKUP($B$179,  SO_C2,5, FALSE)","v":""},{"$f":"VLOOKUP($B$179,  SO_C2, 6, FALSE)","v":""}]
[]
[null,"Servizi di Installazione"]
[null,"No Installation Service Selected",1,null,"[683-11870]"]
[]
[null,"Channel only - Support Extension"]
[null,"Channel 39M Basic Warranty - Next Business Day",1,null,"[723-28783]"]
[]
[null,"Warranty Upgrades - Non-Std/Local POS"]
[null,"CSTM CONSIP - 39M Onsite Labor Support for CRU for Servers with Basic Warranty",1,null,"[681-24467]"]

{"sheet":"Lotto1 R730 2","index":13,"n_rows":183,"n_cols":9,"rows_kept":183,"cut":false,"hidden":false,"merged":[[27,2,27,4],[4,0,4,4],[5,0,5,4],[10,0,11,5],[12,0,12,5],[18,2,18,4],[20,1,20,4],[21,2,21,4],[23,1,23,4],[24,2,24,4],[26,1,26,4],[53,1,53,4],[29,1,29,4],[30,2,30,4],[33,1,33,4],[34,2,34,4],[36,1,36,4],[39,1,39,4],[40,2,40,4],[42,1,42,4],[43,2,43,4],[49,1,49,4],[50,2,50,4],[91,1,91,4],[54,2,54,4],[56,1,56,4],[57,2,57,4],[59,1,59,4],[61,1,61,4],[74,2,74,4],[76,1,76,4],[77,2,77,4],[83,1,83,4],[85,1,85,4],[87,1,87,4],[64,1,64,4],[73,1,73,4],[92,2,92,4],[96,2,96,4],[99,1,99,4],[95,1,95,3],[95,7,96,8],[118,2,118,4],[100,2,100,4],[102,1,102,4],[103,2,103,4],[105,1,105,4],[106,2,106,4],[108,1,108,4],[109,2,109,4],[111,1,111,4],[114,1,114,4],[115,2,115,4],[117,1,117,4],[139,2,139,4],[120,1,120,4],[124,2,124,4],[126,1,126,4],[127,2,127,4],[129,1,129,4],[130,2,130,4],[132,1,132,4],[133,2,133,4],[135,1,135,4],[136,2,136,4],[138,1,138,4],[121,2,121,4],[123,1,123,4],[157,2,157,4],[141,1,141,4],[142,2,142,4],[144,1,144,4],[145,2,145,4],[147,1,147,4],[148,2,148,4],[150,1,150,4],[151,2,151,4],[153,1,153,4],[154,2,154,4],[156,1,156,4],[175,2,175,4],[159,1,159,4],[160,2,160,4],[162,1,162,4],[163,2,163,4],[165,1,165,4],[166,2,166,4],[168,1,168,4],[169,2,169,4],[171,1,171,4],[172,2,172,4],[174,1,174,4],[177,1,177,4],[178,2,178,4],[180,1,180,4],[181,2,181,4],[183,1,183,4]]}
["IN ROSSO LE OPZIONI 20%"]
[]
[]
[]
["Tecnologie Server 1 Lotto 1"]
[]
[null,null,null,null,null,null,null,"Totale Server e Opzioni",{"$f":"F17*SRV_B1.2","v":0}]
[null,null,null,null,null,null,null,"Totale Ulteriori Opzioni ",{"$f":"G16*SRV_B1.2-(G73*SRV_B1.2)+G73-(SRV_B1.2*G70)+G70","v":0}]
[]
[null,null,null,null,null,null,null,"TOTALE CONVENZIONE",{"$f":"I8+I7","v":0}]
["Components: \nServer DELL PowerEdge R730 (1CPU Intel® Xeon® E5-2680 v4, 64GB RDIMM, 2xHDD 300GB 10K RPM SAS 12Gbps 2.5in)"]
[]
[]
[]
["PowerEdge R730","Category: Server",null,null,null,{"$f":"2371","v":2371}]
[null,"Quantity: ",null,null,null,{"$f":"SUM(F20:F185)","v":0},{"$f":"SUM(G20:G185)","v":0}]
[null,null,null,null,null,{"$f":"SUM(F15:F16)","v":2371}]
[]
[null,"Base"]
[null,"PowerEdge R730xd for Intel v4 CPUs",1,null,"[210-ACXU][329-BCZK]"]
[]
[null,"Configurazione dello chassis"]
[null,"Chassis with up to 16, 2.5\" Hard Drives",1,null,"[350-BBIL]"]
[]
[null,"Processore"]
[null,"Intel Xeon E5-2680 v4 2.4GHz,35M Cache,9.60GT/s QPI,Turbo,HT,14C/28T (120W) Max Mem 2400MHz",1,null,"[338-BJDO]"]
[]
[null,"Processore aggiuntivo"]
[null,"No Additional Processor",{"$f":"VLOOKUP($B$29, CPU_B.1, 2, FALSE)","v":0},{"$f":"VLOOKUP($B$29, CPU_B.1, 3, FALSE)","v":""},{"$f":"VLOOKUP($B$29, CPU_B.1, 5, FALSE)","v":"[374-BBBX]"},{"$f":"VLOOKUP(B29, CPU_B.1, 12, FALSE)","v":0}]
[]
[null,"Processor Thermal Configuration"]
[null,"1 CPU Standard",1,null,"[370-ABWF][374-BBHM][750-AAEL]"]
[null,{"$f":"VLOOKUP($B$29, CPU_B, 6, FALSE)","v":""},{"$f":"VLOOKUP($B$29, CPU_B, 7, FALSE)","v":""},null,{"$f":"VLOOKUP($B$29, CPU_B, 8, FALSE)","v":""}]
[]
[null,"Tipo di configurazione memoria"]
[null,"Performance Optimized",1,null,"[370-AAIP]"]
[]
[null,"Memoria Totale in GB",null,{"$f":"IF(('Lotto1 R730 2'!$D$12=0),\"\",'Lotto1 R730 2'!#REF!)","v":""}]
[null,64]
[]
[null,"Tipo e velocità della memoria DIMM"]
[null,"2400MT/s RDIMMs",1,null,"[370-ACPH]"]
[]
[null,"Capacità di memoria"]
[null,"32GB RDIMM, 2400MT/s, Dual Rank, x4 Data Width",2,null,"[370-ACNS]"]
[]
[null,{"$f":"IF($B$29=\"No Additional Processor\",VLOOKUP($B$39, MEM_B1, 2, FALSE),VLOOKUP($B$39, MEM_B2, 2, FALSE))","v":""},{"$f":"IF($B$29=\"No Additional Processor\",VLOOKUP($B$39, MEM_B1, 3, FALSE),VLOOKUP($B$39, MEM_B2, 3, FALSE))","v":""},{"$f":"IF($B$29=\"No Additional Processor\",VLOOKUP($B$39, MEM_B1, 4, FALSE),VLOOKUP($B$39, MEM_B2, 4, FALSE))","v":""},{"$f":"IF($B$29=\"No Additional Processor\",VLOOKUP($B$39, MEM_B1, 6, FALSE),VLOOKUP($B$39, MEM_B2, 6, FALSE))","v":""},{"$f":"IF($B$29=\"No Additional Processor\",VLOOKUP($B$39, MEM_B1, 7, FALSE),VLOOKUP($B$39, MEM_B2, 7, FALSE))","v":""}]
[]
[null,{"$f":"IF($B$29=\"No Additional Processor\",VLOOKUP($B$39, MEM_B1, 11, FALSE),VLOOKUP($B$39, MEM_B2, 11, FALSE))","v":""},{"$f":"IF($B$29=\"No Additional Processor\",VLOOKUP($B$39, MEM_B1, 12, FALSE),VLOOKUP($B$39, MEM_B2, 12, FALSE))","v":""},{"$f":"IF($B$29=\"No Additional Processor\",VLOOKUP($B$39, MEM_B1, 13, FALSE),VLOOKUP($B$39, MEM_B2, 13, FALSE))","v":""},{"$f":"IF($B$29=\"No Additional Processor\",VLOOKUP($B$39, MEM_B1, 15, FALSE),VLOOKUP($B$39, MEM_B2, 15, FALSE))","v":""},{"$f":"IF($B$29=\"No Additional Processor\",VLOOKUP($B$39, MEM_B1, 16, FALSE),VLOOKUP($B$39, MEM_B2, 16, FALSE))","v":""}]
[]
[null,"Sistema operativo preinstallato"]
[null,"No Operating System",{"$f":"VLOOKUP($B$52, OS_B, 2, FALSE)","v":""},{"$f":"VLOOKUP($B$52, OS_B, 3, FALSE)","v":""},{"$f":"VLOOKUP($B$52, OS_B, 5, FALSE)","v":"[611-BBBF]"},{"$f":"VLOOKUP($B$52, OS_B, 6, FALSE)","v":""}]
[null,{"$f":"IF($B$29=\"No Additional Processor\",VLOOKUP($B$52, OS_B, 20, FALSE),VLOOKUP($B$52, OS_B2, 20, FALSE))","v":""},{"$f":"IF($B$29=\"No Additional Processor\",VLOOKUP($B$52, OS_B, 21, FALSE),VLOOKUP($B$52, OS_B2, 21, FALSE))","v":0},{"$f":"IF($B$29=\"No Additional Processor\",VLOOKUP($B$52, OS_A, 22, FALSE),VLOOKUP($B$52, OS_B2, 22, FALSE))","v":""},{"$f":"IF($B$29=\"No Additional Processor\",VLOOKUP($B$52, OS_B, 24, FALSE),VLOOKUP($B$52, OS_B2, 24, FALSE))","v":""},{"$f":"IF($B$29=\"No Additional Processor\",VLOOKUP($B$52, OS_B, 25, FALSE),VLOOKUP($B$52, OS_B2, 25, FALSE))","v":""}]
[]
[null,"OS Media Kits"]
[null,"No Media Required",1,null,"[605-BBFN]"]
[]
[null,"Client Access Licenses"]
[null,{"$f":"VLOOKUP($B$52, OS_B, 8, FALSE)","v":"None"},null,{"$f":"VLOOKUP($B$52, OS_A, 10, FALSE)","v":""},{"$f":"VLOOKUP($B$52, OS_A, 12, FALSE)","v":""},{"$f":"VLOOKUP($B$52, OS_A, 13, FALSE)*C59","v":0}]
[]
[null,{"$f":"VLOOKUP($B$52, OS_A, 14, FALSE)","v":"None"},null,{"$f":"VLOOKUP($B$52, OS_A, 16, FALSE)","v":""},{"$f":"VLOOKUP($B$52, OS_A, 18, FALSE)","v":""},{"$f":"VLOOKUP($B$52, OS_A, 19, FALSE)*C61","v":0}]
[]
[null,"Sistema operativo SUSE Linux Enterprise Server"]
[null,"None\n",{"$f":"VLOOKUP($B$64,SUSE, 2, FALSE)","v":0},{"$f":"VLOOKUP($B$64,SUSE, 3, FALSE)","v":""},{"$f":"VLOOKUP($B$64,SUSE, 5, FALSE)","v":""},null,{"$f":"VLOOKUP($B$64, SUSE, 6, FALSE)*C64","v":0}]
[]
[null,"Sistema operativo VMware"]
[null,"None",{"$f":"VLOOKUP($B$67,VMWARE, 2, FALSE)+C29","v":0},{"$f":"VLOOKUP($B$67,VMWARE, 3, FALSE)","v":""},{"$f":"VLOOKUP($B$67,VMWARE, 5, FALSE)","v":""},null,{"$f":"VLOOKUP($B$67, VMWARE, 6, FALSE)*C67","v":0}]
[]
[null,"VMware vCenter Server Standard"]
[null,"None",{"$f":"VLOOKUP($B$70,VMWARE2, 2, FALSE)","v":0},{"$f":"VLOOKUP($B$70,VMWARE2, 3, FALSE)","v":""},{"$f":"VLOOKUP($B$70,VMWARE2, 5, FALSE)","v":""},null,{"$f":"VLOOKUP($B$70, VMWARE2, 6, FALSE)*C70","v":0}]
[]
[null,"Essentials Plus Kit"]
[null,"None",{"$f":"IF(SRV_A<4,VLOOKUP($B$73,VMWARE1, 2, FALSE),0)","v":0},{"$f":"VLOOKUP($B$73,VMWARE1, 3, FALSE)","v":""},{"$f":"VLOOKUP($B$73,VMWARE1, 5, FALSE)","v":""},null,{"$f":"VLOOKUP($B$73, VMWARE1, 6, FALSE)*C73","v":0}]
[]
[null,"Controller"]
[null,"PERC H730P Integrated RAID Controller, 2GB Cache",{"$f":"VLOOKUP($B$76,PERC, 2, FALSE)","v":0},{"$f":"VLOOKUP($B$76,PERC, 3, FALSE)","v":""},{"$f":"VLOOKUP($B$76,PERC, 4, FALSE)","v":""},{"$f":"VLOOKUP($B$76,PERC, 6, FALSE)","v":""},{"$f":"VLOOKUP($B$76,PERC, 7, FALSE)","v":0}]
[]
[null,"Dischi rigidi (numero massimo totale 16)"]
[null,"300GB 10K RPM SAS 12Gbps 2.5in Hot-plug Hard Drive",2,null,"[400-AJPK]"]
[]
[null,"300GB 10K RPM SAS 12Gbps 2.5in Hot-plug Hard Drive,CusKit",null,{"$f":"VLOOKUP($B$81, HDD_A,3, FALSE)","v":"TS1L1-HD300"},{"$f":"VLOOKUP($B$81, HDD_A,5, FALSE)","v":"[400-AJOQ]"},{"$f":"VLOOKUP($B$81, HDD_B,6, FALSE)*C81","v":0}]
[]
[null,"1.2TB 10K RPM SAS 12Gbps 2.5in Hot-plug Hard Drive,CusKit",null,{"$f":"VLOOKUP($B$83, HDD_A,3, FALSE)","v":"TS1L1-HD1200"},{"$f":"VLOOKUP($B$83, HDD_A,5, FALSE)","v":"[400-AJPD]"},{"$f":"VLOOKUP($B$83, HDD_B,6, FALSE)*C83","v":0}]
[]
[null,"1.8TB 10K RPM SAS 12Gbps 512e 2.5in Hot-plug Hard Drive,CusKit",null,"TS1L1-HD1800","[400-AJQP]",{"$f":"VLOOKUP($B$85, HDD_B,6, FALSE)*C85","v":0}]
[]
[null,"960GB Solid State Drive SAS Mix Use MLC 2.5in Hot-plug Drive, PX04SV, Cus Kit",null,"TS1L1-SSD800","[400-ANNX]",{"$f":"VLOOKUP($B$87, HDD_B,6, FALSE)*C87","v":0}]
[]
[null,"1.92TB Solid State Drive SAS Mix Use MLC 2.5in Hot-plug Drive, PX04SV, Cus Kit",null,"TS1L1-SSD1920","[400-ANMN]",{"$f":"VLOOKUP($B$89, HDD_B,6, FALSE)*C89","v":0}]
[]
[null,"DISCHI TOTALI",{"$f":"SUM(C79:C90)","v":2},{"$f":"IF(C91<=16,\"      OK\",\"     ERRORE:   Totale n° di dischi superiore al consentito\")","v":"      OK"}]
[]
[null,"Configurazione RAID"]
[null,"C3 - RAID 1 for H330 (2 HDDs)",1,null,{"$f":"VLOOKUP($B$94,  RAID_B1, 2, FALSE)","v":"[780-BBJK]"}]
[null,"Hot Spare for 300GB HDD","No"]
[null,"SCRIVERE QUI' LA CONFIGURAZIONE RAID RICHIESTA.\nR730 2\n",null,null,null,null,null,{"$f":"IF(B96=\"SCRIVERE QUI' LA CONFIGURAZIONE RAID RICHIESTA.\nR730 2\n\",\"ATTENZIONE COMPILARE IL CAMPO DELLA SCELTA RAID\", \"\")","v":"ATTENZIONE COMPILARE IL CAMPO DELLA SCELTA RAID"}]
[null,"Configurazione RAID HDD 1TB"]
[null,"",1,null,{"$f":"VLOOKUP($B$98,  RAID_B2, 2, FALSE)","v":""}]
[null,"Hot Spare for 1TB HDD","No"]
[]
[null,"Impostazioni del BIOS per la gestione dell'alimentazione"]
[null,"Performance BIOS Setting",1,null,"[384-BBBL]"]
[]
[null,"Alimentatore"]
[null,"Dual, Hot-plug, Redundant Power Supply (1+1), 750W, Titanium, 200-240VAC",1,null,"[450-ADWT]"]
[]
[null,"Cavi di alimentazione"]
[null,"Rack Power Cord 2M (C13/C14 12A)",2,null,"[450-AADY]"]
[]
[null,"PCIe Riser"]
[null,"Risers with up to 4, x8 PCIe Slots + 2, x16 PCIe Slots",1,null,"[330-BBCO][330-BBCQ]"]
[]
[null,"TPM Module"]
[null,"PowerEdge Server FIPS TPM 2.0",1,null,"[461-AADM]"]
[]
[null,"Embedded Systems Management"]
[null,"iDRAC8 Enterprise, integrated Dell Remote Access Controller, Enterprise",1,null,"[385-BBHO]"]
[]
[null,"Adattatore di rete"]
[null,"Broadcom 5720 QP 1Gb Network Daughter Card",1,null,"[540-BBBW]"]
[]
[null,"Modulo Doppia SD"]
[null,"None ",{"$f":"VLOOKUP($B$123,upsell_1, 2, FALSE)","v":0},{"$f":"VLOOKUP($B$123,upsell_1, 3, FALSE)","v":""},{"$f":"VLOOKUP($B$123,upsell_1, 4, FALSE)","v":""},{"$f":"VLOOKUP($B$123,upsell_1, 6, FALSE)","v":""},{"$f":"VLOOKUP($B$123,upsell_1, 7, FALSE)","v":0}]
[]
[null,"Additional Card for PCIe Slot 7 (Full height) (CPU 1)"]
[null,"Broadcom 5719 QP 1Gb Network Interface Card",{"$f":"VLOOKUP(B126,  PCI_B1, 2, FALSE)","v":""},{"$f":"VLOOKUP($B$126,  PCI_B1, 3, FALSE)","v":""},{"$f":"VLOOKUP($B$126,  PCI_B1, 5, FALSE)","v":"540-BBCW"},{"$f":"VLOOKUP($B$126,  PCI_B1, 6, FALSE)","v":""},{"$f":"VLOOKUP($B$126,  PCI_B1, 7, FALSE)","v":0}]
[]
[null,"Additional Card for PCIe Slot 6 (Full height) (CPU 1)"]
[null,"None",{"$f":"VLOOKUP($B$129,  PCI_B1.1, 2, FALSE)","v":""},{"$f":"VLOOKUP($B$129,  PCI_B1.1, 3, FALSE)","v":""},{"$f":"VLOOKUP($B$129,  PCI_B1.1, 5, FALSE)","v":""},{"$f":"VLOOKUP($B$129,  PCI_B1.1, 6, FALSE)","v":""},{"$f":"VLOOKUP($B$129,  PCI_B1.1, 7, FALSE)","v":0}]
[]
[null,"Additional Card for PCIe Slot 5 (Full height) (CPU 1)"]
[null,"None",{"$f":"VLOOKUP($B$132,  PCI_B2, 2, FALSE)","v":""},{"$f":"VLOOKUP($B$132,  PCI_B2, 3, FALSE)","v":""},{"$f":"VLOOKUP($B$132,  PCI_B2, 5, FALSE)","v":""},{"$f":"VLOOKUP($B$132,  PCI_B2, 6, FALSE)","v":""},{"$f":"VLOOKUP($B$132,  PCI_B2, 7, FALSE)","v":0}]
[]
[null,"Additional Card for PCIe Slot 4 (Full height) (CPU 2)"]
[null,"Aggiungere Secondo Processore",{"$f":"IF(B135=\"Aggiungere Secondo Processore\",\"\",(VLOOKUP(B135,PCI_B3, 2, FALSE)))","v":""},{"$f":"IF(B135=\"Aggiungere Secondo Processore\",\"\",(VLOOKUP(B135,  PCI_B3, 3, FALSE)))","v":""},{"$f":"IF(B135=\"Aggiungere Secondo Processore\",\"\",VLOOKUP($B$135,PCI_B3,5,FALSE))","v":""},{"$f":"IF(B135=\"Aggiungere Secondo Processore\",0,VLOOKUP($B$135,PCI_B3,6,FALSE))","v":0},{"$f":"IF(B135=\"Aggiungere Secondo Processore\",0,VLOOKUP($B$135,PCI_B3,7,FALSE))","v":0}]
[]
[null,"Additional Card for PCIe Slot 3 (Low Profile) (CPU 2)"]
[null,"Aggiungere Secondo Processore",{"$f":"IF(B138=\"Aggiungere Secondo Processore\",\"\",(VLOOKUP(B138,PCI_B4, 2, FALSE)))","v":""},{"$f":"IF(B138=\"Aggiungere Secondo Processore\",\"\",(VLOOKUP(B138,  PCI_B4, 3, FALSE)))","v":""},{"$f":"IF(B138=\"Aggiungere Secondo Processore\",\"\",VLOOKUP($B$138,PCI_B4,5,FALSE))","v":""},{"$f":"IF(B138=\"Aggiungere Secondo Processore\",0,VLOOKUP($B$138,PCI_B4,6,FALSE))","v":0},{"$f":"IF(B138=\"Aggiungere Secondo Processore\",0,VLOOKUP($B$138,PCI_B4,7,FALSE))","v":0}]
[]
[null,"Additional Card for PCIe Slot 2 (Low Profile) (CPU 2)"]
[null,"Aggiungere Secondo Processore",{"$f":"IF(B141=\"Aggiungere Secondo Processore\",\"\",(VLOOKUP(B141,PCI_B5, 2, FALSE)))","v":""},{"$f":"IF(B141=\"Aggiungere Secondo Processore\",\"\",(VLOOKUP(B141,  PCI_B5, 3, FALSE)))","v":""},{"$f":"IF(B141=\"Aggiungere Secondo Processore\",\"\",VLOOKUP($B$141,PCI_B5,5,FALSE))","v":""},{"$f":"IF(B141=\"Aggiungere Secondo Processore\",0,VLOOKUP($B$141,PCI_B5,6,FALSE))","v":0},{"$f":"IF(B141=\"Aggiungere Secondo Processore\",0,VLOOKUP($B$141,PCI_B5,7,FALSE))","v":0}]
[]
[null,"Additional Card for PCIe Slot 1 (Low Profile) (CPU 2)"]
[null,"Aggiungere Secondo Processore",{"$f":"IF(B144=\"Aggiungere Secondo Processore\",\"\",(VLOOKUP(B144,PCI_B6, 2, FALSE)))","v":""},{"$f":"IF(B144=\"Aggiungere Secondo Processore\",\"\",(VLOOKUP(B144,  PCI_B6, 3, FALSE)))","v":""},{"$f":"IF(B144=\"Aggiungere Secondo Processore\",\"\",VLOOKUP($B$144,PCI_B5,5,FALSE))","v":""},{"$f":"IF(B144=\"Aggiungere Secondo Processore\",0,VLOOKUP($B$144,PCI_B5,6,FALSE))","v":0},{"$f":"IF(B144=\"Aggiungere Secondo Processore\",0,VLOOKUP($B$144,PCI_B5,7,FALSE))","v":0}]
[]
[null,"Pannello frontale"]
[null,"No Bezel Option",1,null,"350-BBBW"]
[]
[null,"Guide per rack"]
[null,"ReadyRails™ Sliding Rails Without Cable Management Arm",1,null,"[770-BBBQ]"]
[]
[null,"Server Accessories"]
[null,"PowerEdge SFP+, 10GbE SR/SX, Optical Tranceiver, LC Connector, for Intel and Broadcom,CusKit",{"$f":"(VLOOKUP(B144,PCI_A2,8,FALSE))+((VLOOKUP(B129,PCI_B1.1,8,FALSE)))","v":{"$error":"#N/A"}},null,"[407-BBQE]"]
[]
[null,"System Documentation"]
[null,"Electronic System Documentation and OpenManage DVD Kit",1,null,"[631-AAJG]"]
[]
[null,"SHIPPING"]
[null,"PowerEdge R730 Shipping EMEA1 (English/French/German/Spanish/Russian/Hebrew)",1,null,"340-ALXX"]
[]
[null,"Order Information"]
[null,"PowerEdge Order - EMEA",1,null,"[800-11671]"]
[]
[null,"Base warranty"]
[null,"3Yr Basic Warranty - Next Business Day - Minimum Warranty",1,null,"[709-12777][709-12778]"]
[]
[null,"Servizi di assitenza"]
[null,"Dell Channel Order - Service Info only",1,null,"[710-31085]"]
[]
[null,"Aggiornamenti della garanzia"]
[null,"None",{"$f":"VLOOKUP($B$171,  SO_B1,2, FALSE)","v":""},{"$f":"VLOOKUP($B$171,  SO_B1, 3, FALSE)","v":""},{"$f":"VLOOKUP($B$171,  SO_B1, 5, FALSE)","v":""},{"$f":"VLOOKUP($B$171,  SO_B1, 6, FALSE)","v":""}]
[]
[null,"Protezione dei dati - Keep Your Hard Drive "]
[null,"None",{"$f":"VLOOKUP($B$174,  SO_B2, 2, FALSE)","v":""},{"$f":"VLOOKUP($B$174,  SO_B2, 3, FALSE)","v":""},{"$f":"VLOOKUP($B$174,  SO_B2,5, FALSE)","v":""},{"$f":"VLOOKUP($B$174,  SO_B2, 6, FALSE)","v":""}]
[]
[null,"Servizi di Installazione"]
[null,"No Installation Service Selected",1,null,"[683-11870]"]
[]
[null,"Channel only - Support Extension"]
[null,"Channel 39M Basic Warranty - Next Business Day",1,null,"[723-38675]"]
[]
[null,"Warranty Upgrades - Non-Std/Local POS"]
[null,"CSTM CONSIP - 39M Onsite Labor Support for CRU for Servers with Basic Warranty",1,null,"[681-24467]"]

{"sheet":"Lotto1 R730 3","index":14,"n_rows":183,"n_cols":9,"rows_kept":183,"cut":false,"hidden":false,"merged":[[27,2,27,4],[4,0,4,4],[5,0,5,4],[10,0,11,5],[12,0,12,5],[18,2,18,4],[20,1,20,4],[21,2,21,4],[23,1,23,4],[24,2,24,4],[26,1,26,4],[53,1,53,4],[29,1,29,4],[30,2,30,4],[33,1,33,4],[34,2,34,4],[36,1,36,4],[39,1,39,4],[40,2,40,4],[42,1,42,4],[43,2,43,4],[49,1,49,4],[50,2,50,4],[91,1,91,4],[54,2,54,4],[56,1,56,4],[57,2,57,4],[59,1,59,4],[61,1,61,4],[74,2,74,4],[76,1,76,4],[77,2,77,4],[83,1,83,4],[85,1,85,4],[87,1,87,4],[64,1,64,4],[73,1,73,4],[92,2,92,4],[96,2,96,4],[99,1,99,4],[95,1,95,3],[95,7,96,8],[118,2,118,4],[100,2,100,4],[102,1,102,4],[103,2,103,4],[105,1,105,4],[106,2,106,4],[108,1,108,4],[109,2,109,4],[111,1,111,4],[114,1,114,4],[115,2,115,4],[117,1,117,4],[139,2,139,4],[120,1,120,4],[124,2,124,4],[126,1,126,4],[127,2,127,4],[129,1,129,4],[130,2,130,4],[132,1,132,4],[133,2,133,4],[135,1,135,4],[136,2,136,4],[138,1,138,4],[121,2,121,4],[123,1,123,4],[157,2,157,4],[141,1,141,4],[142,2,142,4],[144,1,144,4],[145,2,145,4],[147,1,147,4],[148,2,148,4],[150,1,150,4],[151,2,151,4],[153,1,153,4],[154,2,154,4],[156,1,156,4],[175,2,175,4],[159,1,159,4],[160,2,160,4],[162,1,162,4],[163,2,163,4],[165,1,165,4],[166,2,166,4],[168,1,168,4],[169,2,169,4],[171,1,171,4],[172,2,172,4],[174,1,174,4],[177,1,177,4],[178,2,178,4],[180,1,180,4],[181,2,181,4],[183,1,183,4]]}
["IN ROSSO LE OPZIONI 20%"]
[]
[]
[]
["Tecnologie Server 1 Lotto 1"]
[]
[null,null,null,null,null,null,null,"Totale Server e Opzioni",{"$f":"F17*SRV_B1.3","v":0}]
[null,null,null,null,null,null,null,"Totale Ulteriori Opzioni ",{"$f":"G16*SRV_B1.3","v":0}]
[]
[null,null,null,null,null,null,null,"TOTALE CONVENZIONE",{"$f":"I8+I7","v":0}]
["Components: \nServer DELL PowerEdge R730 (1CPU Intel® Xeon® E5-2680 v4, 64GB RDIMM, 2xHDD 300GB 10K RPM SAS 12Gbps 2.5in)"]
[]
[]
[]
["PowerEdge R730","Category: Server",null,null,null,{"$f":"2371","v":2371}]
[null,"Quantity: ",null,null,null,{"$f":"SUM(F20:F191)","v":0},{"$f":"SUM(G20:G191)","v":0}]
[null,null,null,null,null,{"$f":"SUM(F15:F16)","v":2371}]
[]
[null,"Base"]
[null,"PowerEdge R730xd for Intel v4 CPUs",1,null,"[210-ACXU][329-BCZK]"]
[]
[null,"Configurazione dello chassis"]
[null,"Chassis with up to 16, 2.5\" Hard Drives",1,null,"[350-BBIL]"]
[]
[null,"Processore"]
[null,"Intel Xeon E5-2680 v4 2.4GHz,35M Cache,9.60GT/s QPI,Turbo,HT,14C/28T (120W) Max Mem 2400MHz",1,null,"[338-BJDO]"]
[]
[null,"Processore aggiuntivo"]
[null,"No Additional Processor",{"$f":"VLOOKUP($B$29, CPU_B.1, 2, FALSE)","v":0},{"$f":"VLOOKUP($B$29, CPU_B.1, 3, FALSE)","v":""},{"$f":"VLOOKUP($B$29, CPU_B.1, 5, FALSE)","v":"[374-BBBX]"},{"$f":"VLOOKUP(B29, CPU_B.1, 12, FALSE)","v":0}]
[]
[null,"Processor Thermal Configuration"]
[null,"1 CPU Standard",1,null,"[370-ABWF][374-BBHM][750-AAEL]"]
[null,{"$f":"VLOOKUP($B$29, CPU_B, 6, FALSE)","v":""},{"$f":"VLOOKUP($B$29, CPU_B, 7, FALSE)","v":""},null,{"$f":"VLOOKUP($B$29, CPU_B, 8, FALSE)","v":""}]
[]
[null,"Tipo di configurazione memoria"]
[null,"Performance Optimized",1,null,"[370-AAIP]"]
[]
[null,"Memoria Totale in GB",null,{"$f":"IF(('Lotto1 R730 3'!$D$12=0),\"\",'Lotto1 R730 3'!#REF!)","v":""}]
[null,64]
[]
[null,"Tipo e velocità della memoria DIMM"]
[null,"2400MT/s RDIMMs",1,null,"[370-ACPH]"]
[]
[null,"Capacità di memoria"]
[null,"32GB RDIMM, 2400MT/s, Dual Rank, x4 Data Width",2,null,"[370-ACNS]"]
[]
[null,{"$f":"IF($B$29=\"No Additional Processor\",VLOOKUP($B$39, MEM_B1, 2, FALSE),VLOOKUP($B$39, MEM_B2, 2, FALSE))","v":""},{"$f":"IF($B$29=\"No Additional Processor\",VLOOKUP($B$39, MEM_B1, 3, FALSE),VLOOKUP($B$39, MEM_B2, 3, FALSE))","v":""},{"$f":"IF($B$29=\"No Additional Processor\",VLOOKUP($B$39, MEM_B1, 4, FALSE),VLOOKUP($B$39, MEM_B2, 4, FALSE))","v":""},{"$f":"IF($B$29=\"No Additional Processor\",VLOOKUP($B$39, MEM_B1, 6, FALSE),VLOOKUP($B$39, MEM_B2, 6, FALSE))","v":""},{"$f":"IF($B$29=\"No Additional Processor\",VLOOKUP($B$39, MEM_B1, 7, FALSE),VLOOKUP($B$39, MEM_B2, 7, FALSE))","v":""}]
[]
[null,{"$f":"IF($B$29=\"No Additional Processor\",VLOOKUP($B$39, MEM_B1, 11, FALSE),VLOOKUP($B$39, MEM_B2, 11, FALSE))","v":""},{"$f":"IF($B$29=\"No Additional Processor\",VLOOKUP($B$39, MEM_B1, 12, FALSE),VLOOKUP($B$39, MEM_B2, 12, FALSE))","v":""},{"$f":"IF($B$29=\"No Additional Processor\",VLOOKUP($B$39, MEM_B1, 13, FALSE),VLOOKUP($B$39, MEM_B2, 13, FALSE))","v":""},{"$f":"IF($B$29=\"No Additional Processor\",VLOOKUP($B$39, MEM_B1, 15, FALSE),VLOOKUP($B$39, MEM_B2, 15, FALSE))","v":""},{"$f":"IF($B$29=\"No Additional Processor\",VLOOKUP($B$39, MEM_B1, 16, FALSE),VLOOKUP($B$39, MEM_B2, 16, FALSE))","v":""}]
[]
[null,"Sistema operativo preinstallato"]
[null,"No Operating System",{"$f":"VLOOKUP($B$52, OS_B, 2, FALSE)","v":""},{"$f":"VLOOKUP($B$52, OS_B, 3, FALSE)","v":""},{"$f":"VLOOKUP($B$52, OS_B, 5, FALSE)","v":"[611-BBBF]"},{"$f":"VLOOKUP($B$52, OS_B, 6, FALSE)","v":""}]
[null,{"$f":"IF($B$29=\"No Additional Processor\",VLOOKUP($B$52, OS_B, 20, FALSE),VLOOKUP($B$52, OS_B2, 20, FALSE))","v":""},{"$f":"IF($B$29=\"No Additional Processor\",VLOOKUP($B$52, OS_B, 21, FALSE),VLOOKUP($B$52, OS_B2, 21, FALSE))","v":0},{"$f":"IF($B$29=\"No Additional Processor\",VLOOKUP($B$52, OS_A, 22, FALSE),VLOOKUP($B$52, OS_B2, 22, FALSE))","v":""},{"$f":"IF($B$29=\"No Additional Processor\",VLOOKUP($B$52, OS_B, 24, FALSE),VLOOKUP($B$52, OS_B2, 24, FALSE))","v":""},{"$f":"IF($B$29=\"No Additional Processor\",VLOOKUP($B$52, OS_B, 25, FALSE),VLOOKUP($B$52, OS_B2, 25, FALSE))","v":""}]
[]
[null,"OS Media Kits"]
[null,"No Media Required",1,null,"[605-BBFN]"]
[]
[null,"Client Access Licenses"]
[null,{"$f":"VLOOKUP($B$52, OS_B, 8, FALSE)","v":"None"},null,{"$f":"VLOOKUP($B$52, OS_A, 10, FALSE)","v":""},{"$f":"VLOOKUP($B$52, OS_A, 12, FALSE)","v":""},{"$f":"VLOOKUP($B$52, OS_A, 13, FALSE)*C59","v":0}]
[]
[null,{"$f":"VLOOKUP($B$52, OS_A, 14, FALSE)","v":"None"},null,{"$f":"VLOOKUP($B$52, OS_A, 16, FALSE)","v":""},{"$f":"VLOOKUP($B$52, OS_A, 18, FALSE)","v":""},{"$f":"VLOOKUP($B$52, OS_A, 19, FALSE)*C61","v":0}]
[]
[null,"Sistema opertivo SUSE Linux Enterprise Server"]
[null,"None\n",{"$f":"VLOOKUP($B$64,SUSE, 2, FALSE)","v":0},{"$f":"VLOOKUP($B$64,SUSE, 3, FALSE)","v":""},{"$f":"VLOOKUP($B$64,SUSE, 5, FALSE)","v":""},null,{"$f":"VLOOKUP($B$64, SUSE, 6, FALSE)*C64","v":0}]
[]
[null,"Sistema opertivo VMware"]
[null,"None",{"$f":"VLOOKUP($B$67,VMWARE, 2, FALSE)+C29","v":0},{"$f":"VLOOKUP($B$67,VMWARE, 3, FALSE)","v":""},{"$f":"VLOOKUP($B$67,VMWARE, 5, FALSE)","v":""},null,{"$f":"VLOOKUP($B$67, VMWARE, 6, FALSE)*C67","v":0}]
[]
[null,"VMware vCenter Server Standard"]
[null,"None",{"$f":"VLOOKUP($B$70,VMWARE2, 2, FALSE)","v":0},{"$f":"VLOOKUP($B$70,VMWARE2, 3, FALSE)","v":""},{"$f":"VLOOKUP($B$70,VMWARE2, 5, FALSE)","v":""},null,{"$f":"VLOOKUP($B$70, VMWARE2, 6, FALSE)*C70","v":0}]
[]
[null,"Essentials Plus Kit"]
[null,"None",{"$f":"IF(SRV_A<4,VLOOKUP($B$73,VMWARE1, 2, FALSE),0)","v":0},{"$f":"VLOOKUP($B$73,VMWARE1, 3, FALSE)","v":""},{"$f":"VLOOKUP($B$73,VMWARE1, 5, FALSE)","v":""},null,{"$f":"VLOOKUP($B$73, VMWARE1, 6, FALSE)*C73","v":0}]
[]
[null,"Controller"]
[null,"PERC H730P Integrated RAID Controller, 2GB Cache",{"$f":"VLOOKUP($B$76,PERC, 2, FALSE)","v":0},{"$f":"VLOOKUP($B$76,PERC, 3, FALSE)","v":""},{"$f":"VLOOKUP($B$76,PERC, 4, FALSE)","v":""},{"$f":"VLOOKUP($B$76,PERC, 6, FALSE)","v":""},{"$f":"VLOOKUP($B$76,PERC, 7, FALSE)","v":0}]
[]
[null,"Dischi rigidi (numero massimo totale 16)"]
[null,"300GB 10K RPM SAS 12Gbps 2.5in Hot-plug Hard Drive",2,null,"[400-AJPK]"]
[]
[null,"300GB 10K RPM SAS 12Gbps 2.5in Hot-plug Hard Drive,CusKit",null,{"$f":"VLOOKUP($B$81, HDD_A,3, FALSE)","v":"TS1L1-HD300"},{"$f":"VLOOKUP($B$81, HDD_A,5, FALSE)","v":"[400-AJOQ]"},{"$f":"VLOOKUP($B$81, HDD_B,6, FALSE)*C81","v":0}]
[]
[null,"1.2TB 10K RPM SAS 12Gbps 2.5in Hot-plug Hard Drive,CusKit",null,{"$f":"VLOOKUP($B$83, HDD_A,3, FALSE)","v":"TS1L1-HD1200"},{"$f":"VLOOKUP($B$83, HDD_A,5, FALSE)","v":"[400-AJPD]"},{"$f":"VLOOKUP($B$83, HDD_B,6, FALSE)*C83","v":0}]
[]
[null,"1.8TB 10K RPM SAS 12Gbps 512e 2.5in Hot-plug Hard Drive,CusKit",null,"TS1L1-HD1800","[400-AJQP]",{"$f":"VLOOKUP($B$85, HDD_B,6, FALSE)*C85","v":0}]
[]
[null,"960GB Solid State Drive SAS Mix Use MLC 2.5in Hot-plug Drive, PX04SV, Cus Kit",null,"TS1L1-SSD800","[400-ANNX]",{"$f":"VLOOKUP($B$87, HDD_B,6, FALSE)*C87","v":0}]
[]
[null,"1.92TB Solid State Drive SAS Mix Use MLC 2.5in Hot-plug Drive, PX04SV, Cus Kit",null,"TS1L1-SSD1920","[400-ANMN]",{"$f":"VLOOKUP($B$89, HDD_B,6, FALSE)*C89","v":0}]
[]
[null,"DISCHI TOTALI",{"$f":"SUM(C79:C90)","v":2},{"$f":"IF(C91<=16,\"      OK\",\"     ERRORE:   Totale n° di dischi superiore al consentito\")","v":"      OK"}]
[]
[null,"Configurazione RAID"]
[null,"C3 - RAID 1 for H330 (2 HDDs)",1,null,{"$f":"VLOOKUP($B$94,  RAID_B1, 2, FALSE)","v":"[780-BBJK]"}]
[null,"Hot Spare for 300GB HDD","No"]
[null,"SCRIVERE QUI' LA CONFIGURAZIONE RAID RICHIESTA.\nR730 3\n",null,null,null,null,null,{"$f":"IF(B96=\"SCRIVERE QUI' LA CONFIGURAZIONE RAID RICHIESTA.\nR730 3\n\",\"ATTENZIONE COMPILARE IL CAMPO DELLA SCELTA RAID\", \"\")","v":"ATTENZIONE COMPILARE IL CAMPO DELLA SCELTA RAID"}]
[null,"Configurazione RAID HDD 1TB"]
[null,"",1,null,{"$f":"VLOOKUP($B$98,  RAID_B2, 2, FALSE)","v":""}]
[null,"Hot Spare for 1TB HDD","No"]
[]
[null,"Impostazioni del BIOS per la gestione dell'alimentazione"]
[null,"Performance BIOS Setting",1,null,"[384-BBBL]"]
[]
[null,"Alimentatore"]
[null,"Dual, Hot-plug, Redundant Power Supply (1+1), 750W, Titanium, 200-240VAC",1,null,"[450-ADWT]"]
[]
[null,"Cavi di alimentazione"]
[null,"Rack Power Cord 2M (C13/C14 12A)",2,null,"[450-AADY]"]
[]
[null,"PCIe Riser"]
[null,"Risers with up to 4, x8 PCIe Slots + 2, x16 PCIe Slots",1,null,"[330-BBCO][330-BBCQ]"]
[]
[null,"TPM Module"]
[null,"PowerEdge Server FIPS TPM 2.0",1,null,"[461-AADM]"]
[]
[null,"Embedded Systems Management"]
[null,"iDRAC8 Enterprise, integrated Dell Remote Access Controller, Enterprise",1,null,"[385-BBHO]"]
[]
[null,"Adattatore di rete"]
[null,"Broadcom 5720 QP 1Gb Network Daughter Card",1,null,"[540-BBBW]"]
[]
[null,"Modulo Doppia SD"]
[null,"None ",{"$f":"VLOOKUP($B$123,upsell_1, 2, FALSE)","v":0},{"$f":"VLOOKUP($B$123,upsell_1, 3, FALSE)","v":""},{"$f":"VLOOKUP($B$123,upsell_1, 4, FALSE)","v":""},{"$f":"VLOOKUP($B$123,upsell_1, 6, FALSE)","v":""},{"$f":"VLOOKUP($B$123,upsell_1, 7, FALSE)","v":0}]
[]
[null,"Additional Card for PCIe Slot 7 (Full height) (CPU 1)"]
[null,"Broadcom 5720 DP 1Gb Network Interface Card",null,{"$f":"\"\"","v":""},"540-BBCX"]
[]
[null,"Additional Card for PCIe Slot 6 (Full height) (CPU 1)"]
[null,"None",{"$f":"VLOOKUP($B$129,  PCI_B1.1, 2, FALSE)","v":""},{"$f":"VLOOKUP($B$129,  PCI_B1.1, 3, FALSE)","v":""},{"$f":"VLOOKUP($B$129,  PCI_B1.1, 5, FALSE)","v":""},{"$f":"VLOOKUP($B$129,  PCI_B1.1, 6, FALSE)","v":""},{"$f":"VLOOKUP($B$129,  PCI_B1.1, 7, FALSE)","v":0}]
[]
[null,"Additional Card for PCIe Slot 5 (Full height) (CPU 1)"]
[null,"None",{"$f":"VLOOKUP($B$132,  PCI_B2, 2, FALSE)","v":""},{"$f":"VLOOKUP($B$132,  PCI_B2, 3, FALSE)","v":""},{"$f":"VLOOKUP($B$132,  PCI_B2, 5, FALSE)","v":""},{"$f":"VLOOKUP($B$132,  PCI_B2, 6, FALSE)","v":""},{"$f":"VLOOKUP($B$132,  PCI_B2, 7, FALSE)","v":0}]
[]
[null,"Additional Card for PCIe Slot 4 (Full height) (CPU 2)"]
[null,"Aggiungere Secondo Processore",{"$f":"IF(B135=\"Aggiungere Secondo Processore\",\"\",(VLOOKUP(B135,PCI_B3, 2, FALSE)))","v":""},{"$f":"IF(B135=\"Aggiungere Secondo Processore\",\"\",(VLOOKUP(B135,  PCI_B3, 3, FALSE)))","v":""},{"$f":"IF(B135=\"Aggiungere Secondo Processore\",\"\",VLOOKUP($B$135,PCI_B3,5,FALSE))","v":""},{"$f":"IF(B135=\"Aggiungere Secondo Processore\",0,VLOOKUP($B$135,PCI_B3,6,FALSE))","v":0},{"$f":"IF(B135=\"Aggiungere Secondo Processore\",0,VLOOKUP($B$135,PCI_B3,7,FALSE))","v":0}]
[]
[null,"Additional Card for PCIe Slot 3 (Low Profile) (CPU 2)"]
[null,"Aggiungere Secondo Processore",{"$f":"IF(B138=\"Aggiungere Secondo Processore\",\"\",(VLOOKUP(B138,PCI_B4, 2, FALSE)))","v":""},{"$f":"IF(B138=\"Aggiungere Secondo Processore\",\"\",(VLOOKUP(B138,  PCI_B4, 3, FALSE)))","v":""},{"$f":"IF(B138=\"Aggiungere Secondo Processore\",\"\",VLOOKUP($B$138,PCI_B4,5,FALSE))","v":""},{"$f":"IF(B138=\"Aggiungere Secondo Processore\",0,VLOOKUP($B$138,PCI_B4,6,FALSE))","v":0},{"$f":"IF(B138=\"Aggiungere Secondo Processore\",0,VLOOKUP($B$138,PCI_B4,7,FALSE))","v":0}]
[]
[null,"Additional Card for PCIe Slot 2 (Low Profile) (CPU 2)"]
[null,"Aggiungere Secondo Processore",{"$f":"IF(B141=\"Aggiungere Secondo Processore\",\"\",(VLOOKUP(B141,PCI_B5, 2, FALSE)))","v":""},{"$f":"IF(B141=\"Aggiungere Secondo Processore\",\"\",(VLOOKUP(B141,  PCI_B5, 3, FALSE)))","v":""},{"$f":"IF(B141=\"Aggiungere Secondo Processore\",\"\",VLOOKUP($B$141,PCI_B5,5,FALSE))","v":""},{"$f":"IF(B141=\"Aggiungere Secondo Processore\",0,VLOOKUP($B$141,PCI_B5,6,FALSE))","v":0},{"$f":"IF(B141=\"Aggiungere Secondo Processore\",0,VLOOKUP($B$141,PCI_B5,7,FALSE))","v":0}]
[]
[null,"Additional Card for PCIe Slot 1 (Low Profile) (CPU 2)"]
[null,"Aggiungere Secondo Processore",{"$f":"IF(B144=\"Aggiungere Secondo Processore\",\"\",(VLOOKUP(B144,PCI_B6, 2, FALSE)))","v":""},{"$f":"IF(B144=\"Aggiungere Secondo Processore\",\"\",(VLOOKUP(B144,  PCI_B6, 3, FALSE)))","v":""},{"$f":"IF(B144=\"Aggiungere Secondo Processore\",\"\",VLOOKUP($B$144,PCI_B5,5,FALSE))","v":""},{"$f":"IF(B144=\"Aggiungere Secondo Processore\",0,VLOOKUP($B$144,PCI_B5,6,FALSE))","v":0},{"$f":"IF(B144=\"Aggiungere Secondo Processore\",0,VLOOKUP($B$144,PCI_B5,7,FALSE))","v":0}]
[]
[null,"Pannello frontale"]
[null,"No Bezel Option",1,null,"350-BBBW"]
[]
[null,"Guide per rack"]
[null,"ReadyRails™ Sliding Rails Without Cable Management Arm",1,null,"[770-BBBQ]"]
[]
[null,"Server Accessories"]
[null,"PowerEdge SFP+, 10GbE SR/SX, Optical Tranceiver, LC Connector, for Intel and Broadcom,CusKit",{"$f":"(VLOOKUP(B144,PCI_A2,8,FALSE))+((VLOOKUP(B129,PCI_B1.1,8,FALSE)))","v":{"$error":"#N/A"}},null,"[407-BBQE]"]
[]
[null,"System Documentation"]
[null,"Electronic System Documentation and OpenManage DVD Kit",1,null,"[631-AAJG]"]
[]
[null,"SHIPPING"]
[null,"PowerEdge R730 Shipping EMEA1 (English/French/German/Spanish/Russian/Hebrew)",1,null,"340-ALXX"]
[]
[null,"Order Information"]
[null,"PowerEdge Order - EMEA",1,null,"[800-11671]"]
[]
[null,"Base warranty"]
[null,"3Yr Basic Warranty - Next Business Day - Minimum Warranty",1,null,"[709-12777][709-12778]"]
[]
[null,"Servizi di assitenza"]
[null,"Dell Channel Order - Service Info only",1,null,"[710-31085]"]
[]
[null,"Aggiornamenti della garanzia"]
[null,"None",{"$f":"VLOOKUP($B$171,  SO_B1,2, FALSE)","v":""},{"$f":"VLOOKUP($B$171,  SO_B1, 3, FALSE)","v":""},{"$f":"VLOOKUP($B$171,  SO_B1, 5, FALSE)","v":""},{"$f":"VLOOKUP($B$171,  SO_B1, 6, FALSE)","v":""}]
[]
[null,"Protezione dei dati - Keep Your Hard Drive "]
[null,"None",{"$f":"VLOOKUP($B$174,  SO_B2, 2, FALSE)","v":""},{"$f":"VLOOKUP($B$174,  SO_B2, 3, FALSE)","v":""},{"$f":"VLOOKUP($B$174,  SO_B2,5, FALSE)","v":""},{"$f":"VLOOKUP($B$174,  SO_B2, 6, FALSE)","v":""}]
[]
[null,"Servizi di Installazione"]
[null,"No Installation Service Selected",1,null,"[683-11870]"]
[]
[null,"Channel only - Support Extension"]
[null,"Channel 39M Basic Warranty - Next Business Day",1,null,"[723-38675]"]
[]
[null,"Warranty Upgrades - Non-Std/Local POS"]
[null,"CSTM CONSIP - 39M Onsite Labor Support for CRU for Servers with Basic Warranty",1,null,"[681-24467]"]

{"sheet":"Lotto1 R730xd 2","index":15,"n_rows":181,"n_cols":9,"rows_kept":181,"cut":false,"hidden":false,"merged":[[178,1,178,4],[179,2,179,4],[181,1,181,4],[169,1,169,4],[170,2,170,4],[172,1,172,4],[173,2,173,4],[175,1,175,4],[176,2,176,4],[167,2,167,4],[151,1,151,4],[152,2,152,4],[154,1,154,4],[155,2,155,4],[157,1,157,4],[158,2,158,4],[160,1,160,4],[161,2,161,4],[163,1,163,4],[164,2,164,4],[166,1,166,4],[149,2,149,4],[133,1,133,4],[134,2,134,4],[136,1,136,4],[137,2,137,4],[139,1,139,4],[140,2,140,4],[142,1,142,4],[143,2,143,4],[145,1,145,4],[146,2,146,4],[148,1,148,4],[131,2,131,4],[110,2,110,4],[112,1,112,4],[115,1,115,4],[116,2,116,4],[118,1,118,4],[119,2,119,4],[121,1,121,4],[125,2,125,4],[127,1,127,4],[128,2,128,4],[130,1,130,4],[122,2,122,4],[124,1,124,4],[109,1,109,4],[93,2,93,4],[97,2,97,4],[100,1,100,4],[101,2,101,4],[103,1,103,4],[104,2,104,4],[106,1,106,4],[107,2,107,4],[96,1,96,3],[96,7,97,8],[92,1,92,4],[54,2,54,4],[57,1,57,4],[58,2,58,4],[60,1,60,4],[62,1,62,4],[75,2,75,4],[77,1,77,4],[78,2,78,4],[84,1,84,4],[86,1,86,4],[88,1,88,4],[65,1,65,4],[74,1,74,4],[53,1,53,4],[29,1,29,4],[30,2,30,4],[33,1,33,4],[34,2,34,4],[36,1,36,4],[39,1,39,4],[40,2,40,4],[42,1,42,4],[43,2,43,4],[49,1,49,4],[50,2,50,4],[27,2,27,4],[4,0,4,4],[5,0,5,4],[10,0,11,5],[12,0,12,5],[18,2,18,4],[20,1,20,4],[21,2,21,4],[23,1,23,4],[24,2,24,4],[26,1,26,4]]}
["IN ROSSO LE OPZIONI 20%"]
[]
[]
[]
["Tecnologie Server 1 Lotto 1"]
[]
[null,null,null,null,null,null,null,"Totale Server e Opzioni",{"$f":"F17*SRV_BB","v":0}]
[null,null,null,null,null,null,null,"Totale Ulteriori Opzioni ",{"$f":"G16*SRV_BB-(G74*SRV_BB)+G74-(SRV_BB*G71)+G71","v":0}]
[]
[null,null,null,null,null,null,null,"TOTALE CONVENZIONE",{"$f":"I8+I7","v":0}]
["Components: \nServer DELL PowerEdge R730xd (1CPU Intel® Xeon® E5-2680 v4, 64GB RDIMM, 2xHDD 300GB 10K RPM SAS 12Gbps 2.5in)"]
[]
[]
[]
["PowerEdge R730xd","Category: Server",null,null,null,{"$f":"2371","v":2371}]
[null,"Quantity: ",null,null,null,{"$f":"SUM(F20:F182)","v":0},{"$f":"SUM(G20:G191)","v":0}]
[null,null,null,null,null,{"$f":"SUM(F15:F16)","v":2371}]
[]
[null,"Base"]
[null,"PowerEdge R730xd for Intel v4 CPUs",1,null,"[210-ADBC][329-BCZK]"]
[]
[null,"Configurazione dello chassis"]
[null,"Chassis with up to 24, 2.5\" Hard Drives",1,null,"[350-BBFD]"]
[]
[null,"Processore"]
[null,"Intel Xeon E5-2680 v4 2.4GHz,35M Cache,9.60GT/s QPI,Turbo,HT,14C/28T (120W) Max Mem 2400MHz",1,null,"[338-BJDO]"]
[]
[null,"Processore aggiuntivo"]
[null,"No Additional Processor",{"$f":"VLOOKUP($B$29, CPU_B, 2, FALSE)","v":0},{"$f":"VLOOKUP($B$29, CPU_B, 3, FALSE)","v":""},{"$f":"VLOOKUP($B$29, CPU_B, 5, FALSE)","v":"[374-BBBX]"},{"$f":"VLOOKUP(B29, CPU_B, 12, FALSE)","v":0}]
[]
[null,"Processor Thermal Configuration"]
[null,"1 CPU Standard",1,null,"[370-ABWF][374-BBHM][750-AAEL]"]
[null,{"$f":"VLOOKUP($B$29, CPU_B, 6, FALSE)","v":""},{"$f":"VLOOKUP($B$29, CPU_B, 7, FALSE)","v":""},null,{"$f":"VLOOKUP($B$29, CPU_B, 8, FALSE)","v":""}]
[]
[null,"Tipo di configurazione memoria"]
[null,"Performance Optimized",1,null,"[370-AAIP]"]
[]
[null,"Memoria Totale in GB",null,{"$f":"IF(('Lotto1 R730xd 2'!$D$12=0),\"\",'Lotto1 R730xd 2'!#REF!)","v":""}]
[null,64]
[]
[null,"Tipo e velocità della memoria DIMM"]
[null,"2400MT/s RDIMMs",1,null,"[370-ACPH]"]
[]
[null,"Capacità di memoria"]
[null,"32GB RDIMM, 2400MT/s, Dual Rank, x4 Data Width",2,null,"[370-ACNS]"]
[]
[null,{"$f":"IF($B$29=\"No Additional Processor\",VLOOKUP($B$39, MEM_B1, 2, FALSE),VLOOKUP($B$39, MEM_B2, 2, FALSE))","v":""},{"$f":"IF($B$29=\"No Additional Processor\",VLOOKUP($B$39, MEM_B1, 3, FALSE),VLOOKUP($B$39, MEM_B2, 3, FALSE))","v":""},{"$f":"IF($B$29=\"No Additional Processor\",VLOOKUP($B$39, MEM_B1, 4, FALSE),VLOOKUP($B$39, MEM_B2, 4, FALSE))","v":""},{"$f":"IF($B$29=\"No Additional Processor\",VLOOKUP($B$39, MEM_B1, 6, FALSE),VLOOKUP($B$39, MEM_B2, 6, FALSE))","v":""},{"$f":"IF($B$29=\"No Additional Processor\",VLOOKUP($B$39, MEM_B1, 7, FALSE),VLOOKUP($B$39, MEM_B2, 7, FALSE))","v":""}]
[]
[null,{"$f":"IF($B$29=\"No Additional Processor\",VLOOKUP($B$39, MEM_B1, 11, FALSE),VLOOKUP($B$39, MEM_B2, 11, FALSE))","v":""},{"$f":"IF($B$29=\"No Additional Processor\",VLOOKUP($B$39, MEM_B1, 12, FALSE),VLOOKUP($B$39, MEM_B2, 12, FALSE))","v":""},{"$f":"IF($B$29=\"No Additional Processor\",VLOOKUP($B$39, MEM_B1, 13, FALSE),VLOOKUP($B$39, MEM_B2, 13, FALSE))","v":""},{"$f":"IF($B$29=\"No Additional Processor\",VLOOKUP($B$39, MEM_B1, 15, FALSE),VLOOKUP($B$39, MEM_B2, 15, FALSE))","v":""},{"$f":"IF($B$29=\"No Additional Processor\",VLOOKUP($B$39, MEM_B1, 16, FALSE),VLOOKUP($B$39, MEM_B2, 16, FALSE))","v":""}]
[]
[null,"Sistema operativo preinstallato"]
[null,"No Operating System",{"$f":"VLOOKUP($B$52, OS_B, 2, FALSE)","v":""},{"$f":"VLOOKUP($B$52, OS_B, 3, FALSE)","v":""},{"$f":"VLOOKUP($B$52, OS_B, 5, FALSE)","v":"[611-BBBF]"},{"$f":"VLOOKUP($B$52, OS_B, 6, FALSE)","v":""}]
[null,{"$f":"IF($B$29=\"No Additional Processor\",VLOOKUP($B$52, OS_B, 20, FALSE),VLOOKUP($B$52, OS_B2, 20, FALSE))","v":""},{"$f":"IF($B$29=\"No Additional Processor\",VLOOKUP($B$52, OS_B, 21, FALSE),VLOOKUP($B$52, OS_B2, 21, FALSE))","v":0},{"$f":"IF($B$29=\"No Additional Processor\",VLOOKUP($B$52, OS_A, 22, FALSE),VLOOKUP($B$52, OS_B2, 22, FALSE))","v":""},{"$f":"IF($B$29=\"No Additional Processor\",VLOOKUP($B$52, OS_B, 24, FALSE),VLOOKUP($B$52, OS_B2, 24, FALSE))","v":""},{"$f":"IF($B$29=\"No Additional Processor\",VLOOKUP($B$52, OS_B, 25, FALSE),VLOOKUP($B$52, OS_B2, 25, FALSE))","v":""}]
[]
[null,"OS Media Kits"]
[null,"No Media Required",1,null,"[605-BBFN]"]
[]
[]
[null,"Client Access Licenses"]
[null,{"$f":"VLOOKUP($B$52, OS_B, 8, FALSE)","v":"None"},null,{"$f":"VLOOKUP($B$52, OS_A, 10, FALSE)","v":""},{"$f":"VLOOKUP($B$52, OS_A, 12, FALSE)","v":""},{"$f":"VLOOKUP($B$52, OS_A, 13, FALSE)*C60","v":0}]
[]
[null,{"$f":"VLOOKUP($B$52, OS_A, 14, FALSE)","v":"None"},null,{"$f":"VLOOKUP($B$52, OS_A, 16, FALSE)","v":""},{"$f":"VLOOKUP($B$52, OS_A, 18, FALSE)","v":""},{"$f":"VLOOKUP($B$52, OS_A, 19, FALSE)*C62","v":0}]
[]
[null,"Sistema operativo SUSE Linux Enterprise Server"]
[null,"None\n",{"$f":"VLOOKUP($B$65,SUSE, 2, FALSE)","v":0},{"$f":"VLOOKUP($B$65,SUSE, 3, FALSE)","v":""},{"$f":"VLOOKUP($B$65,SUSE, 5, FALSE)","v":""},null,{"$f":"VLOOKUP($B$65, SUSE, 6, FALSE)*C65","v":0}]
[]
[null,"Sistema operativo VMware"]
[null,"None",{"$f":"VLOOKUP($B$68,VMWARE, 2, FALSE)+C29","v":0},{"$f":"VLOOKUP($B$68,VMWARE, 3, FALSE)","v":""},{"$f":"VLOOKUP($B$68,VMWARE, 5, FALSE)","v":""},null,{"$f":"VLOOKUP($B$68, VMWARE, 6, FALSE)*C68","v":0}]
[]
[null,"VMware vCenter Server Standard"]
[null,"None",{"$f":"VLOOKUP($B$71,VMWARE2, 2, FALSE)","v":0},{"$f":"VLOOKUP($B$71,VMWARE2, 3, FALSE)","v":""},{"$f":"VLOOKUP($B$71,VMWARE2, 5, FALSE)","v":""},null,{"$f":"VLOOKUP($B$71, VMWARE2, 6, FALSE)*C71","v":0}]
[]
[null,"Essentials Plus Kit"]
[null,"None",{"$f":"IF(SRV_A<4,VLOOKUP($B$74,VMWARE1, 2, FALSE),0)","v":0},{"$f":"VLOOKUP($B$74,VMWARE1, 3, FALSE)","v":""},{"$f":"VLOOKUP($B$74,VMWARE1, 5, FALSE)","v":""},null,{"$f":"VLOOKUP($B$74, VMWARE1, 6, FALSE)*C74","v":0}]
[]
[null,"Controller"]
[null,"PERC H730P Integrated RAID Controller, 2GB Cache",{"$f":"VLOOKUP($B$77,PERC, 2, FALSE)","v":0},{"$f":"VLOOKUP($B$77,PERC, 3, FALSE)","v":""},{"$f":"VLOOKUP($B$77,PERC, 4, FALSE)","v":""},{"$f":"VLOOKUP($B$77,PERC, 6, FALSE)","v":""},{"$f":"VLOOKUP($B$77,PERC, 7, FALSE)","v":0}]
[]
[null,"Dischi rigidi  (numero massimo totale 24)"]
[null,"300GB 10K RPM SAS 12Gbps 2.5in Hot-plug Hard Drive",2,null,"[400-AJPK]"]
[]
[null,"300GB 10K RPM SAS 12Gbps 2.5in Hot-plug Hard Drive,CusKit",null,{"$f":"VLOOKUP($B$82, HDD_A,3, FALSE)","v":"TS1L1-HD300"},{"$f":"VLOOKUP($B$82, HDD_A,5, FALSE)","v":"[400-AJOQ]"},{"$f":"VLOOKUP($B$82, HDD_B,6, FALSE)*C82","v":0}]
[]
[null,"1.2TB 10K RPM SAS 12Gbps 2.5in Hot-plug Hard Drive,CusKit",null,{"$f":"VLOOKUP($B$84, HDD_A,3, FALSE)","v":"TS1L1-HD1200"},{"$f":"VLOOKUP($B$84, HDD_A,5, FALSE)","v":"[400-AJPD]"},{"$f":"VLOOKUP($B$84, HDD_B,6, FALSE)*C84","v":0}]
[]
[null,"1.8TB 10K RPM SAS 12Gbps 512e 2.5in Hot-plug Hard Drive,CusKit",null,"TS1L1-HD1800","[400-AJQP]",{"$f":"VLOOKUP($B$86, HDD_B,6, FALSE)*C86","v":0}]
[]
[null,"960GB Solid State Drive SAS Mix Use MLC 2.5in Hot-plug Drive, PX04SV, Cus Kit",null,"TS1L1-SSD800","[400-ANNX]",{"$f":"VLOOKUP($B$88, HDD_B,6, FALSE)*C88","v":0}]
[]
[null,"1.92TB Solid State Drive SAS Mix Use MLC 2.5in Hot-plug Drive, PX04SV, Cus Kit",null,"TS1L1-SSD1920","[400-ANMN]",{"$f":"VLOOKUP($B$90, HDD_B,6, FALSE)*C90","v":0}]
[]
[null,"DISCHI TOTALI",{"$f":"SUM(C80:C91)","v":2},{"$f":"IF(C92<=24,\"      OK\",\"     ERRORE:   Totale n° di dischi superiore al consentito\")","v":"      OK"}]
[]
[null,"Configurazione RAID"]
[null,"C3 - RAID 1 for H330 (2 HDDs)",1,null,{"$f":"VLOOKUP($B$95,  RAID_B1, 2, FALSE)","v":"[780-BBJK]"}]
[null,"Hot Spare for 300GB HDD","No"]
[null,"SCRIVERE QUI' LA CONFIGURAZIONE RAID RICHIESTA.\nR730XD 2\n",null,null,null,null,null,{"$f":"IF(B97=\"SCRIVERE QUI' LA CONFIGURAZIONE RAID RICHIESTA.\nR730XD 2\n\",\"ATTENZIONE COMPILARE IL CAMPO DELLA SCELTA RAID\", \"\")","v":"ATTENZIONE COMPILARE IL CAMPO DELLA SCELTA RAID"}]
[null,"Configurazione RAID HDD 1TB"]
[null,"",1,null,{"$f":"VLOOKUP($B$99,  RAID_B2, 2, FALSE)","v":""}]
[null,"Hot Spare for 1TB HDD","No"]
[]
[null,"Impostazioni del BIOS per la gestione dell'alimentazione"]
[null,"Performance BIOS Setting",1,null,"[384-BBBL]"]
[]
[null,"Alimentatore"]
[null,"Dual, Hot-plug, Redundant Power Supply (1+1), 750W, Titanium, 200-240VAC",1,null,"[450-ADWT]"]
[]
[null,"Cavi di alimentazione"]
[null,"Rack Power Cord 2M (C13/C14 12A)",2,null,"[450-AADY]"]
[]
[null,"PCIe Riser"]
[null,"Risers with up to 4, x8 PCIe Slots + 2, x16 PCIe Slots",1,null,"[330-BBCO][330-BBCR]"]
[]
[null,"TPM Module"]
[null,"PowerEdge Server FIPS TPM 2.0",1,null,"[461-AADM]"]
[]
[null,"Embedded Systems Management"]
[null,"iDRAC8 Enterprise, integrated Dell Remote Access Controller, Enterprise",1,null,"[385-BBHO]"]
[]
[null,"Adattatore di rete"]
[null,"Broadcom 5720 QP 1Gb Network Daughter Card",1,null,"[540-BBBW]"]
[]
[null,"Modulo Doppia SD"]
[null,"None ",{"$f":"VLOOKUP($B$124,upsell_1, 2, FALSE)","v":0},{"$f":"VLOOKUP($B$124,upsell_1, 3, FALSE)","v":""},{"$f":"VLOOKUP($B$124,upsell_1, 4, FALSE)","v":""},{"$f":"VLOOKUP($B$124,upsell_1, 6, FALSE)","v":""},{"$f":"VLOOKUP($B$124,upsell_1, 7, FALSE)","v":0}]
[]
[null,"Additional Card for PCIe Slot 6 (Full height) (CPU 1)"]
[null,"Broadcom 5719 QP 1Gb Network Interface Card",{"$f":"VLOOKUP($B$127,  PCI_B1, 2, FALSE)","v":""},{"$f":"VLOOKUP($B$127,  PCI_B1, 3, FALSE)","v":""},{"$f":"VLOOKUP($B$127,  PCI_B1, 5, FALSE)","v":"540-BBCW"},{"$f":"VLOOKUP($B$127,  PCI_B1, 6, FALSE)","v":""},{"$f":"VLOOKUP($B$127,  PCI_B1, 7, FALSE)","v":0}]
[]
[null,"Additional Card for PCIe Slot 5 (Full height) (CPU 1)"]
[null,"None",{"$f":"VLOOKUP($B$130,  PCI_B2, 2, FALSE)","v":""},{"$f":"VLOOKUP($B$130,  PCI_B2, 3, FALSE)","v":""},{"$f":"VLOOKUP($B$130,  PCI_B2, 5, FALSE)","v":""},{"$f":"VLOOKUP($B$130,  PCI_B2, 6, FALSE)","v":""},{"$f":"VLOOKUP($B$130,  PCI_B2, 7, FALSE)","v":0}]
[]
[null,"Additional Card for PCIe Slot 4 (Full height) (CPU 2)"]
[null,"Aggiungere Secondo Processore",{"$f":"IF(B133=\"Aggiungere Secondo Processore\",\"\",(VLOOKUP(B133,PCI_B3, 2, FALSE)))","v":""},{"$f":"IF(B133=\"Aggiungere Secondo Processore\",\"\",(VLOOKUP(B133,  PCI_B3, 3, FALSE)))","v":""},{"$f":"IF(B133=\"Aggiungere Secondo Processore\",\"\",VLOOKUP($B$133,PCI_B3,5,FALSE))","v":""},{"$f":"IF(B133=\"Aggiungere Secondo Processore\",0,VLOOKUP($B$133,PCI_B3,6,FALSE))","v":0},{"$f":"IF(B133=\"Aggiungere Secondo Processore\",0,VLOOKUP($B$133,PCI_B3,7,FALSE))","v":0}]
[]
[null,"Additional Card for PCIe Slot 3 (Low Profile) (CPU 2)"]
[null,"Aggiungere Secondo Processore",{"$f":"IF(B136=\"Aggiungere Secondo Processore\",\"\",(VLOOKUP(B136,PCI_B4, 2, FALSE)))","v":""},{"$f":"IF(B136=\"Aggiungere Secondo Processore\",\"\",(VLOOKUP(B136,  PCI_B4, 3, FALSE)))","v":""},{"$f":"IF(B136=\"Aggiungere Secondo Processore\",\"\",VLOOKUP($B$136,PCI_B4,5,FALSE))","v":""},{"$f":"IF(B136=\"Aggiungere Secondo Processore\",0,VLOOKUP($B$136,PCI_B4,6,FALSE))","v":0},{"$f":"IF(B136=\"Aggiungere Secondo Processore\",0,VLOOKUP($B$136,PCI_B4,7,FALSE))","v":0}]
[]
[null,"Additional Card for PCIe Slot 2 (Low Profile) (CPU 2)"]
[null,"Aggiungere Secondo Processore",{"$f":"IF(B139=\"Aggiungere Secondo Processore\",\"\",(VLOOKUP(B139,PCI_B5, 2, FALSE)))","v":""},{"$f":"IF(B139=\"Aggiungere Secondo Processore\",\"\",(VLOOKUP(B139,  PCI_B5, 3, FALSE)))","v":""},{"$f":"IF(B139=\"Aggiungere Secondo Processore\",\"\",VLOOKUP($B$139,PCI_B5,5,FALSE))","v":""},{"$f":"IF(B139=\"Aggiungere Secondo Processore\",0,VLOOKUP($B$139,PCI_B5,6,FALSE))","v":0},{"$f":"IF(B139=\"Aggiungere Secondo Processore\",0,VLOOKUP($B$139,PCI_B5,7,FALSE))","v":0}]
[]
[null,"Additional Card for PCIe Slot 1 (Low Profile) (CPU 2)"]
[null,"Aggiungere Secondo Processore",{"$f":"IF(B142=\"Aggiungere Secondo Processore\",\"\",(VLOOKUP(B142,PCI_B6, 2, FALSE)))","v":""},{"$f":"IF(B142=\"Aggiungere Secondo Processore\",\"\",(VLOOKUP(B142,  PCI_B6, 3, FALSE)))","v":""},{"$f":"IF(B142=\"Aggiungere Secondo Processore\",\"\",VLOOKUP($B$142,PCI_B5,5,FALSE))","v":""},{"$f":"IF(B142=\"Aggiungere Secondo Processore\",0,VLOOKUP($B$142,PCI_B5,6,FALSE))","v":0},{"$f":"IF(B142=\"Aggiungere Secondo Processore\",0,VLOOKUP($B$142,PCI_B5,7,FALSE))","v":0}]
[]
[null,"Pannello frontale"]
[null,"No Bezel Option",1,null,"350-BBBW"]
[]
[null,"Guide per rack"]
[null,"ReadyRails™ Sliding Rails Without Cable Management Arm",1,null,"[770-BBBQ]"]
[]
[null,"Server Accessories"]
[null,"PowerEdge SFP+, 10GbE SR/SX, Optical Tranceiver, LC Connector, for Intel and Broadcom,CusKit",{"$f":"(VLOOKUP(B142,PCI_A2,8,FALSE))+((VLOOKUP(B127,PCI_A1,8,FALSE)))","v":{"$error":"#N/A"}},null,"[407-BBQE]"]
[]
[null,"System Documentation"]
[null,"Electronic System Documentation and OpenManage DVD Kit",1,null,"[631-AAJG]"]
[]
[null,"SHIPPING"]
[null,"PowerEdge R730xd Shipping EMEA1 (English/French/German/Spanish/Russian/Hebrew)",1,null,"[340-AMGS]"]
[]
[null,"Order Information"]
[null,"PowerEdge Order - EMEA",1,null,"[800-11671]"]
[]
[null,"Base warranty"]
[null,"3Yr Basic Warranty - Next Business Day - Minimum Warranty",1,null,"[709-12780][709-12781]"]
[]
[null,"Servizi di assitenza"]
[null,"Dell Channel Order - Service Info only",1,null,"[710-31085]"]
[]
[null,"Aggiornamenti della garanzia"]
[null,"None",{"$f":"VLOOKUP($B$169,  SO_B1,2, FALSE)","v":""},{"$f":"VLOOKUP($B$169,  SO_B1, 3, FALSE)","v":""},{"$f":"VLOOKUP($B$169,  SO_B1, 5, FALSE)","v":""},{"$f":"VLOOKUP($B$169,  SO_B1, 6, FALSE)","v":""}]
[]
[null,"Protezione dei dati - Keep Your Hard Drive "]
[null,"None",{"$f":"VLOOKUP($B$172,  SO_B2, 2, FALSE)","v":""},{"$f":"VLOOKUP($B$172,  SO_B2, 3, FALSE)","v":""},{"$f":"VLOOKUP($B$172,  SO_B2,5, FALSE)","v":""},{"$f":"VLOOKUP($B$172,  SO_B2, 6, FALSE)","v":""}]
[]
[null,"Servizi di Installazione"]
[null,"No Installation Service Selected",1,null,"[683-11870]"]
[]
[null,"Channel only - Support Extension"]
[null,"Channel 39M Basic Warranty - Next Business Day",1,null,"[723-28780]"]
[]
[null,"Warranty Upgrades - Non-Std/Local POS"]
[null,"CSTM CONSIP - 39M Onsite Labor Support for CRU for Servers with Basic Warranty",1,null,"[681-24467]"]

{"sheet":"Lotto1 R730xd 3","index":16,"n_rows":181,"n_cols":9,"rows_kept":181,"cut":false,"hidden":false,"merged":[[178,1,178,4],[179,2,179,4],[181,1,181,4],[169,1,169,4],[170,2,170,4],[172,1,172,4],[173,2,173,4],[175,1,175,4],[176,2,176,4],[167,2,167,4],[151,1,151,4],[152,2,152,4],[154,1,154,4],[155,2,155,4],[157,1,157,4],[158,2,158,4],[160,1,160,4],[161,2,161,4],[163,1,163,4],[164,2,164,4],[166,1,166,4],[149,2,149,4],[133,1,133,4],[134,2,134,4],[136,1,136,4],[137,2,137,4],[139,1,139,4],[140,2,140,4],[142,1,142,4],[143,2,143,4],[145,1,145,4],[146,2,146,4],[148,1,148,4],[131,2,131,4],[110,2,110,4],[112,1,112,4],[115,1,115,4],[116,2,116,4],[118,1,118,4],[119,2,119,4],[121,1,121,4],[125,2,125,4],[127,1,127,4],[128,2,128,4],[130,1,130,4],[122,2,122,4],[124,1,124,4],[109,1,109,4],[93,2,93,4],[97,2,97,4],[100,1,100,4],[101,2,101,4],[103,1,103,4],[104,2,104,4],[106,1,106,4],[107,2,107,4],[96,1,96,3],[96,7,97,8],[92,1,92,4],[54,2,54,4],[57,1,57,4],[58,2,58,4],[60,1,60,4],[62,1,62,4],[75,2,75,4],[77,1,77,4],[78,2,78,4],[84,1,84,4],[86,1,86,4],[88,1,88,4],[65,1,65,4],[74,1,74,4],[53,1,53,4],[29,1,29,4],[30,2,30,4],[33,1,33,4],[34,2,34,4],[36,1,36,4],[39,1,39,4],[40,2,40,4],[42,1,42,4],[43,2,43,4],[49,1,49,4],[50,2,50,4],[27,2,27,4],[4,0,4,4],[5,0,5,4],[10,0,11,5],[12,0,12,5],[18,2,18,4],[20,1,20,4],[21,2,21,4],[23,1,23,4],[24,2,24,4],[26,1,26,4]]}
["IN ROSSO LE OPZIONI 20%"]
[]
[]
[]
["Tecnologie Server 1 Lotto 1"]
[]
[null,null,null,null,null,null,null,"Totale Server e Opzioni",{"$f":"F17*SRV_BBB","v":0}]
[null,null,null,null,null,null,null,"Totale Ulteriori Opzioni ",{"$f":"G16*SRV_BBB-(G74*SRV_BBB)+G74-(SRV_BBB*G71)+G71","v":0}]
[]
[null,null,null,null,null,null,null,"TOTALE CONVENZIONE",{"$f":"I8+I7","v":0}]
["Components: \nServer DELL PowerEdge R730xd (1CPU Intel® Xeon® E5-2680 v4, 64GB RDIMM, 2xHDD 300GB 10K RPM SAS 12Gbps 2.5in)"]
[]
[]
[]
["PowerEdge R730xd","Category: Server",null,null,null,{"$f":"2371","v":2371}]
[null,"Quantity: ",null,null,null,{"$f":"SUM(F20:F182)","v":0},{"$f":"SUM(G20:G191)","v":0}]
[null,null,null,null,null,{"$f":"SUM(F15:F16)","v":2371}]
[]
[null,"Base"]
[null,"PowerEdge R730xd for Intel v4 CPUs",1,null,"[210-ADBC][329-BCZK]"]
[]
[null,"Configurazione dello chassis"]
[null,"Chassis with up to 24, 2.5\" Hard Drives",1,null,"[350-BBFD]"]
[]
[null,"Processore"]
[null,"Intel Xeon E5-2680 v4 2.4GHz,35M Cache,9.60GT/s QPI,Turbo,HT,14C/28T (120W) Max Mem 2400MHz",1,null,"[338-BJDO]"]
[]
[null,"Processore aggiuntivo"]
[null,"No Additional Processor",{"$f":"VLOOKUP($B$29, CPU_B, 2, FALSE)","v":0},{"$f":"VLOOKUP($B$29, CPU_B, 3, FALSE)","v":""},{"$f":"VLOOKUP($B$29, CPU_B, 5, FALSE)","v":"[374-BBBX]"},{"$f":"VLOOKUP(B29, CPU_B, 12, FALSE)","v":0}]
[]
[null,"Processor Thermal Configuration"]
[null,"1 CPU Standard",1,null,"[370-ABWF][374-BBHM][750-AAEL]"]
[null,{"$f":"VLOOKUP($B$29, CPU_B, 6, FALSE)","v":""},{"$f":"VLOOKUP($B$29, CPU_B, 7, FALSE)","v":""},null,{"$f":"VLOOKUP($B$29, CPU_B, 8, FALSE)","v":""}]
[]
[null,"Tipo di configurazione memoria"]
[null,"Performance Optimized",1,null,"[370-AAIP]"]
[]
[null,"Memoria Totale in GB",null,{"$f":"IF(('Lotto1 R730xd 3'!$D$12=0),\"\",'Lotto1 R730xd 3'!#REF!)","v":""}]
[null,64]
[]
[null,"Tipo e velocità della memoria DIMM"]
[null,"2400MT/s RDIMMs",1,null,"[370-ACPH]"]
[]
[null,"Capacità di memoria"]
[null,"32GB RDIMM, 2400MT/s, Dual Rank, x4 Data Width",2,null,"[370-ACNS]"]
[]
[null,{"$f":"IF($B$29=\"No Additional Processor\",VLOOKUP($B$39, MEM_B1, 2, FALSE),VLOOKUP($B$39, MEM_B2, 2, FALSE))","v":""},{"$f":"IF($B$29=\"No Additional Processor\",VLOOKUP($B$39, MEM_B1, 3, FALSE),VLOOKUP($B$39, MEM_B2, 3, FALSE))","v":""},{"$f":"IF($B$29=\"No Additional Processor\",VLOOKUP($B$39, MEM_B1, 4, FALSE),VLOOKUP($B$39, MEM_B2, 4, FALSE))","v":""},{"$f":"IF($B$29=\"No Additional Processor\",VLOOKUP($B$39, MEM_B1, 6, FALSE),VLOOKUP($B$39, MEM_B2, 6, FALSE))","v":""},{"$f":"IF($B$29=\"No Additional Processor\",VLOOKUP($B$39, MEM_B1, 7, FALSE),VLOOKUP($B$39, MEM_B2, 7, FALSE))","v":""}]
[]
[null,{"$f":"IF($B$29=\"No Additional Processor\",VLOOKUP($B$39, MEM_B1, 11, FALSE),VLOOKUP($B$39, MEM_B2, 11, FALSE))","v":""},{"$f":"IF($B$29=\"No Additional Processor\",VLOOKUP($B$39, MEM_B1, 12, FALSE),VLOOKUP($B$39, MEM_B2, 12, FALSE))","v":""},{"$f":"IF($B$29=\"No Additional Processor\",VLOOKUP($B$39, MEM_B1, 13, FALSE),VLOOKUP($B$39, MEM_B2, 13, FALSE))","v":""},{"$f":"IF($B$29=\"No Additional Processor\",VLOOKUP($B$39, MEM_B1, 15, FALSE),VLOOKUP($B$39, MEM_B2, 15, FALSE))","v":""},{"$f":"IF($B$29=\"No Additional Processor\",VLOOKUP($B$39, MEM_B1, 16, FALSE),VLOOKUP($B$39, MEM_B2, 16, FALSE))","v":""}]
[]
[null,"Sistema operativo preinstallato"]
[null,"No Operating System",{"$f":"VLOOKUP($B$52, OS_B, 2, FALSE)","v":""},{"$f":"VLOOKUP($B$52, OS_B, 3, FALSE)","v":""},{"$f":"VLOOKUP($B$52, OS_B, 5, FALSE)","v":"[611-BBBF]"},{"$f":"VLOOKUP($B$52, OS_B, 6, FALSE)","v":""}]
[null,{"$f":"IF($B$29=\"No Additional Processor\",VLOOKUP($B$52, OS_B, 20, FALSE),VLOOKUP($B$52, OS_B2, 20, FALSE))","v":""},{"$f":"IF($B$29=\"No Additional Processor\",VLOOKUP($B$52, OS_B, 21, FALSE),VLOOKUP($B$52, OS_B2, 21, FALSE))","v":0},{"$f":"IF($B$29=\"No Additional Processor\",VLOOKUP($B$52, OS_A, 22, FALSE),VLOOKUP($B$52, OS_B2, 22, FALSE))","v":""},{"$f":"IF($B$29=\"No Additional Processor\",VLOOKUP($B$52, OS_B, 24, FALSE),VLOOKUP($B$52, OS_B2, 24, FALSE))","v":""},{"$f":"IF($B$29=\"No Additional Processor\",VLOOKUP($B$52, OS_B, 25, FALSE),VLOOKUP($B$52, OS_B2, 25, FALSE))","v":""}]
[]
[null,"OS Media Kits"]
[null,"No Media Required",1,null,"[605-BBFN]"]
[]
[]
[null,"Client Access Licenses"]
[null,{"$f":"VLOOKUP($B$52, OS_B, 8, FALSE)","v":"None"},null,{"$f":"VLOOKUP($B$52, OS_A, 10, FALSE)","v":""},{"$f":"VLOOKUP($B$52, OS_A, 12, FALSE)","v":""},{"$f":"VLOOKUP($B$52, OS_A, 13, FALSE)*C60","v":0}]
[]
[null,{"$f":"VLOOKUP($B$52, OS_A, 14, FALSE)","v":"None"},null,{"$f":"VLOOKUP($B$52, OS_A, 16, FALSE)","v":""},{"$f":"VLOOKUP($B$52, OS_A, 18, FALSE)","v":""},{"$f":"VLOOKUP($B$52, OS_A, 19, FALSE)*C62","v":0}]
[]
[null,"Sistema operativo SUSE Linux Enterprise Server"]
[null,"None\n",{"$f":"VLOOKUP($B$65,SUSE, 2, FALSE)","v":0},{"$f":"VLOOKUP($B$65,SUSE, 3, FALSE)","v":""},{"$f":"VLOOKUP($B$65,SUSE, 5, FALSE)","v":""},null,{"$f":"VLOOKUP($B$65, SUSE, 6, FALSE)*C65","v":0}]
[]
[null,"Sistema operativo VMware"]
[null,"None",{"$f":"VLOOKUP($B$68,VMWARE, 2, FALSE)+C29","v":0},{"$f":"VLOOKUP($B$68,VMWARE, 3, FALSE)","v":""},{"$f":"VLOOKUP($B$68,VMWARE, 5, FALSE)","v":""},null,{"$f":"VLOOKUP($B$68, VMWARE, 6, FALSE)*C68","v":0}]
[]
[null,"VMware vCenter Server Standard"]
[null,"None",{"$f":"VLOOKUP($B$71,VMWARE2, 2, FALSE)","v":0},{"$f":"VLOOKUP($B$71,VMWARE2, 3, FALSE)","v":""},{"$f":"VLOOKUP($B$71,VMWARE2, 5, FALSE)","v":""},null,{"$f":"VLOOKUP($B$71, VMWARE2, 6, FALSE)*C71","v":0}]
[]
[null,"Essentials Plus Kit"]
[null,"None",{"$f":"IF(SRV_A<4,VLOOKUP($B$74,VMWARE1, 2, FALSE),0)","v":0},{"$f":"VLOOKUP($B$74,VMWARE1, 3, FALSE)","v":""},{"$f":"VLOOKUP($B$74,VMWARE1, 5, FALSE)","v":""},null,{"$f":"VLOOKUP($B$74, VMWARE1, 6, FALSE)*C74","v":0}]
[]
[null,"Controller"]
[null,"PERC H730P Integrated RAID Controller, 2GB Cache",{"$f":"VLOOKUP($B$77,PERC, 2, FALSE)","v":0},{"$f":"VLOOKUP($B$77,PERC, 3, FALSE)","v":""},{"$f":"VLOOKUP($B$77,PERC, 4, FALSE)","v":""},{"$f":"VLOOKUP($B$77,PERC, 6, FALSE)","v":""},{"$f":"VLOOKUP($B$77,PERC, 7, FALSE)","v":0}]
[]
[null,"Dischi rigidi  (numero massimo totale 24)"]
[null,"300GB 10K RPM SAS 12Gbps 2.5in Hot-plug Hard Drive",2,null,"[400-AJPK]"]
[]
[null,"300GB 10K RPM SAS 12Gbps 2.5in Hot-plug Hard Drive,CusKit",null,{"$f":"VLOOKUP($B$82, HDD_A,3, FALSE)","v":"TS1L1-HD300"},{"$f":"VLOOKUP($B$82, HDD_A,5, FALSE)","v":"[400-AJOQ]"},{"$f":"VLOOKUP($B$82, HDD_B,6, FALSE)*C82","v":0}]
[]
[null,"1.2TB 10K RPM SAS 12Gbps 2.5in Hot-plug Hard Drive,CusKit",null,{"$f":"VLOOKUP($B$84, HDD_A,3, FALSE)","v":"TS1L1-HD1200"},{"$f":"VLOOKUP($B$84, HDD_A,5, FALSE)","v":"[400-AJPD]"},{"$f":"VLOOKUP($B$84, HDD_B,6, FALSE)*C84","v":0}]
[]
[null,"1.8TB 10K RPM SAS 12Gbps 512e 2.5in Hot-plug Hard Drive,CusKit",null,"TS1L1-HD1800","[400-AJQP]",{"$f":"VLOOKUP($B$86, HDD_B,6, FALSE)*C86","v":0}]
[]
[null,"960GB Solid State Drive SAS Mix Use MLC 2.5in Hot-plug Drive, PX04SV, Cus Kit",null,"TS1L1-SSD800","[400-ANNX]",{"$f":"VLOOKUP($B$88, HDD_B,6, FALSE)*C88","v":0}]
[]
[null,"1.92TB Solid State Drive SAS Mix Use MLC 2.5in Hot-plug Drive, PX04SV, Cus Kit",null,"TS1L1-SSD1920","[400-ANMN]",{"$f":"VLOOKUP($B$90, HDD_B,6, FALSE)*C90","v":0}]
[]
[null,"DISCHI TOTALI",{"$f":"SUM(C80:C91)","v":2},{"$f":"IF(C92<=24,\"      OK\",\"     ERRORE:   Totale n° di dischi superiore al consentito\")","v":"      OK"}]
[]
[null,"Configurazione RAID"]
[null,"C3 - RAID 1 for H330 (2 HDDs)",1,null,{"$f":"VLOOKUP($B$95,  RAID_B1, 2, FALSE)","v":"[780-BBJK]"}]
[null,"Hot Spare for 300GB HDD","No"]
[null,"SCRIVERE QUI' LA CONFIGURAZIONE RAID RICHIESTA.\nR730XD 3\n",null,null,null,null,null,{"$f":"IF(B97=\"SCRIVERE QUI' LA CONFIGURAZIONE RAID RICHIESTA.\nR730XD 3\n\",\"ATTENZIONE COMPILARE IL CAMPO DELLA SCELTA RAID\", \"\")","v":"ATTENZIONE COMPILARE IL CAMPO DELLA SCELTA RAID"}]
[null,"Configurazione RAID HDD 1TB"]
[null,"",1,null,{"$f":"VLOOKUP($B$99,  RAID_B2, 2, FALSE)","v":""}]
[null,"Hot Spare for 1TB HDD","No"]
[]
[null,"Impostazioni del BIOS per la gestione dell'alimentazione"]
[null,"Performance BIOS Setting",1,null,"[384-BBBL]"]
[]
[null,"Alimentatore"]
[null,"Dual, Hot-plug, Redundant Power Supply (1+1), 750W, Titanium, 200-240VAC",1,null,"[450-ADWT]"]
[]
[null,"Cavi di alimentazione"]
[null,"Rack Power Cord 2M (C13/C14 12A)",2,null,"[450-AADY]"]
[]
[null,"PCIe Riser"]
[null,"Risers with up to 4, x8 PCIe Slots + 2, x16 PCIe Slots",1,null,"[330-BBCO][330-BBCR]"]
[]
[null,"TPM Module"]
[null,"PowerEdge Server FIPS TPM 2.0",1,null,"[461-AADM]"]
[]
[null,"Embedded Systems Management"]
[null,"iDRAC8 Enterprise, integrated Dell Remote Access Controller, Enterprise",1,null,"[385-BBHO]"]
[]
[null,"Adattatore di rete"]
[null,"Broadcom 5720 QP 1Gb Network Daughter Card",1,null,"[540-BBBW]"]
[]
[null,"Modulo Doppia SD"]
[null,"None ",{"$f":"VLOOKUP($B$124,upsell_1, 2, FALSE)","v":0},{"$f":"VLOOKUP($B$124,upsell_1, 3, FALSE)","v":""},{"$f":"VLOOKUP($B$124,upsell_1, 4, FALSE)","v":""},{"$f":"VLOOKUP($B$124,upsell_1, 6, FALSE)","v":""},{"$f":"VLOOKUP($B$124,upsell_1, 7, FALSE)","v":0}]
[]
[null,"Additional Card for PCIe Slot 6 (Full height) (CPU 1)"]
[null,"Broadcom 5719 QP 1Gb Network Interface Card",{"$f":"VLOOKUP($B$127,  PCI_B1, 2, FALSE)","v":""},{"$f":"VLOOKUP($B$127,  PCI_B1, 3, FALSE)","v":""},{"$f":"VLOOKUP($B$127,  PCI_B1, 5, FALSE)","v":"540-BBCW"},{"$f":"VLOOKUP($B$127,  PCI_B1, 6, FALSE)","v":""},{"$f":"VLOOKUP($B$127,  PCI_B1, 7, FALSE)","v":0}]
[]
[null,"Additional Card for PCIe Slot 5 (Full height) (CPU 1)"]
[null,"None",{"$f":"VLOOKUP($B$130,  PCI_B2, 2, FALSE)","v":""},{"$f":"VLOOKUP($B$130,  PCI_B2, 3, FALSE)","v":""},{"$f":"VLOOKUP($B$130,  PCI_B2, 5, FALSE)","v":""},{"$f":"VLOOKUP($B$130,  PCI_B2, 6, FALSE)","v":""},{"$f":"VLOOKUP($B$130,  PCI_B2, 7, FALSE)","v":0}]
[]
[null,"Additional Card for PCIe Slot 4 (Full height) (CPU 2)"]
[null,"Aggiungere Secondo Processore",{"$f":"IF(B133=\"Aggiungere Secondo Processore\",\"\",(VLOOKUP(B133,PCI_B3, 2, FALSE)))","v":""},{"$f":"IF(B133=\"Aggiungere Secondo Processore\",\"\",(VLOOKUP(B133,  PCI_B3, 3, FALSE)))","v":""},{"$f":"IF(B133=\"Aggiungere Secondo Processore\",\"\",VLOOKUP($B$133,PCI_B3,5,FALSE))","v":""},{"$f":"IF(B133=\"Aggiungere Secondo Processore\",0,VLOOKUP($B$133,PCI_B3,6,FALSE))","v":0},{"$f":"IF(B133=\"Aggiungere Secondo Processore\",0,VLOOKUP($B$133,PCI_B3,7,FALSE))","v":0}]
[]
[null,"Additional Card for PCIe Slot 3 (Low Profile) (CPU 2)"]
[null,"Aggiungere Secondo Processore",{"$f":"IF(B136=\"Aggiungere Secondo Processore\",\"\",(VLOOKUP(B136,PCI_B4, 2, FALSE)))","v":""},{"$f":"IF(B136=\"Aggiungere Secondo Processore\",\"\",(VLOOKUP(B136,  PCI_B4, 3, FALSE)))","v":""},{"$f":"IF(B136=\"Aggiungere Secondo Processore\",\"\",VLOOKUP($B$136,PCI_B4,5,FALSE))","v":""},{"$f":"IF(B136=\"Aggiungere Secondo Processore\",0,VLOOKUP($B$136,PCI_B4,6,FALSE))","v":0},{"$f":"IF(B136=\"Aggiungere Secondo Processore\",0,VLOOKUP($B$136,PCI_B4,7,FALSE))","v":0}]
[]
[null,"Additional Card for PCIe Slot 2 (Low Profile) (CPU 2)"]
[null,"Aggiungere Secondo Processore",{"$f":"IF(B139=\"Aggiungere Secondo Processore\",\"\",(VLOOKUP(B139,PCI_B5, 2, FALSE)))","v":""},{"$f":"IF(B139=\"Aggiungere Secondo Processore\",\"\",(VLOOKUP(B139,  PCI_B5, 3, FALSE)))","v":""},{"$f":"IF(B139=\"Aggiungere Secondo Processore\",\"\",VLOOKUP($B$139,PCI_B5,5,FALSE))","v":""},{"$f":"IF(B139=\"Aggiungere Secondo Processore\",0,VLOOKUP($B$139,PCI_B5,6,FALSE))","v":0},{"$f":"IF(B139=\"Aggiungere Secondo Processore\",0,VLOOKUP($B$139,PCI_B5,7,FALSE))","v":0}]
[]
[null,"Additional Card for PCIe Slot 1 (Low Profile) (CPU 2)"]
[null,"Aggiungere Secondo Processore",{"$f":"IF(B142=\"Aggiungere Secondo Processore\",\"\",(VLOOKUP(B142,PCI_B6, 2, FALSE)))","v":""},{"$f":"IF(B142=\"Aggiungere Secondo Processore\",\"\",(VLOOKUP(B142,  PCI_B6, 3, FALSE)))","v":""},{"$f":"IF(B142=\"Aggiungere Secondo Processore\",\"\",VLOOKUP($B$142,PCI_B5,5,FALSE))","v":""},{"$f":"IF(B142=\"Aggiungere Secondo Processore\",0,VLOOKUP($B$142,PCI_B5,6,FALSE))","v":0},{"$f":"IF(B142=\"Aggiungere Secondo Processore\",0,VLOOKUP($B$142,PCI_B5,7,FALSE))","v":0}]
[]
[null,"Pannello frontale"]
[null,"No Bezel Option",1,null,"350-BBBW"]
[]
[null,"Guide per rack"]
[null,"ReadyRails™ Sliding Rails Without Cable Management Arm",1,null,"[770-BBBQ]"]
[]
[null,"Server Accessories"]
[null,"PowerEdge SFP+, 10GbE SR/SX, Optical Tranceiver, LC Connector, for Intel and Broadcom,CusKit",{"$f":"(VLOOKUP(B142,PCI_A2,8,FALSE))+((VLOOKUP(B127,PCI_A1,8,FALSE)))","v":{"$error":"#N/A"}},null,"[407-BBQE]"]
[]
[null,"System Documentation"]
[null,"Electronic System Documentation and OpenManage DVD Kit",1,null,"[631-AAJG]"]
[]
[null,"SHIPPING"]
[null,"PowerEdge R730xd Shipping EMEA1 (English/French/German/Spanish/Russian/Hebrew)",1,null,"[340-AMGS]"]
[]
[null,"Order Information"]
[null,"PowerEdge Order - EMEA",1,null,"[800-11671]"]
[]
[null,"Base warranty"]
[null,"3Yr Basic Warranty - Next Business Day - Minimum Warranty",1,null,"[709-12780][709-12781]"]
[]
[null,"Servizi di assitenza"]
[null,"Dell Channel Order - Service Info only",1,null,"[710-31085]"]
[]
[null,"Aggiornamenti della garanzia"]
[null,"None",{"$f":"VLOOKUP($B$169,  SO_B1,2, FALSE)","v":""},{"$f":"VLOOKUP($B$169,  SO_B1, 3, FALSE)","v":""},{"$f":"VLOOKUP($B$169,  SO_B1, 5, FALSE)","v":""},{"$f":"VLOOKUP($B$169,  SO_B1, 6, FALSE)","v":""}]
[]
[null,"Protezione dei dati - Keep Your Hard Drive "]
[null,"None",{"$f":"VLOOKUP($B$172,  SO_B2, 2, FALSE)","v":""},{"$f":"VLOOKUP($B$172,  SO_B2, 3, FALSE)","v":""},{"$f":"VLOOKUP($B$172,  SO_B2,5, FALSE)","v":""},{"$f":"VLOOKUP($B$172,  SO_B2, 6, FALSE)","v":""}]
[]
[null,"Servizi di Installazione"]
[null,"No Installation Service Selected",1,null,"[683-11870]"]
[]
[null,"Channel only - Support Extension"]
[null,"Channel 39M Basic Warranty - Next Business Day",1,null,"[723-28780]"]
[]
[null,"Warranty Upgrades - Non-Std/Local POS"]
[null,"CSTM CONSIP - 39M Onsite Labor Support for CRU for Servers with Basic Warranty",1,null,"[681-24467]"]

{"sheet":"Codici","index":17,"n_rows":174,"n_cols":21,"rows_kept":174,"cut":false,"hidden":true,"merged":[[56,0,57,0],[56,1,57,1],[58,0,59,0],[58,1,59,1],[103,0,104,0],[88,0,90,0],[88,1,90,1],[91,0,93,0],[91,1,93,1],[12,12,14,12],[12,19,14,19],[12,20,14,20],[18,2,19,2],[20,2,21,2],[22,2,23,2],[24,2,25,2],[26,20,27,20],[26,9,27,9],[26,10,27,10],[26,11,27,11],[26,12,27,12],[26,19,27,19],[22,10,23,10],[22,11,23,11],[22,12,23,12],[22,19,23,19],[22,20,23,20],[20,10,21,10],[20,12,21,12],[20,19,21,19],[20,20,21,20],[18,6,19,6],[20,6,23,6],[1,11,2,11],[1,12,2,12],[1,19,2,19],[1,20,2,20],[1,6,2,6],[1,7,2,7],[1,8,2,8],[1,9,2,9],[1,10,2,10],[30,6,31,6],[24,10,25,10],[24,11,25,11],[24,12,25,12],[24,19,25,19],[24,20,25,20],[24,7,25,7],[24,8,25,8],[24,9,25,9],[22,7,23,7],[22,8,23,8],[22,9,23,9],[24,6,27,6],[26,7,27,7],[26,8,27,8],[20,11,21,11],[10,0,12,0],[10,1,12,1],[18,0,19,0],[18,1,19,1],[12,6,14,6],[12,7,14,7],[12,8,14,8],[12,9,14,9],[12,10,14,10],[12,11,14,11],[20,7,21,7],[20,8,21,8],[20,9,21,9],[4,0,5,0],[4,1,5,1],[6,0,7,0],[6,1,7,1],[24,0,25,0],[24,1,25,1],[45,1,48,1],[45,2,48,2],[20,0,21,0],[20,1,21,1],[22,0,23,0],[22,1,23,1],[132,1,135,1],[103,1,104,1],[105,1,106,1],[107,1,108,1],[109,1,110,1],[109,0,110,0],[94,0,95,0],[94,1,95,1],[132,2,135,2],[109,2,110,2],[103,2,104,2],[105,0,106,0],[105,2,106,2],[107,0,108,0],[107,2,108,2],[141,0,142,0],[141,1,142,1],[168,1,171,1],[168,2,171,2],[144,0,146,0],[144,1,146,1],[160,0,162,0],[160,1,162,1],[160,2,162,2],[150,1,151,1],[150,0,151,0]]}
["Codici",null,null,null,null,null,null,"CODICE CONVERGE",null,"CODICE CONVENZIONE",null,"Nr. Offerta","Version",null,"Product Number","Description","Qty","Prezzo Listino","Offering","TOTAL Offering","Prezzo CONSIP"]
["TS1L1-R630","Rack Base",1720,1,"Server DELL EMC PowerEdge R630, 1U, 1 x Intel Xeon E5-2640 v4, RAM 32GB, 2 x HDD 300GB 10k 2.5\"",null,null,"TS1L1-R630",{"$f":"LEN(H2)","v":10},"TS1L1-R630",{"$f":"LEN(J2)","v":10},15900100,12,null,null,null,1,5608,null,{"$f":"SUMPRODUCT(Q2:Q3,S2:S3)","v":0},1720]
[{"$f":"\"\"","v":""},{"$f":"\"\"","v":""},{"$f":"\"\"","v":""},{"$f":"\"\"","v":""},{"$f":"\"\"","v":""},null,null,null,null,null,null,null,null,null,null,"Cavi di rete"]
["TS1L1-WIN1","OpzWinServ1",598,1,"Windows Server 2016,Standard,ROK,16CORE (for Distributor sale only)",null,"R630","CODICE CONVERGE",null,"CODICE CONVENZIONE",null,null,null,null,"Product Number","Description","Qty","Prezzo Listino","Offering","TOTAL Offering","Prezzo CONSIP"]
["TS1L1-CALDEV","OpzDeviceCal",22,1,"1-pack of Windows Server 2016,2012 Device CALs (Standard or Datacenter),CUS",null,"OpzWinServ1","TS1L1-WIN1",{"$f":"LEN(H5)","v":10},"TS1L1-WIN1-R630",{"$f":"LEN(J5)","v":15},15902257,11,null,"634-BIPU","Windows Server 2016,Standard,ROK,16CORE (for Distributor sale only)",1,625,null,{"$f":"S5*Q5","v":0},598]
[null,null,null,1,"5-pack of Windows Server 2016 Device CALs (Standard or Datacenter),CUS",null,null,null,null,null,null,15911903,5,null,"634-BIPU","Windows Server 2016,Standard,ROK,16CORE (for Distributor sale only)",1,529,null,0]
["TS1L1-CALUSER","OpzUserCal",25,1,"1-pack of Windows Server 2016,2012 User CALs (Standard or Datacenter),CUS",null,"OpzDeviceCal","TS1L1-CALDEV",{"$f":"LEN(H7)","v":12},"TS1L1-CALDEV-R630",{"$f":"LEN(J7)","v":17},15902257,11,null,"623-BBBX","1-pack of Windows Server 2016,2012 Device CALs (Standard or Datacenter),CUS",1,44,null,0,22]
[null,null,null,1,"5-pack of Windows Server 2016 USER CALs (Standard or Datacenter),CUS",null,null,null,null,null,null,15911903,5,null,"623-BBBU","5-pack of Windows Server 2016 Device CALs (Standard or Datacenter),CUS",null,95]
["TS1L1-WIN2CORE","OpzWinServ 2 core",75,null,"Windows Server 2016 Standard Ed, Additional Lic,ROK,2CORE",null,"OpzUserCal","TS1L1-CALUSER",{"$f":"LEN(H9)","v":13},"TS1L1-CALUSER-R630",18,15902257,11,null,"623-BBCC","1-pack of Windows Server 2016,2012 User CALs (Standard or Datacenter),CUS",1,57,null,0,25]
["TS1L1-LINUX","OpzOpenSource",47,null,"DVD Linux Centos 7.x",null,null,null,null,null,null,15911903,5,null,"623-BBBY","5-pack of Windows Server 2016 USER CALs (Standard or Datacenter),CUS",null,125]
["TS1L1-CPU-R630","Opz1P",728,1,"Intel Xeon Processor E5-2640 V4\n(Intel Xeon E5-2640 v4 2.4GHz 25M Cache 8.0GT/s QPI Turbo HT 10C/20T)",null,"OpzWinServ 2 core","TS1L1-WIN2CORE",{"$f":"LEN(H11)","v":14},"TS1L1-WIN2CORE-R630",19,15902257,11,null,"634-BJQW","Windows Server 2016 Standard Ed, Additional Lic,ROK,2CORE",1,83,null,0,75]
[null,null,null,1,"R630 PCIe Riser for up to 2, x16 PCIe Slots for x8, 2 PCIe Chassis with 2 Processors,CusKit",null,"OpzOpenSource","TS1L1-LINUX",{"$f":"LEN(H12)","v":11},"TS1L1-LINUX-R630",16,null,null,null,null,null,null,null,null,0,47]
[null,null,null,1,"Kit - 120W Heatsink for PowerEdge R630",null,"Opz1P","TS1L1-CPU-R630",{"$f":"LEN(H13)","v":14},"TS1L1-CPU-R630",14,15902257,11,null,"338-BJET","Intel Xeon E5-2640 v4 2.4GHz,25M Cache,8.0GT/s QPI,Turbo,HT,10C/20T (90W) Max Mem 2133MHz,processor only,Cust Kit",1,1262.99,null,{"$f":"SUMPRODUCT(Q13:Q15,S13:S15)","v":0},728]
["TS1L1-16GB","OpzRam16",122,1,"Kit Upgrade Ram 16GB",null,null,null,null,null,null,null,null,null,"412-AAFB","Kit - 120W Heatsink for PowerEdge R630",1,59.99]
["TS1L1-32GB","OpzRam32",313,1,"Kit Upgrade Ram 32GB",null,null,null,{"$f":"LEN(H15)","v":0},null,0,null,null,null,"330-BBCM","R630 PCIe Riser for up to 2, x16 PCIe Slots for x8, 2 PCIe Chassis with 2 Processors,CusKit",1,29.99]
["TS1L1-64GB","OpzRam64",618,1,"Kit Upgrade Ram 64GB",null,"OpzRam16","TS1L1-16GB",10,"TS1L1-16GB-R630",15,15902257,11,null,"A8711887","Dell 16 GB Modulo di memoria da determinati - 2RX8 RDIMM 2400MHz",1,333.74,null,{"$f":"S16*Q16","v":0},122]
["TS1L1-1GB","OpzGigabit",35,1,"Scheda Lan Gigabit Low\n(Broadcom 5720 DP 1Gb Network Interface Card, Low Profile,CusKit)",null,"OpzRam32","TS1L1-32GB",10,"TS1L1-32GB-R630",15,15902257,11,null,"A8711888","Dell 32 GB Modulo di memoria da determinati - 2Rx4 DDR4 RDIMM 2400MHz",1,660.28,null,{"$f":"S17*Q17","v":0},313]
["TS1L1-1GB-L","OpzGigabit",35,1,"Scheda Lan Gigabit Full\n(Broadcom 5720 DP 1Gb Network Interface Card,Full Height,CusKit)",null,"OpzRam64","TS1L1-64GB",10,"TS1L1-64GB-R630",15,15902257,11,null,"A8711890","Dell 64 GB Modulo di memoria da determinati - 4RX4 DDR4 LRDIMM 2400MHz",1,1464.62,null,{"$f":"S18*Q18","v":0},618]
["TS1L1-10GB","OpzGigabit 10GB",147,1,"QLogic 57810 Dual Port 10Gb Low\n(QLogic 57810 Dual Port 10Gb Direct Attach/SFP+ Low Profile Network Adapter,CusKit)",null,"OpzGigabit","TS1L1-1GB",9,"TS1L1-1GB-R630",14,15902257,11,null,"540-BBGY","Broadcom 5720 DP 1Gb Network Interface Card,Full Height,CusKit",1,189.99,null,{"$f":"S19*Q19","v":0},35]
[null,null,null,2,"PowerEdge SFP+, 10GbE SR/SX, Optical Tranceiver, LC Connector, for Intel and Broadcom,CusKit",null,null,"TS1L1-1GB-L",11,"TS1L1-1GB-L-R630",16,15902257,11,null,"540-BBGW","Broadcom 5720 DP 1Gb Network Interface Card, Low Profile,CusKit",1,175.99,null,{"$f":"S20*Q20","v":0},35]
["TS1L1-10GB-L","OpzGigabit 10GB",147,1,"QLogic 57810 Dual Port 10Gb Full\n(QLogic 57810 Dual Port 10Gb Direct Attach/SFP+ Network Adapter,Full Height,CusKit)",null,"OpzGigabit 10 GBs","TS1L1-10GB",10,"TS1L1-10GB-R630",{"$f":"LEN(J21)","v":15},15902257,11,null,"540-BBGS","QLogic 57810 Dual Port 10Gb Direct Attach/SFP+ Network Adapter,Full Height,CusKit",1,497.99,null,{"$f":"SUMPRODUCT(Q21:Q22,S21:S22)","v":0},147]
[null,null,null,2,"PowerEdge SFP+, 10GbE SR/SX, Optical Tranceiver, LC Connector, for Intel and Broadcom,CusKit",null,null,null,null,null,null,15902257,11,null,"407-BBRM","SFP+, Short Range, Optical Transceiver, LC Connector, 10Gb compatible with QLogic 578xx Series, Cuskit",2,169.99]
["TS1L1-CNA","OpzGigabit 10GB CNA",147,1,"QLogic 57810 Dual Port 10Gb CNA Low\n(QLogic 57810 Dual Port 10Gb Direct Attach/SFP+ (CNA), Low Profile,CusKit)",null,null,"TS1L1-10GB-L",{"$f":"LEN(H23)","v":12},"TS1L1-10GB-L-R630",{"$f":"LEN(J23)","v":17},15902257,11,null,"540-BBDX","QLogic 57810 Dual Port 10Gb Direct Attach/SFP+ Low Profile Network Adapter,CusKit",1,497.99,null,{"$f":"SUMPRODUCT(Q23:Q24,S23:S24)","v":0},147]
[null,null,null,2,"PowerEdge SFP+, 10GbE SR/SX, Optical Tranceiver, LC Connector, for Intel and Broadcom,CusKit",null,null,null,null,null,null,15902257,11,null,"407-BBRM","SFP+, Short Range, Optical Transceiver, LC Connector, 10Gb compatible with QLogic 578xx Series, Cuskit",2,169.99]
["TS1L1-CNA-L","OpzGigabit 10GB CNA",147,1,"QLogic 57810 DualPort 10GbCNA Full\n(QLogic 57810 Dual Port 10Gb Direct Attach/SFP+ (CNA),Full Height,CusKit)",null,"OpzGigabit 10 GBs CNA","TS1L1-CNA",{"$f":"LEN(H25)","v":9},"TS1L1-CNA-R630",{"$f":"LEN(J25)","v":14},15902257,11,null,"540-BBGS","QLogic 57810 Dual Port 10Gb Direct Attach/SFP+ Network Adapter,Full Height,CusKit",1,497.99,null,{"$f":"SUMPRODUCT(Q25:Q26,S25:S26)","v":0},147]
[null,null,null,2,"PowerEdge SFP+, 10GbE SR/SX, Optical Tranceiver, LC Connector, for Intel and Broadcom,CusKit",null,null,null,null,null,null,15902257,11,null,"407-BBRM","SFP+, Short Range, Optical Transceiver, LC Connector, 10Gb compatible with QLogic 578xx Series, Cuskit",2,169.99]
["TS1L1-HD300","OpzStorage300",120,1,"HDD 300GB SAS\n(300GB 10K RPM SAS 12Gbps 2.5in Hot-plug Hard Drive,CusKit)",null,null,"TS1L1-CNA-L",{"$f":"LEN(H27)","v":11},"TS1L1-CNA-L-R630",{"$f":"LEN(J27)","v":16},15902257,11,null,"540-BBDX","QLogic 57810 Dual Port 10Gb Direct Attach/SFP+ Low Profile Network Adapter,CusKit",1,497.99,null,{"$f":"SUMPRODUCT(Q27:Q28,S27:S28)","v":0},147]
["TS1L1-HD1200","OpzStorage1Tb",212,1,"HDD 1.2TB SAS\n(1.2TB 10K RPM SAS 12Gbps 2.5in Hot-plug Hard Drive,CusKit)",null,null,null,null,null,null,15902257,11,null,"407-BBRM","SFP+, Short Range, Optical Transceiver, LC Connector, 10Gb compatible with QLogic 578xx Series, Cuskit",2,169.99]
["TS1L1-FC","OpzFibreChannel",311,1,"QLogic 2560 SP Full\n(QLogic 2560, Single Port 8Gb Optical Fibre Channel HBA,Full Height,CusKit)",null,"OpzStorage300","TS1L1-HD300",{"$f":"LEN(H29)","v":11},"TS1L1-HD300-R630",{"$f":"LEN(J29)","v":16},15902257,11,null,"400-AJOQ","300GB 10K RPM SAS 12Gbps 2.5in Hot-plug Hard Drive,CusKit",1,208.99,null,{"$f":"S29*Q29","v":0},120]
["TS1L1-4ANNI","OpzEstensione12",42,1,"Estensione della manutenzione in garanzia per ulteriori 12 mesi",null,"OpzStorage1Tb","TS1L1-HD1200",{"$f":"LEN(H30)","v":12},"TS1L1-HD1200-R630",{"$f":"LEN(J30)","v":17},15902257,11,null,"400-AJPD","1.2TB 10K RPM SAS 12Gbps 2.5in Hot-plug Hard Drive,CusKit",1,579.99,null,0,212]
["TS1L1-5ANNI","OpzEstensione24",85,1,"Estensione della manutenzione in garanzia per ulteriori 24 mesi",null,"OpzFibreChannel","TS1L1-FC",{"$f":"LEN(H31)","v":8},"TS1L1-FC-R630",{"$f":"LEN(J31)","v":13},15902257,11,null,"406-BBEV","QLogic 2560, Single Port 8Gb Optical Fibre Channel HBA,Full Height,CusKit",1,1071.99,null,0,311]
[]
[null,null,null,null,null,null,"OpzEstensione12","TS1L1-4ANNI",{"$f":"LEN(H33)","v":11},"TS1L1-4ANNI-R630",{"$f":"LEN(J33)","v":16},15911903,5,null,"732-34071","1Yr Basic Warranty - Next Business Day Nr. serial number: R630_4Y",1,36,null,0,42]
["TS1L1-UPS","OpzUPS 3000VA",403,1,"UPS MSR 3000 VA",null,"OpzEstensione24","TS1L1-5ANNI",{"$f":"LEN(H34)","v":11},"TS1L1-5ANNI-R630",{"$f":"LEN(J34)","v":16},15911903,5,null,"732-34072","2Yr Basic Warranty - Next Business Day Nr. serial number: R630_5Y",1,72,null,0,85]
[]
["TS1L1-GUI","OpzGUIRack",452,1,"Console KVM per rack"]
["TS1L1-KVMIP","OpzSWGUIRack",577,1,"KVM Switch IP per GUI"]
[]
[]
[]
["TS1L1-RACK","OpzRack",487,null,"Armadio Rack 42U"]
[]
["10L1-SO-WIN","ServOpzSysManWindows",193,1,"System-Network Mng. svc Windows"]
["10L1-SO-LINUX","ServOpzSysManOS",193,1,"System-Network Mng. svc Linux"]
["10L1-SO-PREV","Manutenzione Preventiva",193,1,"Servizi di manutenzione Preventiva"]
["10L1-SO-HDD","Hard-Disk retention",150,1,"Servizio HDD Retention"]
[null,null,null,1,"Servizio HDD Retention 36 mesi"]
[null,null,null,1,"Servizio HDD Retention 48 mesi"]
[null,null,null,1,"Servizio HDD Retention 60 mesi"]
["10L1-SO-12M-P","OpzEstensione12",175,1,"Estensione garanzia 12 mesi Agg."]
["10L1-SO-24M-P","OpzEstensione24",350,1,"Estensione garanzia 24 mesi Agg."]
[]
["TS1L1-R730XD","Rack Prestazionale Alternativo",2371,1,"Server DELL EMC PowerEdge R730xd, 2U, 1 x Intel Xeon E5-2680 v4, RAM 64GB, 2 x HDD 300GB 10k 2.5\""]
["TS1L1-R730","Rack Prestazionale",2371,1,"Server DELL EMC PowerEdge R730, 2U, 1 x Intel Xeon E5-2680 v4, RAM 64GB, 2 x HDD 300GB 10k 2.5\""]
["TS1L1-T630R","Rack Base Alternativo",1720,1,"Server DELL EMC PowerEdge T630, 5U, 1 x Intel Xeon E5-2640 v4, RAM 32GB, 2 x HDD 300GB 10k 2.5\""]
["TS1L1-WIN1","OpzWinServ1",598,1,"Windows Server 2016,Standard,ROK,16CORE (for Distributor sale only)"]
["TS1L1-CALDEV","OpzDeviceCal",22,1,"1-pack of Windows Server 2016,2012 Device CALs (Standard or Datacenter),CUS"]
[null,null,null,1,"5-pack of Windows Server 2016 Device CALs (Standard or Datacenter),CUS"]
["TS1L1-CALUSER","OpzUserCal",25,1,"1-pack of Windows Server 2016,2012 User CALs (Standard or Datacenter),CUS"]
[null,null,null,1,"5-pack of Windows Server 2016 USER CALs (Standard or Datacenter),CUS"]
["TS1L1-WIN2CORE","OpzWinServ 2 core",75,null,"Windows Server 2016 Standard Ed, Additional Lic,ROK,2CORE"]
["TS1L1-LINUX","OpzOpenSource",47,null,"DVD Linux Centos 7.x"]
[]
["TS1L1-HD1800","OpzStorage2Tb",236,1,"1.8TB 10K RPM SAS 12Gbps 512e 2.5in Hot-plug Hard Drive,CusKit"]
["TS1L1-SSD800","OpzStorageSSD800",748,1,"960GB Solid State Drive SAS Mix Use MLC 2.5in Hot-plug Drive, PX04SV, Cus Kit"]
["TS1L1-SSD1920","OpzStorageSSD1,6TB",1795,1,"1.92TB Solid State Drive SAS Mix Use MLC 2.5in Hot-plug Drive, PX04SV, Cus Kit"]
["TS1-874-006887","OpzSUSE1",1350,1,"SUSE Linux Enterprise Server, x86 & x86-64, 1-2 Sockets or 1-2 Virtual Machines, Standard Subscription, 3 Years"]
["TS1-874-006898","OpzSUSE2",2242.5,1,"SUSE Linux Enterprise Server, x86 & x86-64, 1-2 Sockets or 1-2 Virtual Machines, Standard Subscription, 5 Years"]
["TS1-874-006888","OpzSUSE3",2692.5,1,"SUSE Linux Enterprise Server, x86 & x86-64, 1-2 Sockets with Unlimited Virtual Machines, Standard Subscription, 3 Years"]
["TS1-874-006902","OpzSUSE4",4500,1,"SUSE Linux Enterprise Server, x86 & x86-64, 1-2 Sockets with Unlimited Virtual Machines, Standard Subscription, 5 Years"]
["TS1-874-006883","OpzSUSE5",2520,1,"SUSE Linux Enterprise Server, x86 & x86-64, 1-2 Sockets or 1-2 Virtual Machines, Priority Subscription, 3 Year"]
["TS1-874-006894","OpzSUSE6",4200,1,"SUSE Linux Enterprise Server, x86 & x86-64, 1-2 Sockets or 1-2 Virtual Machines, Priority Subscription, 5 Year"]
["TS1-874-006884","OpzSUSE7",5100,1,"SUSE Linux Enterprise Server, x86 & x86-64, 1-2 Sockets with Unlimited Virtual Machines, Priority Subscription, 3 Year"]
["TS1-874-006895","OpzSUSE8",8400,1,"SUSE Linux Enterprise Server, x86 & x86-64, 1-2 Sockets with Unlimited Virtual Machines, Priority Subscription, 5 Year"]
["TS1-646861","OpzPDU32A",289,null,"PDU Vertical 20+4 outlets C13  with MCB - IEC60309 input"]
["TS1-646875","OpzPDU_TRIFASE",349,null,"PDU Vertical  18+6 outlets (C13+C19)  with MCB and ammeter - IEC60309 input - 3 phase"]
["TS1-210-AIKY","OpzVMwareKit3Y",4100,1,"VMware vSphere Essentials Plus, 6CPU, 3YR"]
["TS1-210-AHRT","OpzVMwareS3Y",1463,1,"VMware vSphere Standard, 1CPU, 3YR License/Maintenance"]
["TS1-210-AHRF","OpzVMwareVC3Y",8338,1,"VMware vCenter Standard, 3YR License/Maintenance"]
["TS1-210-AHRP","OpzVMwareEP3Y",4400,1,"VMware vSphere Enterprise Plus, 1CPU, 3YR License/Maintenance"]
["S1-IDSDM16GB","Opz IDSDM",82,null,"Internal Dual SD Module, with 2 16Gb SD Card, Cus Kit"]
["S1-405-AAES","Opz SAS",160,null,"SAS 12Gbps HBA External Controller, Low Profile, CusKit"]
["S1-405-AAER","Opz H830",479,null,"PERC H830 RAID Adapter for External MD14XX Only, 2GB NV Cache, Low Profile,CusKit"]
["S1-540-BBIU","Opz10Gb BaseT",248,null,"QLogic 57810 Dual Port 10Gb Base-T Low Profile Network Adapter,CusKit"]
["S1-406-BBEK","OpzFibreChannel2",810,null,"QLogic 2562, Dual Port 8Gb Optical Fibre Channel HBA,Full Height,CusKit"]
["S1-405-AAJW","OpzHBA330",219,1,"HBA330 Internal 12Gbps SAS HBA,Minicard"]
["S1-RDXCC","OpzRDX",365,null,"Tandberg RDX External drive, black, USB3, con 3 Cartucce da 500 GB"]
["TS1L1-540-BBIW","OpzX710",370,1,"Intel X710 Quad Port 10Gb Direct Attach, SFP+, Converged Network Adapter"]
["TS1L1-CPU-R730","Opz1P",1307,1,"Intel Xeon E5-2680 v4 2.4GHz,35M Cache,9.60GT/s QPI,Turbo,HT,14C/28T (120W) Max Mem 2400MHz,processor only,Cust Kit"]
[null,null,null,1,"Kit - 2U CPU Heatsink for PowerEdge R730 without GPU, or PowerEdge R730x"]
[null,null,null,1,"R730/xd PCIe Riser 1, Right, 3 x8 PCIe Slots with at least 2 Processors,CusKit"]
["TS1L1-CPU-R730X","Opz1P",1307,1,"Intel Xeon E5-2680 v4 2.4GHz,35M Cache,9.60GT/s QPI,Turbo,HT,14C/28T (120W) Max Mem 2400MHz,processor only,Cust Kit"]
[null,null,null,1,"Kit - 2U CPU Heatsink for PowerEdge R730 without GPU, or PowerEdge R730x"]
[null,null,null,1,"R730/xd PCIe Riser 1, Right, 3 x8 PCIe Slots with at least 2 Processors,CusKit"]
["TS1L1-CPU-T630R","Opz1P",728,1,"Intel Xeon E5-2640 v4 2.4GHz,25M Cache,8.0GT/s QPI,Turbo,HT,10C/20T (90W) Max Mem 2133MHz,processor only,Cust Kit"]
[null,null,null,1,"Kit - 105W Heatsink for T630"]
[]
[]
["TS1L1-16GB","OpzRam16",122,1,"Kit Upgrade Ram 16GB"]
["TS1L1-32GB","OpzRam32",313,1,"Kit Upgrade Ram 32GB"]
["TS1L1-64GB","OpzRam64",618,1,"Kit Upgrade Ram 64GB"]
["TS1L1-1GB","OpzGigabit",35,1,"Scheda Lan Gigabit Full\n(Broadcom 5720 DP 1Gb Network Interface Card,Full Height,CusKit)"]
["TS1L1-1GB-L","OpzGigabit",35,1,"Scheda Lan Gigabit Low\n(Broadcom 5720 DP 1Gb Network Interface Card, Low Profile,CusKit)"]
["TS1L1-10GB","OpzGigabit 10GB",147,1,"QLogic 57810 Dual Port 10Gb Full\n(QLogic 57810 Dual Port 10Gb Direct Attach/SFP+ Network Adapter,Full Height,CusKit)"]
[null,null,null,2,"PowerEdge SFP+, 10GbE SR/SX, Optical Tranceiver, LC Connector, for Intel and Broadcom,CusKit"]
["TS1L1-10GB-L","OpzGigabit 10GB",147,1,"QLogic 57810 Dual Port 10Gb Low\n(QLogic 57810 Dual Port 10Gb Direct Attach/SFP+ Low Profile Network Adapter,CusKit)"]
[null,null,null,2,"PowerEdge SFP+, 10GbE SR/SX, Optical Tranceiver, LC Connector, for Intel and Broadcom,CusKit"]
["TS1L1-CNA","OpzGigabit 10GB CNA",147,1,"QLogic 57810 DualPort 10GbCNA Full\n(QLogic 57810 Dual Port 10Gb Direct Attach/SFP+ (CNA),Full Height,CusKit)"]
[null,null,null,2,"PowerEdge SFP+, 10GbE SR/SX, Optical Tranceiver, LC Connector, for Intel and Broadcom,CusKit"]
["TS1L1-CNA-L","OpzGigabit 10GB CNA",147,1,"QLogic 57810 Dual Port 10Gb CNA Low\n(QLogic 57810 Dual Port 10Gb Direct Attach/SFP+ (CNA), Low Profile,CusKit)"]
[null,null,null,2,"PowerEdge SFP+, 10GbE SR/SX, Optical Tranceiver, LC Connector, for Intel and Broadcom,CusKit"]
["TS1L1-HD300","OpzStorage300",120,1,"HDD 300GB SAS\n(300GB 10K RPM SAS 12Gbps 2.5in Hot-plug Hard Drive,CusKit)"]
["TS1L1-HD1200","OpzStorage1Tb",212,1,"HDD 1.2TB SAS\n(1.2TB 10K RPM SAS 12Gbps 2.5in Hot-plug Hard Drive,CusKit)"]
[]
[]
["TS1L1-FC","OpzFibreChannel",311,1,"QLogic 2560 SP Full\n(QLogic 2560, Single Port 8Gb Optical Fibre Channel HBA,Full Height,CusKit)"]
["TS1L1-4ANNI","OpzEstensione12",42,1,"Estensione della manutenzione in garanzia per ulteriori 12 mesi"]
["TS1L1-5ANNI","OpzEstensione24",85,1,"Estensione della manutenzione in garanzia per ulteriori 24 mesi"]
[]
[]
["10L1-UPS","OpzUPS 3000VA",422,1,"UPS MSR 3000 VA"]
[]
["10L1-GUI","OpzGUIRack",461,1,"Console KVM per rack"]
["10L1-KVMIP","OpzSWGUIRack",550,1,"KVM Switch IP per GUI con cavi"]
[]
[]
[]
["10L1-RACK","OpzRack",497,null,"Armadio Rack 42U"]
[]
["10L1-SO-WIN","ServOpzSysManWindows",193,1,"System-Network Mng. svc Windows"]
["10L1-SO-LINUX","ServOpzSysManOS",193,1,"System-Network Mng. svc Linux","1-pack of Windows Server 2012 Device CALs (Standard or Datacenter)"]
["10L1-SO-PREV","Manutenzione Preventiva",193,1,"Servizi di manutenzione Preventiva"]
["10L1-SO-HDD","Hard-Disk retention",150,1,"Servizio HDD Retention"]
[null,null,null,1,"Servizio HDD Retention 36 mesi"]
[null,null,null,1,"Servizio HDD Retention 48 mesi"]
[null,null,null,1,"Servizio HDD Retention 60 mesi"]
["10L1-SO-12M-S","OpzEstensione12",175,1,"Estensione garanzia 12 mesi Agg."]
["10L1-SO-24M-S","OpzEstensione24",350,1,"Estensione garanzia 24 mesi Agg."]
["COD_C"]
["TS1L1-T630","Server Tower Base",2158,1,"DELL PowerEdge T630\n(1CPU Intel® Xeon® E5-2640 v4, 32GB RDIMM, 2xHDD 300GB 10K RPM SAS 12Gbps 2.5in)"]
["TS1L1-T630P","Server Tower Prestazionale",2214,{"$f":"\"\"","v":""},"DELL PowerEdge T630\n(1CPU Intel® Xeon® E5-2650 v4, 64GB RDIMM, 2xHDD 300GB 10K RPM SAS 12Gbps 2.5in)"]
["TS1L1-CPU-T630P","Opz1P",917,null,"Intel Xeon E5-2650 v4 2.2GHz,30M Cache,9.60GT/s QPI,Turbo,HT,12C/24T (105W) Max Mem 2400MHz,processor only,Cust Kit"]
[null,null,null,null,"Kit - 105W Heatsink for T630"]
[{"$f":"\"\"","v":""},{"$f":"\"\"","v":""},{"$f":"\"\"","v":""},{"$f":"\"\"","v":""},{"$f":"\"\"","v":""},null,null,"TS1L1-CPU-T630"]
["TS1L1-CPU-T630","Opz1P",650,1,"Intel Xeon E5-2640 v4 2.4GHz,25M Cache,8.0GT/s QPI,Turbo,HT,10C/20T (90W) Max Mem 2133MHz,processor only,Cust Kit"]
[null,null,null,1,"Kit - 105W Heatsink for T630"]
[]
["TS1L1-16GB","OpzRam16",122,1,"Kit Upgrade Ram 16GB"]
["TS1L1-32GB","OpzRam32",313,1,"Kit Upgrade Ram 32GB"]
["TS1L1-1GB","OpzGigabit",35,1,"Scheda Lan Gigabit Full\n(Broadcom 5720 DP 1Gb Network Interface Card,Full Height,CusKit)"]
["TS1L1-10GB","OpzGigabit 10 GBs",147,1,"QLogic 57810 Dual Port 10Gb Full\n(QLogic 57810 Dual Port 10Gb Direct Attach/SFP+ Network Adapter,Full Height,CusKit)"]
[null,null,null,2,"PowerEdge SFP+, 10GbE SR/SX, Optical Tranceiver, LC Connector, for Intel and Broadcom,CusKit"]
["TS1L1-HD300T","OpzStorage300",111,1,"HDD 300GB SAS\n(300GB 10K RPM SAS 12Gbps 2.5in Hot-plug Hard Drive,3.5in HYB CARR, CusKit)"]
["TS1L1-HD1200T","OpzStorage1Tb",173,1,"HDD 1.2TB SAS\n(1.2TB 10K RPM SAS 12Gbps 2.5in Hot-plug Hard Drive,3.5in HYB CARR, CusKit)"]
["TS1L1-FC","OpzFibreChannel",311,null,"QLogic 2560 SP Full\n(QLogic 2560, Single Port 8Gb Optical Fibre Channel HBA,Full Height,CusKit)"]
[]
["TS1L1-UPS-T","OpzUPS 3000VA",387,1,"UPS MSR 3000 VA"]
["TS1L1-4ANNI","OpzEstensione12",42,1,"Estensione della manutenzione in garanzia per ulteriori 12 mesi"]
["TS1L1-5ANNI","OpzEstensione24",85,1,"Estensione della manutenzione in garanzia per ulteriori 24 mesi"]
[]
["TS1L1-GUI-T","OpzGUIDesk",96,1,"KIT Monitor 19\" + Mouse + Keyboard"]
[null,null,null,1,"Mice : Dell USB Dual Tone Mouse - Grey - 2 button & Scrollwheel - kit"]
[null,null,null,1,"Dell 19 Monitor | E1916H - 47cm(18.5\") Black ITL"]
[]
[]
["10L1-SO-WIN","ServOpzSysManWindows",193,1,"System-Network Mng. svc Windows"]
["10L1-SO-LINUX","ServOpzSysManOS",193,1,"System-Network Mng. svc Linux"]
["10L1-SO-PREV","Manutenzione Preventiva",193,1,"Servizi di manutenzione Preventiva"]
["10L1-SO-HDD","Hard-Disk retention",150,1,"Servizio HDD Retention"]
[null,null,null,1,"Servizio HDD Retention 36 mesi"]
[null,null,null,1,"Servizio HDD Retention 48 mesi"]
[null,null,null,1,"Servizio HDD Retention 60 mesi"]
["10L1-SO-12M-T","OpzEstensione12",175,1,"Estensione garanzia 12 mesi Agg."]
["10L1-SO-24M-T","OpzEstensione24",350,1,"Estensione garanzia 24 mesi Agg."]

{"sheet":"Processor","index":18,"n_rows":36,"n_cols":13,"rows_kept":36,"cut":false,"hidden":true,"merged":[[26,1,26,3]]}
["Additional Processor"]
["Server R630",null,"CPU-A"]
["No Additional Processor",0,{"$f":"\"\"","v":""},null,"[374-BBBX]",{"$f":"\"\"","v":""},{"$f":"\"\"","v":""},{"$f":"\"\"","v":""},"Riser with up to 1, x8 PCIe Slots + 1, x16 PCIe Slots for x8, 2 PCIe Chassis with 1 Processor",1,"[330-BBCS]"]
["Intel Xeon E5-2640 v4 2.4GHz,25M Cache,8.0GT/s QPI,Turbo,HT,10C/20T (90W) Max Mem 2133MHz,processor only,Cust Kit",1,"TS1L1-CPU-R630","TS1L1-CPU-R630","[338-BJET]","Kit - 120W Heatsink for PowerEdge R630",1,"[412-AAFB]","R630 PCIe Riser for up to 2, x16 PCIe Slots for x8, 2 PCIe Chassis with 2 Processors,CusKit",1,"[330-BBCM]",728]
[]
["Server R730xd",null,"CPU-B"]
["No Additional Processor",0,{"$f":"\"\"","v":""},null,"[374-BBBX]",{"$f":"\"\"","v":""},{"$f":"\"\"","v":""},{"$f":"\"\"","v":""},null,null,null,null,{"$f":"\"\"","v":""}]
["Intel Xeon E5-2680 v4 2.4GHz,35M Cache,9.60GT/s QPI,Turbo,HT,14C/28T (120W) Max Mem 2400MHz,processor only,Cust Kit",1,"TS1L1-CPU-R730X","TS1L1-CPU-R730X","[338-BJEV]","Kit - 2U CPU Heatsink for PowerEdge R730 without GPU, or PowerEdge R730x",1,"[412-AAFW]","R730/xd PCIe Riser 1, Right, 3 x8 PCIe Slots with at least 2 Processors,CusKit",1,"330-BBEY",1307]
[]
["Server R730",null,"CPU-B.1"]
["No Additional Processor",0,{"$f":"\"\"","v":""},null,"[374-BBBX]",{"$f":"\"\"","v":""},{"$f":"\"\"","v":""},{"$f":"\"\"","v":""},null,null,null,null,{"$f":"\"\"","v":""}]
["Intel Xeon E5-2680 v4 2.4GHz,35M Cache,9.60GT/s QPI,Turbo,HT,14C/28T (120W) Max Mem 2400MHz,processor only,Cust Kit",1,"TS1L1-CPU-R730","TS1L1-CPU-R730","[338-BJEV]","Kit - 1U CPU Heatsink for PowerEdge R730 with GPU, or CPU with 120W or less",1,"412-AAFV","R730/xd PCIe Riser 1, Right, 3 x8 PCIe Slots with at least 2 Processors,CusKit",1,"330-BBEY",1307]
[]
["Server T630 Rack",null,"CPU-C"]
["No Additional Processor",0,{"$f":"\"\"","v":""},null,"[374-BBBX]",{"$f":"\"\"","v":""},{"$f":"\"\"","v":""},{"$f":"\"\"","v":""},null,null,null,null,{"$f":"\"\"","v":""}]
["Intel Xeon E5-2640 v4 2.4GHz,25M Cache,8.0GT/s QPI,Turbo,HT,10C/20T (90W) Max Mem 2133MHz,processor only,Cust Kit",1,"TS1L1-CPU-T630R","TS1L1-CPU-T630R","[338-BJET]","Kit - 105W Heatsink for T630",1,"[412-AADU]",null,null,null,728]
[]
["Server T630 Tower Base",null,"CPU-D"]
["No Additional Processor",0,{"$f":"\"\"","v":""},null,"[374-BBBX]",{"$f":"\"\"","v":""},{"$f":"\"\"","v":""},{"$f":"\"\"","v":""},null,null,null,null,{"$f":"\"\"","v":""}]
["Intel Xeon E5-2640 v4 2.4GHz,25M Cache,8.0GT/s QPI,Turbo,HT,10C/20T (90W) Max Mem 2133MHz,processor only,Cust Kit",1,"TS1L1-CPU-T630","TS1L1-CPU-T630","[338-BJET]","Kit - 105W Heatsink for T630",1,"[412-AADU]",null,null,null,650]
[]
["Server T630 Tower Base",null,"CPU-E"]
["No Additional Processor",0,{"$f":"\"\"","v":""},null,"[374-BBBX]",{"$f":"\"\"","v":""},{"$f":"\"\"","v":""},{"$f":"\"\"","v":""},null,null,null,null,{"$f":"\"\"","v":""}]
["Intel Xeon E5-2650 v4 2.2GHz,30M Cache,9.60GT/s QPI,Turbo,HT,12C/24T (105W) Max Mem 2400MHz,processor only,Cust Kit",1,"TS1L1-CPU-T630P","TS1L1-CPU-T630P","[338-BJEZ]","Kit - 105W Heatsink for T630",1,"[412-AADU]",null,null,null,917]
[]
[]
["Processore"]
["Intel Xeon E5-2640 v4 2.4GHz 25M Cache 8.0GT/s QPI Turbo HT 10C/20T (90W) Max Mem 2133MHz",1,{"$f":"\"\"","v":""},{"$f":"\"\"","v":""},"[338-BJDL]"]
[]
[]
["Intel Xeon E5-2643 v4 3.4GHz,20M Cache,9.60GT/s QPI,Turbo,HT,6C/12T (135W) Max Mem 2400MHz,processor only,Cust Kit",1,{"$f":"CONCATENATE(\"TS1-L1-\",E31)","v":"TS1-L1-338-BJFF"},"TS1-L1-338-BJFF","338-BJFF",2629.99]
["Intel Xeon E5-2697 v4 2.3GHz,45M Cache,9.60GT/s QPI,Turbo,HT,18C/36T (145W) Max Mem 2400MHz,processor only, Cust Kit",1,{"$f":"CONCATENATE(\"TS1-L1-\",E32)","v":"TS1-L1-338-BJES"},"TS1-L1-338-BJES","338-BJES",4574.99]
[]
[]
["Intel Xeon E5-2643 v4 3.4GHz,20M Cache,9.60GT/s QPI,Turbo,HT,6C/12T (135W) Max Mem 2400MHz,processor only,Cust Kit",1,{"$f":"CONCATENATE(\"TS1-L1-\",E35)","v":"TS1-L1-338-BJFF"},"TS1-L1-338-BJFF","338-BJFF","Kit - 120W Heatsink for PowerEdge R630",1,"[412-AAFB]","R630 PCIe Riser for up to 2, x16 PCIe Slots for x8, 2 PCIe Chassis with 2 Processors,CusKit",1,"[330-BBCM]",null,2629.99]
["Intel Xeon E5-2697 v4 2.3GHz,45M Cache,9.60GT/s QPI,Turbo,HT,18C/36T (145W) Max Mem 2400MHz,processor only, Cust Kit",1,{"$f":"CONCATENATE(\"TS1-L1-\",E36)","v":"TS1-L1-338-BJES"},"TS1-L1-338-BJES","338-BJES","Kit - 120W Heatsink for PowerEdge R630",1,"[412-AAFB]","R630 PCIe Riser for up to 2, x16 PCIe Slots for x8, 2 PCIe Chassis with 2 Processors,CusKit",1,"[330-BBCM]",null,4574.99]

{"sheet":"PCI","index":19,"n_rows":323,"n_cols":11,"rows_kept":323,"cut":false,"hidden":true,"merged":[[88,1,88,3],[91,0,91,3],[92,1,92,3],[62,1,62,3],[66,1,66,3],[69,0,69,3],[70,1,70,3],[84,1,84,3]]}
["Additional Card for PCIe Slot 1 (Low Profile)"]
["R630"]
["None",{"$f":"\"\"","v":""},{"$f":"\"\"","v":""},{"$f":"\"\"","v":""},{"$f":"\"\"","v":""},{"$f":"\"\"","v":""},null,{"$f":"\"\"","v":""},0,{"$f":"\"\"","v":""}]
["Broadcom 5720 DP 1Gb Network Interface Card, Low Profile,CusKit",1,"TS1L1-1GB-L","TS1L1-1GB-L-R630","540-BBGW",35,null,"",0,""]
["QLogic 57810 Dual Port 10Gb Direct Attach/SFP+ Low Profile Network Adapter,CusKit",1,"TS1L1-10GB-L","TS1L1-10GB-L-R630","540-BBDX",147,null,"SFP+, Short Range, Optical Transceiver, LC Connector, 10Gb compatible with QLogic 578xx Series, Cuskit",2,"407-BBRM"]
["QLogic 57810 Dual Port 10Gb CNA Direct Attach/SFP+ Low Profile Network Adapter,CusKit",1,"TS1L1-CNA-L","TS1L1-CNA-L-R630","540-BBDX",147,null,"SFP+, Short Range, Optical Transceiver, LC Connector, 10Gb compatible with QLogic 578xx Series, Cuskit",2,"407-BBRM"]
["QLogic 57810 Dual Port 10Gb Base-T Low Profile Network Adapter,CusKit",1,"S1-540-BBIU","S1-540-BBIU","540-BBIU",null,248]
["PERC H830 RAID Adapter for External MD14XX Only, 2GB NV Cache, Low Profile,CusKit",1,"S1-405-AAER","S1-405-AAER","405-AAER",null,479]
["SAS 12Gbps HBA External Controller, Low Profile, CusKit",1,"S1-405-AAES","S1-405-AAES","405-AAES",null,160]
[]
["Additional Card for PCIe Slot 2 (Full height)"]
["R630"]
["None",{"$f":"\"\"","v":""},{"$f":"\"\"","v":""},{"$f":"\"\"","v":""},{"$f":"\"\"","v":""},{"$f":"\"\"","v":""},null,{"$f":"\"\"","v":""},0,{"$f":"\"\"","v":""}]
["Broadcom 5720 DP 1Gb Network Interface Card,Full Height,CusKit",1,"TS1L1-1GB","TS1L1-1GB-R630","540-BBGY",35,null,"",0,""]
["QLogic 57810 Dual Port 10Gb Direct Attach/SFP+ Network Adapter,Full Height,CusKit",1,"TS1L1-10GB","TS1L1-10GB-R630","540-BBGS",147,null,"SFP+, Short Range, Optical Transceiver, LC Connector, 10Gb compatible with QLogic 578xx Series, Cuskit",2,"407-BBRM"]
["QLogic 57810 Dual Port 10Gb CNA Direct Attach/SFP+ Network Adapter,Full Height,CusKit",1,"TS1L1-CNA","TS1L1-CNA-R630","540-BBGS",147,null,"SFP+, Short Range, Optical Transceiver, LC Connector, 10Gb compatible with QLogic 578xx Series, Cuskit",2,"407-BBRM"]
["QLogic 2560, Single Port 8Gb Optical Fibre Channel HBA,Full Height,CusKit",1,"TS1L1-FC","TS1L1-FC-R630","406-BBEV",311,null,"",0,""]
["Intel X710 Quad Port 10Gb Direct Attach, SFP+, Converged Network Adapter",1,"TS1L1-540-BBIW","TS1L1-540-BBIW","540-BBIW",null,370,null,0]
["QLogic 2562, Dual Port 8Gb Optical Fibre Channel HBA,Full Height,CusKit",1,"S1-406-BBEK","S1-406-BBEK","406-BBEK",null,810,"",0,""]
[]
["Qlogic 2692 Dual Port 16Gb Fibre Channel HBA, Low Profile, Customer Install",1,"TS1-L1-403-BBMT","TS1-L1-403-BBMT","403-BBMT",null,1858.99,null,0,""]
["QLogic 2742 Dual Port 32Gb Fibre Channel HBA, Low Profile, Customer Install",1,"TS1-L1-403-BBMR","TS1-L1-403-BBMR","403-BBMR",null,2785.99,null,0,""]
["QLogic 2740 Single Port 32Gb Fibre Channel HBA, Low Profile, Customer Install",1,"TS1-L1-403-BBMO","TS1-L1-403-BBMO","403-BBMO",null,1884.99,null,0,""]
["Intel Ethernet X540 DP 10GBASE-T Server Adapter, Low Profile,CusKit",1,"TS1-L1-540-BBDT","TS1-L1-540-BBDT","540-BBDT",null,821.99,null,0,""]
["Intel X520 DP 10Gb DA/SFP+ Server Adapter, Low Profile,CusKit",1,"TS1-L1-540-BBDW","TS1-L1-540-BBDW","540-BBDW",null,566.99,null,0,""]
["Broadcom 5719 QP 1Gb Network Interface Card, Low Profile,CusKit",1,"TS1-L1-540-BBHB","TS1-L1-540-BBHB","540-BBHB",null,207.99,null,0,""]
["QLogic 57810 Dual Port 10Gb Base-T Low Profile Network Adapter,CusKit",1,"TS1-L1-540-BBIU","TS1-L1-540-BBIU","540-BBIU",null,635.99,null,0,""]
["Intel X710 Dual Port 10Gb Direct Attach, SFP+, Converged Network Adapter, Low Profile, Cuskit",1,"TS1-L1-540-BBIX","TS1-L1-540-BBIX","540-BBIX",null,749.99,null,0,""]
["QLogic FastLinQ QL45212-DE Dual Port 25GbE SFP28 Adapter, Low Profile, Customer Install",1,"TS1-L1-540-BBQQ","TS1-L1-540-BBQQ","540-BBQQ",null,703.99,null,0,""]
["Intel Omni-Path Host Fabric Adapter 100 Series 1 Port PCIe x16, Low Profile, Customer Install",1,"TS1-L1-540-BBQT","TS1-L1-540-BBQT","540-BBQT",null,1526.99,null,0,""]
["Intel X550 Dual Port 10G Base-T Adapter, Low Profile, Customer Install",1,"TS1-L1-540-BBRG","TS1-L1-540-BBRG","540-BBRG",null,774.99,null,0,""]
["Intel XL710 Dual Port 40G, QSFP+, Low Profile, Customer Install",1,"TS1-L1-540-BBRN","TS1-L1-540-BBRN","540-BBRN",null,1133.99,null,0,""]
["PERC H830 RAID Adapter for External MD14XX Only, 2GB NV Cache, Low Profile,CusKit",1,"TS1-L1-405-AAER","TS1-L1-405-AAER","405-AAER",null,987.99,null,0,""]
["SAS 12Gbps HBA External Controller, Low Profile, CusKit",1,"TS1-L1-405-AAES","TS1-L1-405-AAES","405-AAES",null,318.99,null,0,""]
[]
["QLogic 2742 Dual Port 32Gb Fibre Channel HBA, Customer Install",1,"TS1-L1-403-BBMK","TS1-L1-403-BBMK","403-BBMK",null,2783.99,null,0,""]
["Qlogic 2692 Dual Port 16Gb Fibre Channel HBA, Customer Install",1,"TS1-L1-403-BBMU","TS1-L1-403-BBMU","403-BBMU",null,1858.99,null,0,""]
["Intel X520 DP 10Gb DA/SFP+ Server Adapter,Full Height,CusKit",1,"TS1-L1-540-BBDR","TS1-L1-540-BBDR","540-BBDR",null,667.99,null,0,""]
["Intel Ethernet X540 DP 10GBASE-T Server Adapter,Full Height,CusKit",1,"TS1-L1-540-BBDU","TS1-L1-540-BBDU","540-BBDU",null,737.99,null,0,""]
["Intel X710 Dual Port 10Gb Direct Aattach, SFP+, Converged Network Adapter, Customer Kit",1,"TS1-L1-540-BBIV","TS1-L1-540-BBIV","540-BBIV",null,655.99,null,0,""]
["Intel X710 Quad Port 10Gb Direct Aattach, SFP+, Converged Network Adapter",1,"TS1-L1-540-BBIW","TS1-L1-540-BBIW","540-BBIW",null,1040.99,null,0,""]
["QLogic FastLinQ QL45212-DE Dual Port 25GbE SFP28 Adapter, Customer Install",1,"TS1-L1-540-BBQR","TS1-L1-540-BBQR","540-BBQR",null,703.99,null,0,""]
["Intel Omni-Path Host Fabric Adapter 100 Series 1 Port PCIe x16, Customer Install",1,"TS1-L1-540-BBQU","TS1-L1-540-BBQU","540-BBQU",null,1526.99,null,0,""]
["Intel XL710 Dual Port 40G, QSFP+, Full Height, Customer Install",1,"TS1-L1-540-BBRH","TS1-L1-540-BBRH","540-BBRH",null,1133.99,null,0,""]
["Intel XL710 Dual Port 40G, QSFP+, rNDC, Customer Install",1,"TS1-L1-540-BBRJ","TS1-L1-540-BBRJ","540-BBRJ",null,1306.99,null,0,""]
["Intel X550 Dual Port 10G Base-T Adapter, Full Height, Customer Install",1,"TS1-L1-540-BBRK","TS1-L1-540-BBRK","540-BBRK",null,774.99,null,0,""]
["SAS 12Gbps HBA External Controller, Full Height,CusKit",1,"TS1-L1-405-AADZ","TS1-L1-405-AADZ","405-AADZ",null,324.99,null,0,""]
[]
[]
["PERC H730P Integrated RAID Controller, 2GB Cache",0,{"$f":"\"\"","v":""},{"$f":"\"\"","v":""},{"$f":"\"\"","v":""},{"$f":"\"\"","v":""}]
["HBA330 Internal 12Gbps SAS HBA,Minicard",1,"S1-405-AAJW","405-AAJW","405-AAJW",null,219]
[]
[]
["Broadcom 5720 QP 1Gb Network Daughter Card",1,{"$f":"\"\"","v":""},{"$f":"\"\"","v":""},"[540-BBBW]",{"$f":"\"\"","v":""}]
["Broadcom 5720 QP 1Gb Network Daughter Card",1,{"$f":"\"\"","v":""},{"$f":"\"\"","v":""},"[540-BBBW]",{"$f":"\"\"","v":""}]
["Modulo Doppia SD"]
["None ",0,{"$f":"\"\"","v":""},{"$f":"\"\"","v":""},{"$f":"\"\"","v":""},{"$f":"\"\"","v":""}]
["Internal Dual SD Module, with 2 16Gb SD Card, Cus Kit",1,"S1-IDSDM16GB","S1-IDSDM16GB",{"$f":"\"\"","v":""},{"$f":"\"\"","v":""},82,"upsell_1"]
["Unità ottica interna"]
["No Internal Optical Drive for 8 HDD Chassis",1,{"$f":"\"\"","v":""},{"$f":"\"\"","v":""},"[429-AAQN]",{"$f":"\"\"","v":""}]
["No Internal Optical Drive for 8 HDD Chassis",1,{"$f":"\"\"","v":""},{"$f":"\"\"","v":""},"[429-AAQN]",{"$f":"\"\"","v":""}]
[]
["Pannello frontale"]
["No Bezel Option",1,{"$f":"\"\"","v":""},{"$f":"\"\"","v":""},"[350-BBBW]"]
["No Bezel Option",1,{"$f":"\"\"","v":""},{"$f":"\"\"","v":""},"[350-BBBW]"]
[]
["Guide per rack"]
["ReadyRails™ Sliding Rails Without Cable Management Arm",1,{"$f":"\"\"","v":""},{"$f":"\"\"","v":""},"[770-BBBC]"]
["ReadyRails™ Sliding Rails Without Cable Management Arm",1,{"$f":"\"\"","v":""},{"$f":"\"\"","v":""},"[770-BBBC]"]
[]
["Alimentatore"]
["Dual, Hot-plug, Redundant Power Supply (1+1), 750W, Titanium, 200-240VAC",1,{"$f":"\"\"","v":""},{"$f":"\"\"","v":""},"[450-ADWT]"]
["Dual, Hot-plug, Redundant Power Supply (1+1), 750W, Titanium, 200-240VAC",1,{"$f":"\"\"","v":""},{"$f":"\"\"","v":""},"[450-ADWT]"]
[]
["Broadcom 5720 QP 1Gb Network Daughter Card",1,{"$f":"\"\"","v":""},{"$f":"\"\"","v":""},"[540-BBBW]",{"$f":"\"\"","v":""}]
["QLogic 57840S Quad Port 10Gb SFP+ Direct Attach Rack Network Daughter Card,CusKit",1,"TS1-L1-540-BBEV",{"$f":"\"\"","v":""},"540-BBEV",{"$f":"\"\"","v":""},740.99]
["Modulo Doppia SD"]
["None ",1,{"$f":"\"\"","v":""},{"$f":"\"\"","v":""},{"$f":"\"\"","v":""},{"$f":"\"\"","v":""}]
["Internal Dual SD Module,CusKit + (2 x 16GB SD Card For IDSDM, Cus Kit)",1,"TS1-L1-DSD-16GB",{"$f":"\"\"","v":""},"330-BBCN 385-BBLK 385-BBLK",{"$f":"\"\"","v":""},180]
["Internal Dual SD Module,CusKit + (2 x 32GB SD Card For IDSDM, Cus Kit)",1,"TS1-L1-DSD-32GB",{"$f":"\"\"","v":""},"330-BBCN 385-BBKB 385-BBKB",{"$f":"\"\"","v":""},210,"upsell_1 da sostituire (copia incolla)"]
["Unità ottica interna"]
["No Internal Optical Drive for 8 HDD Chassis",1,{"$f":"\"\"","v":""},{"$f":"\"\"","v":""},"[429-AAQN]",{"$f":"\"\"","v":""}]
["8X DVD+/-RW ROM Drive SATA - Kit",1,{"$f":"CONCATENATE(\"TS1-L1-\",E83)","v":"TS1-L1-429-AATE"},{"$f":"\"\"","v":""},"429-AATE",null,32.99]
[]
["Pannello frontale"]
["No Bezel Option",1,{"$f":"\"\"","v":""},{"$f":"\"\"","v":""},"[350-BBBW]"]
["Dell EMC 1U Standard Bezel,CK",1,{"$f":"CONCATENATE(\"TS1-L1-\",E87)","v":"TS1-L1-325-BCJX"},{"$f":"\"\"","v":""},"325-BCJX",null,85.99]
[]
["Guide per rack"]
["ReadyRails™ Sliding Rails Without Cable Management Arm",1,{"$f":"\"\"","v":""},{"$f":"\"\"","v":""},"[770-BBBC]"]
["ReadyRails™ Sliding Rails With Cable Management Arm",1,{"$f":"CONCATENATE(\"TS1-L1-\",E91)","v":"TS1-L1-770-BBIE"},{"$f":"\"\"","v":""},"770-BBIE",null,111.99]
[]
["Alimentatore"]
["Dual, Hot-plug, Redundant Power Supply (1+1), 750W, Titanium, 200-240VAC",1,{"$f":"\"\"","v":""},{"$f":"\"\"","v":""},"[450-ADWT]"]
["Dual, Hot-plug, Redundant Power Supply (1+1),  1100W, CusKit",2,{"$f":"CONCATENATE(\"TS1-L1-\",E95)","v":"TS1-L1-450-AEBL"},{"$f":"\"\"","v":""},"450-AEBL",null,{"$f":"349.99*B95","v":699.98}]
[]
["Additional Card for PCIe Slot 6 (Full height) (CPU 1)"]
["R730"]
[]
["None","","","","","",null,"",0,""]
["Broadcom 5720 DP 1Gb Network Interface Card,Full Height,CusKit",1,"TS1L1-1GB","TS1L1-1GB-R630","540-BBGY",35,null,"",0,""]
["QLogic 57810 Dual Port 10Gb Direct Attach/SFP+ Network Adapter,Full Height,CusKit",1,"TS1L1-10GB","TS1L1-10GB-R630","540-BBGS",147,null,"SFP+, Short Range, Optical Transceiver, LC Connector, 10Gb compatible with QLogic 578xx Series, Cuskit",2,"407-BBRM"]
["QLogic 57810 Dual Port 10Gb CNA Direct Attach/SFP+ Network Adapter,Full Height,CusKit",1,"TS1L1-CNA","TS1L1-CNA-R630","540-BBGS",147,null,"SFP+, Short Range, Optical Transceiver, LC Connector, 10Gb compatible with QLogic 578xx Series, Cuskit",2,"407-BBRM"]
["Intel X710 Quad Port 10Gb Direct Attach, SFP+, Converged Network Adapter",1,"TS1L1-540-BBIW","TS1L1-540-BBIW","540-BBIW",null,370,"",0,"",{"$f":"\"\"","v":""}]
["QLogic 2560, Single Port 8Gb Optical Fibre Channel HBA,Full Height,CusKit",1,"TS1L1-FC","TS1L1-FC-R630","406-BBEV",311,null,"",0,""]
["QLogic 2562, Dual Port 8Gb Optical Fibre Channel HBA,Full Height,CusKit",1,"S1-406-BBEK","S1-406-BBEK","406-BBEK",null,810,"",0,""]
[]
["Additional Card for PCIe Slot 5 (Full height) (CPU 1)"]
["R730"]
["None","","","","","",null,"",0,""]
["Broadcom 5720 DP 1Gb Network Interface Card,Full Height,CusKit",1,"TS1L1-1GB","TS1L1-1GB-R630","540-BBGY",35,null,"",0,""]
["QLogic 57810 Dual Port 10Gb Direct Attach/SFP+ Network Adapter,Full Height,CusKit",1,"TS1L1-10GB","TS1L1-10GB-R630","540-BBGS",147,null,"SFP+, Short Range, Optical Transceiver, LC Connector, 10Gb compatible with QLogic 578xx Series, Cuskit",2,"407-BBRM"]
["QLogic 57810 Dual Port 10Gb CNA Direct Attach/SFP+ Network Adapter,Full Height,CusKit",1,"TS1L1-CNA","TS1L1-CNA-R630","540-BBGS",147,null,"SFP+, Short Range, Optical Transceiver, LC Connector, 10Gb compatible with QLogic 578xx Series, Cuskit",2,"407-BBRM"]
["Intel X710 Quad Port 10Gb Direct Attach, SFP+, Converged Network Adapter",1,"TS1L1-540-BBIW","TS1L1-540-BBIW","540-BBIW",null,370,"",0,"",{"$f":"\"\"","v":""}]
["QLogic 2560, Single Port 8Gb Optical Fibre Channel HBA,Full Height,CusKit",1,"TS1L1-FC","TS1L1-FC-R630","406-BBEV",311,null,"",0,""]
["QLogic 2562, Dual Port 8Gb Optical Fibre Channel HBA,Full Height,CusKit",1,"S1-406-BBEK","S1-406-BBEK","406-BBEK",null,810,"",0,""]
[]
["Additional Card for PCIe Slot 4 (Full height) (CPU 1)"]
["R730xd"]
["None","","","","","",null,"",0,"",{"$f":"\"\"","v":""}]
["Broadcom 5720 DP 1Gb Network Interface Card,Full Height,CusKit",1,"TS1L1-1GB","TS1L1-1GB-R630","540-BBGY",35,null,"",0,"",""]
["QLogic 57810 Dual Port 10Gb Direct Attach/SFP+ Network Adapter,Full Height,CusKit",1,"TS1L1-10GB","TS1L1-10GB-R630","540-BBGS",147,null,"SFP+, Short Range, Optical Transceiver, LC Connector, 10Gb compatible with QLogic 578xx Series, Cuskit",2,"407-BBRM","[407-BBOK]"]
["QLogic 57810 Dual Port 10Gb CNA Direct Attach/SFP+ Network Adapter,Full Height,CusKit",1,"TS1L1-CNA","TS1L1-CNA-R630","540-BBGS",147,null,"SFP+, Short Range, Optical Transceiver, LC Connector, 10Gb compatible with QLogic 578xx Series, Cuskit",2,"407-BBRM","[407-BBOK]"]
["Intel X710 Quad Port 10Gb Direct Attach, SFP+, Converged Network Adapter",1,"TS1L1-540-BBIW","TS1L1-540-BBIW","540-BBIW",null,370,"",0,"",{"$f":"\"\"","v":""}]
["QLogic 2560, Single Port 8Gb Optical Fibre Channel HBA,Full Height,CusKit",1,"TS1L1-FC","TS1L1-FC-R630","406-BBEV",311,null,"",0,""]
["QLogic 2562, Dual Port 8Gb Optical Fibre Channel HBA,Full Height,CusKit",1,"S1-406-BBEK","S1-406-BBEK","406-BBEK",null,810,"",0,""]
[]
["Additional Card for PCIe Slot 3 (Low Profile) (CPU 2)"]
["R730xd"]
["None","","","","","",null,"",0,"",{"$f":"\"\"","v":""}]
["Broadcom 5720 DP 1Gb Network Interface Card, Low Profile,CusKit",1,"TS1L1-1GB-L","TS1L1-1GB-L-R630","540-BBGW",35,null,"",0,"",""]
["QLogic 57810 Dual Port 10Gb Direct Attach/SFP+ Low Profile Network Adapter,CusKit",1,"TS1L1-10GB-L","TS1L1-10GB-L-R630","540-BBDX",147,null,"SFP+, Short Range, Optical Transceiver, LC Connector, 10Gb compatible with QLogic 578xx Series, Cuskit",2,"407-BBRM","[407-BBOK]"]
["QLogic 57810 Dual Port 10Gb CNA Direct Attach/SFP+ Low Profile Network Adapter,CusKit",1,"TS1L1-CNA-L","TS1L1-CNA-L-R630","540-BBDX",147,null,"SFP+, Short Range, Optical Transceiver, LC Connector, 10Gb compatible with QLogic 578xx Series, Cuskit",2,"407-BBRM"]
["QLogic 57810 Dual Port 10Gb Base-T Low Profile Network Adapter,CusKit",1,"S1-540-BBIU","S1-540-BBIU","540-BBIU",null,248]
["PERC H830 RAID Adapter for External MD14XX Only, 2GB NV Cache, Low Profile,CusKit",1,"S1-405-AAER","S1-405-AAER","405-AAER",null,479]
["SAS 12Gbps HBA External Controller, Low Profile, CusKit",1,"S1-405-AAES","S1-405-AAES","405-AAES",null,160]
[]
["Additional Card for PCIe Slot 2 (Low Profile) (CPU 2)"]
["R730xd"]
["None","","","","","",null,"",0,"",""]
["Broadcom 5720 DP 1Gb Network Interface Card, Low Profile,CusKit",1,"TS1L1-1GB-L","TS1L1-1GB-L-R630","540-BBGW",35,null,"",0,"",""]
["QLogic 57810 Dual Port 10Gb Direct Attach/SFP+ Low Profile Network Adapter,CusKit",1,"TS1L1-10GB-L","TS1L1-10GB-L-R630","540-BBDX",147,null,"SFP+, Short Range, Optical Transceiver, LC Connector, 10Gb compatible with QLogic 578xx Series, Cuskit",2,"407-BBRM","[407-BBOK]"]
["QLogic 57810 Dual Port 10Gb CNA Direct Attach/SFP+ Low Profile Network Adapter,CusKit",1,"TS1L1-CNA-L","TS1L1-CNA-L-R630","540-BBDX",147,null,"SFP+, Short Range, Optical Transceiver, LC Connector, 10Gb compatible with QLogic 578xx Series, Cuskit",2,"407-BBRM"]
["QLogic 57810 Dual Port 10Gb Base-T Low Profile Network Adapter,CusKit",1,"S1-540-BBIU","S1-540-BBIU","540-BBIU",null,248]
["PERC H830 RAID Adapter for External MD14XX Only, 2GB NV Cache, Low Profile,CusKit",1,"S1-405-AAER","S1-405-AAER","405-AAER",null,479]
["SAS 12Gbps HBA External Controller, Low Profile, CusKit",1,"S1-405-AAES","S1-405-AAES","405-AAES",null,160]
[]
["Additional Card for PCIe Slot 1 (Low Profile) (CPU 2)"]
["R730xd"]
["None","","","","","",null,"",0,"",""]
["Broadcom 5720 DP 1Gb Network Interface Card, Low Profile,CusKit",1,"TS1L1-1GB-L","TS1L1-1GB-L-R630","540-BBGW",35,null,"",0,"",""]
["QLogic 57810 Dual Port 10Gb Direct Attach/SFP+ Low Profile Network Adapter,CusKit",1,"TS1L1-10GB-L","TS1L1-10GB-L-R630","540-BBDX",147,null,"SFP+, Short Range, Optical Transceiver, LC Connector, 10Gb compatible with QLogic 578xx Series, Cuskit",2,"407-BBRM","[407-BBOK]"]
["QLogic 57810 Dual Port 10Gb CNA Direct Attach/SFP+ Low Profile Network Adapter,CusKit",1,"TS1L1-CNA-L","TS1L1-CNA-L-R630","540-BBDX",147,null,"SFP+, Short Range, Optical Transceiver, LC Connector, 10Gb compatible with QLogic 578xx Series, Cuskit",2,"407-BBRM"]
["QLogic 57810 Dual Port 10Gb Base-T Low Profile Network Adapter,CusKit",1,"S1-540-BBIU","S1-540-BBIU","540-BBIU",null,248]
["PERC H830 RAID Adapter for External MD14XX Only, 2GB NV Cache, Low Profile,CusKit",1,"S1-405-AAER","S1-405-AAER","405-AAER",null,479]
["SAS 12Gbps HBA External Controller, Low Profile, CusKit",1,"S1-405-AAES","S1-405-AAES","405-AAES",null,160]
[]
[]
[]
["Additional Card for PCIe Slot 6 (Full height) (CPU 1)"]
["R730xd"]
["Broadcom 5719 QP 1Gb Network Interface Card","","","","540-BBCW","",null,"",0,""]
["Broadcom 5720 DP 1Gb Network Interface Card,Full Height,CusKit",1,"TS1L1-1GB","TS1L1-1GB-R630","540-BBGY",35,null,"",0,""]
["QLogic 57810 Dual Port 10Gb Direct Attach/SFP+ Network Adapter,Full Height,CusKit",1,"TS1L1-10GB","TS1L1-10GB-R630","540-BBGS",147,null,"SFP+, Short Range, Optical Transceiver, LC Connector, 10Gb compatible with QLogic 578xx Series, Cuskit",2,"407-BBRM"]
["QLogic 57810 Dual Port 10Gb CNA Direct Attach/SFP+ Network Adapter,Full Height,CusKit",1,"TS1L1-CNA","TS1L1-CNA-R630","540-BBGS",147,null,"SFP+, Short Range, Optical Transceiver, LC Connector, 10Gb compatible with QLogic 578xx Series, Cuskit",2,"407-BBRM"]
["Intel X710 Quad Port 10Gb Direct Attach, SFP+, Converged Network Adapter",1,"TS1L1-540-BBIW","TS1L1-540-BBIW","540-BBIW",null,370,"",0,"",{"$f":"\"\"","v":""}]
["QLogic 2560, Single Port 8Gb Optical Fibre Channel HBA,Full Height,CusKit",1,"TS1L1-FC","TS1L1-FC-R630","406-BBEV",311,null,"",0,""]
["QLogic 2562, Dual Port 8Gb Optical Fibre Channel HBA,Full Height,CusKit",1,"S1-406-BBEK","S1-406-BBEK","406-BBEK",null,810,"",0,""]
[]
["Additional Card for PCIe Slot 5 (Full height) (CPU 1)"]
["R730xd"]
["None","","","","","",null,"",0,""]
["Broadcom 5720 DP 1Gb Network Interface Card,Full Height,CusKit",1,"TS1L1-1GB","TS1L1-1GB-R630","540-BBGY",35,null,"",0,""]
["QLogic 57810 Dual Port 10Gb Direct Attach/SFP+ Network Adapter,Full Height,CusKit",1,"TS1L1-10GB","TS1L1-10GB-R630","540-BBGS",147,null,"SFP+, Short Range, Optical Transceiver, LC Connector, 10Gb compatible with QLogic 578xx Series, Cuskit",2,"407-BBRM"]
["QLogic 57810 Dual Port 10Gb CNA Direct Attach/SFP+ Network Adapter,Full Height,CusKit",1,"TS1L1-CNA","TS1L1-CNA-R630","540-BBGS",147,null,"SFP+, Short Range, Optical Transceiver, LC Connector, 10Gb compatible with QLogic 578xx Series, Cuskit",2,"407-BBRM"]
["Intel X710 Quad Port 10Gb Direct Attach, SFP+, Converged Network Adapter",1,"TS1L1-540-BBIW","TS1L1-540-BBIW","540-BBIW",null,370,"",0,"",{"$f":"\"\"","v":""}]
["QLogic 2560, Single Port 8Gb Optical Fibre Channel HBA,Full Height,CusKit",1,"TS1L1-FC","TS1L1-FC-R630","406-BBEV",311,null,"",0,""]
["QLogic 2562, Dual Port 8Gb Optical Fibre Channel HBA,Full Height,CusKit",1,"S1-406-BBEK","S1-406-BBEK","406-BBEK",null,810,"",0,""]
[]
["Additional Card for PCIe Slot 4 (Full height) (CPU 1)"]
["R730xd"]
["None","","","","","",null,"",0,"",{"$f":"\"\"","v":""}]
["Broadcom 5720 DP 1Gb Network Interface Card,Full Height,CusKit",1,"TS1L1-1GB","TS1L1-1GB-R630","540-BBGY",35,null,"",0,"",""]
["QLogic 57810 Dual Port 10Gb Direct Attach/SFP+ Network Adapter,Full Height,CusKit",1,"TS1L1-10GB","TS1L1-10GB-R630","540-BBGS",147,null,"SFP+, Short Range, Optical Transceiver, LC Connector, 10Gb compatible with QLogic 578xx Series, Cuskit",2,"407-BBRM","[407-BBOK]"]
["QLogic 57810 Dual Port 10Gb CNA Direct Attach/SFP+ Network Adapter,Full Height,CusKit",1,"TS1L1-CNA","TS1L1-CNA-R630","540-BBGS",147,null,"SFP+, Short Range, Optical Transceiver, LC Connector, 10Gb compatible with QLogic 578xx Series, Cuskit",2,"407-BBRM","[407-BBOK]"]
["Intel X710 Quad Port 10Gb Direct Attach, SFP+, Converged Network Adapter",1,"TS1L1-540-BBIW","TS1L1-540-BBIW","540-BBIW",null,370,"",0,"",{"$f":"\"\"","v":""}]
["QLogic 2560, Single Port 8Gb Optical Fibre Channel HBA,Full Height,CusKit",1,"TS1L1-FC","TS1L1-FC-R630","406-BBEV",311,null,"",0,""]
["QLogic 2562, Dual Port 8Gb Optical Fibre Channel HBA,Full Height,CusKit",1,"S1-406-BBEK","S1-406-BBEK","406-BBEK",null,810,"",0,""]
[]
["Additional Card for PCIe Slot 3 (Low Profile) (CPU 2)"]
["R730xd"]
["None","","","","","",null,"",0,"",{"$f":"\"\"","v":""}]
["Broadcom 5720 DP 1Gb Network Interface Card, Low Profile,CusKit",1,"TS1L1-1GB-L","TS1L1-1GB-L-R630","540-BBGW",35,null,"",0,"",""]
["QLogic 57810 Dual Port 10Gb Direct Attach/SFP+ Low Profile Network Adapter,CusKit",1,"TS1L1-10GB-L","TS1L1-10GB-L-R630","540-BBDX",147,null,"SFP+, Short Range, Optical Transceiver, LC Connector, 10Gb compatible with QLogic 578xx Series, Cuskit",2,"407-BBRM","[407-BBOK]"]
["QLogic 57810 Dual Port 10Gb CNA Direct Attach/SFP+ Low Profile Network Adapter,CusKit",1,"TS1L1-CNA-L","TS1L1-CNA-L-R630","540-BBDX",147,null,"SFP+, Short Range, Optical Transceiver, LC Connector, 10Gb compatible with QLogic 578xx Series, Cuskit",2,"407-BBRM"]
["QLogic 57810 Dual Port 10Gb Base-T Low Profile Network Adapter,CusKit",1,"S1-540-BBIU","S1-540-BBIU","540-BBIU",null,248]
["PERC H830 RAID Adapter for External MD14XX Only, 2GB NV Cache, Low Profile,CusKit",1,"S1-405-AAER","S1-405-AAER","405-AAER",null,479]
["SAS 12Gbps HBA External Controller, Low Profile, CusKit",1,"S1-405-AAES","S1-405-AAES","405-AAES",null,160]
[]
["Additional Card for PCIe Slot 2 (Low Profile) (CPU 2)"]
["R730xd"]
["None","","","","","",null,"",0,"",""]
["Broadcom 5720 DP 1Gb Network Interface Card, Low Profile,CusKit",1,"TS1L1-1GB-L","TS1L1-1GB-L-R630","540-BBGW",35,null,"",0,"",""]
["QLogic 57810 Dual Port 10Gb Direct Attach/SFP+ Low Profile Network Adapter,CusKit",1,"TS1L1-10GB-L","TS1L1-10GB-L-R630","540-BBDX",147,null,"SFP+, Short Range, Optical Transceiver, LC Connector, 10Gb compatible with QLogic 578xx Series, Cuskit",2,"407-BBRM","[407-BBOK]"]
["QLogic 57810 Dual Port 10Gb CNA Direct Attach/SFP+ Low Profile Network Adapter,CusKit",1,"TS1L1-CNA-L","TS1L1-CNA-L-R630","540-BBDX",147,null,"SFP+, Short Range, Optical Transceiver, LC Connector, 10Gb compatible with QLogic 578xx Series, Cuskit",2,"407-BBRM"]
["QLogic 57810 Dual Port 10Gb Base-T Low Profile Network Adapter,CusKit",1,"S1-540-BBIU","S1-540-BBIU","540-BBIU",null,248]
["PERC H830 RAID Adapter for External MD14XX Only, 2GB NV Cache, Low Profile,CusKit",1,"S1-405-AAER","S1-405-AAER","405-AAER",null,479]
["SAS 12Gbps HBA External Controller, Low Profile, CusKit",1,"S1-405-AAES","S1-405-AAES","405-AAES",null,160]
[]
["Additional Card for PCIe Slot 1 (Low Profile) (CPU 2)"]
["R730xd"]
["None","","","","","",null,"",0,"",""]
["Broadcom 5720 DP 1Gb Network Interface Card, Low Profile,CusKit",1,"TS1L1-1GB-L","TS1L1-1GB-L-R630","540-BBGW",35,null,"",0,"",""]
["QLogic 57810 Dual Port 10Gb Direct Attach/SFP+ Low Profile Network Adapter,CusKit",1,"TS1L1-10GB-L","TS1L1-10GB-L-R630","540-BBDX",147,null,"SFP+, Short Range, Optical Transceiver, LC Connector, 10Gb compatible with QLogic 578xx Series, Cuskit",2,"407-BBRM","[407-BBOK]"]
["QLogic 57810 Dual Port 10Gb CNA Direct Attach/SFP+ Low Profile Network Adapter,CusKit",1,"TS1L1-CNA-L","TS1L1-CNA-L-R630","540-BBDX",147,null,"SFP+, Short Range, Optical Transceiver, LC Connector, 10Gb compatible with QLogic 578xx Series, Cuskit",2,"407-BBRM"]
["QLogic 57810 Dual Port 10Gb Base-T Low Profile Network Adapter,CusKit",1,"S1-540-BBIU","S1-540-BBIU","540-BBIU",null,248]
["PERC H830 RAID Adapter for External MD14XX Only, 2GB NV Cache, Low Profile,CusKit",1,"S1-405-AAER","S1-405-AAER","405-AAER",null,479]
["SAS 12Gbps HBA External Controller, Low Profile, CusKit",1,"S1-405-AAES","S1-405-AAES","405-AAES",null,160]
[]
[]
["Additional Card for PCIe Slot 1 (Full height) (CPU1)"]
["T630"]
["None",{"$f":"\"\"","v":""},{"$f":"\"\"","v":""},{"$f":"\"\"","v":""},{"$f":"\"\"","v":""},{"$f":"\"\"","v":""},null,"Aggiungere Secondo Processore",{"$f":"\"\"","v":""},0,{"$f":"\"\"","v":""}]
["Broadcom 5720 DP 1Gb Network Interface Card,Full Height,CusKit",1,"TS1L1-1GB","TS1L1-1GB-T630R","[540-BBGY]",35,null,"Aggiungere Secondo Processore","",0,""]
["QLogic 2560, Single Port 8Gb Optical Fibre Channel HBA,Full Height,CusKit",1,"TS1L1-FC","TS1L1-FC-T630R","[406-BBEK]",311,null,"Aggiungere Secondo Processore",null,0,""]
["QLogic 57810 Dual Port 10Gb Direct Attach/SFP+ Network Adapter,Full Height,CusKit",1,"TS1L1-10GB","TS1L1-10GB-T630R","[540-BBGS]",147,null,"Aggiungere Secondo Processore","PowerEdge SFP+, 10GbE SR/SX, Optical Tranceiver, LC Connector, for Intel and Broadcom,CusKit",2,"[407-BBOK]"]
["Intel X710 Quad Port 10Gb Direct Attach, SFP+, Converged Network Adapter",1,"TS1L1-540-BBIW","TS1L1-540-BBIW","540-BBIW",null,370,"Aggiungere Secondo Processore",{"$f":"\"\"","v":""},0,{"$f":"\"\"","v":""}]
["QLogic 2562, Dual Port 8Gb Optical Fibre Channel HBA,Full Height,CusKit",1,"S1-406-BBEK","S1-406-BBEK","406-BBEK",null,810,"Aggiungere Secondo Processore",0,"",""]
[]
[]
["Additional Card for PCIe Slot 2 (Full height) (CPU1)"]
["T630"]
["None",{"$f":"\"\"","v":""},{"$f":"\"\"","v":""},{"$f":"\"\"","v":""},{"$f":"\"\"","v":""},{"$f":"\"\"","v":""},null,"Aggiungere Secondo Processore",{"$f":"\"\"","v":""},0,{"$f":"\"\"","v":""}]
["Broadcom 5720 DP 1Gb Network Interface Card,Full Height,CusKit",1,"TS1L1-1GB","TS1L1-1GB-T630R","[540-BBGY]",35,null,"Aggiungere Secondo Processore","",0,""]
["QLogic 2560, Single Port 8Gb Optical Fibre Channel HBA,Full Height,CusKit",1,"TS1L1-FC","TS1L1-FC-T630R","[406-BBEK]",311,null,"Aggiungere Secondo Processore",null,0,""]
["QLogic 57810 Dual Port 10Gb Direct Attach/SFP+ Network Adapter,Full Height,CusKit",1,"TS1L1-10GB","TS1L1-10GB-T630R","[540-BBGS]",147,null,"Aggiungere Secondo Processore","PowerEdge SFP+, 10GbE SR/SX, Optical Tranceiver, LC Connector, for Intel and Broadcom,CusKit",2,"[407-BBOK]"]
["Intel X710 Quad Port 10Gb Direct Attach, SFP+, Converged Network Adapter",1,"TS1L1-540-BBIW","TS1L1-540-BBIW","540-BBIW",null,370,"Aggiungere Secondo Processore",{"$f":"\"\"","v":""},0,{"$f":"\"\"","v":""}]
["QLogic 2562, Dual Port 8Gb Optical Fibre Channel HBA,Full Height,CusKit",1,"S1-406-BBEK","S1-406-BBEK","406-BBEK",null,810,"Aggiungere Secondo Processore",0,"",""]
[]
[]
["Additional Card for PCIe Slot 3 (Full height) (CPU2)"]
["T630"]
["None",{"$f":"\"\"","v":""},{"$f":"\"\"","v":""},{"$f":"\"\"","v":""},{"$f":"\"\"","v":""},{"$f":"\"\"","v":""},null,"Aggiungere Secondo Processore",{"$f":"\"\"","v":""},0,{"$f":"\"\"","v":""}]
["Broadcom 5720 DP 1Gb Network Interface Card,Full Height,CusKit",1,"TS1L1-1GB","TS1L1-1GB-T630R","[540-BBGY]",35,null,"Aggiungere Secondo Processore","",0,""]
["QLogic 2560, Single Port 8Gb Optical Fibre Channel HBA,Full Height,CusKit",1,"TS1L1-FC","TS1L1-FC-T630R","[406-BBEK]",311,null,"Aggiungere Secondo Processore",null,0,""]
["QLogic 57810 Dual Port 10Gb Direct Attach/SFP+ Network Adapter,Full Height,CusKit",1,"TS1L1-10GB","TS1L1-10GB-T630R","[540-BBGS]",147,null,"Aggiungere Secondo Processore","PowerEdge SFP+, 10GbE SR/SX, Optical Tranceiver, LC Connector, for Intel and Broadcom,CusKit",2,"[407-BBOK]"]
["Intel X710 Quad Port 10Gb Direct Attach, SFP+, Converged Network Adapter",1,"TS1L1-540-BBIW","TS1L1-540-BBIW","540-BBIW",null,370,"Aggiungere Secondo Processore",{"$f":"\"\"","v":""},0,{"$f":"\"\"","v":""}]
["QLogic 2562, Dual Port 8Gb Optical Fibre Channel HBA,Full Height,CusKit",1,"S1-406-BBEK","S1-406-BBEK","406-BBEK",null,810,"Aggiungere Secondo Processore",0,"",""]
[]
[]
["Additional Card for PCIe Slot 4 (Full height) (CPU2)"]
["T630",null,{"$f":"(PCI!H9:J9+PCI!#REF!:J21CERCA.VERT(#REF!,PCI_A2,8,FALSE))+((VLOOKUP(B233,PCI_A1,8,FALSE)))","v":{"$error":"#VALUE!"}}]
["None",{"$f":"\"\"","v":""},{"$f":"\"\"","v":""},{"$f":"\"\"","v":""},{"$f":"\"\"","v":""},{"$f":"\"\"","v":""},null,"Aggiungere Secondo Processore",{"$f":"\"\"","v":""},0,{"$f":"\"\"","v":""}]
["Broadcom 5720 DP 1Gb Network Interface Card,Full Height,CusKit",1,"TS1L1-1GB","TS1L1-1GB-T630R","[540-BBGY]",35,null,"Aggiungere Secondo Processore","",0,""]
["QLogic 2560, Single Port 8Gb Optical Fibre Channel HBA,Full Height,CusKit",1,"TS1L1-FC","TS1L1-FC-T630R","[406-BBEK]",311,null,"Aggiungere Secondo Processore",null,0,""]
["QLogic 57810 Dual Port 10Gb Direct Attach/SFP+ Network Adapter,Full Height,CusKit",1,"TS1L1-10GB","TS1L1-10GB-T630R","[540-BBGS]",147,null,"Aggiungere Secondo Processore","PowerEdge SFP+, 10GbE SR/SX, Optical Tranceiver, LC Connector, for Intel and Broadcom,CusKit",2,"[407-BBOK]"]
["Intel X710 Quad Port 10Gb Direct Attach, SFP+, Converged Network Adapter",1,"TS1L1-540-BBIW","TS1L1-540-BBIW","540-BBIW",null,370,"Aggiungere Secondo Processore",{"$f":"\"\"","v":""},0,{"$f":"\"\"","v":""}]
["QLogic 2562, Dual Port 8Gb Optical Fibre Channel HBA,Full Height,CusKit",1,"S1-406-BBEK","S1-406-BBEK","406-BBEK",null,810,"Aggiungere Secondo Processore",0,"",""]
[]
[]
[]
["Additional Card for PCIe Slot 5 (Full height) (CPU2)"]
["T630"]
["None",{"$f":"\"\"","v":""},{"$f":"\"\"","v":""},{"$f":"\"\"","v":""},{"$f":"\"\"","v":""},{"$f":"\"\"","v":""},null,"Aggiungere Secondo Processore",{"$f":"\"\"","v":""},0,{"$f":"\"\"","v":""}]
["Broadcom 5720 DP 1Gb Network Interface Card,Full Height,CusKit",1,"TS1L1-1GB","TS1L1-1GB-T630R","[540-BBGY]",35,null,"Aggiungere Secondo Processore","",0,""]
["QLogic 2560, Single Port 8Gb Optical Fibre Channel HBA,Full Height,CusKit",1,"TS1L1-FC","TS1L1-FC-T630R","[406-BBEK]",311,null,"Aggiungere Secondo Processore",null,0,""]
["QLogic 57810 Dual Port 10Gb Direct Attach/SFP+ Network Adapter,Full Height,CusKit",1,"TS1L1-10GB","TS1L1-10GB-T630R","[540-BBGS]",147,null,"Aggiungere Secondo Processore","PowerEdge SFP+, 10GbE SR/SX, Optical Tranceiver, LC Connector, for Intel and Broadcom,CusKit",2,"[407-BBOK]"]
["Intel X710 Quad Port 10Gb Direct Attach, SFP+, Converged Network Adapter",1,"TS1L1-540-BBIW","TS1L1-540-BBIW","540-BBIW",null,370,"Aggiungere Secondo Processore",{"$f":"\"\"","v":""},0,{"$f":"\"\"","v":""}]
["QLogic 2562, Dual Port 8Gb Optical Fibre Channel HBA,Full Height,CusKit",1,"S1-406-BBEK","S1-406-BBEK","406-BBEK",null,810,"Aggiungere Secondo Processore",0,"",""]
[]
[]
["Additional Card for PCIe Slot 6 (Full height) (CPU2)"]
["T630"]
["None",{"$f":"\"\"","v":""},{"$f":"\"\"","v":""},{"$f":"\"\"","v":""},{"$f":"\"\"","v":""},{"$f":"\"\"","v":""},null,"Aggiungere Secondo Processore",{"$f":"\"\"","v":""},0,{"$f":"\"\"","v":""}]
["Broadcom 5720 DP 1Gb Network Interface Card,Full Height,CusKit",1,"TS1L1-1GB","TS1L1-1GB-T630R","[540-BBGY]",35,null,"Aggiungere Secondo Processore","",0,""]
["QLogic 2560, Single Port 8Gb Optical Fibre Channel HBA,Full Height,CusKit",1,"TS1L1-FC","TS1L1-FC-T630R","[406-BBEK]",311,null,"Aggiungere Secondo Processore",null,0,""]
["QLogic 57810 Dual Port 10Gb Direct Attach/SFP+ Network Adapter,Full Height,CusKit",1,"TS1L1-10GB","TS1L1-10GB-T630R","[540-BBGS]",147,null,"Aggiungere Secondo Processore","PowerEdge SFP+, 10GbE SR/SX, Optical Tranceiver, LC Connector, for Intel and Broadcom,CusKit",2,"[407-BBOK]"]
["Intel X710 Quad Port 10Gb Direct Attach, SFP+, Converged Network Adapter",1,"TS1L1-540-BBIW","TS1L1-540-BBIW","540-BBIW",null,370,"Aggiungere Secondo Processore",{"$f":"\"\"","v":""},0,{"$f":"\"\"","v":""}]
["QLogic 2562, Dual Port 8Gb Optical Fibre Channel HBA,Full Height,CusKit",1,"S1-406-BBEK","S1-406-BBEK","406-BBEK",null,810,"Aggiungere Secondo Processore",0,"",""]
[]
[]
["Aggiungere Secondo Processore"]
[]
["Qlogic 2692 Dual Port 16Gb Fibre Channel HBA, Low Profile, Customer Install",1,"TS1-L1-403-BBMT","TS1-L1-403-BBMT","403-BBMT",null,1858.99]
["QLogic 2742 Dual Port 32Gb Fibre Channel HBA, Low Profile, Customer Install",1,"TS1-L1-403-BBMR","TS1-L1-403-BBMR","403-BBMR",null,2785.99]
["QLogic 2740 Single Port 32Gb Fibre Channel HBA, Low Profile, Customer Install",1,"TS1-L1-403-BBMO","TS1-L1-403-BBMO","403-BBMO",null,1884.99]
["Intel Ethernet X540 DP 10GBASE-T Server Adapter, Low Profile,CusKit",1,"TS1-L1-540-BBDT","TS1-L1-540-BBDT","540-BBDT",null,821.99]
["Intel X520 DP 10Gb DA/SFP+ Server Adapter, Low Profile,CusKit",1,"TS1-L1-540-BBDW","TS1-L1-540-BBDW","540-BBDW",null,566.99]
["Broadcom 5719 QP 1Gb Network Interface Card, Low Profile,CusKit",1,"TS1-L1-540-BBHB","TS1-L1-540-BBHB","540-BBHB",null,207.99]
["QLogic 57810 Dual Port 10Gb Base-T Low Profile Network Adapter,CusKit",1,"TS1-L1-540-BBIU","TS1-L1-540-BBIU","540-BBIU",null,635.99]
["Intel X710 Dual Port 10Gb Direct Attach, SFP+, Converged Network Adapter, Low Profile, Cuskit",1,"TS1-L1-540-BBIX","TS1-L1-540-BBIX","540-BBIX",null,749.99]
["QLogic FastLinQ QL45212-DE Dual Port 25GbE SFP28 Adapter, Low Profile, Customer Install",1,"TS1-L1-540-BBQQ","TS1-L1-540-BBQQ","540-BBQQ",null,703.99]
["Intel Omni-Path Host Fabric Adapter 100 Series 1 Port PCIe x16, Low Profile, Customer Install",1,"TS1-L1-540-BBQT","TS1-L1-540-BBQT","540-BBQT",null,1526.99]
["Intel X550 Dual Port 10G Base-T Adapter, Low Profile, Customer Install",1,"TS1-L1-540-BBRG","TS1-L1-540-BBRG","540-BBRG",null,774.99]
["Intel XL710 Dual Port 40G, QSFP+, Low Profile, Customer Install",1,"TS1-L1-540-BBRN","TS1-L1-540-BBRN","540-BBRN",null,1133.99]
["PERC H830 RAID Adapter for External MD14XX Only, 2GB NV Cache, Low Profile,CusKit",1,"TS1-L1-405-AAER","TS1-L1-405-AAER","405-AAER",null,987.99]
["SAS 12Gbps HBA External Controller, Low Profile, CusKit",1,"TS1-L1-405-AAES","TS1-L1-405-AAES","405-AAES",null,318.99]
[]
["Intel X520 DP 10Gb DA/SFP+ Server Adapter,Full Height,CusKit",1,"TS1-L1-540-BBDR","TS1-L1-540-BBDR","540-BBDR",null,667.99]
["Intel Ethernet X540 DP 10GBASE-T Server Adapter,Full Height,CusKit",1,"TS1-L1-540-BBDU","TS1-L1-540-BBDU","540-BBDU",null,737.99]
["Intel X710 Dual Port 10Gb Direct Aattach, SFP+, Converged Network Adapter, Customer Kit",1,"TS1-L1-540-BBIV","TS1-L1-540-BBIV","540-BBIV",null,655.99]
["Intel X710 Quad Port 10Gb Direct Aattach, SFP+, Converged Network Adapter",1,"TS1-L1-540-BBIW","TS1-L1-540-BBIW","540-BBIW",null,1040.99]
["QLogic FastLinQ QL45212-DE Dual Port 25GbE SFP28 Adapter, Customer Install",1,"TS1-L1-540-BBQR","TS1-L1-540-BBQR","540-BBQR",null,703.99]
["Intel Omni-Path Host Fabric Adapter 100 Series 1 Port PCIe x16, Customer Install",1,"TS1-L1-540-BBQU","TS1-L1-540-BBQU","540-BBQU",null,1526.99]
["Intel XL710 Dual Port 40G, QSFP+, Full Height, Customer Install",1,"TS1-L1-540-BBRH","TS1-L1-540-BBRH","540-BBRH",null,1133.99]
["Intel XL710 Dual Port 40G, QSFP+, rNDC, Customer Install",1,"TS1-L1-540-BBRJ","TS1-L1-540-BBRJ","540-BBRJ",null,1306.99]
["Intel X550 Dual Port 10G Base-T Adapter, Full Height, Customer Install",1,"TS1-L1-540-BBRK","TS1-L1-540-BBRK","540-BBRK",null,774.99]
["SAS 12Gbps HBA External Controller, Full Height,CusKit",1,"TS1-L1-405-AADZ","TS1-L1-405-AADZ","405-AADZ",null,324.99]
["PERC H730P Integrated RAID Controller,2GB NV Cache,CusKit",1,"TS1-L1-405-AAEK","TS1-L1-405-AAEK","405-AAEK",null,774.99]
[]
[]
["RDX"]
["None",0,{"$f":"\"\"","v":""},{"$f":"\"\"","v":""},{"$f":"\"\"","v":""},{"$f":"\"\"","v":""}]
["Tandberg RDX External drive, black, USB3, con 3 Cartucce da 500 GB",1,"S1-RDXCC","S1-RDXCC",{"$f":"\"\"","v":""},{"$f":"\"\"","v":""},365]
[]
[]
[]
[]
[]
[]
[]
[]
["S1-RDXCC","OpzRDX",365,null,"Tandberg RDX External drive, black, USB3, con 3 Cartucce da 500 GB"]

{"sheet":"HDD","index":20,"n_rows":260,"n_cols":15,"rows_kept":260,"cut":false,"hidden":true,"merged":[]}
["Hard Drives"]
["R630"]
["300GB 10K RPM SAS 12Gbps 2.5in Hot-plug Hard Drive,CusKit",null,"TS1L1-HD300",null,"[400-AJOQ]",120]
["1.2TB 10K RPM SAS 12Gbps 2.5in Hot-plug Hard Drive,CusKit",null,"TS1L1-HD1200",null,"[400-AJPD]",212]
[null,"R630 ","R630 1","R630 2"]
["HDD max",8,8,8]
["HDD 300GB Base",2,2,2,"Hot Spare for 300GB HDD",{"$f":"'Lotto1 R630 1'!$C$95","v":"No"},{"$f":"IF(F7=\"Yes\",1,0)","v":0},{"$f":"'Lotto1 R630 2'!$C$95","v":"No"},{"$f":"IF(H7=\"Yes\",1,0)","v":0},{"$f":"'Lotto1 R630 3'!$C$95","v":"No"},{"$f":"IF(J7=\"Yes\",1,0)","v":0}]
["HDD 300GB Selected",{"$f":"HD300_A","v":0},{"$f":"HD300_AA","v":0},{"$f":"HD300_AAA","v":0}]
["300GB 10K RPM SAS 12Gbps 2.5in Hot-plug Hard Drive,CusKit",0,0,0]
[null,1,1,1]
[null,2,2,2]
[null,3,3,3]
[null,4,4,4]
[null,5,5,5]
[null,6,6,6]
["HDD max",8,8,8]
["HDD 300GB",{"$f":"B7+B8","v":2},{"$f":"C7+C8","v":2},{"$f":"D7+D8","v":2}]
["HDD 1TB Selected",{"$f":"'Lotto1 R630 1'!$C$83","v":0},{"$f":"HD1000_AA","v":0},{"$f":"HD1000_AAA","v":0},"Hot Spare for 1TB HDD",{"$f":"'Lotto1 R630 1'!$C$99","v":"No"},{"$f":"IF(F18=\"Yes\",1,0)","v":0},{"$f":"'Lotto1 R630 2'!$C$99","v":"No"},{"$f":"IF(H18=\"Yes\",1,0)","v":0},{"$f":"'Lotto1 R630 3'!$C$99","v":"No"},{"$f":"IF(J18=\"Yes\",1,0)","v":0}]
["1TB 7.2K RPM NLSAS 6Gbps 2.5in Hot-plug Hard Drive,13G,CusKit",{"$f":"B$6-B$7-B$8","v":6},{"$f":"C$6-C$7-C$8","v":6},{"$f":"D$6-D$7-D$8","v":6}]
[null,{"$f":"IF(B19-1<1,0,B19-1)","v":5},5,5]
[null,4,4,4]
[null,3,3,3]
[null,2,2,2]
[null,1,1,1]
[null,0,0,0]
[null,0]
[null,0]
[]
["Hot Spare","Yes"]
[null,"No"]
[]
["RAID Configuration",null,null,"HDD 300GB R630",null,"HDD 1TB R630",null,"HDD 300GB R630 2",null,"HDD 1TB R630 2",null,"HDD 300GB R630 3",null,"HDD 1TB R630 3"]
["RAID Personalizzato",{"$f":"IF($B$137<=8,0,\"\")","v":0},"[780-BBJC]","RAID Personalizzato","[780-BBJC]","RAID Personalizzato","[780-BBJC]","RAID Personalizzato","[780-BBJC]","RAID Personalizzato","[780-BBJC]","RAID Personalizzato","[780-BBJC]","RAID Personalizzato","[780-BBJC]"]
["C10 - Unconfigured RAID for H330 (1-8 HDDs)",1,"[780-BBJD] ",{"$f":"IF($G$7=0,A34,\"\")","v":"C10 - Unconfigured RAID for H330 (1-8 HDDs)"},{"$f":"IF($G$7=0,C34,\"\")","v":"[780-BBJD] "},{"$f":"IF($G$18=0,A34,\"\")","v":"C10 - Unconfigured RAID for H330 (1-8 HDDs)"},{"$f":"IF($G$18=0,C34,\"\")","v":"[780-BBJD] "},{"$f":"IF(I7=0,$A$34,\"\")","v":"C10 - Unconfigured RAID for H330 (1-8 HDDs)"},{"$f":"IF(I7=0,$C$34,\"\")","v":"[780-BBJD] "},{"$f":"IF(I18=0,$A$34,\"\")","v":"C10 - Unconfigured RAID for H330 (1-8 HDDs)"},{"$f":"IF(I18=0,$C$34,\"\")","v":"[780-BBJD] "},{"$f":"IF(K7=0,$A$34,\"\")","v":"C10 - Unconfigured RAID for H330 (1-8 HDDs)"},{"$f":"IF(K7=0,$C$34,\"\")","v":"[780-BBJD] "},{"$f":"IF(K18=0,$A$34,\"\")","v":"C10 - Unconfigured RAID for H330 (1-8 HDDs)"},{"$f":"IF(K18=0,$C$34,\"\")","v":"[780-BBJD] "}]
["C2 - RAID 0 for H330 (1-8 HDDs)",1,"[780-BBJF]",{"$f":"IF($G$7=0,A35,\"\")","v":"C2 - RAID 0 for H330 (1-8 HDDs)"},{"$f":"IF($G$7=0,C35,\"\")","v":"[780-BBJF]"},{"$f":"IF($G$18=0,A35,\"\")","v":"C2 - RAID 0 for H330 (1-8 HDDs)"},{"$f":"IF($G$18=0,C35,\"\")","v":"[780-BBJF]"},{"$f":"IF(I7=0,$A$35,\"\")","v":"C2 - RAID 0 for H330 (1-8 HDDs)"},{"$f":"IF(I7=0,$C$35,\"\")","v":"[780-BBJF]"},{"$f":"IF(I18=0,$A$35,\"\")","v":"C2 - RAID 0 for H330 (1-8 HDDs)"},{"$f":"IF(I18=0,$C$35,\"\")","v":"[780-BBJF]"},{"$f":"IF(K7=0,$A$35,\"\")","v":"C2 - RAID 0 for H330 (1-8 HDDs)"},{"$f":"IF(K7=0,$C$35,\"\")","v":"[780-BBJF]"},{"$f":"IF(K18=0,$A$35,\"\")","v":"C2 - RAID 0 for H330 (1-8 HDDs)"},{"$f":"IF(K18=0,$C$35,\"\")","v":"[780-BBJF]"}]
["C3 - RAID 1 for H330 (2 HDDs)",1,"[780-BBJK]",{"$f":"IF($B$7+$B$8-$G$7=2,A36,\"\")","v":"C3 - RAID 1 for H330 (2 HDDs)"},{"$f":"IF($B$7+$B$8-$G$7=2,C36,\"\")","v":"[780-BBJK]"},{"$f":"IF($B$18-$G$18=2,A36,\"\")","v":""},{"$f":"IF($B$18-$G$18=2,C36,\"\")","v":""},{"$f":"IF($C$7+$C$8-I7=2,$A$36,\"\")","v":"C3 - RAID 1 for H330 (2 HDDs)"},{"$f":"IF($C$7+$C$8-I7=2,$C$36,\"\")","v":"[780-BBJK]"},{"$f":"IF($C$18-I18=2,A36,\"\")","v":""},{"$f":"IF($C$18-I18=2,$C$36,\"\")","v":""},{"$f":"IF($C$7+$C$8-K7=2,$A$36,\"\")","v":"C3 - RAID 1 for H330 (2 HDDs)"},{"$f":"IF($C$7+$C$8-K7=2,$C$36,\"\")","v":"[780-BBJK]"},{"$f":"IF($C$18-M18=2,E36,\"\")","v":""},{"$f":"IF($D$18-K18=2,$C$36,\"\")","v":""}]
["C4 - RAID 5 for H330 (3-8 HDDs)",1,"[780-BBJL]",{"$f":"IF($B$7+$B$8-$G$7>=3,A37,\"\")","v":""},{"$f":"IF($B$7+$B$8-$G$7>=3,C37,\"\")","v":""},{"$f":"IF($B$18-$G$18>=3,A37,\"\")","v":""},{"$f":"IF($B$18-$G$18>=3,C37,\"\")","v":""},{"$f":"IF($C$7+$C$8-I7>=3,$A$37,\"\")","v":""},{"$f":"IF($C$7+$C$8-I7>=3,$C$37,\"\")","v":""},{"$f":"IF($C$18-I18>=3,$A$37,\"\")","v":""},{"$f":"IF($C$18-I18>=3,$C$37,\"\")","v":""},{"$f":"IF($D$7+$D$8-K7>=3,$A$37,\"\")","v":""},{"$f":"IF($D$7+$D$8-K7>=3,$C$37,\"\")","v":""},{"$f":"IF($D$18-K18>=3,$A$37,\"\")","v":""},{"$f":"IF($D$18-K18>=3,$C$37,\"\")","v":""}]
["C6 - RAID 10 forH330 (4-8 HDDs in pairs) ",1,"[780-BBJN]",{"$f":"IF($B$7+$B$8-$G$7=4,A38,\"\")","v":""},{"$f":"IF($B$7+$B$8-$G$7=4,C38,\"\")","v":""},{"$f":"IF($B$18-$G$18=4,A38,\"\")","v":""},{"$f":"IF($B$18-$G$18=4,C38,\"\")","v":""},{"$f":"IF($C$7+$C$8-I7=4,$A$38,\"\")","v":""},{"$f":"IF($C$7+$C$8-I7=4,$C$38,\"\")","v":""},{"$f":"IF($C$18-I18=4,$A$38,\"\")","v":""},{"$f":"IF($C$18-I18=4,$C$38,\"\")","v":""},{"$f":"IF($D$7+$D$8-K7=4,$A$38,\"\")","v":""},{"$f":"IF($D$7+$D$8-K7=4,$C$38,\"\")","v":""},{"$f":"IF($D$18-K18=4,$A$38,\"\")","v":""},{"$f":"IF($D$18-K18=4,$C$38,\"\")","v":""}]
["C7 - RAID 1+RAID 1 for H330 (2 + 2 HDDs) ",1,"[780-BBJO]",{"$f":"IF($B$7+$B$8-$G$7=4,A39,\"\")","v":""},{"$f":"IF($B$7+$B$8-$G$7=4,C39,\"\")","v":""},{"$f":"IF($B$18-$G$18=4,A39,\"\")","v":""},{"$f":"IF($B$18-$G$18=4,C39,\"\")","v":""},{"$f":"IF($C$7+$C$8-I7=4,$A$39,\"\")","v":""},{"$f":"IF($C$7+$C$8-I7=4,$C$39,\"\")","v":""},{"$f":"IF($C$18-I18=4,A39,\"\")","v":""},{"$f":"IF($C$18-I18=4,$C$39,\"\")","v":""},{"$f":"IF($D$7+$D$8-K7=4,$A$39,\"\")","v":""},{"$f":"IF($D$7+$D$8-K7=4,$C$39,\"\")","v":""},{"$f":"IF($D$18-K18=4,A39,\"\")","v":""},{"$f":"IF($D$18-K18=4,$C$39,\"\")","v":""}]
["C8 - RAID 1+RAID 5 for H330 (2 + 3-8 HDDs)",1,"[780-BBJP]",{"$f":"IF($B$7+$B$8-$G$7>=5,A40,\"\")","v":""},{"$f":"IF($B$7+$B$8-$G$7>=5,C40,\"\")","v":""},{"$f":"IF($B$18-$G$18>=5,A40,\"\")","v":""},{"$f":"IF($B$18-$G$18>=5,C40,\"\")","v":""},{"$f":"IF($C$7+$C$8-I7>=5,$A$40,\"\")","v":""},{"$f":"IF($C$7+$C$8-I7>=5,$C$40,\"\")","v":""},{"$f":"IF($C$18-I18>=5,$A$40,\"\")","v":""},{"$f":"IF($C$18-I18>=5,$C$40,\"\")","v":""},{"$f":"IF($D$7+$D$8-K7>=5,$A$40,\"\")","v":""},{"$f":"IF($D$7+$D$8-K7>=5,$C$40,\"\")","v":""},{"$f":"IF($D$18-K18>=5,$A$40,\"\")","v":""},{"$f":"IF($D$18-K18>=5,$C$40,\"\")","v":""}]
["C9 - RAID 1+RAID 10 for H330 (2 + 4 HDDs in pairs) ",1,"[780-BBJQ] ",{"$f":"IF($B$7+$B$8-$G$7=6,A41,\"\")","v":""},{"$f":"IF($B$7+$B$8-$G$7=6,C41,\"\")","v":""},{"$f":"IF($B$18-$G$18=6,A41,\"\")","v":""},{"$f":"IF($B$18-$G$18=6,C41,\"\")","v":""},{"$f":"IF($C$7+$C$8-I7=6,$A$41,\"\")","v":""},{"$f":"IF($C$7+$C$8-I7=6,$C$41,\"\")","v":""},{"$f":"IF($C$18-I18=6,A41,\"\")","v":""},{"$f":"IF($C$18-I18=6,$C$41,\"\")","v":""},{"$f":"IF($D$7+$D$8-M7=6,$A$41,\"\")","v":""},{"$f":"IF($D$7+$D$8-M7=6,$C$41,\"\")","v":""},{"$f":"IF($D$18-K18=6,A41,\"\")","v":""},{"$f":"IF($D$18-K18=6,$C$41,\"\")","v":""}]
[]
["R730xd"]
["300GB 10K RPM SAS 12Gbps 2.5in Hot-plug Hard Drive,CusKit",null,"10L1-HDD300GB",null,"[400-AJOQ]",120]
["1.2TB 10K RPM SAS 12Gbps 2.5in Hot-plug Hard Drive,CusKit",null,"TS1L1-HD1200",null,"[400-AJPD]",212]
["1.8TB 10K RPM SAS 12Gbps 512e 2.5in Hot-plug Hard Drive,CusKit",null,"TS1L1-HD1800","TS1L1-HD1800-R730","400-AJQP",236]
["960GB Solid State Drive SAS Mix Use MLC 2.5in Hot-plug Drive, PX04SV, Cus Kit",null,"TS1L1-SSD800","TS1L1-SSD800-R730","400-ANNX",748]
["1.92TB Solid State Drive SAS Mix Use MLC 2.5in Hot-plug Drive, PX04SV, Cus Kit",null,"TS1L1-SSD1920","TS1L1-SSD1920-R730","400-ANMN",1795]
[null,{"$f":"'Lotto1 R730xd 1'!$C$96","v":"No"},{"$f":"'Lotto1 R730xd 2'!$C$96","v":"No"},{"$f":"'Lotto1 R730xd 3'!$C$96","v":"No"}]
["HDD max",24,24,24]
["HDD 300GB Base",2,2,2]
["Hot Spare for 300GB HDD",{"$f":"IF(B49=\"Yes\",1,0)","v":0},{"$f":"IF(C49=\"Yes\",1,0)","v":0},{"$f":"IF(D49=\"Yes\",1,0)","v":0}]
["HDD 300GB Selected",{"$f":"HD300_B","v":0},{"$f":"HD300_BB","v":0},{"$f":"HD300_BBB","v":0}]
["300GB 10K RPM SAS 12Gbps 2.5in Hot-plug Hard Drive,CusKit",0,0,0]
[null,1,1,1]
[null,2,2,2]
[null,3,3,3]
[null,4,4,4]
[null,5,5,5]
[null,6,6,6]
[null,7,7,7]
[null,8,8,8]
[null,9,9,9]
[null,10,10,10]
[null,11,11,11]
[null,12,12,12]
[null,13,13,13]
[null,14,14,14]
[null,15,15,15]
[null,16,16,16]
[null,17,17,17]
[null,18,18,18]
[null,19,19,19]
[null,20,20,20]
[null,21,21,21]
[null,22,22,22]
[]
[]
[]
[]
[]
[]
[null,{"$f":"'Lotto1 R730xd 1'!$C$100","v":"No"},{"$f":"'Lotto1 R730xd 2'!$C$100","v":"No"},{"$f":"'Lotto1 R730xd 2'!$C$100","v":"No"}]
["HDD max",24,24,24]
["HDD 300GB",{"$f":"B51+B53","v":2},{"$f":"C51+C53","v":2},{"$f":"D51+D53","v":2}]
["Hot Spare for 1TB HDD",{"$f":"IF(B83=\"Yes\",1,0)","v":0},{"$f":"IF(C83=\"Yes\",1,0)","v":0},{"$f":"IF(D83=\"Yes\",1,0)","v":0}]
["HDD 1TB Selected",{"$f":"'Lotto1 R730xd 1'!$C$84","v":0},{"$f":"'Lotto1 R730xd 2'!$C$84","v":0},{"$f":"'Lotto1 R730xd 3'!$C$84","v":0}]
["1TB 7.2K RPM NLSAS 6Gbps 2.5in Hot-plug Hard Drive,13G,CusKit",{"$f":"$B$84-$B$85-$B$87","v":22},{"$f":"$C$84-$C$85-$C$87","v":22},{"$f":"$D$84-$D$85-$D$87","v":22}]
[null,{"$f":"IF(B88-1<1,0,B88-1)","v":21},21,{"$f":"IF(D88-1<1,0,D88-1)","v":21}]
[null,20,20,20]
[null,19,19,19]
[null,18,18,18]
[null,17,17,17]
[null,16,16,16]
[null,15,15,15]
[null,14,14,14]
[null,{"$f":"IF(B96-1<1,0,B96-1)","v":13},13,13]
[null,12,12,12]
[null,11,11,11]
[null,10,10,10]
[null,9,9,9]
[null,8,8,8]
[null,7,7,7]
[null,6,6,6]
[null,5,5,5]
[null,4,4,4]
[null,3,3,3]
[null,2,2,2]
[null,1,1,1]
[null,0,0,0]
[]
[]
[]
[]
[]
[]
[]
[]
[]
["RAID Configuration",null,null,"HDD 300GB R730xd",null,"HDD 1TB R730xd",null,"HDD 300GB R730xd 2",null,"HDD 1TB R730xd 2",null,"HDD 300GB R730xd 3",null,"HDD 1TB R730xd 3"]
["RAID Personalizzato",{"$f":"IF($B$137<=8,0,\"\")","v":0},"[780-BBJC]","RAID Personalizzato","[780-BBJC]","RAID Personalizzato","[780-BBJC]","RAID Personalizzato","[780-BBJC]","RAID Personalizzato","[780-BBJC]","RAID Personalizzato","[780-BBJC]","RAID Personalizzato","[780-BBJC]"]
["C10 - Unconfigured RAID for H330 (1-8 HDDs)",1,"[780-BBJD] ",{"$f":"IF($B$52=0,A122,\"\")","v":"C10 - Unconfigured RAID for H330 (1-8 HDDs)"},{"$f":"IF($B$52=0,C122,\"\")","v":"[780-BBJD] "},{"$f":"IF($B$86=0,A122,\"\")","v":"C10 - Unconfigured RAID for H330 (1-8 HDDs)"},{"$f":"IF($B$86=0,C122,\"\")","v":"[780-BBJD] "},{"$f":"IF($C$52=0,A122,\"\")","v":"C10 - Unconfigured RAID for H330 (1-8 HDDs)"},{"$f":"IF($C$52=0,C122,\"\")","v":"[780-BBJD] "},{"$f":"IF($C$86=0,A122,\"\")","v":"C10 - Unconfigured RAID for H330 (1-8 HDDs)"},{"$f":"IF($C$86=0,C122,\"\")","v":"[780-BBJD] "},{"$f":"IF($D$52=0,A122,\"\")","v":"C10 - Unconfigured RAID for H330 (1-8 HDDs)"},{"$f":"IF($D$52=0,C122,\"\")","v":"[780-BBJD] "},{"$f":"IF($D$86=0,A122,\"\")","v":"C10 - Unconfigured RAID for H330 (1-8 HDDs)"},{"$f":"IF($D$86=0,C122,\"\")","v":"[780-BBJD] "}]
["C2 - RAID 0 for H330 (1-8 HDDs)",1,"[780-BBJF]",{"$f":"IF($B$52=0,A123,\"\")","v":"C2 - RAID 0 for H330 (1-8 HDDs)"},{"$f":"IF($B$52=0,C123,\"\")","v":"[780-BBJF]"},{"$f":"IF($B$86=0,A123,\"\")","v":"C2 - RAID 0 for H330 (1-8 HDDs)"},{"$f":"IF($B$86=0,C123,\"\")","v":"[780-BBJF]"},{"$f":"IF($C$52=0,A123,\"\")","v":"C2 - RAID 0 for H330 (1-8 HDDs)"},{"$f":"IF($C$52=0,C123,\"\")","v":"[780-BBJF]"},{"$f":"IF($C$86=0,A123,\"\")","v":"C2 - RAID 0 for H330 (1-8 HDDs)"},{"$f":"IF($C$86=0,C123,\"\")","v":"[780-BBJF]"},{"$f":"IF($D$52=0,A123,\"\")","v":"C2 - RAID 0 for H330 (1-8 HDDs)"},{"$f":"IF($D$52=0,C123,\"\")","v":"[780-BBJF]"},{"$f":"IF($D$86=0,A123,\"\")","v":"C2 - RAID 0 for H330 (1-8 HDDs)"},{"$f":"IF($D$86=0,C123,\"\")","v":"[780-BBJF]"}]
["C3 - RAID 1 for H330 (2 HDDs)",1,"[780-BBJK]",{"$f":"IF($B$51+$B$53-$B$52=2,A124,\"\")","v":"C3 - RAID 1 for H330 (2 HDDs)"},{"$f":"IF($B$51+$B$53-$B$52=2,C124,\"\")","v":"[780-BBJK]"},{"$f":"IF($B$87-$B$86=2,A124,\"\")","v":""},{"$f":"IF($B$87-$B$86=2,C124,\"\")","v":""},{"$f":"IF($C$51+$C$53-$C$52=2,A124,\"\")","v":"C3 - RAID 1 for H330 (2 HDDs)"},{"$f":"IF($C$51+$C$53-$C$52=2,C124,\"\")","v":"[780-BBJK]"},{"$f":"IF($C$87-$C$86=2,A124,\"\")","v":""},{"$f":"IF($C$87-$C$86=2,C124,\"\")","v":""},{"$f":"IF($D$51+$D$53-$D$52=2,A124,\"\")","v":"C3 - RAID 1 for H330 (2 HDDs)"},{"$f":"IF($D$51+$D$53-$D$52=2,C124,\"\")","v":"[780-BBJK]"},{"$f":"IF($D$87-$D$86=2,A124,\"\")","v":""},{"$f":"IF($D$87-$D$86=2,C124,\"\")","v":""}]
["C4 - RAID 5 for H330 (3-8 HDDs)",1,"[780-BBJL]",{"$f":"IF($B$51+$B$53-$B$52>=3,A125,\"\")","v":""},{"$f":"IF($B$51+$B$53-$B$52>=3,C125,\"\")","v":""},{"$f":"IF($B$87-$B$86>=3,A125,\"\")","v":""},{"$f":"IF($B$87-$B$86>=3,C125,\"\")","v":""},{"$f":"IF($C$51+$C$53-$C$52>=3,A125,\"\")","v":""},{"$f":"IF($C$51+$C$53-$C$52>=3,C125,\"\")","v":""},{"$f":"IF($C$87-$C$86>=3,A125,\"\")","v":""},{"$f":"IF($C$87-$C$86>=3,C125,\"\")","v":""},{"$f":"IF($D$51+$D$53-$D$52>=3,A125,\"\")","v":""},{"$f":"IF($D$51+$D$53-$D$52>=3,C125,\"\")","v":""},{"$f":"IF($D$87-$D$86>=3,A125,\"\")","v":""},{"$f":"IF($D$87-$D$86>=3,C125,\"\")","v":""}]
["C6 - RAID 10 forH330 (4-8 HDDs in pairs) ",1,"[780-BBJN]",{"$f":"IF($B$51+$B$53-$B$52=4,A126,\"\")","v":""},{"$f":"IF($B$51+$B$53-$B$52=4,C126,\"\")","v":""},{"$f":"IF($B$87-$B$86=4,A126,\"\")","v":""},{"$f":"IF($B$87-$B$86=4,C126,\"\")","v":""},{"$f":"IF($C$51+$C$53-$C$52=4,A126,\"\")","v":""},{"$f":"IF($C$51+$C$53-$C$52=4,C126,\"\")","v":""},{"$f":"IF($C$87-$C$86=4,A126,\"\")","v":""},{"$f":"IF($C$87-$C$86=4,C126,\"\")","v":""},{"$f":"IF($D$51+$D$53-$D$52=4,A126,\"\")","v":""},{"$f":"IF($D$51+$D$53-$D$52=4,C126,\"\")","v":""},{"$f":"IF($D$87-$D$86=4,A126,\"\")","v":""},{"$f":"IF($D$87-$D$86=4,C126,\"\")","v":""}]
["C7 - RAID 1+RAID 1 for H330 (2 + 2 HDDs) ",1,"[780-BBJO]",{"$f":"IF($B$51+$B$53-$B$52=4,A127,\"\")","v":""},{"$f":"IF($B$51+$B$53-$B$52=4,C127,\"\")","v":""},{"$f":"IF($B$87-$B$86=4,A127,\"\")","v":""},{"$f":"IF($B$87-$B$86=4,C127,\"\")","v":""},{"$f":"IF($C$51+$C$53-$C$52=4,A127,\"\")","v":""},{"$f":"IF($C$51+$C$53-$C$52=4,C127,\"\")","v":""},{"$f":"IF($C$87-$C$86=4,A127,\"\")","v":""},{"$f":"IF($C$87-$C$86=4,C127,\"\")","v":""},{"$f":"IF($D$51+$D$53-$D$52=4,A127,\"\")","v":""},{"$f":"IF($D$51+$D$53-$D$52=4,C127,\"\")","v":""},{"$f":"IF($D$87-$D$86=4,A127,\"\")","v":""},{"$f":"IF($D$87-$D$86=4,C127,\"\")","v":""}]
["C8 - RAID 1+RAID 5 for H330 (2 + 3-8 HDDs)",1,"[780-BBJP]",{"$f":"IF($B$51+$B$53-$B$52>=5,A128,\"\")","v":""},{"$f":"IF($B$51+$B$53-$B$52>=5,C128,\"\")","v":""},{"$f":"IF($B$87-$B$86>=5,A128,\"\")","v":""},{"$f":"IF($B$87-$B$86>=5,C128,\"\")","v":""},{"$f":"IF($C$51+$C$53-$C$52>=5,A128,\"\")","v":""},{"$f":"IF($C$51+$C$53-$C$52>=5,C128,\"\")","v":""},{"$f":"IF($C$87-$C$86>=5,A128,\"\")","v":""},{"$f":"IF($C$87-$C$86>=5,C128,\"\")","v":""},{"$f":"IF($D$51+$D$53-$D$52>=5,A128,\"\")","v":""},{"$f":"IF($D$51+$D$53-$D$52>=5,C128,\"\")","v":""},{"$f":"IF($D$87-$D$86>=5,A128,\"\")","v":""},{"$f":"IF($D$87-$D$86>=5,C128,\"\")","v":""}]
["C9 - RAID 1+RAID 10 for H330 (2 + 4 HDDs in pairs) ",1,"[780-BBJQ] ",{"$f":"IF($B$51+$B$53-$B$52=6,A129,\"\")","v":""},{"$f":"IF($B$51+$B$53-$B$52=6,C129,\"\")","v":""},{"$f":"IF($B$87-$B$86=6,A129,\"\")","v":""},{"$f":"IF($B$87-$B$86=6,C129,\"\")","v":""},{"$f":"IF($C$51+$C$53-$C$52=6,A129,\"\")","v":""},{"$f":"IF($C$51+$C$53-$C$52=6,C129,\"\")","v":""},{"$f":"IF($C$87-$C$86=6,A129,\"\")","v":""},{"$f":"IF($C$87-$C$86=6,C129,\"\")","v":""},{"$f":"IF($D$51+$D$53-$D$52=6,A129,\"\")","v":""},{"$f":"IF($D$51+$D$53-$D$52=6,C129,\"\")","v":""},{"$f":"IF($D$87-$D$86=6,A129,\"\")","v":""},{"$f":"IF($D$87-$D$86=6,C129,\"\")","v":""}]
[]
[]
[]
[]
[]
[]
["T630"]
["300GB 10K RPM SAS 12Gbps 2.5in Hot-plug Hard Drive,CusKit",null,"TS1L1-HD300","TS1L1-HD300-T630R","400-AJOQ",120]
["1.2TB 10K RPM SAS 12Gbps 2.5in Hot-plug Hard Drive,CusKit",null,"TS1L1-HD1200","TS1L1-HD1200-T630R","400-AJPD",212]
[]
["HDD max",16]
["HDD 300GB Base",2]
["HDD 300GB Selected",{"$f":"HD300_C","v":0}]
["300GB 10K RPM SAS 12Gbps 2.5in Hot-plug Hard Drive,CusKit",0,null,"Hot Spare for 300GB HDD",{"$f":"'Lotto1 T630R 1'!C96","v":"No"},{"$f":"IF(E143=\"Yes\",1,0)","v":0}]
[null,1]
[null,2]
[null,3]
[null,4]
[null,5]
[null,6]
[null,7]
[null,8]
[null,9]
[null,10]
[null,11]
[null,12]
[null,13]
[null,14]
["HDD max",16]
["HDD 300GB",{"$f":"B141+B142","v":2}]
["HDD 1TB Selected",{"$f":"HD1000_c","v":0},null,"Hot Spare for 1TB HDD",{"$f":"'Lotto1 T630R 1'!C100","v":"No"},{"$f":"IF(E160=\"Yes\",1,0)","v":0}]
["1.2TB 10K RPM SAS 12Gbps 2.5in Hot-plug Hard Drive,CusKit",{"$f":"$B$158-$B$159-$B$160","v":14}]
[null,{"$f":"IF(B161-1<1,0,B161-1)","v":13}]
[null,12]
[null,11]
[null,10]
[null,9]
[null,8]
[null,7]
[null,6]
[null,{"$f":"IF(B169-1<1,0,B169-1)","v":5}]
[null,4]
[null,3]
[null,2]
[null,1]
[null,0]
[]
["RAID Configuration",null,null,"HDD 300GB",null,"HDD 1TB"]
["RAID Personalizzato",{"$f":"IF($B$137<=8,0,\"\")","v":0},"[780-BBJC]","RAID Personalizzato","[780-BBJC]","RAID Personalizzato","[780-BBJC]"]
["C10 - Unconfigured RAID for H330 (1-8 HDDs)",1,"[780-BBJD] ",{"$f":"IF($F$143=0,A179,\"\")","v":"C10 - Unconfigured RAID for H330 (1-8 HDDs)"},{"$f":"IF($F$143=0,C179,\"\")","v":"[780-BBJD] "},{"$f":"IF($F$160=0,A179,\"\")","v":"C10 - Unconfigured RAID for H330 (1-8 HDDs)"},{"$f":"IF($F$160=0,C179,\"\")","v":"[780-BBJD] "}]
["C2 - RAID 0 for H330 (1-8 HDDs)",1,"[780-BBJF]",{"$f":"IF($F$143=0,A180,\"\")","v":"C2 - RAID 0 for H330 (1-8 HDDs)"},{"$f":"IF($F$143=0,C180,\"\")","v":"[780-BBJF]"},{"$f":"IF($F$160=0,A180,\"\")","v":"C2 - RAID 0 for H330 (1-8 HDDs)"},{"$f":"IF($F$160=0,C180,\"\")","v":"[780-BBJF]"}]
["C3 - RAID 1 for H330 (2 HDDs)",1,"[780-BBJK]",{"$f":"IF($B$141+$B$142-$F$143=2,A181,\"\")","v":"C3 - RAID 1 for H330 (2 HDDs)"},{"$f":"IF($B$141+$B$142-$F$143=2,C181,\"\")","v":"[780-BBJK]"},{"$f":"IF($B$160-$F$160=2,A181,\"\")","v":""},{"$f":"IF($B$160-$F$160=2,C181,\"\")","v":""}]
["C4 - RAID 5 for H330 (3-8 HDDs)",1,"[780-BBJL]",{"$f":"IF($B$141+$B$142-$F$143>=3,A182,\"\")","v":""},{"$f":"IF($B$141+$B$142-$F$143>=3,C182,\"\")","v":""},{"$f":"IF($B$160-$F$160>=3,A182,\"\")","v":""},{"$f":"IF($B$160-$F$160>=3,C182,\"\")","v":""}]
["C6 - RAID 10 forH330 (4-8 HDDs in pairs) ",1,"[780-BBJN]",{"$f":"IF($B$141+$B$142-$F$143=4,A183,\"\")","v":""},{"$f":"IF($B$141+$B$142-$F$143=4,C183,\"\")","v":""},{"$f":"IF($B$160-$F$160=4,A183,\"\")","v":""},{"$f":"IF($B$160-$F$160=4,C183,\"\")","v":""}]
["C7 - RAID 1+RAID 1 for H330 (2 + 2 HDDs) ",1,"[780-BBJO]",{"$f":"IF($B$141+$B$142-$F$143=4,A184,\"\")","v":""},{"$f":"IF($B$141+$B$142-$F$143=4,C184,\"\")","v":""},{"$f":"IF($B$160-$F$160=4,A184,\"\")","v":""},{"$f":"IF($B$160-$F$160=4,C184,\"\")","v":""}]
["C8 - RAID 1+RAID 5 for H330 (2 + 3-8 HDDs)",1,"[780-BBJP]",{"$f":"IF($B$141+$B$142-$F$143>=5,A185,\"\")","v":""},{"$f":"IF($B$141+$B$142-$F$143>=5,C185,\"\")","v":""},{"$f":"IF($B$160-$F$160>=5,A185,\"\")","v":""},{"$f":"IF($B$160-$F$160>=5,C185,\"\")","v":""}]
["C9 - RAID 1+RAID 10 for H330 (2 + 4 HDDs in pairs) ",1,"[780-BBJQ] ",{"$f":"IF($B$141+$B$142-$F$143=6,A186,\"\")","v":""},{"$f":"IF($B$141+$B$142-$F$143=6,C186,\"\")","v":""},{"$f":"IF($B$160-$F$160=6,A186,\"\")","v":""},{"$f":"IF($B$160-$F$160=6,C186,\"\")","v":""}]
[]
[]
[]
["T630 Tower Base"]
["300GB 10K RPM SAS 2.5in Hot-plug Hard Drive,3.5in HYB CARR,CusKit",1,"TS1L1-HD300T","TS1L1-HD300-T630","400-AJOU",111]
["1.2TB 10K RPM SAS 12Gbps 2.5in Hot-plug Hard Drive,3.5in HYB CARR,CusKit",1,"TS1L1-HD1200T","TS1L1-HD1200-T630","400-AJPC",173]
[]
[]
["HDD max",18]
["HDD 300GB Base",2]
["HDD 300GB Selected",{"$f":"HD300_D","v":0}]
["300GB 10K RPM SAS 2.5in Hot-plug Hard Drive,3.5in HYB CARR,CusKit",0,null,"Hot Spare for 300GB HDD",{"$f":"'Lotto1 T630 1 (Tower)'!C151","v":0},{"$f":"IF(E198=\"Yes\",1,0)","v":0}]
[null,1]
[null,2]
[null,3]
[null,4]
[null,5]
[null,6]
[null,7]
[null,8]
[null,9]
[null,10]
[null,11]
[null,12]
[null,13]
[null,14]
[null,15]
[null,16]
["HDD max",18]
["HDD 300GB",{"$f":"B196+B197","v":2}]
["HDD 1TB Selected",{"$f":"HD1000_D","v":0},null,"Hot Spare for 1TB HDD",{"$f":"'Lotto1 T630 1 (Tower)'!C155","v":0},{"$f":"IF(E217=\"Yes\",1,0)","v":0}]
["1.2TB 10K RPM SAS 12Gbps 2.5in Hot-plug Hard Drive,3.5in HYB CARR,CusKit",{"$f":"$B$195-$B$196-$B$197","v":16}]
[null,{"$f":"IF(B218-1<1,0,B218-1)","v":15}]
[null,14]
[null,13]
[null,12]
[null,11]
[null,10]
[null,9]
[null,8]
[null,7]
[null,6]
[null,5]
[null,4]
[null,3]
[null,2]
[null,1]
[null,0]
[]
["T630 Tower Prest 2650"]
["300GB 10K RPM SAS 2.5in Hot-plug Hard Drive,3.5in HYB CARR,CusKit",1,"TS1L1-HD300T","TS1L1-HD300-T630","400-AJOU",111]
["1.2TB 10K RPM SAS 12Gbps 2.5in Hot-plug Hard Drive,3.5in HYB CARR,CusKit",1,"TS1L1-HD1200T","TS1L1-HD1200-T630","400-AJPC",173]
[]
[]
["HDD max",8]
["HDD 300GB Base",2]
["HDD 300GB Selected",{"$f":"HD300_E","v":0}]
["300GB 10K RPM SAS 2.5in Hot-plug Hard Drive,3.5in HYB CARR,CusKit",0,null,"Hot Spare for 300GB HDD",{"$f":"'Lotto1 T630 1 (Tower) Prest'!C197","v":0},{"$f":"IF(E244=\"Yes\",1,0)","v":0}]
[null,1]
[null,2]
[null,3]
[null,4]
[null,5]
[null,6]
["HDD max",8]
["HDD 300GB",{"$f":"B242+B243","v":2}]
["HDD 1TB Selected",{"$f":"HD1000_E","v":0},null,"Hot Spare for 1TB HDD",{"$f":"'Lotto1 T630 1 (Tower) Prest'!C201","v":0},{"$f":"IF(E253=\"Yes\",1,0)","v":0}]
["1.2TB 10K RPM SAS 12Gbps 2.5in Hot-plug Hard Drive,3.5in HYB CARR,CusKit",{"$f":"$B$251-$B$252-$B$253","v":6}]
[null,{"$f":"IF(B254-1<1,0,B254-1)","v":5}]
[null,4]
[null,3]
[null,2]
[null,1]
[null,0]

{"sheet":"Memory","index":21,"n_rows":68,"n_cols":16,"rows_kept":68,"cut":false,"hidden":true,"merged":[]}
[null,"Total Memory"]
[]
[null,"Dell 16 GB Modulo di memoria - 2RX8 RDIMM 2400MHz",1,"TS1L1-16GB","TS1L1-16GB","A8711887",122]
[null,"Dell 32 GB Modulo di memoria - 2Rx4 DDR4 RDIMM 2400MHz",1,"TS1L1-32GB","TS1L1-32GB","A8711888",313]
[null,"Dell 64 GB Modulo di memoria - 4RX4 DDR4 LRDIMM 2400MHz",1,"TS1L1-64GB","TS1L1-64GB","A8711890",618]
[]
[]
["1CPU","MEMORY A"]
[32,{"$f":"\"\"","v":""},{"$f":"\"\"","v":""},{"$f":"\"\"","v":""},{"$f":"\"\"","v":""},{"$f":"\"\"","v":""},{"$f":"\"\"","v":""},"32GB RDIMM, 2400MT/s, Dual Rank, x4 Data Width",1,"[370-ACNS]",{"$f":"\"\"","v":""},{"$f":"\"\"","v":""},{"$f":"\"\"","v":""},{"$f":"\"\"","v":""},{"$f":"\"\"","v":""},{"$f":"\"\"","v":""}]
[64,"Dell 32 GB Modulo di memoria - 2Rx4 DDR4 RDIMM 2400MHz",1,"TS1L1-32GB","TS1L1-32GB","A8711888",{"$f":"$G$4*C10","v":313},"32GB RDIMM, 2400MT/s, Dual Rank, x4 Data Width",1,"[370-ACNS]",{"$f":"\"\"","v":""},{"$f":"\"\"","v":""},{"$f":"\"\"","v":""},{"$f":"\"\"","v":""},{"$f":"\"\"","v":""},{"$f":"\"\"","v":""}]
[96,"Dell 32 GB Modulo di memoria - 2Rx4 DDR4 RDIMM 2400MHz",2,"TS1L1-32GB","TS1L1-32GB","A8711888",{"$f":"$G$4*C11","v":626},"32GB RDIMM, 2400MT/s, Dual Rank, x4 Data Width",1,"[370-ACNS]",{"$f":"\"\"","v":""},{"$f":"\"\"","v":""},{"$f":"\"\"","v":""},{"$f":"\"\"","v":""},{"$f":"\"\"","v":""},{"$f":"\"\"","v":""}]
[128,"Dell 32 GB Modulo di memoria - 2Rx4 DDR4 RDIMM 2400MHz",3,"TS1L1-32GB","TS1L1-32GB","A8711888",939,"32GB RDIMM, 2400MT/s, Dual Rank, x4 Data Width",1,"[370-ACNS]",{"$f":"\"\"","v":""},{"$f":"\"\"","v":""},{"$f":"\"\"","v":""},{"$f":"\"\"","v":""},{"$f":"\"\"","v":""},{"$f":"\"\"","v":""}]
[160,"Dell 32 GB Modulo di memoria - 2Rx4 DDR4 RDIMM 2400MHz",4,"TS1L1-32GB","TS1L1-32GB","A8711888",1252,"32GB RDIMM, 2400MT/s, Dual Rank, x4 Data Width",1,"[370-ACNS]",{"$f":"\"\"","v":""},{"$f":"\"\"","v":""},{"$f":"\"\"","v":""},{"$f":"\"\"","v":""},{"$f":"\"\"","v":""},{"$f":"\"\"","v":""}]
[192,"Dell 32 GB Modulo di memoria - 2Rx4 DDR4 RDIMM 2400MHz",5,"TS1L1-32GB","TS1L1-32GB","A8711888",1565,"32GB RDIMM, 2400MT/s, Dual Rank, x4 Data Width",1,"[370-ACNS]",{"$f":"\"\"","v":""},{"$f":"\"\"","v":""},{"$f":"\"\"","v":""},{"$f":"\"\"","v":""},{"$f":"\"\"","v":""},{"$f":"\"\"","v":""}]
[256,"Dell 32 GB Modulo di memoria - 2Rx4 DDR4 RDIMM 2400MHz",7,"TS1L1-32GB","TS1L1-32GB","A8711888",{"$f":"$G$4*C15","v":2191},"32GB RDIMM, 2400MT/s, Dual Rank, x4 Data Width",1,"[370-ACNS]",{"$f":"\"\"","v":""},{"$f":"\"\"","v":""},{"$f":"\"\"","v":""},{"$f":"\"\"","v":""},{"$f":"\"\"","v":""},{"$f":"\"\"","v":""}]
[320,"Dell 32 GB Modulo di memoria - 2Rx4 DDR4 RDIMM 2400MHz",9,"TS1L1-32GB","TS1L1-32GB","A8711888",{"$f":"$G$4*C16","v":2817},"32GB RDIMM, 2400MT/s, Dual Rank, x4 Data Width",1,"[370-ACNS]",{"$f":"\"\"","v":""},{"$f":"\"\"","v":""},{"$f":"\"\"","v":""},{"$f":"\"\"","v":""},{"$f":"\"\"","v":""},{"$f":"\"\"","v":""}]
[384,"Dell 32 GB Modulo di memoria - 2Rx4 DDR4 RDIMM 2400MHz",11,"TS1L1-32GB","TS1L1-32GB","A8711888",3443,"32GB RDIMM, 2400MT/s, Dual Rank, x4 Data Width",1,"[370-ACNS]",{"$f":"\"\"","v":""},{"$f":"\"\"","v":""},{"$f":"\"\"","v":""},{"$f":"\"\"","v":""},{"$f":"\"\"","v":""},{"$f":"\"\"","v":""}]
["2CPU"]
[64,"Dell 32 GB Modulo di memoria - 2Rx4 DDR4 RDIMM 2400MHz",1,"TS1L1-32GB","TS1L1-32GB","A8711888",{"$f":"$G$4*C19","v":313},"32GB RDIMM, 2400MT/s, Dual Rank, x4 Data Width",1,"[370-ACNS]",{"$f":"\"\"","v":""},{"$f":"\"\"","v":""},{"$f":"\"\"","v":""},{"$f":"\"\"","v":""},{"$f":"\"\"","v":""},{"$f":"\"\"","v":""}]
[128,"Dell 32 GB Modulo di memoria - 2Rx4 DDR4 RDIMM 2400MHz",3,"TS1L1-32GB","TS1L1-32GB","A8711888",{"$f":"$G$4*C20","v":939},"32GB RDIMM, 2400MT/s, Dual Rank, x4 Data Width",1,"[370-ACNS]",{"$f":"\"\"","v":""},{"$f":"\"\"","v":""},{"$f":"\"\"","v":""},{"$f":"\"\"","v":""},{"$f":"\"\"","v":""},{"$f":"\"\"","v":""}]
[192,"Dell 32 GB Modulo di memoria - 2Rx4 DDR4 RDIMM 2400MHz",5,"TS1L1-32GB","TS1L1-32GB","A8711888",1565,"32GB RDIMM, 2400MT/s, Dual Rank, x4 Data Width",1,"[370-ACNS]",{"$f":"\"\"","v":""},{"$f":"\"\"","v":""},{"$f":"\"\"","v":""},{"$f":"\"\"","v":""},{"$f":"\"\"","v":""},{"$f":"\"\"","v":""}]
[256,"Dell 32 GB Modulo di memoria - 2Rx4 DDR4 RDIMM 2400MHz",7,"TS1L1-32GB","TS1L1-32GB","A8711888",2191,"32GB RDIMM, 2400MT/s, Dual Rank, x4 Data Width",1,"[370-ACNS]",{"$f":"\"\"","v":""},{"$f":"\"\"","v":""},{"$f":"\"\"","v":""},{"$f":"\"\"","v":""},{"$f":"\"\"","v":""},{"$f":"\"\"","v":""}]
[320,"Dell 32 GB Modulo di memoria - 2Rx4 DDR4 RDIMM 2400MHz",9,"TS1L1-32GB","TS1L1-32GB","A8711888",2817,"32GB RDIMM, 2400MT/s, Dual Rank, x4 Data Width",1,"[370-ACNS]",{"$f":"\"\"","v":""},{"$f":"\"\"","v":""},{"$f":"\"\"","v":""},{"$f":"\"\"","v":""},{"$f":"\"\"","v":""},{"$f":"\"\"","v":""}]
[384,"Dell 32 GB Modulo di memoria - 2Rx4 DDR4 RDIMM 2400MHz",11,"TS1L1-32GB","TS1L1-32GB","A8711888",3443,"32GB RDIMM, 2400MT/s, Dual Rank, x4 Data Width",1,"[370-ACNS]",{"$f":"\"\"","v":""},{"$f":"\"\"","v":""},{"$f":"\"\"","v":""},{"$f":"\"\"","v":""},{"$f":"\"\"","v":""},{"$f":"\"\"","v":""}]
[512,"Dell 32 GB Modulo di memoria - 2Rx4 DDR4 RDIMM 2400MHz",15,"TS1L1-32GB","TS1L1-32GB","A8711888",{"$f":"$G$4*C25","v":4695},"32GB RDIMM, 2400MT/s, Dual Rank, x4 Data Width",1,"[370-ACNS]",{"$f":"\"\"","v":""},{"$f":"\"\"","v":""},{"$f":"\"\"","v":""},{"$f":"\"\"","v":""},{"$f":"\"\"","v":""},{"$f":"\"\"","v":""}]
[640,"Dell 32 GB Modulo di memoria - 2Rx4 DDR4 RDIMM 2400MHz",19,"TS1L1-32GB","TS1L1-32GB","A8711888",{"$f":"$G$4*C26","v":5947},"32GB RDIMM, 2400MT/s, Dual Rank, x4 Data Width",1,"[370-ACNS]",{"$f":"\"\"","v":""},{"$f":"\"\"","v":""},{"$f":"\"\"","v":""},{"$f":"\"\"","v":""},{"$f":"\"\"","v":""},{"$f":"\"\"","v":""}]
[768,"Dell 32 GB Modulo di memoria - 2Rx4 DDR4 RDIMM 2400MHz",23,"TS1L1-32GB","TS1L1-32GB","A8711888",{"$f":"$G$4*C27","v":7199},"32GB RDIMM, 2400MT/s, Dual Rank, x4 Data Width",1,"[370-ACNS]",{"$f":"\"\"","v":""},{"$f":"\"\"","v":""},{"$f":"\"\"","v":""},{"$f":"\"\"","v":""},{"$f":"\"\"","v":""},{"$f":"\"\"","v":""}]
[]
[]
["1CPU","MEMORY B"]
[64,{"$f":"\"\"","v":""},{"$f":"\"\"","v":""},{"$f":"\"\"","v":""},{"$f":"\"\"","v":""},{"$f":"\"\"","v":""},{"$f":"\"\"","v":""},"32GB RDIMM, 2400MT/s, Dual Rank, x4 Data Width",2,"[370-ACNS]",{"$f":"\"\"","v":""},{"$f":"\"\"","v":""},{"$f":"\"\"","v":""},{"$f":"\"\"","v":""},{"$f":"\"\"","v":""},{"$f":"\"\"","v":""}]
[128,"Dell 32 GB Modulo di memoria - 2Rx4 DDR4 RDIMM 2400MHz",2,"TS1L1-32GB","TS1L1-32GB","A8711888",{"$f":"$G$4*C32","v":626},"32GB RDIMM, 2400MT/s, Dual Rank, x4 Data Width",2,"[370-ACNS]",{"$f":"\"\"","v":""},{"$f":"\"\"","v":""},{"$f":"\"\"","v":""},{"$f":"\"\"","v":""},{"$f":"\"\"","v":""},{"$f":"\"\"","v":""}]
[160,"Dell 32 GB Modulo di memoria - 2Rx4 DDR4 RDIMM 2400MHz",3,"TS1L1-32GB","TS1L1-32GB","A8711888",939,"32GB RDIMM, 2400MT/s, Dual Rank, x4 Data Width",2,"[370-ACNS]",{"$f":"\"\"","v":""},{"$f":"\"\"","v":""},{"$f":"\"\"","v":""},{"$f":"\"\"","v":""},{"$f":"\"\"","v":""},{"$f":"\"\"","v":""}]
[192,"Dell 32 GB Modulo di memoria - 2Rx4 DDR4 RDIMM 2400MHz",4,"TS1L1-32GB","TS1L1-32GB","A8711888",1252,"32GB RDIMM, 2400MT/s, Dual Rank, x4 Data Width",2,"[370-ACNS]",{"$f":"\"\"","v":""},{"$f":"\"\"","v":""},{"$f":"\"\"","v":""},{"$f":"\"\"","v":""},{"$f":"\"\"","v":""},{"$f":"\"\"","v":""}]
[256,"Dell 32 GB Modulo di memoria - 2Rx4 DDR4 RDIMM 2400MHz",6,"TS1L1-32GB","TS1L1-32GB","A8711888",1878,"32GB RDIMM, 2400MT/s, Dual Rank, x4 Data Width",2,"[370-ACNS]",{"$f":"\"\"","v":""},{"$f":"\"\"","v":""},{"$f":"\"\"","v":""},{"$f":"\"\"","v":""},{"$f":"\"\"","v":""},{"$f":"\"\"","v":""}]
[320,"Dell 32 GB Modulo di memoria - 2Rx4 DDR4 RDIMM 2400MHz",8,"TS1L1-32GB","TS1L1-32GB","A8711888",2504,"32GB RDIMM, 2400MT/s, Dual Rank, x4 Data Width",2,"[370-ACNS]",{"$f":"\"\"","v":""},{"$f":"\"\"","v":""},{"$f":"\"\"","v":""},{"$f":"\"\"","v":""},{"$f":"\"\"","v":""},{"$f":"\"\"","v":""}]
[384,"Dell 32 GB Modulo di memoria - 2Rx4 DDR4 RDIMM 2400MHz",10,"TS1L1-32GB","TS1L1-32GB","A8711888",3130,"32GB RDIMM, 2400MT/s, Dual Rank, x4 Data Width",2,"[370-ACNS]",{"$f":"\"\"","v":""},{"$f":"\"\"","v":""},{"$f":"\"\"","v":""},{"$f":"\"\"","v":""},{"$f":"\"\"","v":""},{"$f":"\"\"","v":""}]
["2CPU"]
[64,{"$f":"\"\"","v":""},{"$f":"\"\"","v":""},{"$f":"\"\"","v":""},{"$f":"\"\"","v":""},{"$f":"\"\"","v":""},{"$f":"\"\"","v":""},"32GB RDIMM, 2400MT/s, Dual Rank, x4 Data Width",2,"[370-ACNS]",{"$f":"\"\"","v":""},{"$f":"\"\"","v":""},{"$f":"\"\"","v":""},{"$f":"\"\"","v":""},{"$f":"\"\"","v":""},{"$f":"\"\"","v":""}]
[128,"Dell 32 GB Modulo di memoria - 2Rx4 DDR4 RDIMM 2400MHz",2,"TS1L1-32GB","TS1L1-32GB","A8711888",{"$f":"$G$4*C40","v":626},"32GB RDIMM, 2400MT/s, Dual Rank, x4 Data Width",2,"[370-ACNS]",{"$f":"\"\"","v":""},{"$f":"\"\"","v":""},{"$f":"\"\"","v":""},{"$f":"\"\"","v":""},{"$f":"\"\"","v":""},{"$f":"\"\"","v":""}]
[192,"Dell 32 GB Modulo di memoria - 2Rx4 DDR4 RDIMM 2400MHz",4,"TS1L1-32GB","TS1L1-32GB","A8711888",1252,"32GB RDIMM, 2400MT/s, Dual Rank, x4 Data Width",2,"[370-ACNS]",{"$f":"\"\"","v":""},{"$f":"\"\"","v":""},{"$f":"\"\"","v":""},{"$f":"\"\"","v":""},{"$f":"\"\"","v":""},{"$f":"\"\"","v":""}]
[256,"Dell 32 GB Modulo di memoria - 2Rx4 DDR4 RDIMM 2400MHz",6,"TS1L1-32GB","TS1L1-32GB","A8711888",1878,"32GB RDIMM, 2400MT/s, Dual Rank, x4 Data Width",2,"[370-ACNS]",{"$f":"\"\"","v":""},{"$f":"\"\"","v":""},{"$f":"\"\"","v":""},{"$f":"\"\"","v":""},{"$f":"\"\"","v":""},{"$f":"\"\"","v":""}]
[320,"Dell 32 GB Modulo di memoria - 2Rx4 DDR4 RDIMM 2400MHz",8,"TS1L1-32GB","TS1L1-32GB","A8711888",2504,"32GB RDIMM, 2400MT/s, Dual Rank, x4 Data Width",2,"[370-ACNS]",{"$f":"\"\"","v":""},{"$f":"\"\"","v":""},{"$f":"\"\"","v":""},{"$f":"\"\"","v":""},{"$f":"\"\"","v":""},{"$f":"\"\"","v":""}]
[384,"Dell 32 GB Modulo di memoria - 2Rx4 DDR4 RDIMM 2400MHz",10,"TS1L1-32GB","TS1L1-32GB","A8711888",3130,"32GB RDIMM, 2400MT/s, Dual Rank, x4 Data Width",2,"[370-ACNS]",{"$f":"\"\"","v":""},{"$f":"\"\"","v":""},{"$f":"\"\"","v":""},{"$f":"\"\"","v":""},{"$f":"\"\"","v":""},{"$f":"\"\"","v":""}]
[512,"Dell 32 GB Modulo di memoria - 2Rx4 DDR4 RDIMM 2400MHz",14,"TS1L1-32GB","TS1L1-32GB","A8711888",4382,"32GB RDIMM, 2400MT/s, Dual Rank, x4 Data Width",2,"[370-ACNS]",{"$f":"\"\"","v":""},{"$f":"\"\"","v":""},{"$f":"\"\"","v":""},{"$f":"\"\"","v":""},{"$f":"\"\"","v":""},{"$f":"\"\"","v":""}]
[640,"Dell 32 GB Modulo di memoria - 2Rx4 DDR4 RDIMM 2400MHz",18,"TS1L1-32GB","TS1L1-32GB","A8711888",5634,"32GB RDIMM, 2400MT/s, Dual Rank, x4 Data Width",2,"[370-ACNS]",{"$f":"\"\"","v":""},{"$f":"\"\"","v":""},{"$f":"\"\"","v":""},{"$f":"\"\"","v":""},{"$f":"\"\"","v":""},{"$f":"\"\"","v":""}]
[768,"Dell 32 GB Modulo di memoria - 2Rx4 DDR4 RDIMM 2400MHz",22,"TS1L1-32GB","TS1L1-32GB","A8711888",6886,"32GB RDIMM, 2400MT/s, Dual Rank, x4 Data Width",2,"[370-ACNS]",{"$f":"\"\"","v":""},{"$f":"\"\"","v":""},{"$f":"\"\"","v":""},{"$f":"\"\"","v":""},{"$f":"\"\"","v":""},{"$f":"\"\"","v":""}]
[]
[]
["1CPU","MEMORY C"]
[32,{"$f":"\"\"","v":""},{"$f":"\"\"","v":""},{"$f":"\"\"","v":""},{"$f":"\"\"","v":""},{"$f":"\"\"","v":""},{"$f":"\"\"","v":""},"16GB RDIMM, 2400MT/s, Dual Rank, x8 Data Width","2","[370-ACNX]",{"$f":"\"\"","v":""},{"$f":"\"\"","v":""},{"$f":"\"\"","v":""},{"$f":"\"\"","v":""},{"$f":"\"\"","v":""},{"$f":"\"\"","v":""}]
[64,"16GB RDIMM, 2400MT/s, Dual Rank, x8 Data Width,CusKit",2,"10L1-16GB-U","S10L1-T630-16GB","A8711887",{"$f":"$G$3*C52","v":244},"16GB RDIMM, 2400MT/s, Dual Rank, x8 Data Width","2","[370-ACNX]",{"$f":"\"\"","v":""},{"$f":"\"\"","v":""},{"$f":"\"\"","v":""},{"$f":"\"\"","v":""},{"$f":"\"\"","v":""},{"$f":"\"\"","v":""}]
[96,"16GB RDIMM, 2400MT/s, Dual Rank, x8 Data Width,CusKit",4,"10L1-16GB-U","S10L1-R630-16GB","A8711887",488,"16GB RDIMM, 2400MT/s, Dual Rank, x8 Data Width",2,"[370-ACNX]",{"$f":"\"\"","v":""},{"$f":"\"\"","v":""},{"$f":"\"\"","v":""},{"$f":"\"\"","v":""},{"$f":"\"\"","v":""},{"$f":"\"\"","v":""}]
[128,"16GB RDIMM, 2400MT/s, Dual Rank, x8 Data Width,CusKit",6,"10L1-16GB-U","S10L1-T630-16GB","A8711887",732,"16GB RDIMM, 2400MT/s, Dual Rank, x8 Data Width","2","[370-ACNX]",{"$f":"\"\"","v":""},{"$f":"\"\"","v":""},{"$f":"\"\"","v":""},{"$f":"\"\"","v":""},{"$f":"\"\"","v":""},{"$f":"\"\"","v":""}]
[160,"16GB RDIMM, 2400MT/s, Dual Rank, x8 Data Width,CusKit",8,"10L1-16GB-U","S10L1-T630-16GB","A8711887",976,"16GB RDIMM, 2400MT/s, Dual Rank, x8 Data Width","2","[370-ACNX]",{"$f":"\"\"","v":""},{"$f":"\"\"","v":""},{"$f":"\"\"","v":""},{"$f":"\"\"","v":""},{"$f":"\"\"","v":""},{"$f":"\"\"","v":""}]
[192,"16GB RDIMM, 2400MT/s, Dual Rank, x8 Data Width,CusKit",10,"10L1-16GB-U","S10L1-T630-16GB","A8711887",1220,"16GB RDIMM, 2400MT/s, Dual Rank, x8 Data Width","2","[370-ACNX]",{"$f":"\"\"","v":""},{"$f":"\"\"","v":""},{"$f":"\"\"","v":""},{"$f":"\"\"","v":""},{"$f":"\"\"","v":""},{"$f":"\"\"","v":""}]
[256,"16GB RDIMM, 2400MT/s, Dual Rank, x8 Data Width,CusKit",6,"10L1-16GB-U","S10L1-T630-16GB","A8711887",732,"16GB RDIMM, 2400MT/s, Dual Rank, x8 Data Width","2","[370-ACNX]","32GB RDIMM, 2400MT/s, Dual Rank, x4 Data Width,CusKit",4,"10L1-32GB-U","S10L1-T630-32GB","A8711888",{"$f":"#REF!*L57","v":{"$error":"#REF!"}}]
["2CPU"]
[32,{"$f":"\"\"","v":""},{"$f":"\"\"","v":""},{"$f":"\"\"","v":""},{"$f":"\"\"","v":""},{"$f":"\"\"","v":""},{"$f":"\"\"","v":""},"16GB RDIMM, 2400MT/s, Dual Rank, x8 Data Width","2","[370-ACNX]",{"$f":"\"\"","v":""},{"$f":"\"\"","v":""},{"$f":"\"\"","v":""},{"$f":"\"\"","v":""},{"$f":"\"\"","v":""},{"$f":"\"\"","v":""}]
[64,"16GB RDIMM, 2400MT/s, Dual Rank, x8 Data Width,CusKit",2,"10L1-16GB-U","S10L1-T630-16GB","A8711887",{"$f":"$G$3*C60","v":244},"16GB RDIMM, 2400MT/s, Dual Rank, x8 Data Width","2","[370-ACNX]",{"$f":"\"\"","v":""},{"$f":"\"\"","v":""},{"$f":"\"\"","v":""},{"$f":"\"\"","v":""},{"$f":"\"\"","v":""},{"$f":"\"\"","v":""}]
[96,"16GB RDIMM, 2400MT/s, Dual Rank, x8 Data Width,CusKit",4,"10L1-16GB-U","S10L1-R630-16GB","A8711887",{"$f":"$G$3*C61","v":488},"16GB RDIMM, 2400MT/s, Dual Rank, x8 Data Width",2,"[370-ACNX]",{"$f":"\"\"","v":""},{"$f":"\"\"","v":""},{"$f":"\"\"","v":""},{"$f":"\"\"","v":""},{"$f":"\"\"","v":""},{"$f":"\"\"","v":""}]
[128,"16GB RDIMM, 2400MT/s, Dual Rank, x8 Data Width,CusKit",6,"10L1-16GB-U","S10L1-T630-16GB","A8711887",732,"16GB RDIMM, 2400MT/s, Dual Rank, x8 Data Width","2","[370-ACNX]",{"$f":"\"\"","v":""},{"$f":"\"\"","v":""},{"$f":"\"\"","v":""},{"$f":"\"\"","v":""},{"$f":"\"\"","v":""},{"$f":"\"\"","v":""}]
[160,"16GB RDIMM, 2400MT/s, Dual Rank, x8 Data Width,CusKit",8,"10L1-16GB-U","S10L1-T630-16GB","A8711887",976,"16GB RDIMM, 2400MT/s, Dual Rank, x8 Data Width","2","[370-ACNX]",{"$f":"\"\"","v":""},{"$f":"\"\"","v":""},{"$f":"\"\"","v":""},{"$f":"\"\"","v":""},{"$f":"\"\"","v":""},{"$f":"\"\"","v":""}]
[192,"16GB RDIMM, 2400MT/s, Dual Rank, x8 Data Width,CusKit",10,"10L1-16GB-U","S10L1-T630-16GB","A8711887",1220,"16GB RDIMM, 2400MT/s, Dual Rank, x8 Data Width","2","[370-ACNX]",{"$f":"\"\"","v":""},{"$f":"\"\"","v":""},{"$f":"\"\"","v":""},{"$f":"\"\"","v":""},{"$f":"\"\"","v":""},{"$f":"\"\"","v":""}]
[256,"16GB RDIMM, 2400MT/s, Dual Rank, x8 Data Width,CusKit",14,"10L1-16GB-U","S10L1-T630-16GB","A8711887",1708,"16GB RDIMM, 2400MT/s, Dual Rank, x8 Data Width","2","[370-ACNX]",{"$f":"\"\"","v":""},{"$f":"\"\"","v":""},{"$f":"\"\"","v":""},{"$f":"\"\"","v":""},{"$f":"\"\"","v":""},{"$f":"\"\"","v":""}]
[320,"16GB RDIMM, 2400MT/s, Dual Rank, x8 Data Width,CusKit",18,"10L1-16GB-U","S10L1-T630-16GB","A8711887",2196,"16GB RDIMM, 2400MT/s, Dual Rank, x8 Data Width","2","[370-ACNX]",{"$f":"\"\"","v":""},{"$f":"\"\"","v":""},{"$f":"\"\"","v":""},{"$f":"\"\"","v":""},{"$f":"\"\"","v":""},{"$f":"\"\"","v":""}]
[384,"16GB RDIMM, 2400MT/s, Dual Rank, x8 Data Width,CusKit",22,"10L1-16GB-U","S10L1-T630-16GB","A8711887",2684,"16GB RDIMM, 2400MT/s, Dual Rank, x8 Data Width","2","[370-ACNX]",{"$f":"\"\"","v":""},{"$f":"\"\"","v":""},{"$f":"\"\"","v":""},{"$f":"\"\"","v":""},{"$f":"\"\"","v":""},{"$f":"\"\"","v":""}]
[512,"16GB RDIMM, 2400MT/s, Dual Rank, x8 Data Width,CusKit",14,"10L1-16GB-U","S10L1-T630-16GB","A8711887",1708,"16GB RDIMM, 2400MT/s, Dual Rank, x8 Data Width","2","[370-ACNX]","32GB RDIMM, 2400MT/s, Dual Rank, x4 Data Width,CusKit",8,"10L1-32GB-U","S10L1-T630-32GB","A8711888",{"$f":"#REF!*L68","v":{"$error":"#REF!"}}]

{"sheet":"Servizi Opzionali","index":22,"n_rows":81,"n_cols":13,"rows_kept":81,"cut":false,"hidden":true,"merged":[]}
["Warranty Upgrades",null,null,null,null,null,"Protezione dei dati - Keep Your Hard Drive "]
["R630"]
["None",{"$f":"\"\"","v":""},{"$f":"\"\"","v":""},{"$f":"\"\"","v":""},{"$f":"\"\"","v":""},{"$f":"\"\"","v":""},null,null,{"$f":"IF(($A$22=$A$12),\"\",IF($A$8=$A$3,I13,IF($A$8=$A$4,I14,IF($A$8=$A$5,I15))))","v":""},{"$f":"IF(($A$22=$A$12),\"\",IF($A$8=$A$3,J13,IF($A$8=$A$4,J14,IF($A$8=$A$5,J15))))","v":""},{"$f":"IF(($A$22=$A$12),\"\",IF($A$8=$A$3,K13,IF($A$8=$A$4,K14,IF($A$8=$A$5,K15))))","v":""},{"$f":"IF(($A$22=$A$12),\"\",IF($A$8=$A$3,L13,IF($A$8=$A$4,L14,IF($A$8=$A$5,L15))))","v":""},{"$f":"IF(($A$22=$A$12),\"\",IF($A$8=$A$3,M13,IF($A$8=$A$4,M14,IF($A$8=$A$5,M15))))","v":""}]
["Estensione della manutenzione in garanzia per ulteriori 12 mesi",1,"TS1L1-4ANNI","TS1L1-4ANNI-R630",{"$f":"\"\"","v":""},42]
["Estensione della manutenzione in garanzia per ulteriori 24 mesi",1,"TS1L1-5ANNI","TS1L1-5ANNI-R630",{"$f":"\"\"","v":""},85]
[]
["Estensione Garanzia Selezionata"]
[{"$f":"'Lotto1 R630 1'!$B$159","v":"None"},null,"R630"]
[{"$f":"#REF!","v":{"$error":"#REF!"}},null,"R630 2"]
[{"$f":"#REF!","v":{"$error":"#REF!"}},null,"R630 3"]
[]
["None",{"$f":"\"\"","v":""},{"$f":"\"\"","v":""},{"$f":"\"\"","v":""},{"$f":"\"\"","v":""},{"$f":"\"\"","v":""},null,"None"]
[{"$f":"IF($A$8=$A$3,H13,IF($A$8=$A$4,H14,IF($A$8=$A$5,H15)))","v":"3Yr Data Protection - Keep Your Hard Drive"},1,"10L1-SO-HDD","S10L1-R630-S-HDD",{"$f":"IF($A$8=$A$3,L13,IF($A$8=$A$4,L14,IF($A$8=$A$5,L15)))","v":"[733-10057]"},150,null,"3Yr Data Protection - Keep Your Hard Drive",1,"10L1-SO-HDD","S10L1-R630-S-HDD","[733-10057]",150]
["None",{"$f":"\"\"","v":""},{"$f":"\"\"","v":""},{"$f":"\"\"","v":""},{"$f":"\"\"","v":""},{"$f":"\"\"","v":""},null,"4Yr Data Protection - Keep Your Hard Drive",{"$f":"I13","v":1},{"$f":"J13","v":"10L1-SO-HDD"},{"$f":"K13","v":"S10L1-R630-S-HDD"},"[733-10058]",{"$f":"M13","v":150}]
[{"$f":"IF(A9=A3,H13,IF(A9=A4,H14,IF(A9=A5,H15)))","v":{"$error":"#REF!"}},1,"10L1-SO-HDD","S10L1-R730xd-S-HDD",{"$f":"IF(A9=A3,L13,IF(A9=A4,L14,IF(A9=A5,L15)))","v":{"$error":"#REF!"}},150,null,"5Yr Data Protection - Keep Your Hard Drive",{"$f":"I13","v":1},{"$f":"J13","v":"10L1-SO-HDD"},{"$f":"K13","v":"S10L1-R630-S-HDD"},"[733-10059]",{"$f":"M13","v":150}]
["None",{"$f":"\"\"","v":""},{"$f":"\"\"","v":""},{"$f":"\"\"","v":""},{"$f":"\"\"","v":""},{"$f":"\"\"","v":""}]
[{"$f":"IF(A10=A3,H13,IF(A10=A4,H14,IF(A10=A5,H15)))","v":{"$error":"#REF!"}},1,"10L1-SO-HDD","S10L1-R730xd-S-HDD",{"$f":"IF(A10=A3,L13,IF(A10=A4,L14,IF(A10=A5,L15)))","v":{"$error":"#REF!"}},150]
[]
[]
[]
["Protezione dei dati Selezionata"]
[{"$f":"'Lotto1 R630 1'!B162","v":"None"}]
[]
["Servizio Specialistico di System and Network Management per sistema opertivo Windows, erogato on site.",1,"10L1-SO-WIN","S10L1-R630-S-WIN",null,193]
["Servizio Specialistico di System and Network Management per sistema opertivo Linux, erogato on site.",1,"10L1-SO-LINUX","S10L1-R630-S-LINUX",null,193]
[]
["None",{"$f":"\"\"","v":""},{"$f":"\"\"","v":""},{"$f":"\"\"","v":""},{"$f":"\"\"","v":""},{"$f":"\"\"","v":""}]
[{"$f":"IF('Lotto1 R630 1'!$C$16>=5,H28,\"None\")","v":"None"},{"$f":"IF('Lotto1 R630 1'!$C$16>=5,I28,\"\")","v":""},{"$f":"IF('Lotto1 R630 1'!$C$16>=5,J28,\"\")","v":""},{"$f":"IF('Lotto1 R630 1'!$C$16>=5,K28,\"\")","v":""},{"$f":"IF('Lotto1 R630 1'!$C$16>=5,L28,\"\")","v":""},{"$f":"IF('Lotto1 R630 1'!$C$16>=5,M28,\"\")","v":""},null,"Servizi di manutenzione preventiva",1,"10L1-SO-PREV","S10L1-T630-S-PREV",null,193]
[]
["Warranty Upgrades",null,null,null,null,null,"Protezione dei dati - Keep Your Hard Drive "]
["R730xd"]
["None",{"$f":"\"\"","v":""},{"$f":"\"\"","v":""},{"$f":"\"\"","v":""},{"$f":"\"\"","v":""},{"$f":"\"\"","v":""},null,null,{"$f":"IF(($A$22=$A$12),\"\",IF($A$8=$A$3,I42,IF($A$8=$A$4,I43,IF($A$8=$A$5,I44))))","v":""},{"$f":"IF(($A$22=$A$12),\"\",IF($A$8=$A$3,J42,IF($A$8=$A$4,J43,IF($A$8=$A$5,J44))))","v":""},{"$f":"IF(($A$22=$A$12),\"\",IF($A$8=$A$3,K42,IF($A$8=$A$4,K43,IF($A$8=$A$5,K44))))","v":""},{"$f":"IF(($A$22=$A$12),\"\",IF($A$8=$A$3,L42,IF($A$8=$A$4,L43,IF($A$8=$A$5,L44))))","v":""},{"$f":"IF(($A$22=$A$12),\"\",IF($A$8=$A$3,M42,IF($A$8=$A$4,M43,IF($A$8=$A$5,M44))))","v":""}]
["Estensione della manutenzione in garanzia per ulteriori 12 mesi",1,"TS1L1-4ANNI","TS1L1-4ANNI-R730XD","",42]
["Estensione della manutenzione in garanzia per ulteriori 24 mesi",1,"TS1L1-5ANNI","TS1L1-5ANNI-R730XD","",85]
[]
["Estensione Garanzia Selezionata"]
[{"$f":"'Lotto1 R730xd 1'!$B$169","v":"None"},null,"R730xd"]
[{"$f":"#REF!","v":{"$error":"#REF!"}},null,"R730xd 2"]
[{"$f":"#REF!","v":{"$error":"#REF!"}},null,"R730xd 3"]
[]
["None",{"$f":"\"\"","v":""},{"$f":"\"\"","v":""},{"$f":"\"\"","v":""},{"$f":"\"\"","v":""},{"$f":"\"\"","v":""},null,"None"]
[{"$f":"IF($A$37=$A$32,H42,IF($A$37=$A$33,H43,IF($A$37=$A$34,H44)))","v":"3Yr Data Protection - Keep Your Hard Drive"},1,"10L1-SO-HDD","S10L1-R730xd-S-HDD",{"$f":"IF($A$37=$A$32,L42,IF($A$37=$A$33,L43,IF($A$37=$A$34,L44)))","v":"[733-10057]"},150,null,"3Yr Data Protection - Keep Your Hard Drive",1,"10L1-SO-HDD","S10L1-R730xd-S-HDD","[733-10057]",150]
["None",{"$f":"\"\"","v":""},{"$f":"\"\"","v":""},{"$f":"\"\"","v":""},{"$f":"\"\"","v":""},{"$f":"\"\"","v":""},null,"4Yr Data Protection - Keep Your Hard Drive",{"$f":"I42","v":1},{"$f":"J42","v":"10L1-SO-HDD"},{"$f":"K42","v":"S10L1-R730xd-S-HDD"},"[733-10058]",{"$f":"M42","v":150}]
[{"$f":"IF(A38=A32,H42,IF(A38=A33,H43,IF(A38=A34,H44)))","v":{"$error":"#REF!"}},1,"10L1-SO-HDD","S10L1-R730xd-S-HDD",{"$f":"IF(A38=A32,L42,IF(A38=A33,L43,IF(A38=A34,L44)))","v":{"$error":"#REF!"}},150,null,"5Yr Data Protection - Keep Your Hard Drive",{"$f":"I42","v":1},{"$f":"J42","v":"10L1-SO-HDD"},{"$f":"K42","v":"S10L1-R730xd-S-HDD"},"[733-10059]",{"$f":"M42","v":150}]
["None",{"$f":"\"\"","v":""},{"$f":"\"\"","v":""},{"$f":"\"\"","v":""},{"$f":"\"\"","v":""},{"$f":"\"\"","v":""}]
[{"$f":"IF(A39=A32,H42,IF(A39=A33,H43,IF(A39=A34,H44)))","v":{"$error":"#REF!"}},1,"10L1-SO-HDD","S10L1-R730xd-S-HDD",{"$f":"IF(A39=A32,L42,IF(A39=A33,L43,IF(A39=A34,L44)))","v":{"$error":"#REF!"}},150]
[]
[]
[]
["Protezione dei dati Selezionata"]
[{"$f":"'Lotto1 R730xd 1'!B172","v":"None"}]
[]
["Servizio Specialistico di System and Network Management per sistema opertivo Windows, erogato on site.",1,"10L1-SO-WIN","S10L1-R730xd-S-WIN",null,193]
["Servizio Specialistico di System and Network Management per sistema opertivo Linux, erogato on site.",1,"10L1-SO-LINUX","S10L1-R730xd-S-LINUX",null,193]
[]
["None",{"$f":"\"\"","v":""},{"$f":"\"\"","v":""},{"$f":"\"\"","v":""},{"$f":"\"\"","v":""},{"$f":"\"\"","v":""}]
[{"$f":"IF('Lotto1 R730xd 1'!$C$16>=5,H57,\"None\")","v":"None"},{"$f":"IF('Lotto1 R730xd 1'!$C$16>=5,I57,\"\")","v":""},{"$f":"IF('Lotto1 R730xd 1'!$C$16>=5,J57,\"\")","v":""},{"$f":"IF('Lotto1 R730xd 1'!$C$16>=5,K57,\"\")","v":""},{"$f":"IF('Lotto1 R730xd 1'!$C$16>=5,L57,\"\")","v":""},{"$f":"IF('Lotto1 R730xd 1'!$C$16>=5,M57,\"\")","v":""},null,"Servizi di manutenzione preventiva",1,"10L1-SO-PREV","S10L1-R730xd-S-PREV",null,193]
[]
[]
["Warranty Upgrades",null,null,null,null,null,"Protezione dei dati - Keep Your Hard Drive "]
["T630"]
["None",{"$f":"\"\"","v":""},{"$f":"\"\"","v":""},{"$f":"\"\"","v":""},{"$f":"\"\"","v":""},{"$f":"\"\"","v":""},null,null,{"$f":"IF(($A$22=$A$12),\"\",IF($A$8=$A$3,I72,IF($A$8=$A$4,I73,IF($A$8=$A$5,I74))))","v":""},{"$f":"IF(($A$22=$A$12),\"\",IF($A$8=$A$3,J72,IF($A$8=$A$4,J73,IF($A$8=$A$5,J74))))","v":""},{"$f":"IF(($A$22=$A$12),\"\",IF($A$8=$A$3,K72,IF($A$8=$A$4,K73,IF($A$8=$A$5,K74))))","v":""},{"$f":"IF(($A$22=$A$12),\"\",IF($A$8=$A$3,L72,IF($A$8=$A$4,L73,IF($A$8=$A$5,L74))))","v":""},{"$f":"IF(($A$22=$A$12),\"\",IF($A$8=$A$3,M72,IF($A$8=$A$4,M73,IF($A$8=$A$5,M74))))","v":""}]
["Estensione della manutenzione in garanzia per ulteriori 12 mesi",1,"TS1L1-4ANNI","TS1L1-4ANNI-T630R","",42]
["Estensione della manutenzione in garanzia per ulteriori 24 mesi",1,"TS1L1-5ANNI","TS1L1-5ANNI-T630R","",85]
[]
["Estensione Garanzia Selezionata"]
[{"$f":"'Lotto1 T630R 1'!B176","v":"None"}]
[]
["None",{"$f":"\"\"","v":""},{"$f":"\"\"","v":""},{"$f":"\"\"","v":""},{"$f":"\"\"","v":""},{"$f":"\"\"","v":""},null,"None"]
[{"$f":"IF($A$67=$A$62,H70,IF($A$67=$A$63,H71,IF($A$67=$A$64,H72)))","v":"3Yr Data Protection - Keep Your Hard Drive"},1,"10L1-SO-HDD","S10L1-T630-S-HDD",{"$f":"IF($A$67=$A$62,L70,IF($A$67=$A$63,L71,IF($A$67=$A$64,L72)))","v":"[733-10057]"},150,null,"3Yr Data Protection - Keep Your Hard Drive",1,"10L1-SO-HDD","S10L1-T630-S-HDD","[733-10057]",150]
[null,null,null,null,null,null,null,"4Yr Data Protection - Keep Your Hard Drive",{"$f":"I70","v":1},{"$f":"J70","v":"10L1-SO-HDD"},{"$f":"K70","v":"S10L1-T630-S-HDD"},"[733-10058]",{"$f":"M70","v":150}]
[null,null,null,null,null,null,null,"5Yr Data Protection - Keep Your Hard Drive",{"$f":"I70","v":1},{"$f":"J70","v":"10L1-SO-HDD"},{"$f":"K70","v":"S10L1-T630-S-HDD"},"[733-10059]",{"$f":"M70","v":150}]
[]
["Protezione dei dati Selezionata"]
[{"$f":"'Lotto1 T630R 1'!B179","v":"None"}]
[]
["Servizio Specialistico di System and Network Management per sistema opertivo Windows, erogato on site.",1,"10L1-SO-WIN","S10L1-T630-S-WIN",null,193]
["Servizio Specialistico di System and Network Management per sistema opertivo Linux, erogato on site.",1,"10L1-SO-LINUX","S10L1-T630-S-LINUX",null,193]
[]
["None",{"$f":"\"\"","v":""},{"$f":"\"\"","v":""},{"$f":"\"\"","v":""},{"$f":"\"\"","v":""},{"$f":"\"\"","v":""}]
[{"$f":"IF('Lotto1 T630R 1'!$C$17>=5,H81,\"None\")","v":"None"},{"$f":"IF('Lotto1 T630R 1'!$C$17>=5,I81,\"\")","v":""},{"$f":"IF('Lotto1 T630R 1'!$C$17>=5,J81,\"\")","v":""},{"$f":"IF('Lotto1 T630R 1'!$C$17>=5,K81,\"\")","v":""},{"$f":"IF('Lotto1 T630R 1'!$C$17>=5,L81,\"\")","v":""},{"$f":"IF('Lotto1 T630R 1'!$C$17>=5,M81,\"\")","v":""},null,"Servizi di manutenzione preventiva",1,"10L1-SO-PREV","S10L1-T630-S-PREV",null,193]