{"text_format":"1","workbook":"xlsx","n_sheets":23,"sheets":["CNV R640 1","CNV R740 1","CNV R740xd 1","CNV T640 (Tower)","CNV T640 1 (Tower) Prest","CNV T640 (Rack)","RACK, Accessori e Servizi","Riepilogo","CNV R640 2","CNV R640 3","CNV R740 2","CNV R740 3","CNV R740xd 2","CNV R740xd 3","HDD","Operating System","Memory","Processor","Codici","PCI","Lotto1 T630R 2","Lotto1 T630R 3","Servizi Opzionali"],"not_rendered":{"charts":0,"images":27,"macros":1,"external_links":1,"defined_names":167,"comments":0,"pivot_tables":0},"unopened":[],"bounds":{"document_bytes":16777216,"sheet_cells":100000,"rows_first":2000,"rows_last":500,"rows_between":2000,"halvings":0,"cell_chars":16384,"cell_head_chars":4096},"cells_cut":0,"cells_raw":0,"read":"whole","date_system":"1900"}

{"sheet":"CNV R640 1","index":0,"n_rows":174,"n_cols":8,"rows_kept":174,"cut":false,"hidden":false,"merged":[[96,8,99,10],[162,1,162,4],[142,2,142,4],[123,1,123,4],[127,2,127,4],[129,1,129,4],[130,2,130,4],[132,1,132,4],[133,2,133,4],[135,1,135,4],[136,2,136,4],[138,1,138,4],[139,2,139,4],[141,1,141,4],[126,1,126,4],[124,2,124,4],[163,2,163,4],[165,1,165,4],[160,2,160,4],[144,1,144,4],[145,2,145,4],[147,1,147,4],[148,2,148,4],[150,1,150,4],[151,2,151,4],[153,1,153,4],[154,2,154,4],[156,1,156,4],[157,2,157,4],[159,1,159,4],[174,1,174,4],[166,2,166,4],[168,1,168,4],[169,2,169,4],[171,1,171,4],[172,2,172,4],[121,2,121,4],[99,1,99,4],[100,2,100,4],[102,1,102,4],[103,2,103,4],[105,1,105,4],[106,2,106,4],[108,1,108,4],[109,2,109,4],[111,1,111,4],[115,2,115,4],[117,1,117,4],[114,1,114,4],[118,2,118,4],[120,1,120,4],[4,0,4,4],[5,0,5,4],[10,0,11,5],[12,0,12,5],[18,2,18,4],[20,1,20,4],[21,2,21,4],[23,1,23,4],[24,2,24,4],[27,2,27,4],[26,1,26,4],[29,1,29,4],[30,2,30,4],[33,1,33,4],[34,2,34,4],[36,1,36,4],[39,1,39,4],[40,2,40,4],[42,1,42,4],[96,2,96,4],[54,2,54,4],[56,1,56,4],[77,2,77,4],[91,1,91,4],[92,2,92,4],[57,2,57,4],[59,1,59,4],[61,1,61,4],[74,2,74,4],[76,1,76,4],[95,1,95,3],[64,1,64,4],[73,1,73,4],[94,7,95,8],[43,2,43,4],[49,1,49,4],[50,2,50,4],[53,1,53,4]]}
[null,null,null,"TOTALE MEPA",null,null,null,{"$f":"G10","v":0}]
[]
[]
[]
["POWEREDGE R640"]
[]
[null,null,null,null,null,"Totale Server e Opzioni",{"$f":"F18*SRV_A+G70+G73","v":0}]
[null,null,null,null,null,"Totale Ulteriori Opzioni "]
[]
[null,null,null,null,null,"TOTALE CONVENZIONE",{"$f":"G8+G7","v":0}]
["Components: \nServer DELL PowerEdge R640 (1CPU Intel® Xeon® Silver 4114, 32GB RDIMM, 2xHDD 600GB 10K RPM SAS 12Gbps 2.5in)"]
[]
[]
[]
[null,"Category: Server"]
[null,"Quantity: ",null,null,null,1720]
[null,null,null,null,null,{"$f":"SUM(F21:F189)","v":0},{"$f":"SUM(G21:G189)","v":0}]
[null,null,null,null,null,{"$f":"SUM(F16:F17)","v":1720}]
[null,"Base"]
[null,"PowerEdge R640 Server, 8HDD",1,null,"[210-AKWU][329-BDKC]"]
[]
[null,"Configurazione dello chassis"]
[null,"2.5 Chassis with up to 8 Hard Drives and 2PCIe slots",1,null,"[321-BCQJ]"]
[]
[null,"Processore"]
[null,"Intel® Xeon® Silver 4114 2.2G, 10C/20T, 9.6GT/s 2UPI, 14M Cache, Turbo, HT\n(85W)",1,null,"[338-BLUS]"]
[]
[null,"Processore aggiuntivo"]
[null,"No Additional Processor",{"$f":"VLOOKUP($B$29, CPU_A, 2, FALSE)","v":0},{"$f":"VLOOKUP($B$29, CPU_A, 3, FALSE)","v":""},{"$f":"VLOOKUP($B$29, CPU_A, 5, FALSE)","v":"[374-BBBX]"},{"$f":"VLOOKUP(B29, CPU_A, 15, FALSE)","v":0}]
[]
[null,"Processor Thermal Configuration"]
[null,"Standard 1U Heatsink",1,null,"[412-AAIQ]"]
[null,{"$f":"VLOOKUP($B$29, CPU_A, 6, FALSE)","v":""},{"$f":"VLOOKUP($B$29, CPU_A, 7, FALSE)","v":""},null,{"$f":"VLOOKUP($B$29, CPU_A, 8, FALSE)","v":""}]
[]
[null,"Tipo di configurazione memoria"]
[null,"Performance Optimized",1,null,"[370-AAIP]"]
[]
[null,"Memoria Totale in GB",{"$f":"IF(F29=728,IF(B39=32,\"ATTENZIONE: AUMENTARE LA RAM\",\"\"),\"\")","v":""}]
[null,32]
[]
[null,"Tipo e velocità della memoria DIMM"]
[null,"2667MT/s RDIMMs",1,null,"[370-ADNU]"]
[]
[null,"Capacità di memoria"]
[null,{"$f":"IF($B$29=\"No Additional Processor\",VLOOKUP($B$39, MEM_A1, 8, FALSE),VLOOKUP($B$39, MEM_A2, 8, FALSE))","v":"Dell 32 GB Modulo di memoria - RDIMM 2666MHz"},{"$f":"IF($B$29=\"No Additional Processor\",VLOOKUP($B$39, MEM_A1, 9, FALSE),VLOOKUP($B$39, MEM_A2, 9, FALSE))","v":1},null,{"$f":"IF($B$29=\"No Additional Processor\",VLOOKUP($B$39, MEM_A1, 10, FALSE),VLOOKUP($B$39, MEM_A2, 10, FALSE))","v":"[370-ADNF]"}]
[]
[null,{"$f":"IF($B$29=\"No Additional Processor\",VLOOKUP($B$39, MEM_A1, 2, FALSE),VLOOKUP($B$39, MEM_A2, 2, FALSE))","v":""},{"$f":"IF($B$29=\"No Additional Processor\",VLOOKUP($B$39, MEM_A1, 3, FALSE),VLOOKUP($B$39, MEM_A2, 3, FALSE))","v":""},{"$f":"IF($B$29=\"No Additional Processor\",VLOOKUP($B$39, MEM_A1, 4, FALSE),VLOOKUP($B$39, MEM_A2, 4, FALSE))","v":""},{"$f":"IF($B$29=\"No Additional Processor\",VLOOKUP($B$39, MEM_A1, 6, FALSE),VLOOKUP($B$39, MEM_A2, 6, FALSE))","v":""},{"$f":"IF($B$29=\"No Additional Processor\",VLOOKUP($B$39, MEM_A1, 7, FALSE),VLOOKUP($B$39, MEM_A2, 7, FALSE))","v":""}]
[]
[null,{"$f":"IF($B$29=\"No Additional Processor\",VLOOKUP($B$39, MEM_A1, 11, FALSE),VLOOKUP($B$39, MEM_A2, 11, FALSE))","v":""},{"$f":"IF($B$29=\"No Additional Processor\",VLOOKUP($B$39, MEM_A1, 12, FALSE),VLOOKUP($B$39, MEM_A2, 12, FALSE))","v":""},{"$f":"IF($B$29=\"No Additional Processor\",VLOOKUP($B$39, MEM_A1, 13, FALSE),VLOOKUP($B$39, MEM_A2, 13, FALSE))","v":""},{"$f":"IF($B$29=\"No Additional Processor\",VLOOKUP($B$39, MEM_A1, 15, FALSE),VLOOKUP($B$39, MEM_A2, 15, FALSE))","v":""},{"$f":"IF($B$29=\"No Additional Processor\",VLOOKUP($B$39, MEM_A1, 16, FALSE),VLOOKUP($B$39, MEM_A2, 16, FALSE))","v":""}]
[]
[null,"Sistema operativo preinstallato"]
[null,"No Operating System",{"$f":"VLOOKUP($B$52, OS_A, 2, FALSE)","v":""},{"$f":"VLOOKUP($B$52, OS_A, 3, FALSE)","v":""},{"$f":"VLOOKUP($B$52, OS_A, 5, FALSE)","v":"[611-BBBF]"},{"$f":"VLOOKUP($B$52, OS_A, 6, FALSE)","v":""}]
[null,{"$f":"IF($B$29=\"No Additional Processor\",VLOOKUP($B$52, OS_A, 20, FALSE),VLOOKUP($B$52, OS_A2, 20, FALSE))","v":""},{"$f":"IF($B$29=\"No Additional Processor\",VLOOKUP($B$52, OS_A, 21, FALSE),VLOOKUP($B$52, OS_A2, 21, FALSE))","v":0},{"$f":"IF($B$29=\"No Additional Processor\",VLOOKUP($B$52, OS_A, 22, FALSE),VLOOKUP($B$52, OS_A2, 22, FALSE))","v":""},{"$f":"IF($B$29=\"No Additional Processor\",VLOOKUP($B$52, OS_A, 24, FALSE),VLOOKUP($B$52, OS_A2, 24, FALSE))","v":""},{"$f":"IF($B$29=\"No Additional Processor\",VLOOKUP($B$52, OS_A, 25, FALSE),VLOOKUP($B$52, OS_A2, 25, FALSE))","v":""}]
[]
[null,"OS Media Kits"]
[null,"No Media Required",1,null,"[605-BBFN]"]
[]
[null,"Client Access Licenses"]
[null,{"$f":"VLOOKUP($B$52, OS_A, 8, FALSE)","v":"None"},null,{"$f":"VLOOKUP($B$52, OS_A, 10, FALSE)","v":""},{"$f":"VLOOKUP($B$52, OS_A, 12, FALSE)","v":""},{"$f":"VLOOKUP($B$52, OS_A, 13, FALSE)*C59","v":0}]
[]
[null,{"$f":"VLOOKUP($B$52, OS_A, 14, FALSE)","v":"None"},null,{"$f":"VLOOKUP($B$52, OS_A, 16, FALSE)","v":""},{"$f":"VLOOKUP($B$52, OS_A, 18, FALSE)","v":""},{"$f":"VLOOKUP($B$52, OS_A, 19, FALSE)*C61","v":0}]
[]
[null,"Sistema operativo SUSE Linux Enterprise Server"]
[null,"None\n",{"$f":"VLOOKUP($B$64,SUSE, 2, FALSE)","v":0},{"$f":"VLOOKUP($B$64,SUSE, 3, FALSE)","v":""},{"$f":"VLOOKUP($B$64,SUSE, 5, FALSE)","v":""},{"$f":"VLOOKUP($B$64, SUSE, 6, FALSE)*C64","v":0}]
[]
[null,"Sistema operativo VMware"]
[null,"None",{"$f":"VLOOKUP($B$67,VMWARE, 2, FALSE)+C29","v":0},{"$f":"VLOOKUP($B$67,VMWARE, 3, FALSE)","v":""},{"$f":"VLOOKUP($B$67,VMWARE, 5, FALSE)","v":""},{"$f":"VLOOKUP($B$67, VMWARE, 6, FALSE)*C67","v":0}]
[]
[null,"VMware vCenter Server Standard"]
[null,"None",{"$f":"VLOOKUP($B$70,VMWARE2, 2, FALSE)","v":0},{"$f":"VLOOKUP($B$70,VMWARE2, 3, FALSE)","v":""},{"$f":"VLOOKUP($B$70,VMWARE2, 5, FALSE)","v":""},null,{"$f":"VLOOKUP($B$70, VMWARE2, 6, FALSE)*C70","v":0}]
[]
[null,"Essentials Plus Kit"]
[null,"None",{"$f":"IF(SRV_A<4,VLOOKUP($B$73,VMWARE1, 2, FALSE),0)","v":0},{"$f":"VLOOKUP($B$73,VMWARE1, 3, FALSE)","v":""},{"$f":"VLOOKUP($B$73,VMWARE1, 5, FALSE)","v":""},null,{"$f":"VLOOKUP($B$73, VMWARE1, 6, FALSE)*C73","v":0}]
[]
[null,"Controller RAID"]
[null,"PERC H730P RAID Controller, 2Gb NV Cache, Minicard",1,null,"[405-AAQU]"]
[]
[null,"Dischi rigidi (numero massimo totale 8)"]
[null,"600GB 10K RPM SAS 12Gbps 512n 2.5in Hot-plug Hard Drive",2,null,"[400-ASGS]"]
[]
[null,"600GB 10K RPM SAS 12Gbps 512n 2.5in Hot-plug Hard Drive",null,{"$f":"VLOOKUP($B$81, HDD_A,3, FALSE)","v":"CNV-TS1L1-HD600"},{"$f":"VLOOKUP($B$81, HDD_A,5, FALSE)","v":"[400-AUNQ]"},{"$f":"VLOOKUP($B$81, HDD_B,6, FALSE)*C81","v":0}]
[]
[null,"1.2TB 10K RPM SAS 12Gbps 512n 2.5in Hot-plug Hard Drive",null,{"$f":"VLOOKUP($B$83, HDD_A,3, FALSE)","v":"CNV-TS1L1-HD1200-U"},{"$f":"VLOOKUP($B$83, HDD_A,5, FALSE)","v":"[400-ATJL]"},{"$f":"VLOOKUP($B$83, HDD_B,6, FALSE)*C83","v":0}]
[]
[null,"1.8TB 10K RPM SAS 12Gbps 512e 2.5in Hot-plug Hard Drive",null,"CNV-TS1L1-HD1800-U","[400-ATJR]",{"$f":"VLOOKUP($B$85, HDD_B,6, FALSE)*C85","v":0}]
[]
[null,"960GB SSD SAS Mix Use 12Gbps 512n 2.5in Hot-plug Drive,\nPX05SV,3 DWPD,5256 TBW",null,"CNV-TS1L1-SSD800-U","[400-ATLR]",{"$f":"VLOOKUP($B$87, HDD_B,6, FALSE)*C87","v":0}]
[]
[null,"1.92TB SSD SAS Mix Use 12Gbps 512n 2.5in Hot-plug Drive,\nPX05SV,3 DWPD,10512 TBW",null,"CNV-TS1L1-SSD1920-U","[400-ATNG]",{"$f":"VLOOKUP($B$89, HDD_B,6, FALSE)*C89","v":0}]
[]
[null,"DISCHI TOTALI",{"$f":"SUM(C79:C90)","v":2},{"$f":"IF(C91<=8,\"      OK\",\"     ERRORE:   Totale n° di dischi superiore al consentito\")","v":"      OK"}]
[]
[null,"Configurazione RAID"]
[null,"C3 - RAID 1 for H330 (2 HDDs)",1,null,{"$f":"VLOOKUP($B$94,  RAID_A1, 2, FALSE)","v":"[780-BBJK]"}]
[null,"Hot Spare for 300GB HDD","No",null,null,null,null,{"$f":"IF(B96=\"SCRIVERE QUI' LA CONFIGURAZIONE RAID RICHIESTA.\nR640 1\n\",\"ATTENZIONE COMPILARE IL CAMPO DELLA SCELTA RAID\", \"\")","v":"ATTENZIONE COMPILARE IL CAMPO DELLA SCELTA RAID"}]
[null,"SCRIVERE QUI' LA CONFIGURAZIONE RAID RICHIESTA.\nR640 1\n"]
[null,"Configurazione RAID HDD 1TB"]
[null,"",1,null,{"$f":"VLOOKUP($B$98,  RAID_A2, 2, FALSE)","v":""}]
[null,"Hot Spare for 1TB HDD","No"]
[]
[null,"Impostazioni del BIOS per la gestione dell'alimentazione"]
[null,"Performance BIOS Setting",1,null,"[384-BBBL]"]
[]
[null,"Alimentatore"]
[null,"Dual, Hot-plug, Redundant Power Supply (1+1), 750W, Titanium, 200-240VAC",{"$f":"VLOOKUP(B105,upsell_1, 2, FALSE)","v":1},{"$f":"VLOOKUP(B105,upsell_1, 3, FALSE)","v":""},{"$f":"VLOOKUP(B105,upsell_1, 5, FALSE)","v":"[450-ADWT]"},{"$f":"VLOOKUP(B105,upsell_1, 6, FALSE)","v":0},{"$f":"VLOOKUP(B105,upsell_1, 7, FALSE)","v":0}]
[]
[null,"Cavi di alimentazione"]
[null,"Rack Power Cord 2M (C13/C14 12A)",2,null,"[450-AADY]"]
[]
[null,"Fans"]
[null,{"$f":"VLOOKUP(B29, CPU_A, 12, FALSE)","v":"5 Standard Fans for R640"},{"$f":"VLOOKUP($B$29, CPU_A, 13, FALSE)","v":1},null,{"$f":"VLOOKUP($B$29, CPU_A, 14, FALSE)","v":"[384-BBPR]"}]
[]
[null,"TPM Module"]
[null,"Trusted Platform Module 1.2",1,null,"[461-AAEL]"]
[]
[null,"Embedded Systems Management"]
[null,"iDRAC9,Enterprise",1,null,"[385-BBKT]"]
[]
[null,"PCIe Riser"]
[null,"Riser Config 4, 2x16 LP",1,null,"[330-BBGY]"]
[]
[null,"Adattatore di rete"]
[null,"Intel Ethernet i350 QP 1Gb Network Daughter Card",{"$f":"VLOOKUP($B$123,upsell_1, 2, FALSE)","v":1},{"$f":"VLOOKUP($B$123,upsell_1, 3, FALSE)","v":""},{"$f":"VLOOKUP($B$123,upsell_1, 5, FALSE)","v":"[540-BBCB]"},{"$f":"VLOOKUP($B$123,upsell_1, 7, FALSE)","v":0}]
[]
[null,"Modulo Doppia SD"]
[null,"None ",{"$f":"VLOOKUP($B$126,upsell_1, 2, FALSE)","v":0},{"$f":"VLOOKUP($B$126,upsell_1, 3, FALSE)","v":""},{"$f":"VLOOKUP($B$126,upsell_1, 4, FALSE)","v":""},{"$f":"VLOOKUP($B$126,upsell_1, 7, FALSE)","v":0}]
[]
[null,"Additional Card for PCIe Slot 1 (Low Profile)"]
[null,"None",{"$f":"VLOOKUP($B$129,  PCI_A1, 2, FALSE)","v":""},{"$f":"VLOOKUP($B$129,  PCI_A1, 3, FALSE)","v":""},{"$f":"VLOOKUP($B$129,  PCI_A1, 5, FALSE)","v":""},{"$f":"VLOOKUP($B$129,  PCI_A1, 6, FALSE)","v":""},{"$f":"VLOOKUP($B$129,  PCI_A1, 7, FALSE)","v":0}]
[]
[null,"Additional Card for PCIe Slot 2 (Low Profile)"]
[null,"None",{"$f":"VLOOKUP($B$132,  PCI_A1, 2, FALSE)","v":""},{"$f":"VLOOKUP($B$132,  PCI_A1, 3, FALSE)","v":""},{"$f":"VLOOKUP($B$132,  PCI_A1, 5, FALSE)","v":""},{"$f":"VLOOKUP($B$132,  PCI_A1, 6, FALSE)","v":""},{"$f":"VLOOKUP($B$132,  PCI_A1, 7, FALSE)","v":0}]
[]
[null,"Pannello frontale"]
[null,"No Bezel Option",{"$f":"VLOOKUP(B135,upsell_1, 2, FALSE)","v":1},{"$f":"VLOOKUP(B135,upsell_1, 3, FALSE)","v":""},{"$f":"VLOOKUP(B135,upsell_1, 5, FALSE)","v":"[350-BBBW]"},{"$f":"VLOOKUP(B135,upsell_1, 6, FALSE)","v":0},{"$f":"VLOOKUP(B135,upsell_1, 7, FALSE)","v":0}]
[]
[null,"Guide per rack"]
[null,"ReadyRails™ Sliding Rails Without Cable Management Arm 1U",{"$f":"VLOOKUP(B138,upsell_1, 2, FALSE)","v":1},{"$f":"VLOOKUP(B138,upsell_1, 3, FALSE)","v":""},{"$f":"VLOOKUP(B138,upsell_1, 5, FALSE)","v":"[770-BBBC]"},{"$f":"VLOOKUP(B138,upsell_1, 6, FALSE)","v":0},{"$f":"VLOOKUP(B138,upsell_1, 7, FALSE)","v":0}]
[]
[null,"Unità ottica interna"]
[null,"No Internal Optical Drive for 8 HDD Chassis",1,"","[429-AAQN]",null,""]
[]
[null,"Accessori Server"]
[null,"PowerEdge SFP+, 10GbE SR/SX, Optical Tranceiver, LC Connector, for Intel and Broadcom,CusKit",{"$f":"(VLOOKUP(B132,PCI_A2,9,FALSE))+((VLOOKUP(B129,PCI_A1,9,FALSE)))","v":0},null,"[407-BBQE]"]
[]
[null,"Sistema documentazione"]
[null,"Electronic System Documentation and OpenManage DVD Kit",1,null,"[343-BBDK]"]
[]
[null,"SHIPPING"]
[null,"R630 Shipping - 8 Drive Chassis, EMEA1 (English/French/German/Spanish/Russian/Hebrew)",1,null,"[340-AMIN]"]
[]
[null,"Order Information"]
[null,"PowerEdge Order - EMEA",1,null,"[800-11671]"]
[]
[null,"Base warranty"]
[null,"3Yr Basic Warranty - Next Business Day - Minimum Warranty",1,null,"[709-12767][709-12768]"]
[]
[null,"Servizi di assitenza"]
[null,"Dell Channel Order - Service Info only",1,null,"[710-31085]"]
[]
[null,"Estenzione di Garanzia"]
[null,"None",{"$f":"VLOOKUP($B$162,  SO_A1, 2, FALSE)","v":""},{"$f":"VLOOKUP($B$162,  SO_A1, 3, FALSE)","v":""},{"$f":"VLOOKUP($B$162,  SO_A1, 5, FALSE)","v":""},{"$f":"VLOOKUP($B$162,  SO_A1, 6, FALSE)","v":""}]
[]
[null,"Protezione dei dati - Keep Your Hard Drive "]
[null,"None",{"$f":"VLOOKUP($B$165,  SO_A2, 2, FALSE)","v":""},{"$f":"VLOOKUP($B$165,  SO_A2, 3, FALSE)","v":""},{"$f":"VLOOKUP($B$165,  SO_A2,5, FALSE)","v":""},{"$f":"VLOOKUP($B$165,  SO_A2, 6, FALSE)","v":""}]
[]
[null,"Servizi di Installazione"]
[null,"No Installation Service Selected",1,null,"[683-11870]"]
[]
[null,"Channel only - Support Extension"]
[null,"Channel 39M Basic Warranty - Next Business Day",1,null,"[723-28776]"]
[]
[null,"Warranty Upgrades - Non-Std/Local POS"]
[null,"CSTM CONSIP - 39M Onsite Labor Support for CRU for Servers with Basic Warranty",1,null,"[681-24467]"]

{"sheet":"CNV R740 1","index":1,"n_rows":189,"n_cols":8,"rows_kept":189,"cut":false,"hidden":false,"merged":[[189,1,189,4],[127,2,127,4],[129,1,129,4],[177,1,177,4],[178,2,178,4],[180,1,180,4],[181,2,181,4],[183,1,183,4],[184,2,184,4],[168,1,168,4],[169,2,169,4],[171,1,171,4],[172,2,172,4],[174,1,174,4],[175,2,175,4],[159,1,159,4],[160,2,160,4],[162,1,162,4],[163,2,163,4],[165,1,165,4],[166,2,166,4],[186,1,186,4],[187,2,187,4],[135,1,135,4],[136,2,136,4],[109,2,109,4],[111,1,111,4],[117,1,117,4],[118,2,118,4],[120,1,120,4],[121,2,121,4],[123,1,123,4],[130,2,130,4],[132,1,132,4],[133,2,133,4],[157,2,157,4],[138,1,138,4],[139,2,139,4],[141,1,141,4],[142,2,142,4],[144,1,144,4],[145,2,145,4],[147,1,147,4],[151,2,151,4],[153,1,153,4],[154,2,154,4],[156,1,156,4],[148,2,148,4],[150,1,150,4],[103,2,103,4],[124,2,124,4],[126,1,126,4],[106,2,106,4],[95,1,95,3],[91,1,91,4],[92,2,92,4],[96,2,96,4],[99,1,99,4],[100,2,100,4],[102,1,102,4],[105,1,105,4],[112,2,112,4],[114,1,114,4],[108,1,108,4],[42,1,42,4],[43,2,43,4],[49,1,49,4],[50,2,50,4],[74,2,74,4],[76,1,76,4],[77,2,77,4],[95,7,96,8],[83,1,83,4],[85,1,85,4],[54,2,54,4],[56,1,56,4],[57,2,57,4],[59,1,59,4],[61,1,61,4],[87,1,87,4],[64,1,64,4],[73,1,73,4],[53,1,53,4],[29,1,29,4],[30,2,30,4],[33,1,33,4],[34,2,34,4],[36,1,36,4],[39,1,39,4],[40,2,40,4],[27,2,27,4],[4,0,4,4],[5,0,5,4],[10,0,11,5],[12,0,12,5],[18,2,18,4],[20,1,20,4],[21,2,21,4],[23,1,23,4],[24,2,24,4],[26,1,26,4]]}
[null,null,null,"TOTALE MEPA",null,null,null,{"$f":"G10","v":0}]
[]
[]
[]
["POWEREDGE R740"]
[]
[null,null,null,null,null,"Totale Server e Opzioni",{"$f":"F17*SRV_B1.1+G70+G73","v":0}]
[null,null,null,null,null,"Totale Ulteriori Opzioni ",{"$f":"G16*SRV_B1.1-(G73*SRV_B1.1)+G73-(SRV_B1.1*G70)+G70","v":0}]
[]
[null,null,null,null,null,"TOTALE CONVENZIONE",{"$f":"G8+G7","v":0}]
["Components: \nServer DELL PowerEdge R740 (1CPU Intel® Xeon® Gold 5120, 64GB RDIMM, 2xHDD 600GB 10K RPM SAS 12Gbps 2.5in)"]
[]
[]
[]
[null,"Category: Server",null,null,null,{"$f":"2371","v":2371}]
[null,"Quantity: ",null,null,null,{"$f":"SUM(F20:F191)","v":0},{"$f":"SUM(G20:G191)","v":0}]
[null,null,null,null,null,{"$f":"SUM(F15:F16)","v":2371}]
[]
[null,"Base"]
[null,"PowerEdge R740 Server",1,null,"[210-AKXJ]"]
[]
[null,"Configurazione dello chassis"]
[null,"Chassis with up to 16 x 2.5\" SAS/SATA Hard Drives for 1CPU Configuration",1,null,"[321-BCSL]"]
[]
[null,"Processore"]
[null,"Intel® Xeon® Gold 5120 2.2G, 14C/28T, 10.4GT/s, 19M Cache, Turbo, HT (105W)",1,null,"[338-BLUX]"]
[]
[null,"Processore aggiuntivo"]
[null,"No Additional Processor",{"$f":"VLOOKUP($B$29, CPU_B.1, 2, FALSE)","v":0},{"$f":"VLOOKUP($B$29, CPU_B.1, 3, FALSE)","v":""},{"$f":"VLOOKUP($B$29, CPU_B.1, 5, FALSE)","v":"[374-BBBX]"},{"$f":"VLOOKUP(B29, CPU_B.1, 15, FALSE)","v":0}]
[]
[null,"Processor Thermal Configuration"]
[null,"1 CPU Standard",1,null,"[370-ABWF][374-BBHM][750-AAEL]"]
[null,{"$f":"VLOOKUP($B$29, CPU_B, 6, FALSE)","v":""},{"$f":"VLOOKUP($B$29, CPU_B, 7, FALSE)","v":""},null,{"$f":"VLOOKUP($B$29, CPU_B, 8, FALSE)","v":""}]
[]
[null,"Tipo di configurazione memoria"]
[null,"Performance Optimized",1,null,"[370-AAIP]"]
[]
[null,"Memoria Totale in GB",null,{"$f":"IF(('CNV R740 1'!$D$12=0),\"\",'CNV R740 1'!#REF!)","v":""}]
[null,64]
[]
[null,"Tipo e velocità della memoria DIMM"]
[null,"2666MT/s RDIMMs",1,null,"[370-ADNU]"]
[]
[null,"Capacità di memoria"]
[null,{"$f":"IF($B$29=\"No Additional Processor\",VLOOKUP($B$39, MEM_B1, 8, FALSE),VLOOKUP($B$39, MEM_B2, 8, FALSE))","v":"Dell 32 GB Modulo di memoria - RDIMM 2666MHz"},{"$f":"IF($B$29=\"No Additional Processor\",VLOOKUP($B$39, MEM_B1, 9, FALSE),VLOOKUP($B$39, MEM_B2, 9, FALSE))","v":2},null,{"$f":"IF($B$29=\"No Additional Processor\",VLOOKUP($B$39, MEM_B1, 10, FALSE),VLOOKUP($B$39, MEM_B2, 10, FALSE))","v":"[370-ADNF]"}]
[]
[null,{"$f":"IF($B$29=\"No Additional Processor\",VLOOKUP($B$39, MEM_B1, 2, FALSE),VLOOKUP($B$39, MEM_B2, 2, FALSE))","v":""},{"$f":"IF($B$29=\"No Additional Processor\",VLOOKUP($B$39, MEM_B1, 3, FALSE),VLOOKUP($B$39, MEM_B2, 3, FALSE))","v":""},{"$f":"IF($B$29=\"No Additional Processor\",VLOOKUP($B$39, MEM_B1, 4, FALSE),VLOOKUP($B$39, MEM_B2, 4, FALSE))","v":""},{"$f":"IF($B$29=\"No Additional Processor\",VLOOKUP($B$39, MEM_B1, 6, FALSE),VLOOKUP($B$39, MEM_B2, 6, FALSE))","v":""},{"$f":"IF($B$29=\"No Additional Processor\",VLOOKUP($B$39, MEM_B1, 7, FALSE),VLOOKUP($B$39, MEM_B2, 7, FALSE))","v":""}]
[]
[null,{"$f":"IF($B$29=\"No Additional Processor\",VLOOKUP($B$39, MEM_B1, 11, FALSE),VLOOKUP($B$39, MEM_B2, 11, FALSE))","v":""},{"$f":"IF($B$29=\"No Additional Processor\",VLOOKUP($B$39, MEM_B1, 12, FALSE),VLOOKUP($B$39, MEM_B2, 12, FALSE))","v":""},{"$f":"IF($B$29=\"No Additional Processor\",VLOOKUP($B$39, MEM_B1, 13, FALSE),VLOOKUP($B$39, MEM_B2, 13, FALSE))","v":""},{"$f":"IF($B$29=\"No Additional Processor\",VLOOKUP($B$39, MEM_B1, 15, FALSE),VLOOKUP($B$39, MEM_B2, 15, FALSE))","v":""},{"$f":"IF($B$29=\"No Additional Processor\",VLOOKUP($B$39, MEM_B1, 16, FALSE),VLOOKUP($B$39, MEM_B2, 16, FALSE))","v":""}]
[]
[null,"Sistema operativo preinstallato"]
[null,"No Operating System",{"$f":"VLOOKUP($B$52, OS_B, 2, FALSE)","v":""},{"$f":"VLOOKUP($B$52, OS_B, 3, FALSE)","v":""},{"$f":"VLOOKUP($B$52, OS_B, 5, FALSE)","v":"[611-BBBF]"},{"$f":"VLOOKUP($B$52, OS_B, 6, FALSE)","v":""}]
[null,{"$f":"IF($B$29=\"No Additional Processor\",VLOOKUP($B$52, OS_B, 20, FALSE),VLOOKUP($B$52, OS_B2, 20, FALSE))","v":""},{"$f":"IF($B$29=\"No Additional Processor\",VLOOKUP($B$52, OS_B, 21, FALSE),VLOOKUP($B$52, OS_B2, 21, FALSE))","v":0},{"$f":"IF($B$29=\"No Additional Processor\",VLOOKUP($B$52, OS_A, 22, FALSE),VLOOKUP($B$52, OS_B2, 22, FALSE))","v":""},{"$f":"IF($B$29=\"No Additional Processor\",VLOOKUP($B$52, OS_B, 24, FALSE),VLOOKUP($B$52, OS_B2, 24, FALSE))","v":""},{"$f":"IF($B$29=\"No Additional Processor\",VLOOKUP($B$52, OS_B, 25, FALSE),VLOOKUP($B$52, OS_B2, 25, FALSE))","v":""}]
[]
[null,"OS Media Kits"]
[null,"No Media Required",1,null,"[605-BBFN]"]
[]
[null,"Client Access Licenses"]
[null,{"$f":"VLOOKUP($B$52, OS_B, 8, FALSE)","v":"None"},null,{"$f":"VLOOKUP($B$52, OS_A, 10, FALSE)","v":""},{"$f":"VLOOKUP($B$52, OS_A, 12, FALSE)","v":""},{"$f":"VLOOKUP($B$52, OS_A, 13, FALSE)*C59","v":0}]
[]
[null,{"$f":"VLOOKUP($B$52, OS_A, 14, FALSE)","v":"None"},null,{"$f":"VLOOKUP($B$52, OS_A, 16, FALSE)","v":""},{"$f":"VLOOKUP($B$52, OS_A, 18, FALSE)","v":""},{"$f":"VLOOKUP($B$52, OS_A, 19, FALSE)*C61","v":0}]
[]
[null,"Sistema operativo SUSE Linux Enterprise Server"]
[null,"None\n",{"$f":"VLOOKUP($B$64,SUSE, 2, FALSE)","v":0},{"$f":"VLOOKUP($B$64,SUSE, 3, FALSE)","v":""},{"$f":"VLOOKUP($B$64,SUSE, 5, FALSE)","v":""},{"$f":"VLOOKUP($B$64, SUSE, 6, FALSE)*C64","v":0}]
[]
[null,"Sistema operativo VMware"]
[null,"None",{"$f":"VLOOKUP($B$67,VMWARE, 2, FALSE)+C29","v":0},{"$f":"VLOOKUP($B$67,VMWARE, 3, FALSE)","v":""},{"$f":"VLOOKUP($B$67,VMWARE, 5, FALSE)","v":""},{"$f":"VLOOKUP($B$67, VMWARE, 6, FALSE)*C67","v":0}]
[]
[null,"VMware vCenter Server Standard"]
[null,"None",{"$f":"VLOOKUP($B$70,VMWARE2, 2, FALSE)","v":0},{"$f":"VLOOKUP($B$70,VMWARE2, 3, FALSE)","v":""},{"$f":"VLOOKUP($B$70,VMWARE2, 5, FALSE)","v":""},null,{"$f":"VLOOKUP($B$70, VMWARE2, 6, FALSE)*C70","v":0}]
[]
[null,"Essentials Plus Kit"]
[null,"None",{"$f":"IF(SRV_A<4,VLOOKUP($B$73,VMWARE1, 2, FALSE),0)","v":0},{"$f":"VLOOKUP($B$73,VMWARE1, 3, FALSE)","v":""},{"$f":"VLOOKUP($B$73,VMWARE1, 5, FALSE)","v":""},null,{"$f":"VLOOKUP($B$73, VMWARE1, 6, FALSE)*C73","v":0}]
[]
[null,"Controller"]
[null,"PERC H730P RAID Controller, 2Gb NV Cache, Minicard",{"$f":"VLOOKUP($B$76,PERC, 2, FALSE)","v":0},{"$f":"VLOOKUP($B$76,PERC, 3, FALSE)","v":""},{"$f":"VLOOKUP($B$76,PERC, 4, FALSE)","v":""},{"$f":"VLOOKUP($B$76,PERC, 7, FALSE)","v":0}]
[]
[null,"Dischi rigidi (numero massimo totale 16)"]
[null,"600GB 10K RPM SAS 12Gbps 512n 2.5in Hot-plug Hard Drive",2,null,"[400-AJPK]"]
[]
[null,"600GB 10K RPM SAS 12Gbps 512n 2.5in Hot-plug Hard Drive",null,{"$f":"VLOOKUP($B$81, HDD_A,3, FALSE)","v":"CNV-TS1L1-HD600"},{"$f":"VLOOKUP($B$81, HDD_A,5, FALSE)","v":"[400-AUNQ]"},{"$f":"VLOOKUP($B$81, HDD_B,6, FALSE)*C81","v":0}]
[]
[null,"1.2TB 10K RPM SAS 12Gbps 512n 2.5in Hot-plug Hard Drive",null,{"$f":"VLOOKUP($B$83, HDD_A,3, FALSE)","v":"CNV-TS1L1-HD1200-U"},{"$f":"VLOOKUP($B$83, HDD_A,5, FALSE)","v":"[400-ATJL]"},{"$f":"VLOOKUP($B$83, HDD_B,6, FALSE)*C83","v":0}]
[]
[null,"1.8TB 10K RPM SAS 12Gbps 512e 2.5in Hot-plug Hard Drive",null,"CNV-TS1L1-HD1800","[400-AJQP]",{"$f":"VLOOKUP($B$85, HDD_B,6, FALSE)*C85","v":0}]
[]
[null,"960GB SSD SAS Mix Use 12Gbps 512n 2.5in Hot-plug Drive,\nPX05SV,3 DWPD,5256 TBW",null,"CNV-TS1L1-SSD800","[400-ANNX]",{"$f":"VLOOKUP($B$87, HDD_B,6, FALSE)*C87","v":0}]
[]
[null,"1.92TB SSD SAS Mix Use 12Gbps 512n 2.5in Hot-plug Drive,\nPX05SV,3 DWPD,10512 TBW",null,"CNV-TS1L1-SSD1920","[400-ANMN]",{"$f":"VLOOKUP($B$89, HDD_B,6, FALSE)*C89","v":0}]
[]
[null,"DISCHI TOTALI",{"$f":"SUM(C79:C90)","v":2},{"$f":"IF(C91<=16,\"      OK\",\"     ERRORE:   Totale n° di dischi superiore al consentito\")","v":"      OK"}]
[]
[null,"Configurazione RAID"]
[null,"C3 - RAID 1 for H330 (2 HDDs)",1,null,{"$f":"VLOOKUP($B$94,  RAID_B1, 2, FALSE)","v":"[780-BBJK]"}]
[null,"Hot Spare for 300GB HDD","No"]
[null,"SCRIVERE QUI' LA CONFIGURAZIONE RAID RICHIESTA.\nR740 1\n",null,null,null,null,null,{"$f":"IF(B96=\"SCRIVERE QUI' LA CONFIGURAZIONE RAID RICHIESTA.\nR740 1\n\",\"ATTENZIONE COMPILARE IL CAMPO DELLA SCELTA RAID\", \"\")","v":"ATTENZIONE COMPILARE IL CAMPO DELLA SCELTA RAID"}]
[null,"Configurazione RAID HDD 1TB"]
[null,"",1,null,{"$f":"VLOOKUP($B$98,  RAID_B2, 2, FALSE)","v":""}]
[null,"Hot Spare for 1TB HDD","No"]
[]
[null,"Impostazioni del BIOS per la gestione dell'alimentazione"]
[null,"Performance BIOS Setting",1,null,"[384-BBBL]"]
[]
[null,"Alimentatore"]
[null,"Dual, Hot-plug, Redundant Power Supply (1+1), 750W, Titanium, 200-240VAC",1,null,"[450-ADWT]"]
[]
[null,"Cavi di alimentazione"]
[null,"Rack Power Cord 2M (C13/C14 12A)",2,null,"[450-AADY]"]
[]
[null,"Fans"]
[null,{"$f":"VLOOKUP(B29, CPU_B.1, 9, FALSE)","v":"4 Standard Fans for R740/740XD"},{"$f":"VLOOKUP($B$29, CPU_B.1, 10, FALSE)","v":1},null,{"$f":"VLOOKUP($B$29, CPU_B.1, 11, FALSE)","v":"[384-BBQB]"}]
[]
[null,"PCIe Riser"]
[null,{"$f":"VLOOKUP(B29, CPU_B.1, 12, FALSE)","v":"Riser Config 1, 4 x8 slots"},{"$f":"VLOOKUP($B$29, CPU_B.1, 13, FALSE)","v":1},null,{"$f":"VLOOKUP($B$29, CPU_B.1, 14, FALSE)","v":"[330-BBGZ]"}]
[]
[null,"TPM Module"]
[null,"Trusted Platform Module 1.2",1,null,"[461-AAEL]"]
[]
[null,"Embedded Systems Management"]
[null,"iDRAC9,Enterprise",1,null,"[385-BBKT]"]
[]
[null,"Adattatore di rete"]
[null,"Broadcom 5720 QP 1Gb Network Daughter Card",1,null,"[540-BBBW]"]
[]
[null,"Modulo Doppia SD"]
[null,"None ",{"$f":"VLOOKUP($B$126,upsell_1, 2, FALSE)","v":0},{"$f":"VLOOKUP($B$126,upsell_1, 3, FALSE)","v":""},{"$f":"VLOOKUP($B$126,upsell_1, 4, FALSE)","v":""},{"$f":"VLOOKUP($B$126,upsell_1, 7, FALSE)","v":0}]
[]
[null,"Additional Card for PCIe Slot 1 (Full height) (CPU 1)"]
[null,"Broadcom 5720 DP 1Gb Network Interface Card",null,{"$f":"\"\"","v":""},"540-BBCX"]
[]
[null,"Additional Card for PCIe Slot 2 (Full height) (CPU 1)"]
[null,"None",{"$f":"VLOOKUP(B132,  PCI_B1.1, 2, FALSE)","v":""},{"$f":"VLOOKUP(B132,  PCI_B1.1, 3, FALSE)","v":""},{"$f":"VLOOKUP(B132,  PCI_B1.1, 5, FALSE)","v":""},{"$f":"VLOOKUP(B132,  PCI_B1.1, 6, FALSE)","v":""},{"$f":"VLOOKUP(B132,  PCI_B1.1, 7, FALSE)","v":0}]
[]
[null,"Additional Card for PCIe Slot 3 (Full height) (CPU 1)"]
[null,"None",{"$f":"VLOOKUP(B135,  PCI_B1.1, 2, FALSE)","v":""},{"$f":"VLOOKUP(B135,  PCI_B1.1, 3, FALSE)","v":""},{"$f":"VLOOKUP(B135,  PCI_B1.1, 5, FALSE)","v":""},{"$f":"VLOOKUP(B135,  PCI_B1.1, 6, FALSE)","v":""},{"$f":"VLOOKUP(B135,  PCI_B1.1, 7, FALSE)","v":0}]
[]
[null,"Additional Card for PCIe Slot 4 (Full height) (CPU 2)"]
[null,"None",{"$f":"VLOOKUP(B138,  PCI_B1.1, 2, FALSE)","v":""},{"$f":"VLOOKUP(B138,  PCI_B1.1, 3, FALSE)","v":""},{"$f":"VLOOKUP(B138,  PCI_B1.1, 5, FALSE)","v":""},{"$f":"VLOOKUP(B138,  PCI_B1.1, 6, FALSE)","v":""},{"$f":"VLOOKUP(B138,  PCI_B1.1, 7, FALSE)","v":0}]
[]
[null,"Additional Card for PCIe Slot 5 (Full height) (CPU 2)"]
[null,"None",{"$f":"VLOOKUP(B141,  PCI_B1.1, 2, FALSE)","v":""},{"$f":"VLOOKUP(B141,  PCI_B1.1, 3, FALSE)","v":""},{"$f":"VLOOKUP(B141,  PCI_B1.1, 5, FALSE)","v":""},{"$f":"VLOOKUP(B141,  PCI_B1.1, 6, FALSE)","v":""},{"$f":"VLOOKUP(B141,  PCI_B1.1, 7, FALSE)","v":0}]
[]
[null,"Additional Card for PCIe Slot 6 (Low Profile) (CPU 1)"]
[null,"None",{"$f":"VLOOKUP(B144,PCI_B5, 2, FALSE)","v":""},{"$f":"VLOOKUP(B144,  PCI_B5, 3, FALSE)","v":""},{"$f":"VLOOKUP($B$144,PCI_B5,5,FALSE)","v":""},{"$f":"VLOOKUP($B$144,PCI_B5,6,FALSE)","v":""},{"$f":"VLOOKUP($B$144,PCI_B5,7,FALSE)","v":0}]
[]
[null,"Additional Card for PCIe Slot 7 (Full height) (CPU 2)"]
[null,"None",{"$f":"VLOOKUP(B147,  PCI_B1.1, 2, FALSE)","v":""},{"$f":"VLOOKUP(B147,  PCI_B1.1, 3, FALSE)","v":""},{"$f":"VLOOKUP(B147,  PCI_B1.1, 5, FALSE)","v":""},{"$f":"VLOOKUP(B147,  PCI_B1.1, 6, FALSE)","v":""},{"$f":"VLOOKUP(B147,  PCI_B1.1, 7, FALSE)","v":0}]
[]
[null,"Additional Card for PCIe Slot 8 (Full height) (CPU 2)"]
[null,"None",{"$f":"VLOOKUP(B150,  PCI_B1.1, 2, FALSE)","v":""},{"$f":"VLOOKUP(B150,  PCI_B1.1, 3, FALSE)","v":""},{"$f":"VLOOKUP(B150,  PCI_B1.1, 5, FALSE)","v":""},{"$f":"VLOOKUP(B150,  PCI_B1.1, 6, FALSE)","v":""},{"$f":"VLOOKUP(B150,  PCI_B1.1, 7, FALSE)","v":0}]
[]
[null,"Pannello frontale"]
[null,"No Bezel Option",{"$f":"VLOOKUP(B153,upsell_1, 2, FALSE)","v":1},{"$f":"VLOOKUP(B153,upsell_1, 3, FALSE)","v":""},{"$f":"VLOOKUP(B153,upsell_1, 5, FALSE)","v":"[350-BBBW]"},{"$f":"VLOOKUP(B153,upsell_1, 6, FALSE)","v":0},{"$f":"VLOOKUP(B153,upsell_1, 7, FALSE)","v":0}]
[]
[null,"Guide per rack"]
[null,"ReadyRails™ Sliding Rails Without Cable Management Arm 2U",{"$f":"VLOOKUP(B156,upsell_1, 2, FALSE)","v":1},{"$f":"VLOOKUP(B156,upsell_1, 3, FALSE)","v":""},{"$f":"VLOOKUP(B156,upsell_1, 5, FALSE)","v":"[770-BBBQ]"},{"$f":"VLOOKUP(B156,upsell_1, 6, FALSE)","v":0},{"$f":"VLOOKUP(B156,upsell_1, 7, FALSE)","v":0}]
[]
[null,"Server Accessories"]
[null,"PowerEdge SFP+, 10GbE SR/SX, Optical Tranceiver, LC Connector, for Intel and Broadcom,CusKit",{"$f":"(VLOOKUP(B147,PCI_A2,8,FALSE))+((VLOOKUP(B132,PCI_B1.1,8,FALSE)))","v":{"$error":"#VALUE!"}},null,"[407-BBQE]"]
[]
[null,"System Documentation"]
[null,"Electronic System Documentation and OpenManage DVD Kit",1,null,"[631-AAJG]"]
[]
[null,"SHIPPING"]
[null,"PowerEdge R730 Shipping EMEA1 (English/French/German/Spanish/Russian/Hebrew)",1,null,"340-ALXX"]
[]
[null,"Order Information"]
[null,"PowerEdge Order - EMEA",1,null,"[800-11671]"]
[]
[null,"Base warranty"]
[null,"3Yr Basic Warranty - Next Business Day - Minimum Warranty",1,null,"[709-12777][709-12778]"]
[]
[null,"Servizi di assitenza"]
[null,"Dell Channel Order - Service Info only",1,null,"[710-31085]"]
[]
[null,"Aggiornamenti della garanzia"]
[null,"None",{"$f":"VLOOKUP($B$177,  SO_B1,2, FALSE)","v":""},{"$f":"VLOOKUP($B$177,  SO_B1, 3, FALSE)","v":""},{"$f":"VLOOKUP($B$177,  SO_B1, 5, FALSE)","v":""},{"$f":"VLOOKUP($B$177,  SO_B1, 6, FALSE)","v":""}]
[]
[null,"Protezione dei dati - Keep Your Hard Drive "]
[null,"None",{"$f":"VLOOKUP($B$180,  SO_B2, 2, FALSE)","v":""},{"$f":"VLOOKUP($B$180,  SO_B2, 3, FALSE)","v":""},{"$f":"VLOOKUP($B$180,  SO_B2,5, FALSE)","v":""},{"$f":"VLOOKUP($B$180,  SO_B2, 6, FALSE)","v":""}]
[]
[null,"Servizi di Installazione"]
[null,"No Installation Service Selected",1,null,"[683-11870]"]
[]
[null,"Channel only - Support Extension"]
[null,"Channel 39M Basic Warranty - Next Business Day",1,null,"[723-38675]"]
[]
[null,"Warranty Upgrades - Non-Std/Local POS"]
[null,"CSTM CONSIP - 39M Onsite Labor Support for CRU for Servers with Basic Warranty",1,null,"[681-24467]"]

{"sheet":"CNV R740xd 1","index":2,"n_rows":190,"n_cols":8,"rows_kept":190,"cut":false,"hidden":false,"merged":[[190,1,190,4],[131,2,131,4],[133,1,133,4],[134,2,134,4],[136,1,136,4],[137,2,137,4],[139,1,139,4],[146,2,146,4],[148,1,148,4],[182,2,182,4],[184,1,184,4],[185,2,185,4],[187,1,187,4],[188,2,188,4],[178,1,178,4],[179,2,179,4],[181,1,181,4],[169,1,169,4],[170,2,170,4],[172,1,172,4],[173,2,173,4],[175,1,175,4],[176,2,176,4],[167,2,167,4],[154,1,154,4],[155,2,155,4],[157,1,157,4],[158,2,158,4],[160,1,160,4],[161,2,161,4],[163,1,163,4],[164,2,164,4],[166,1,166,4],[152,2,152,4],[109,1,109,4],[110,2,110,4],[112,1,112,4],[119,2,119,4],[121,1,121,4],[122,2,122,4],[124,1,124,4],[128,2,128,4],[130,1,130,4],[149,2,149,4],[151,1,151,4],[115,1,115,4],[125,2,125,4],[127,1,127,4],[142,1,142,4],[143,2,143,4],[145,1,145,4],[113,2,113,4],[118,1,118,4],[140,2,140,4],[53,1,53,4],[54,2,54,4],[57,1,57,4],[58,2,58,4],[60,1,60,4],[62,1,62,4],[65,1,65,4],[74,1,74,4],[107,2,107,4],[77,1,77,4],[78,2,78,4],[84,1,84,4],[93,2,93,4],[97,2,97,4],[100,1,100,4],[101,2,101,4],[103,1,103,4],[104,2,104,4],[106,1,106,4],[86,1,86,4],[88,1,88,4],[92,1,92,4],[96,1,96,3],[96,7,97,8],[18,2,18,4],[4,0,4,4],[5,0,5,4],[10,0,11,5],[12,0,12,5],[39,1,39,4],[20,1,20,4],[21,2,21,4],[23,1,23,4],[24,2,24,4],[26,1,26,4],[27,2,27,4],[29,1,29,4],[30,2,30,4],[33,1,33,4],[34,2,34,4],[36,1,36,4],[75,2,75,4],[40,2,40,4],[42,1,42,4],[43,2,43,4],[49,1,49,4],[50,2,50,4]]}
[null,null,null,"TOTALE MEPA",null,null,null,{"$f":"G10","v":0}]
[]
[]
[]
["POWEREDGE R740xd"]
[]
[null,null,null,null,null,"Totale Server e Opzioni",{"$f":"F17*SRV_B+G71+G74","v":0}]
[null,null,null,null,null,"Totale Ulteriori Opzioni ",{"$f":"G16*SRV_B1.2-(G73*SRV_B1.1)+G73-(SRV_B1.2*G70)+G70","v":0}]
[]
[null,null,null,null,null,"TOTALE CONVENZIONE",{"$f":"G8+G7","v":0}]
["Components: \nServer DELL PowerEdge R740xd (1CPU Intel® Xeon® Gold 5120, 64GB RDIMM, 2xHDD 600GB 10K RPM SAS 12Gbps 2.5in)"]
[]
[]
[]
[null,"Category: Server",null,null,null,{"$f":"2371","v":2371}]
[null,"Quantity: ",null,null,null,{"$f":"SUM(F20:F206)","v":0},{"$f":"SUM(G20:G206)","v":0}]
[null,null,null,null,null,{"$f":"SUM(F15:F16)","v":2371}]
[]
[null,"Base"]
[null,"PowerEdge R740XD Server",1,null,"[210-AKZR]"]
[]
[null,"Configurazione dello chassis"]
[null,"Chassis with Up to 24 x 2.5” Hard Drives for 1CPU Configuration",1,null,"[321-BCPX]"]
[]
[null,"Processore"]
[null,"Intel® Xeon® Gold 5120 2.2G, 14C/28T, 10.4GT/s, 19M Cache, Turbo, HT (105W) DDR4-2400",1,null,"[338-BLUX]"]
[]
[null,"Processore aggiuntivo"]
[null,"No Additional Processor",{"$f":"VLOOKUP($B$29, CPU_B, 2, FALSE)","v":0},{"$f":"VLOOKUP($B$29, CPU_B, 3, FALSE)","v":""},{"$f":"VLOOKUP($B$29, CPU_B, 5, FALSE)","v":"[374-BBBX]"},{"$f":"VLOOKUP(B29, CPU_B, 15, FALSE)","v":0}]
[]
[null,"Processor Thermal Configuration"]
[null,"1 CPU Standard",1,null,"[370-ABWF][374-BBHM][750-AAEL]"]
[null,{"$f":"VLOOKUP($B$29, CPU_B, 6, FALSE)","v":""},{"$f":"VLOOKUP($B$29, CPU_B, 7, FALSE)","v":""},null,{"$f":"VLOOKUP($B$29, CPU_B, 8, FALSE)","v":""}]
[]
[null,"Tipo di configurazione memoria"]
[null,"Performance Optimized",1,null,"[370-AAIP]"]
[]
[null,"Memoria Totale in GB",null,{"$f":"IF(('CNV R740 1'!$D$12=0),\"\",'CNV R740 1'!#REF!)","v":""}]
[null,64]
[]
[null,"Tipo e velocità della memoria DIMM"]
[null,"2666MT/s RDIMMs",1,null,"[370-ADNU]"]
[]
[null,"Capacità di memoria"]
[null,{"$f":"IF($B$29=\"No Additional Processor\",VLOOKUP($B$39, MEM_B1, 8, FALSE),VLOOKUP($B$39, MEM_B2, 8, FALSE))","v":"Dell 32 GB Modulo di memoria - RDIMM 2666MHz"},{"$f":"IF($B$29=\"No Additional Processor\",VLOOKUP($B$39, MEM_B1, 9, FALSE),VLOOKUP($B$39, MEM_B2, 9, FALSE))","v":2},null,{"$f":"IF($B$29=\"No Additional Processor\",VLOOKUP($B$39, MEM_B1, 10, FALSE),VLOOKUP($B$39, MEM_B2, 10, FALSE))","v":"[370-ADNF]"}]
[]
[null,{"$f":"IF($B$29=\"No Additional Processor\",VLOOKUP($B$39, MEM_B1, 2, FALSE),VLOOKUP($B$39, MEM_B2, 2, FALSE))","v":""},{"$f":"IF($B$29=\"No Additional Processor\",VLOOKUP($B$39, MEM_B1, 3, FALSE),VLOOKUP($B$39, MEM_B2, 3, FALSE))","v":""},{"$f":"IF($B$29=\"No Additional Processor\",VLOOKUP($B$39, MEM_B1, 4, FALSE),VLOOKUP($B$39, MEM_B2, 4, FALSE))","v":""},{"$f":"IF($B$29=\"No Additional Processor\",VLOOKUP($B$39, MEM_B1, 6, FALSE),VLOOKUP($B$39, MEM_B2, 6, FALSE))","v":""},{"$f":"IF($B$29=\"No Additional Processor\",VLOOKUP($B$39, MEM_B1, 7, FALSE),VLOOKUP($B$39, MEM_B2, 7, FALSE))","v":""}]
[]
[null,{"$f":"IF($B$29=\"No Additional Processor\",VLOOKUP($B$39, MEM_B1, 11, FALSE),VLOOKUP($B$39, MEM_B2, 11, FALSE))","v":""},{"$f":"IF($B$29=\"No Additional Processor\",VLOOKUP($B$39, MEM_B1, 12, FALSE),VLOOKUP($B$39, MEM_B2, 12, FALSE))","v":""},{"$f":"IF($B$29=\"No Additional Processor\",VLOOKUP($B$39, MEM_B1, 13, FALSE),VLOOKUP($B$39, MEM_B2, 13, FALSE))","v":""},{"$f":"IF($B$29=\"No Additional Processor\",VLOOKUP($B$39, MEM_B1, 15, FALSE),VLOOKUP($B$39, MEM_B2, 15, FALSE))","v":""},{"$f":"IF($B$29=\"No Additional Processor\",VLOOKUP($B$39, MEM_B1, 16, FALSE),VLOOKUP($B$39, MEM_B2, 16, FALSE))","v":""}]
[]
[null,"Sistema operativo preinstallato"]
[null,"No Operating System",{"$f":"VLOOKUP($B$52, OS_B, 2, FALSE)","v":""},{"$f":"VLOOKUP($B$52, OS_B, 3, FALSE)","v":""},{"$f":"VLOOKUP($B$52, OS_B, 5, FALSE)","v":"[611-BBBF]"},{"$f":"VLOOKUP($B$52, OS_B, 6, FALSE)","v":""}]
[null,{"$f":"IF($B$29=\"No Additional Processor\",VLOOKUP($B$52, OS_B, 20, FALSE),VLOOKUP($B$52, OS_B2, 20, FALSE))","v":""},{"$f":"IF($B$29=\"No Additional Processor\",VLOOKUP($B$52, OS_B, 21, FALSE),VLOOKUP($B$52, OS_B2, 21, FALSE))","v":0},{"$f":"IF($B$29=\"No Additional Processor\",VLOOKUP($B$52, OS_A, 22, FALSE),VLOOKUP($B$52, OS_B2, 22, FALSE))","v":""},{"$f":"IF($B$29=\"No Additional Processor\",VLOOKUP($B$52, OS_B, 24, FALSE),VLOOKUP($B$52, OS_B2, 24, FALSE))","v":""},{"$f":"IF($B$29=\"No Additional Processor\",VLOOKUP($B$52, OS_B, 25, FALSE),VLOOKUP($B$52, OS_B2, 25, FALSE))","v":""}]
[]
[null,"OS Media Kits"]
[null,"No Media Required",1,null,"[605-BBFN]"]
[]
[]
[null,"Client Access Licenses"]
[null,{"$f":"VLOOKUP($B$52, OS_B, 8, FALSE)","v":"None"},null,{"$f":"VLOOKUP($B$52, OS_A, 10, FALSE)","v":""},{"$f":"VLOOKUP($B$52, OS_A, 12, FALSE)","v":""},{"$f":"VLOOKUP($B$52, OS_A, 13, FALSE)*C60","v":0}]
[]
[null,{"$f":"VLOOKUP($B$52, OS_A, 14, FALSE)","v":"None"},null,{"$f":"VLOOKUP($B$52, OS_A, 16, FALSE)","v":""},{"$f":"VLOOKUP($B$52, OS_A, 18, FALSE)","v":""},{"$f":"VLOOKUP($B$52, OS_A, 19, FALSE)*C62","v":0}]
[]
[null,"Sistema operativo SUSE Linux Enterprise Server"]
[null,"None\n",{"$f":"VLOOKUP($B$65,SUSE, 2, FALSE)","v":0},{"$f":"VLOOKUP($B$65,SUSE, 3, FALSE)","v":""},{"$f":"VLOOKUP($B$65,SUSE, 5, FALSE)","v":""},{"$f":"VLOOKUP($B$65, SUSE, 6, FALSE)*C65","v":0}]
[]
[null,"Sistema operativo VMware"]
[null,"None",{"$f":"VLOOKUP($B$68,VMWARE, 2, FALSE)+C29","v":0},{"$f":"VLOOKUP($B$68,VMWARE, 3, FALSE)","v":""},{"$f":"VLOOKUP($B$68,VMWARE, 5, FALSE)","v":""},{"$f":"VLOOKUP($B$68, VMWARE, 6, FALSE)*C68","v":0}]
[]
[null,"VMware vCenter Server Standard"]
[null,"None",{"$f":"VLOOKUP($B$71,VMWARE2, 2, FALSE)","v":0},{"$f":"VLOOKUP($B$71,VMWARE2, 3, FALSE)","v":""},{"$f":"VLOOKUP($B$71,VMWARE2, 5, FALSE)","v":""},null,{"$f":"VLOOKUP($B$71, VMWARE2, 6, FALSE)*C71","v":0}]
[]
[null,"Essentials Plus Kit"]
[null,"None",{"$f":"IF(SRV_A<4,VLOOKUP($B$74,VMWARE1, 2, FALSE),0)","v":0},{"$f":"VLOOKUP($B$74,VMWARE1, 3, FALSE)","v":""},{"$f":"VLOOKUP($B$74,VMWARE1, 5, FALSE)","v":""},null,{"$f":"VLOOKUP($B$74, VMWARE1, 6, FALSE)*C74","v":0}]
[]
[null,"Controller RAID"]
[null,"PERC H730P RAID Controller, 2Gb NV Cache, Minicard",{"$f":"VLOOKUP($B$77,PERC, 2, FALSE)","v":0},{"$f":"VLOOKUP($B$77,PERC, 3, FALSE)","v":""},{"$f":"VLOOKUP($B$77,PERC, 4, FALSE)","v":""},{"$f":"VLOOKUP($B$77,PERC, 7, FALSE)","v":0}]
[]
[null,"Dischi rigidi  (numero massimo totale 24)"]
[null,"600GB 10K RPM SAS 12Gbps 512n 2.5in Hot-plug Hard Drive",2,null,"[400-AJPK]"]
[]
[null,"600GB 10K RPM SAS 12Gbps 512n 2.5in Hot-plug Hard Drive",null,{"$f":"VLOOKUP($B$82, HDD_A,3, FALSE)","v":"CNV-TS1L1-HD600"},{"$f":"VLOOKUP($B$82, HDD_A,5, FALSE)","v":"[400-AUNQ]"},{"$f":"VLOOKUP($B$82, HDD_B,6, FALSE)*C82","v":0}]
[]
[null,"1.2TB 10K RPM SAS 12Gbps 512n 2.5in Hot-plug Hard Drive",null,{"$f":"VLOOKUP($B$84, HDD_A,3, FALSE)","v":"CNV-TS1L1-HD1200-U"},{"$f":"VLOOKUP($B$84, HDD_A,5, FALSE)","v":"[400-ATJL]"},{"$f":"VLOOKUP($B$84, HDD_B,6, FALSE)*C84","v":0}]
[]
[null,"1.8TB 10K RPM SAS 12Gbps 512e 2.5in Hot-plug Hard Drive",null,"CNV-TS1L1-HD1800","[400-AJQP]",{"$f":"VLOOKUP($B$86, HDD_B,6, FALSE)*C86","v":0}]
[]
[null,"960GB SSD SAS Mix Use 12Gbps 512n 2.5in Hot-plug Drive,\nPX05SV,3 DWPD,5256 TBW",null,"CNV-TS1L1-SSD800","[400-ANNX]",{"$f":"VLOOKUP($B$88, HDD_B,6, FALSE)*C88","v":0}]
[]
[null,"1.92TB SSD SAS Mix Use 12Gbps 512n 2.5in Hot-plug Drive,\nPX05SV,3 DWPD,10512 TBW",null,"CNV-TS1L1-SSD1920","[400-ANMN]",{"$f":"VLOOKUP($B$90, HDD_B,6, FALSE)*C90","v":0}]
[]
[null,"DISCHI TOTALI",{"$f":"SUM(C80:C91)","v":2},{"$f":"IF(C92<=24,\"      OK\",\"     ERRORE:   Totale n° di dischi superiore al consentito\")","v":"      OK"}]
[]
[null,"Configurazione RAID"]
[null,"C3 - RAID 1 for H330 (2 HDDs)",1,null,{"$f":"VLOOKUP($B$95,  RAID_B1, 2, FALSE)","v":"[780-BBJK]"}]
[null,"Hot Spare for 300GB HDD","No"]
[null,"SCRIVERE QUI' LA CONFIGURAZIONE RAID RICHIESTA.\nR740XD 1\n",null,null,null,null,null,{"$f":"IF(B97=\"SCRIVERE QUI' LA CONFIGURAZIONE RAID RICHIESTA.\nR740XD 1\n\",\"ATTENZIONE COMPILARE IL CAMPO DELLA SCELTA RAID\", \"\")","v":"ATTENZIONE COMPILARE IL CAMPO DELLA SCELTA RAID"}]
[null,"Configurazione RAID HDD 1TB"]
[null,"",1,null,{"$f":"VLOOKUP($B$99,  RAID_B2, 2, FALSE)","v":""}]
[null,"Hot Spare for 1TB HDD","No"]
[]
[null,"Impostazioni del BIOS per la gestione dell'alimentazione"]
[null,"Performance BIOS Setting",1,null,"[384-BBBL]"]
[]
[null,"Alimentatore"]
[null,"Dual, Hot-plug, Redundant Power Supply (1+1), 750W, Titanium, 200-240VAC",1,null,"[450-ADWT]"]
[]
[null,"Cavi di alimentazione"]
[null,"Rack Power Cord 2M (C13/C14 12A)",2,null,"[450-AADY]"]
[]
[null,"Fans"]
[null,{"$f":"VLOOKUP(B29, CPU_B, 9, FALSE)","v":"4 Standard Fans for R740/740XD"},{"$f":"VLOOKUP($B$29, CPU_B.1, 10, FALSE)","v":1},null,{"$f":"VLOOKUP($B$29, CPU_B.1, 11, FALSE)","v":"[384-BBQB]"}]
[]
[null,"PCIe Riser"]
[null,{"$f":"VLOOKUP(B29, CPU_B.1, 12, FALSE)","v":"Riser Config 1, 4 x8 slots"},{"$f":"VLOOKUP($B$29, CPU_B.1, 13, FALSE)","v":1},null,{"$f":"VLOOKUP($B$29, CPU_B.1, 14, FALSE)","v":"[330-BBGZ]"}]
[]
[null,"TPM Module"]
[null,"Trusted Platform Module 1.2",1,null,"[461-AAEL]"]
[]
[null,"Embedded Systems Management"]
[null,"iDRAC9,Enterprise",1,null,"[385-BBKT]"]
[]
[null,"Adattatore di rete"]
[null,"Broadcom 5720 QP 1Gb Network Daughter Card",1,null,"[540-BBBW]"]
[]
[null,"Modulo Doppia SD"]
[null,"None ",{"$f":"VLOOKUP($B$127,upsell_1, 2, FALSE)","v":0},{"$f":"VLOOKUP($B$127,upsell_1, 3, FALSE)","v":""},{"$f":"VLOOKUP($B$127,upsell_1, 4, FALSE)","v":""},{"$f":"VLOOKUP($B$127,upsell_1, 7, FALSE)","v":0}]
[]
[null,"Additional Card for PCIe Slot 1 (Full height) (CPU 1)"]
[null,"Broadcom 5719 QP 1Gb Network Interface Card",null,{"$f":"\"\"","v":""},"540-BBCW"]
[]
[null,"Additional Card for PCIe Slot 2 (Full height) (CPU 1)"]
[null,"None",{"$f":"VLOOKUP(B133,  PCI_B1.1, 2, FALSE)","v":""},{"$f":"VLOOKUP(B133,  PCI_B1.1, 3, FALSE)","v":""},{"$f":"VLOOKUP(B133,  PCI_B1.1, 5, FALSE)","v":""},{"$f":"VLOOKUP(B133,  PCI_B1.1, 6, FALSE)","v":""},{"$f":"VLOOKUP(B133,  PCI_B1.1, 7, FALSE)","v":0}]
[]
[null,"Additional Card for PCIe Slot 3 (Full height) (CPU 1)"]
[null,"None",{"$f":"VLOOKUP(B136,  PCI_B1.1, 2, FALSE)","v":""},{"$f":"VLOOKUP(B136,  PCI_B1.1, 3, FALSE)","v":""},{"$f":"VLOOKUP(B136,  PCI_B1.1, 5, FALSE)","v":""},{"$f":"VLOOKUP(B136,  PCI_B1.1, 6, FALSE)","v":""},{"$f":"VLOOKUP(B136,  PCI_B1.1, 7, FALSE)","v":0}]
[]
[null,"Additional Card for PCIe Slot 4 (Full height) (CPU 2)"]
[null,"None",{"$f":"VLOOKUP(B139,  PCI_B1.1, 2, FALSE)","v":""},{"$f":"VLOOKUP(B139,  PCI_B1.1, 3, FALSE)","v":""},{"$f":"VLOOKUP(B139,  PCI_B1.1, 5, FALSE)","v":""},{"$f":"VLOOKUP(B139,  PCI_B1.1, 6, FALSE)","v":""},{"$f":"VLOOKUP(B139,  PCI_B1.1, 7, FALSE)","v":0}]
[]
[null,"Additional Card for PCIe Slot 5 (Full height) (CPU 2)"]
[null,"None",{"$f":"VLOOKUP(B142,  PCI_B1.1, 2, FALSE)","v":""},{"$f":"VLOOKUP(B142,  PCI_B1.1, 3, FALSE)","v":""},{"$f":"VLOOKUP(B142,  PCI_B1.1, 5, FALSE)","v":""},{"$f":"VLOOKUP(B142,  PCI_B1.1, 6, FALSE)","v":""},{"$f":"VLOOKUP(B142,  PCI_B1.1, 7, FALSE)","v":0}]
[]
[null,"Additional Card for PCIe Slot 6 (Low Profile) (CPU 1)"]
[null,"None",{"$f":"VLOOKUP(B145,PCI_B5, 2, FALSE)","v":""},{"$f":"VLOOKUP(B145,  PCI_B5, 3, FALSE)","v":""},{"$f":"VLOOKUP($B$145,PCI_B5,5,FALSE)","v":""},{"$f":"VLOOKUP($B$145,PCI_B5,6,FALSE)","v":""},{"$f":"VLOOKUP($B$145,PCI_B5,7,FALSE)","v":0}]
[]
[null,"Additional Card for PCIe Slot 7 (Full height) (CPU 2)"]
[null,"None",{"$f":"VLOOKUP(B148,  PCI_B1.1, 2, FALSE)","v":""},{"$f":"VLOOKUP(B148,  PCI_B1.1, 3, FALSE)","v":""},{"$f":"VLOOKUP(B148,  PCI_B1.1, 5, FALSE)","v":""},{"$f":"VLOOKUP(B148,  PCI_B1.1, 6, FALSE)","v":""},{"$f":"VLOOKUP(B148,  PCI_B1.1, 7, FALSE)","v":0}]
[]
[null,"Additional Card for PCIe Slot 8 (Full height) (CPU 2)"]
[null,"None",{"$f":"VLOOKUP(B151,  PCI_B1.1, 2, FALSE)","v":""},{"$f":"VLOOKUP(B151,  PCI_B1.1, 3, FALSE)","v":""},{"$f":"VLOOKUP(B151,  PCI_B1.1, 5, FALSE)","v":""},{"$f":"VLOOKUP(B151,  PCI_B1.1, 6, FALSE)","v":""},{"$f":"VLOOKUP(B151,  PCI_B1.1, 7, FALSE)","v":0}]
[]
[null,"Pannello frontale"]
[null,"No Bezel Option",{"$f":"VLOOKUP(B154,upsell_1, 2, FALSE)","v":1},{"$f":"VLOOKUP(B154,upsell_1, 3, FALSE)","v":""},{"$f":"VLOOKUP(B154,upsell_1, 5, FALSE)","v":"[350-BBBW]"},{"$f":"VLOOKUP(B154,upsell_1, 6, FALSE)","v":0},{"$f":"VLOOKUP(B154,upsell_1, 7, FALSE)","v":0}]
[]
[null,"Guide per rack"]
[null,"ReadyRails™ Sliding Rails Without Cable Management Arm 2U",{"$f":"VLOOKUP(B157,upsell_1, 2, FALSE)","v":1},{"$f":"VLOOKUP(B157,upsell_1, 3, FALSE)","v":""},{"$f":"VLOOKUP(B157,upsell_1, 5, FALSE)","v":"[770-BBBQ]"},{"$f":"VLOOKUP(B157,upsell_1, 6, FALSE)","v":0},{"$f":"VLOOKUP(B157,upsell_1, 7, FALSE)","v":0}]
[]
[null,"Server Accessories"]
[null,"PowerEdge SFP+, 10GbE SR/SX, Optical Tranceiver, LC Connector, for Intel and Broadcom,CusKit",{"$f":"(VLOOKUP(B151,PCI_A2,8,FALSE))+((VLOOKUP(B130,PCI_A1,8,FALSE)))","v":{"$error":"#VALUE!"}},null,"[407-BBQE]"]
[]
[null,"System Documentation"]
[null,"Electronic System Documentation and OpenManage DVD Kit",1,null,"[631-AAJG]"]
[]
[null,"SHIPPING"]
[null,"PowerEdge R730xd Shipping EMEA1 (English/French/German/Spanish/Russian/Hebrew)",1,null,"[340-AMGS]"]
[]
[null,"Order Information"]
[null,"PowerEdge Order - EMEA",1,null,"[800-11671]"]
[]
[null,"Base warranty"]
[null,"3Yr Basic Warranty - Next Business Day - Minimum Warranty",1,null,"[709-12780][709-12781]"]
[]
[null,"Servizi di assitenza"]
[null,"Dell Channel Order - Service Info only",1,null,"[710-31085]"]
[]
[null,"Aggiornamenti della garanzia"]
[null,"None",{"$f":"VLOOKUP($B$178,  SO_B2,2, FALSE)","v":""},{"$f":"VLOOKUP($B$178,  SO_B2, 3, FALSE)","v":""},{"$f":"VLOOKUP($B$178,  SO_B2, 5, FALSE)","v":""},{"$f":"VLOOKUP($B$178,  SO_B2, 6, FALSE)","v":""}]
[]
[null,"Protezione dei dati - Keep Your Hard Drive "]
[null,"None",{"$f":"VLOOKUP($B$181,  SO_B2, 2, FALSE)","v":""},{"$f":"VLOOKUP($B$181,  SO_B2, 3, FALSE)","v":""},{"$f":"VLOOKUP($B$181,  SO_B2,5, FALSE)","v":""},{"$f":"VLOOKUP($B$181,  SO_B2, 6, FALSE)","v":""}]
[]
[null,"Servizi di Installazione"]
[null,"No Installation Service Selected",1,null,"[683-11870]"]
[]
[null,"Channel only - Support Extension"]
[null,"Channel 39M Basic Warranty - Next Business Day",1,null,"[723-28780]"]
[]
[null,"Warranty Upgrades - Non-Std/Local POS"]
[null,"CSTM CONSIP - 39M Onsite Labor Support for CRU for Servers with Basic Warranty",1,null,"[681-24467]"]

{"sheet":"CNV T640 (Tower)","index":3,"n_rows":182,"n_cols":8,"rows_kept":182,"cut":false,"hidden":false,"merged":[[180,2,180,4],[182,1,182,4],[171,2,171,4],[173,1,173,4],[174,2,174,4],[176,1,176,4],[177,2,177,4],[179,1,179,4],[170,1,170,4],[153,2,153,4],[155,1,155,4],[156,2,156,4],[158,1,158,4],[159,2,159,4],[161,1,161,4],[162,2,162,4],[164,1,164,4],[165,2,165,4],[167,1,167,4],[168,2,168,4],[152,1,152,4],[131,2,131,4],[133,1,133,4],[134,2,134,4],[136,1,136,4],[137,2,137,4],[139,1,139,4],[140,2,140,4],[142,1,142,4],[143,2,143,4],[150,2,150,4],[90,7,91,8],[130,1,130,4],[107,2,107,4],[109,1,109,4],[110,2,110,4],[115,1,115,4],[119,2,119,4],[121,1,121,4],[122,2,122,4],[124,1,124,4],[125,2,125,4],[127,1,127,4],[128,2,128,4],[116,2,116,4],[118,1,118,4],[106,1,106,4],[103,1,103,4],[91,2,91,4],[94,1,94,4],[95,2,95,4],[97,1,97,4],[74,1,74,4],[54,2,54,4],[98,2,98,4],[100,1,100,4],[101,2,101,4],[77,1,77,4],[78,2,78,4],[87,2,87,4],[90,1,90,3],[86,1,86,4],[4,0,4,4],[5,0,5,4],[6,0,8,3],[18,2,18,4],[39,1,39,4],[20,1,20,4],[21,2,21,4],[23,1,23,4],[24,2,24,4],[26,1,26,4],[27,2,27,4],[29,1,29,4],[30,2,30,4],[33,1,33,4],[34,2,34,4],[36,1,36,4],[112,1,112,4],[113,2,113,4],[12,0,12,5],[147,1,147,4],[57,1,57,4],[58,2,58,4],[60,1,60,4],[62,1,62,4],[65,1,65,4],[75,2,75,4],[40,2,40,4],[42,1,42,4],[43,2,43,4],[49,1,49,4],[50,2,50,4],[53,1,53,4]]}
[null,null,null,"TOTALE MEPA",null,null,null,{"$f":"F14","v":0}]
[]
[]
[]
["POWEREDGE T640"]
[]
["Components: \nServer DELL EMC PowerEdge T640 (1CPU Intel® Xeon Silver 4114, RAM 32GB,2 x HDD 600GB 10K RPM SAS 12Gbps 2.5in)",null,null,null,"Totale Server e Opzioni",{"$f":"F17*SRV_D+G71+G75","v":0}]
[null,null,null,null,"Totale Ulteriori Opzioni ",{"$f":"G16*SRV_E-(G75*SRV_E)+G75-(SRV_E*G71)+G71","v":0}]
[]
[]
[]
[]
[]
[null,null,null,null,"TOTALE CONVENZIONE",{"$f":"F8+F7","v":0}]
[null,"Category: Server",null,null,null,2158]
[null,"Quantity: ",null,null,null,{"$f":"SUM(F20:F183)","v":0},{"$f":"SUM(G20:G192)","v":0}]
[null,null,null,null,null,{"$f":"SUM(F15:F16)","v":2158}]
[]
[null,"Base"]
[null,"PowerEdge T640",1,null,"[210-ACWJ][329-BCZH]"]
[]
[null,"Configurazione dello chassis"]
[null,"Chassis with up to 18, 3.5\" Hard Drives, Tower Configuration",1,null,"[321-BBJT]"]
[]
[null,"Processore"]
[null,"Intel® Xeon® Silver 4114 2.2G, 10C/20T, 9.6GT/s 2UPI, 14M Cache, Turbo, HT\n(85W) DDR4-2400",1,null,"[338-BLUS]"]
[]
[null,"Processore aggiuntivo"]
[null,"No Additional Processor",{"$f":"VLOOKUP($B$29, CPU_D, 2, FALSE)","v":0},{"$f":"VLOOKUP($B$29, CPU_D, 3, FALSE)","v":""},{"$f":"VLOOKUP($B$29, CPU_D, 5, FALSE)","v":"[374-BBBX]"},{"$f":"VLOOKUP(B29, CPU_D, 15, FALSE)","v":0}]
[]
[null,"Processor Thermal Configuration"]
[null,"1 CPU up to 105W",1,null,"[412-AADW]"]
[null,{"$f":"VLOOKUP($B$29, CPU_C, 6, FALSE)","v":""},{"$f":"VLOOKUP($B$29, CPU_C, 7, FALSE)","v":""},null,{"$f":"VLOOKUP($B$29, CPU_C, 8, FALSE)","v":""}]
[]
[null,"Tipo di configurazione memoria"]
[null,"Performance Optimized",1,null,"[370-AAIP]"]
[]
[null,"Total Memory in GB",{"$f":"IF(F29=650,IF(B39=32,\"ATTENZIONE: AUMENTARE LA RAM\",\"\"),\"\")","v":""}]
[null,32]
[]
[null,"Tipo e velocità della memoria DIMM"]
[null,"2666MT/s RDIMMs",1,null,"[370-ADNU]"]
[]
[null,"Capacità di memoria"]
[null,{"$f":"IF($B$29=\"No Additional Processor\",VLOOKUP($B$39, MEM_A1, 8, FALSE),VLOOKUP($B$39, MEM_A2, 8, FALSE))","v":"Dell 32 GB Modulo di memoria - RDIMM 2666MHz"},{"$f":"IF($B$29=\"No Additional Processor\",VLOOKUP($B$39, MEM_A1, 9, FALSE),VLOOKUP($B$39, MEM_A2, 9, FALSE))","v":1},null,{"$f":"IF($B$29=\"No Additional Processor\",VLOOKUP($B$39, MEM_A1, 10, FALSE),VLOOKUP($B$39, MEM_A2, 10, FALSE))","v":"[370-ADNF]"}]
[]
[null,{"$f":"IF($B$29=\"No Additional Processor\",VLOOKUP($B$39, MEM_A1, 2, FALSE),VLOOKUP($B$39, MEM_A2, 2, FALSE))","v":""},{"$f":"IF($B$29=\"No Additional Processor\",VLOOKUP($B$39, MEM_A1, 3, FALSE),VLOOKUP($B$39, MEM_A2, 3, FALSE))","v":""},{"$f":"IF($B$29=\"No Additional Processor\",VLOOKUP($B$39, MEM_A1, 4, FALSE),VLOOKUP($B$39, MEM_A2, 4, FALSE))","v":""},{"$f":"IF($B$29=\"No Additional Processor\",VLOOKUP($B$39, MEM_A1, 6, FALSE),VLOOKUP($B$39, MEM_A2, 6, FALSE))","v":""},{"$f":"IF($B$29=\"No Additional Processor\",VLOOKUP($B$39, MEM_A1, 7, FALSE),VLOOKUP($B$39, MEM_A2, 7, FALSE))","v":""}]
[]
[null,{"$f":"IF($B$29=\"No Additional Processor\",VLOOKUP($B$39, MEM_A1, 11, FALSE),VLOOKUP($B$39, MEM_A2, 11, FALSE))","v":""},{"$f":"IF($B$29=\"No Additional Processor\",VLOOKUP($B$39, MEM_A1, 12, FALSE),VLOOKUP($B$39, MEM_A2, 12, FALSE))","v":""},{"$f":"IF($B$29=\"No Additional Processor\",VLOOKUP($B$39, MEM_A1, 13, FALSE),VLOOKUP($B$39, MEM_A2, 13, FALSE))","v":""},{"$f":"IF($B$29=\"No Additional Processor\",VLOOKUP($B$39, MEM_A1, 15, FALSE),VLOOKUP($B$39, MEM_A2, 15, FALSE))","v":""},{"$f":"IF($B$29=\"No Additional Processor\",VLOOKUP($B$39, MEM_A1, 16, FALSE),VLOOKUP($B$39, MEM_A2, 16, FALSE))","v":""}]
[]
[null,"Sistema operativo preinstallato"]
[null,"No Operating System",{"$f":"VLOOKUP($B$52, OS_C, 2, FALSE)","v":""},{"$f":"VLOOKUP($B$52, OS_C, 3, FALSE)","v":""},{"$f":"VLOOKUP($B$52, OS_C, 5, FALSE)","v":"[611-BBBF]"},{"$f":"VLOOKUP($B$52, OS_C, 6, FALSE)","v":""}]
[null,{"$f":"IF($B$29=\"No Additional Processor\",VLOOKUP($B$52, OS_A, 20, FALSE),VLOOKUP($B$52, OS_A2, 20, FALSE))","v":""},{"$f":"IF($B$29=\"No Additional Processor\",VLOOKUP($B$52, OS_A, 21, FALSE),VLOOKUP($B$52, OS_A2, 21, FALSE))","v":0},{"$f":"IF($B$29=\"No Additional Processor\",VLOOKUP($B$52, OS_A, 22, FALSE),VLOOKUP($B$52, OS_A2, 22, FALSE))","v":""},{"$f":"IF($B$29=\"No Additional Processor\",VLOOKUP($B$52, OS_A, 24, FALSE),VLOOKUP($B$52, OS_A2, 24, FALSE))","v":""},{"$f":"IF($B$29=\"No Additional Processor\",VLOOKUP($B$52, OS_A, 25, FALSE),VLOOKUP($B$52, OS_A2, 25, FALSE))","v":""}]
[]
[null,"OS Media Kits"]
[null,"No Media Required",1,null,"[605-BBFN]"]
[]
[]
[null,"Client Access Licenses"]
[null,{"$f":"VLOOKUP($B$52, OS_A, 8, FALSE)","v":"None"},null,{"$f":"VLOOKUP($B$52, OS_A, 10, FALSE)","v":""},{"$f":"VLOOKUP($B$52, OS_A, 12, FALSE)","v":""},{"$f":"VLOOKUP($B$52, OS_A, 13, FALSE)*C60","v":0}]
[]
[null,{"$f":"VLOOKUP($B$52, OS_A, 14, FALSE)","v":"None"},null,{"$f":"VLOOKUP($B$52, OS_A, 16, FALSE)","v":""},{"$f":"VLOOKUP($B$52, OS_A, 18, FALSE)","v":""},{"$f":"VLOOKUP($B$52, OS_A, 19, FALSE)*C62","v":0}]
[]
[null,"Sistema operativo SUSE Linux Enterprise Server"]
[null,"None\n",{"$f":"VLOOKUP($B$65,SUSE, 2, FALSE)","v":0},{"$f":"VLOOKUP($B$65,SUSE, 3, FALSE)","v":""},{"$f":"VLOOKUP($B$65,SUSE, 5, FALSE)","v":""},{"$f":"VLOOKUP($B$65, SUSE, 6, FALSE)*C65","v":0}]
[]
[null,"Sistema operativo VMware"]
[null,"None",{"$f":"VLOOKUP($B$68,VMWARE, 2, FALSE)+C29","v":0},{"$f":"VLOOKUP($B$68,VMWARE, 3, FALSE)","v":""},{"$f":"VLOOKUP($B$68,VMWARE, 5, FALSE)","v":""},{"$f":"VLOOKUP($B$68, VMWARE, 6, FALSE)*C68","v":0}]
[]
[null,"VMware vCenter Server Standard"]
[null,"None",{"$f":"VLOOKUP($B$71,VMWARE2, 2, FALSE)","v":0},{"$f":"VLOOKUP($B$71,VMWARE2, 3, FALSE)","v":""},{"$f":"VLOOKUP($B$71,VMWARE2, 5, FALSE)","v":""},null,{"$f":"VLOOKUP($B$71, VMWARE2, 6, FALSE)*C71","v":0}]
[]
[null,"Essentials Plus Kit"]
[null,"None",{"$f":"IF(SRV_A<4,VLOOKUP($B$74,VMWARE1, 2, FALSE),0)","v":0},{"$f":"VLOOKUP($B$74,VMWARE1, 3, FALSE)","v":""},{"$f":"VLOOKUP($B$74,VMWARE1, 5, FALSE)","v":""},null,{"$f":"VLOOKUP($B$74, VMWARE1, 6, FALSE)*C74","v":0}]
[]
[null,"Controller RAID"]
[null,"PERC H730P+ Adapter RAID Controller, 2GB",1,null,"[405-AANW]"]
[]
[null,"Dischi rigidi  (numero massimo totale 18)"]
[null,"600GB 10K RPM SAS 12Gbps 512n 2.5in Hot-plug Hard Drive, 3.5in HYB CARR",2,null,"[400-ASLU]"]
[]
[null,"600GB 10K RPM SAS 12Gbps 512n 2.5in Hot-plug Hard Drive, 3.5in HYB CARR",null,{"$f":"VLOOKUP($B$82, hdd_D,3, FALSE)","v":"CNV-TS1L1-HD600T"},{"$f":"VLOOKUP($B$82, hdd_D,5, FALSE)","v":"400-AOXC"},{"$f":"VLOOKUP($B$82, hdd_D,6, FALSE)*C82","v":0}]
[]
[null,"1.2TB 10K RPM SAS 12Gbps 512n 2.5in Hot-plug Hard Drive, 3.5in HYB CARR",null,{"$f":"VLOOKUP($B$84, hdd_D,3, FALSE)","v":"CNV-TS1L1-HD1200T-U"},{"$f":"VLOOKUP($B$84, hdd_D,5, FALSE)","v":"400-AUUY"},{"$f":"VLOOKUP($B$84, hdd_D,6, FALSE)*C84","v":0}]
[]
[null,"DISCHI TOTALI",{"$f":"SUM(C80:C85)","v":2},{"$f":"IF(C86<=18,\"      OK\",\"     ERRORE:   Totale n° di dischi superiore al consentito\")","v":"      OK"}]
[]
[null,"Configurazione RAID"]
[null,"C3 - RAID 1 for H330 (2 HDDs)",1,null,{"$f":"VLOOKUP($B$89,  RAID_C1, 2, FALSE)","v":"[780-BBJK]"}]
[null,"Hot Spare for 300GB HDD","No"]
[null,"SCRIVERE QUI' LA CONFIGURAZIONE RAID RICHIESTA.\nT630 Tower Base\n",null,null,null,null,null,{"$f":"IF(B91=\"SCRIVERE QUI' LA CONFIGURAZIONE RAID RICHIESTA.\nT630 Tower Base\n\",\"ATTENZIONE COMPILARE IL CAMPO DELLA SCELTA RAID\", \"\")","v":"ATTENZIONE COMPILARE IL CAMPO DELLA SCELTA RAID"}]
[null,"Configurazione RAID HDD 1TB"]
[null,"",1,null,{"$f":"VLOOKUP($B$93,  RAID_C2, 2, FALSE)","v":""}]
[null,"Hot Spare for 1TB HDD","No"]
[]
[null,"Impostazioni del BIOS per la gestione dell'alimentazione"]
[null,"Performance BIOS Setting",1,null,"[384-BBBL]"]
[]
[null,"Alimentatore"]
[null,"Dual, Hot-plug, Redundant Power Supply (1+1), 750W, Titanium, 200-240VAC",1,null,"[450-ADWT]"]
[]
[null,"Cavi di alimentazione"]
[null,"Italian Spare Power Cord 220V",2,null,"[450-AAYN]"]
[]
[null,"TPM Module"]
[null,"Trusted Platform Module 1.2",1,null,"[461-AAEL]"]
[]
[null,"Embedded Systems Management"]
[null,"iDrac9, Enterprise",1,null,"[385-BBKT]"]
[]
[null,"Adattatore di rete aggiuntivo"]
[null,"On-Board LOM 1GBE (Dual Port for Towers, Quad Port for Racks and Blades)",1,null,"[542-BBCT]"]
[]
[null,"Additional Card for PCIe Slot 1 (CPU 1)"]
[null,"Broadcom 5720 DP 1Gb Network Interface Card",1,null,"[540-BBCX]"]
[]
[null,"Additional Card for PCIe Slot 2 (CPU 1)"]
[null,"None",{"$f":"VLOOKUP(B118,  PCI_B1.1, 2, FALSE)","v":""},{"$f":"VLOOKUP(B118,  PCI_B1.1, 3, FALSE)","v":""},{"$f":"VLOOKUP(B118,  PCI_B1.1, 5, FALSE)","v":""},{"$f":"VLOOKUP(B118,  PCI_B1.1, 6, FALSE)","v":""},{"$f":"VLOOKUP(B118,  PCI_B1.1, 7, FALSE)","v":0}]
[]
[null,"Additional Card for PCIe Slot 3 (CPU 1)"]
[null,"None",{"$f":"VLOOKUP(B121,  PCI_B1.1, 2, FALSE)","v":""},{"$f":"VLOOKUP(B121,  PCI_B1.1, 3, FALSE)","v":""},{"$f":"VLOOKUP(B121,  PCI_B1.1, 5, FALSE)","v":""},{"$f":"VLOOKUP(B121,  PCI_B1.1, 6, FALSE)","v":""},{"$f":"VLOOKUP(B121,  PCI_B1.1, 7, FALSE)","v":0}]
[]
[null,"Additional Card for PCIe Slot 4 (CPU 2)"]
[null,"None",{"$f":"IF($B124=Processor!$A$46,\"\",VLOOKUP($B124,  PCI_B1.1, 2, FALSE))","v":""},{"$f":"IF($B124=Processor!$A$46,\"\",VLOOKUP($B124,  PCI_B1.1, 3, FALSE))","v":""},{"$f":"IF($B124=Processor!$A$46,\"\",VLOOKUP($B124,  PCI_B1.1, 5, FALSE))","v":""},{"$f":"IF($B124=Processor!$A$46,\"\",VLOOKUP($B124,  PCI_B1.1, 6, FALSE))","v":""},{"$f":"IF($B124=Processor!$A$46,\"\",VLOOKUP($B124,  PCI_B1.1, 7, FALSE))","v":0}]
[]
[null,"Additional Card for PCIe Slot 5 (CPU 2)"]
[null,"None",{"$f":"IF($B127=Processor!$A$46,\"\",VLOOKUP($B127,  PCI_B1.1, 2, FALSE))","v":""},{"$f":"IF($B127=Processor!$A$46,\"\",VLOOKUP($B127,  PCI_B1.1, 3, FALSE))","v":""},{"$f":"IF($B127=Processor!$A$46,\"\",VLOOKUP($B127,  PCI_B1.1, 5, FALSE))","v":""},{"$f":"IF($B127=Processor!$A$46,\"\",VLOOKUP($B127,  PCI_B1.1, 6, FALSE))","v":""},{"$f":"IF($B127=Processor!$A$46,\"\",VLOOKUP($B127,  PCI_B1.1, 7, FALSE))","v":0}]
[]
[null,"Additional Card for PCIe Slot 6 (CPU 2)"]
[null,"None",{"$f":"IF($B130=Processor!$A$46,\"\",VLOOKUP($B130,  PCI_B1.1, 2, FALSE))","v":""},{"$f":"IF($B130=Processor!$A$46,\"\",VLOOKUP($B130,  PCI_B1.1, 3, FALSE))","v":""},{"$f":"IF($B130=Processor!$A$46,\"\",VLOOKUP($B130,  PCI_B1.1, 5, FALSE))","v":""},{"$f":"IF($B130=Processor!$A$46,\"\",VLOOKUP($B130,  PCI_B1.1, 6, FALSE))","v":""},{"$f":"IF($B130=Processor!$A$46,\"\",VLOOKUP($B130,  PCI_B1.1, 7, FALSE))","v":0}]
[]
[null,"Additional Card for PCIe Slot 7 (CPU 2)"]
[null,"None",{"$f":"IF($B133=Processor!$A$46,\"\",VLOOKUP($B133,  PCI_B1.1, 2, FALSE))","v":""},{"$f":"IF($B133=Processor!$A$46,\"\",VLOOKUP($B133,  PCI_B1.1, 3, FALSE))","v":""},{"$f":"IF($B133=Processor!$A$46,\"\",VLOOKUP($B133,  PCI_B1.1, 5, FALSE))","v":""},{"$f":"IF($B133=Processor!$A$46,\"\",VLOOKUP($B133,  PCI_B1.1, 6, FALSE))","v":""},{"$f":"IF($B133=Processor!$A$46,\"\",VLOOKUP($B133,  PCI_B1.1, 7, FALSE))","v":0}]
[]
[null,"Pannello frontale"]
[null,"No Bezel",1,null,"[350-BBBW]"]
[]
[null,"Guide per rack"]
[null,"No Rack Rails, No Cable Management Arm, No Casters",1,null,"[770-BBCR]"]
[]
[null,"Unità ottica interna"]
[null,"No Internal Optical Drive",1,null,"[429-AAIQ][429-AAQS]"]
[]
[null,"Accessori per server"]
[null,"Redundant Fan Option",1,null,"[750-AAFF]"]
[]
[null,"PowerEdge SFP+, 10GbE SR/SX, Optical Tranceiver, LC Connector, for Intel and Broadcom,CusKit",{"$f":"(VLOOKUP(B121,PCI_C2,8,FALSE))+((VLOOKUP(B118,PCI_C1,8,FALSE)))+((VLOOKUP(B124,PCI_C3,8,FALSE)))+((VLOOKUP(B127,PCI_C4,8,FALSE)))+((VLOOKUP(B130,PCI_C5,8,FALSE)))+((VLOOKUP(B133,PCI_C6,8,FALSE)))","v":{"$error":"#VALUE!"}},null,"[407-BBQE]"]
[]
[]
[null,"PowerEdge SFP+, 10GbE SR/SX, Optical Tranceiver, LC Connector, for Intel and Broadcom,CusKit",{"$f":"(VLOOKUP(B124,PCI_C2,8,FALSE))+((VLOOKUP(B121,PCI_C1,8,FALSE)))+((VLOOKUP(B127,PCI_C3,8,FALSE)))+((VLOOKUP(B130,PCI_C4,8,FALSE)))+((VLOOKUP(B133,PCI_C5,8,FALSE)))+((VLOOKUP(B136,PCI_C6,8,FALSE)))","v":{"$error":"#VALUE!"}},null,"[407-BBQE]"]
[null,"Opzione RDX"]
[null,"None",{"$f":"VLOOKUP($B$152,RDX, 2, FALSE)","v":0},{"$f":"VLOOKUP($B$152,RDX, 3, FALSE)","v":""},{"$f":"VLOOKUP($B$152,RDX, 4, FALSE)","v":""},{"$f":"VLOOKUP($B$152,RDX, 7, FALSE)","v":0}]
[]
[null,"System Documentation"]
[null,"Electronic System Documentation and OpenManage DVD Kit, PowerEdge T630",1,null,"[343-BBDE]"]
[]
[null,"SHIPPING"]
[null,"PowerEdge T630 Shipping EMEA1 (English/French/German/Spanish/Russian/Hebrew)",1,null,"[340-AMBT]"]
[]
[null,"Order Information"]
[null,"Enterprise Order - EMEA",1,null,"[800-11671]"]
[]
[null,"Base warranty"]
[null,"3Yr Basic Warranty - Next Business Day - Minimum Warranty",1,null,"[709-12798][709-12799]"]
[]
[null,"Servizi di assitenza"]
[null,"Dell Channel Order - Service Info only",1,null,"[710-31085]"]
[]
[null,"Aggiornamenti della garanzia"]
[null,"None",{"$f":"VLOOKUP($B$170,  'Servizi Opzionali'!$A$73:$F$75, 2, FALSE)","v":""},{"$f":"VLOOKUP($B$170,  'Servizi Opzionali'!$A$73:$F$75, 3, FALSE)","v":""},{"$f":"VLOOKUP($B$170,  'Servizi Opzionali'!$A$73:$F$75, 5, FALSE)","v":""},{"$f":"VLOOKUP($B$170,  'Servizi Opzionali'!$A$73:$F$75, 6, FALSE)","v":""}]
[]
[null,"Protezione dei dati - Keep Your Hard Drive "]
[null,"None",{"$f":"VLOOKUP($B$173,  SO_C2, 2, FALSE)","v":""},{"$f":"VLOOKUP($B$173,  SO_C2, 3, FALSE)","v":""},{"$f":"VLOOKUP($B$173,  SO_C2,5, FALSE)","v":""},{"$f":"VLOOKUP($B$173,  SO_C2, 6, FALSE)","v":""}]
[]
[null,"Servizi di Installazione"]
[null,"No Installation Service Selected",1,null,"[683-11870]"]
[]
[null,"Channel only - Support Extension"]
[null,"Channel 39M Basic Warranty - Next Business Day",1,null,"[723-28783]"]
[]
[null,"Warranty Upgrades - Non-Std/Local POS"]
[null,"CSTM CONSIP - 39M Onsite Labor Support for CRU for Servers with Basic Warranty",1,null,"[681-24467]"]

{"sheet":"CNV T640 1 (Tower) Prest","index":4,"n_rows":189,"n_cols":8,"rows_kept":189,"cut":false,"hidden":false,"merged":[[177,1,177,4],[160,2,160,4],[162,1,162,4],[163,2,163,4],[165,1,165,4],[169,2,169,4],[171,1,171,4],[172,2,172,4],[187,2,187,4],[189,1,189,4],[178,2,178,4],[180,1,180,4],[181,2,181,4],[183,1,183,4],[184,2,184,4],[186,1,186,4],[157,2,157,4],[159,1,159,4],[174,1,174,4],[175,2,175,4],[156,1,156,4],[134,2,134,4],[136,1,136,4],[137,2,137,4],[139,1,139,4],[143,2,143,4],[140,2,140,4],[142,1,142,4],[145,1,145,4],[146,2,146,4],[148,1,148,4],[149,2,149,4],[151,1,151,4],[152,2,152,4],[166,2,166,4],[168,1,168,4],[133,1,133,4],[110,2,110,4],[112,1,112,4],[113,2,113,4],[117,1,117,4],[121,2,121,4],[124,1,124,4],[125,2,125,4],[127,1,127,4],[128,2,128,4],[130,1,130,4],[131,2,131,4],[118,2,118,4],[120,1,120,4],[109,1,109,4],[91,2,91,4],[94,1,94,4],[95,2,95,4],[97,1,97,4],[98,2,98,4],[100,1,100,4],[101,2,101,4],[103,1,103,4],[104,2,104,4],[106,1,106,4],[77,1,77,4],[78,2,78,4],[87,2,87,4],[90,1,90,3],[75,2,75,4],[86,1,86,4],[40,2,40,4],[42,1,42,4],[43,2,43,4],[49,1,49,4],[50,2,50,4],[53,1,53,4],[54,2,54,4],[57,1,57,4],[58,2,58,4],[60,1,60,4],[29,1,29,4],[30,2,30,4],[33,1,33,4],[34,2,34,4],[36,1,36,4],[6,0,8,3],[74,1,74,4],[90,7,91,8],[18,2,18,4],[4,0,4,4],[5,0,5,4],[12,0,12,5],[62,1,62,4],[65,1,65,4],[39,1,39,4],[20,1,20,4],[21,2,21,4],[23,1,23,4],[24,2,24,4],[26,1,26,4],[27,2,27,4]]}
[null,null,null,"TOTALE MEPA",null,null,null,{"$f":"F14","v":0}]
[]
[]
[]
["POWEREDGE T640"]
[]
["Components: \nServer DELL EMC PowerEdge T640 (1CPU Intel® Xeon Silver 4116, 64GB RDIMM, 2xHDD 600GB 10K RPM SAS 12Gbps 2.5in)",null,null,null,"Totale Server e Opzioni",{"$f":"F17*SRV_E+G71+G74","v":0}]
[null,null,null,null,"Totale Ulteriori Opzioni ",{"$f":"G16*SRV_E-(G74*SRV_E)+G74-(SRV_E*G71)+G71","v":0}]
[]
[]
[]
[]
[]
[null,null,null,null,"TOTALE CONVENZIONE",{"$f":"F8+F7","v":0}]
[null,"Category: Server",null,null,null,2214]
[null,"Quantity: ",null,null,null,{"$f":"SUM(F20:F190)","v":0},{"$f":"SUM(G20:G207)","v":0}]
[null,null,null,null,null,{"$f":"SUM(F15:F16)","v":2214}]
[]
[null,"Base"]
[null,"PowerEdge T640",1,null,"[210-AMBC][329-BDMT]"]
[]
[null,"Configurazione dello chassis"]
[null,"Chassis with up to 8, 3.5\" Hard Drives, Tower Configuration",1,null,"[321-BCXD]"]
[]
[null,"Processore"]
[null,"Intel Xeon Silver 4116 2.1G, 12C/24T, 9.6GT/s , 16.5M Cache, Turbo, HT (85W)",1,null,"[338-BLUT]"]
[]
[null,"Processore aggiuntivo"]
[null,"No Additional Processor",{"$f":"VLOOKUP($B$29, CPU_E, 2, FALSE)","v":0},{"$f":"VLOOKUP($B$29, CPU_E, 3, FALSE)","v":""},{"$f":"VLOOKUP($B$29, CPU_E, 5, FALSE)","v":"[374-BBBX]"},{"$f":"VLOOKUP(B29, CPU_E, 15, FALSE)","v":0}]
[]
[null,"Processor Thermal Configuration"]
[null,"1 CPU up to 105W",1,null,"[412-AADW]"]
[null,{"$f":"VLOOKUP($B$29, CPU_E, 6, FALSE)","v":""},{"$f":"VLOOKUP($B$29, CPU_E, 7, FALSE)","v":""},null,{"$f":"VLOOKUP($B$29, CPU_E, 8, FALSE)","v":""}]
[]
[null,"Tipo di configurazione memoria"]
[null,"Performance Optimized",1,null,"[370-AAIP]"]
[]
[null,"Memoria Totale in GB",null,{"$f":"IF(('CNV R740 1'!$D$12=0),\"\",'CNV R740 1'!#REF!)","v":""}]
[null,64]
[]
[null,"Tipo e velocità della memoria DIMM"]
[null,"2666MT/s RDIMMs",1,null,"[370-ADNU]"]
[]
[null,"Capacità di memoria"]
[null,{"$f":"IF($B$29=\"No Additional Processor\",VLOOKUP($B$39, MEM_C1, 8, FALSE),VLOOKUP($B$39, MEM_C2, 8, FALSE))","v":"Dell 32 GB Modulo di memoria - RDIMM 2666MHz"},{"$f":"IF($B$29=\"No Additional Processor\",VLOOKUP($B$39, MEM_C1, 9, FALSE),VLOOKUP($B$39, MEM_C2, 9, FALSE))","v":2},null,{"$f":"IF($B$29=\"No Additional Processor\",VLOOKUP($B$39, MEM_C1, 10, FALSE),VLOOKUP($B$39, MEM_C2, 10, FALSE))","v":"[370-ADNF]"}]
[]
[null,{"$f":"IF($B$29=\"No Additional Processor\",VLOOKUP($B$39, MEM_C1, 2, FALSE),VLOOKUP($B$39, MEM_C2, 2, FALSE))","v":""},{"$f":"IF($B$29=\"No Additional Processor\",VLOOKUP($B$39, MEM_C1, 3, FALSE),VLOOKUP($B$39, MEM_C2, 3, FALSE))","v":""},{"$f":"IF($B$29=\"No Additional Processor\",VLOOKUP($B$39, MEM_C1, 4, FALSE),VLOOKUP($B$39, MEM_C2, 4, FALSE))","v":""},{"$f":"IF($B$29=\"No Additional Processor\",VLOOKUP($B$39, MEM_C1, 6, FALSE),VLOOKUP($B$39, MEM_C2, 6, FALSE))","v":""},{"$f":"IF($B$29=\"No Additional Processor\",VLOOKUP($B$39, MEM_C1, 7, FALSE),VLOOKUP($B$39, MEM_C2, 7, FALSE))","v":""}]
[]
[null,{"$f":"IF($B$29=\"No Additional Processor\",VLOOKUP($B$39, MEM_C1, 11, FALSE),VLOOKUP($B$39, MEM_C2, 11, FALSE))","v":""},{"$f":"IF($B$29=\"No Additional Processor\",VLOOKUP($B$39, MEM_C1, 12, FALSE),VLOOKUP($B$39, MEM_C2, 12, FALSE))","v":""},{"$f":"IF($B$29=\"No Additional Processor\",VLOOKUP($B$39, MEM_C1, 13, FALSE),VLOOKUP($B$39, MEM_C2, 13, FALSE))","v":""},{"$f":"IF($B$29=\"No Additional Processor\",VLOOKUP($B$39, MEM_C1, 15, FALSE),VLOOKUP($B$39, MEM_C2, 15, FALSE))","v":""},{"$f":"IF($B$29=\"No Additional Processor\",VLOOKUP($B$39, MEM_C1, 16, FALSE),VLOOKUP($B$39, MEM_C2, 16, FALSE))","v":""}]
[]
[null,"Sistema operativo preinstallato"]
[null,"No Operating System",{"$f":"VLOOKUP($B$52, OS_C, 2, FALSE)","v":""},{"$f":"VLOOKUP($B$52, OS_C, 3, FALSE)","v":""},{"$f":"VLOOKUP($B$52, OS_C, 5, FALSE)","v":"[611-BBBF]"},{"$f":"VLOOKUP($B$52, OS_C, 6, FALSE)","v":""}]
[null,{"$f":"IF($B$29=\"No Additional Processor\",VLOOKUP($B$52, OS_B, 20, FALSE),VLOOKUP($B$52, OS_B2, 20, FALSE))","v":""},{"$f":"IF($B$29=\"No Additional Processor\",VLOOKUP($B$52, OS_B, 21, FALSE),VLOOKUP($B$52, OS_B2, 21, FALSE))","v":0},{"$f":"IF($B$29=\"No Additional Processor\",VLOOKUP($B$52, OS_A, 22, FALSE),VLOOKUP($B$52, OS_B2, 22, FALSE))","v":""},{"$f":"IF($B$29=\"No Additional Processor\",VLOOKUP($B$52, OS_B, 24, FALSE),VLOOKUP($B$52, OS_B2, 24, FALSE))","v":""},{"$f":"IF($B$29=\"No Additional Processor\",VLOOKUP($B$52, OS_B, 25, FALSE),VLOOKUP($B$52, OS_B2, 25, FALSE))","v":""}]
[]
[null,"OS Media Kits"]
[null,"No Media Required",1,null,"[605-BBFN]"]
[]
[]
[null,"Client Access Licenses"]
[null,{"$f":"VLOOKUP($B$52, OS_A, 8, FALSE)","v":"None"},null,{"$f":"VLOOKUP($B$52, OS_A, 10, FALSE)","v":""},{"$f":"VLOOKUP($B$52, OS_A, 12, FALSE)","v":""},{"$f":"VLOOKUP($B$52, OS_A, 13, FALSE)*C60","v":0}]
[]
[null,{"$f":"VLOOKUP($B$52, OS_A, 14, FALSE)","v":"None"},null,{"$f":"VLOOKUP($B$52, OS_A, 16, FALSE)","v":""},{"$f":"VLOOKUP($B$52, OS_A, 18, FALSE)","v":""},{"$f":"VLOOKUP($B$52, OS_A, 19, FALSE)*C62","v":0}]
[]
[null,"Sistema operativo SUSE Linux Enterprise Server"]
[null,"None\n",{"$f":"VLOOKUP($B$65,SUSE, 2, FALSE)","v":0},{"$f":"VLOOKUP($B$65,SUSE, 3, FALSE)","v":""},{"$f":"VLOOKUP($B$65,SUSE, 5, FALSE)","v":""},{"$f":"VLOOKUP($B$65, SUSE, 6, FALSE)*C65","v":0}]
[]
[null,"Sistema operativo VMware"]
[null,"None",{"$f":"VLOOKUP($B$68,VMWARE, 2, FALSE)+C29","v":0},{"$f":"VLOOKUP($B$68,VMWARE, 3, FALSE)","v":""},{"$f":"VLOOKUP($B$68,VMWARE, 5, FALSE)","v":""},{"$f":"VLOOKUP($B$68, VMWARE, 6, FALSE)*C68","v":0}]
[]
[null,"VMware vCenter Server Standard"]
[null,"None",{"$f":"VLOOKUP($B$71,VMWARE2, 2, FALSE)","v":0},{"$f":"VLOOKUP($B$71,VMWARE2, 3, FALSE)","v":""},{"$f":"VLOOKUP($B$71,VMWARE2, 5, FALSE)","v":""},null,{"$f":"VLOOKUP($B$71, VMWARE2, 6, FALSE)*C71","v":0}]
[]
[null,"Essentials Plus Kit"]
[null,"None",{"$f":"IF(SRV_A<4,VLOOKUP($B$74,VMWARE1, 2, FALSE),0)","v":0},{"$f":"VLOOKUP($B$74,VMWARE1, 3, FALSE)","v":""},{"$f":"VLOOKUP($B$74,VMWARE1, 5, FALSE)","v":""},null,{"$f":"VLOOKUP($B$74, VMWARE1, 6, FALSE)*C74","v":0}]
[]
[null,"Controller RAID"]
[null,"PERC H730P+ Adapter RAID Controller, 2GB",1,null,"[405-AANW]"]
[]
[null,"Dischi rigidi (numero massimo totale 8)"]
[null,"600GB 10K RPM SAS 12Gbps 512n 2.5in Hot-plug Hard Drive, 3.5in HYB CARR",2,null,"[400-AJOZ]"]
[]
[null,"600GB 10K RPM SAS 12Gbps 512n 2.5in Hot-plug Hard Drive, 3.5in HYB CARR",null,{"$f":"VLOOKUP($B$82, hdd_D,3, FALSE)","v":"CNV-TS1L1-HD600T"},{"$f":"VLOOKUP($B$82, hdd_D,5, FALSE)","v":"400-AOXC"},{"$f":"VLOOKUP($B$82, hdd_D,6, FALSE)*C82","v":0}]
[]
[null,"1.2TB 10K RPM SAS 12Gbps 512n 2.5in Hot-plug Hard Drive, 3.5in HYB CARR",null,{"$f":"VLOOKUP($B$84, hdd_D,3, FALSE)","v":"CNV-TS1L1-HD1200T-U"},{"$f":"VLOOKUP($B$84, hdd_D,5, FALSE)","v":"400-AUUY"},{"$f":"VLOOKUP($B$84, hdd_D,6, FALSE)*C84","v":0}]
[]
[null,"DISCHI TOTALI",{"$f":"SUM(C80:C85)","v":2},{"$f":"IF(C86<=8,\"      OK\",\"     ERRORE:   Totale n° di dischi superiore al consentito\")","v":"      OK"}]
[]
[null,"Configurazione RAID"]
[null,"C3 - RAID 1 for H330 (2 HDDs)",1,null,{"$f":"VLOOKUP($B$89,  RAID_C1, 2, FALSE)","v":"[780-BBJK]"}]
[null,"Hot Spare for 300GB HDD","No"]
[null,"SCRIVERE QUI' LA CONFIGURAZIONE RAID RICHIESTA.\nT640 Tower Prestazionale\n",null,null,null,null,null,{"$f":"IF(B91=\"SCRIVERE QUI' LA CONFIGURAZIONE RAID RICHIESTA.\nT640 Tower Prestazionale\n\",\"ATTENZIONE COMPILARE IL CAMPO DELLA SCELTA RAID\", \"\")","v":"ATTENZIONE COMPILARE IL CAMPO DELLA SCELTA RAID"}]
[null,"Configurazione RAID HDD 1TB"]
[null,"",1,null,{"$f":"VLOOKUP($B$93,  RAID_C2, 2, FALSE)","v":""}]
[null,"Hot Spare for 1TB HDD","No"]
[]
[null,"Impostazioni del BIOS per la gestione dell'alimentazione"]
[null,"Performance BIOS Setting",1,null,"[384-BBBL]"]
[]
[null,"Raffreddamento"]
[null,"Fresh Air Cooling",1,null,"[384-BBDW]"]
[]
[null,"Alimentatore"]
[null,"Dual, Hot-plug, Redundant Power Supply (1+1), 750W, Titanium, 200-240VAC",1,null,"[450-ADWT]"]
[]
[null,"Cavi di alimentazione"]
[null,"Italian Spare Power Cord 220V",2,null,"[450-AAYN]"]
[]
[null,"TPM Module"]
[null,"Trusted Platform Module 1.2",1,null,"[461-AAEL]"]
[]
[null,"Embedded Systems Management"]
[null,"iDRAC9,Enterprise",1,null,"[385-BBKT]"]
[]
[null,"Adattatore di rete aggiuntivo"]
[null,"On-Board LOM 1GBE (Dual Port for Towers, Quad Port for Racks and Blades)",1,null,"[542-BBCT]"]
[]
[null,"Broadcom 5720 DP 1Gb Network Interface Card",1,null,"[540-BBCX]"]
[]
[null,"Modulo Doppia SD"]
[null,"None ",{"$f":"VLOOKUP($B$120,upsell_1, 2, FALSE)","v":0},{"$f":"VLOOKUP($B$120,upsell_1, 3, FALSE)","v":""},{"$f":"VLOOKUP($B$120,upsell_1, 4, FALSE)","v":""},{"$f":"VLOOKUP($B$120,upsell_1, 7, FALSE)","v":0}]
[]
[null,"Additional Card for PCIe Slot 1 (CPU 1)"]
[null,"Broadcom 5720 DP 1Gb Network Interface Card",1,null,"[540-BBCX]"]
[null,"None",{"$f":"VLOOKUP(B124,  PCI_B1.1, 2, FALSE)","v":""},{"$f":"VLOOKUP(B124,  PCI_B1.1, 3, FALSE)","v":""},{"$f":"VLOOKUP(B124,  PCI_B1.1, 5, FALSE)","v":""},{"$f":"VLOOKUP(B124,  PCI_B1.1, 6, FALSE)","v":""},{"$f":"VLOOKUP(B124,  PCI_B1.1, 7, FALSE)","v":0}]
[]
[null,"Additional Card for PCIe Slot 2 (CPU 1)"]
[null,"None",{"$f":"VLOOKUP(B127,  PCI_B1.1, 2, FALSE)","v":""},{"$f":"VLOOKUP(B127,  PCI_B1.1, 3, FALSE)","v":""},{"$f":"VLOOKUP(B127,  PCI_B1.1, 5, FALSE)","v":""},{"$f":"VLOOKUP(B127,  PCI_B1.1, 6, FALSE)","v":""},{"$f":"VLOOKUP(B127,  PCI_B1.1, 7, FALSE)","v":0}]
[]
[null,"Additional Card for PCIe Slot 3 (CPU 1)"]
[null,"None",{"$f":"VLOOKUP(B130,  PCI_B1.1, 2, FALSE)","v":""},{"$f":"VLOOKUP(B130,  PCI_B1.1, 3, FALSE)","v":""},{"$f":"VLOOKUP(B130,  PCI_B1.1, 5, FALSE)","v":""},{"$f":"VLOOKUP(B130,  PCI_B1.1, 6, FALSE)","v":""},{"$f":"VLOOKUP(B130,  PCI_B1.1, 7, FALSE)","v":0}]
[]
[null,"Additional Card for PCIe Slot 4 (CPU 2)"]
[null,"None",{"$f":"IF($B133=Processor!$A$46,\"\",VLOOKUP($B133,  PCI_B1.1, 2, FALSE))","v":""},{"$f":"IF($B133=Processor!$A$46,\"\",VLOOKUP($B133,  PCI_B1.1, 3, FALSE))","v":""},{"$f":"IF($B133=Processor!$A$46,\"\",VLOOKUP($B133,  PCI_B1.1, 5, FALSE))","v":""},{"$f":"IF($B133=Processor!$A$46,\"\",VLOOKUP($B133,  PCI_B1.1, 6, FALSE))","v":""},{"$f":"IF($B133=Processor!$A$46,\"\",VLOOKUP($B133,  PCI_B1.1, 7, FALSE))","v":0}]
[]
[null,"Additional Card for PCIe Slot 5 (CPU 2)"]
[null,"None",{"$f":"IF($B136=Processor!$A$46,\"\",VLOOKUP($B136,  PCI_B1.1, 2, FALSE))","v":""},{"$f":"IF($B136=Processor!$A$46,\"\",VLOOKUP($B136,  PCI_B1.1, 3, FALSE))","v":""},{"$f":"IF($B136=Processor!$A$46,\"\",VLOOKUP($B136,  PCI_B1.1, 5, FALSE))","v":""},{"$f":"IF($B136=Processor!$A$46,\"\",VLOOKUP($B136,  PCI_B1.1, 6, FALSE))","v":""},{"$f":"IF($B136=Processor!$A$46,\"\",VLOOKUP($B136,  PCI_B1.1, 7, FALSE))","v":0}]
[]
[null,"Additional Card for PCIe Slot 6 (CPU 2)"]
[null,"None",{"$f":"IF($B139=Processor!$A$46,\"\",VLOOKUP($B139,  PCI_B1.1, 2, FALSE))","v":""},{"$f":"IF($B139=Processor!$A$46,\"\",VLOOKUP($B139,  PCI_B1.1, 3, FALSE))","v":""},{"$f":"IF($B139=Processor!$A$46,\"\",VLOOKUP($B139,  PCI_B1.1, 5, FALSE))","v":""},{"$f":"IF($B139=Processor!$A$46,\"\",VLOOKUP($B139,  PCI_B1.1, 6, FALSE))","v":""},{"$f":"IF($B139=Processor!$A$46,\"\",VLOOKUP($B139,  PCI_B1.1, 7, FALSE))","v":0}]
[]
[null,"Additional Card for PCIe Slot 7 (CPU 2)"]
[null,"None",{"$f":"IF($B142=Processor!$A$46,\"\",VLOOKUP($B142,  PCI_B1.1, 2, FALSE))","v":""},{"$f":"IF($B142=Processor!$A$46,\"\",VLOOKUP($B142,  PCI_B1.1, 3, FALSE))","v":""},{"$f":"IF($B142=Processor!$A$46,\"\",VLOOKUP($B142,  PCI_B1.1, 5, FALSE))","v":""},{"$f":"IF($B142=Processor!$A$46,\"\",VLOOKUP($B142,  PCI_B1.1, 6, FALSE))","v":""},{"$f":"IF($B142=Processor!$A$46,\"\",VLOOKUP($B142,  PCI_B1.1, 7, FALSE))","v":0}]
[]
[null,"Pannello frontale"]
[null,"No Bezel",1,null,"[350-BBBW]"]
[]
[null,"Guide per rack"]
[null,"No Rack Rails, No Cable Management Arm, No Casters",1,null,"[770-BBCR]"]
[]
[null,"Unità ottica interna"]
[null,"No Internal Optical Drive",1,null,"[429-AAIQ][429-AAQS]"]
[]
[null,"Accessori per server"]
[null,"Redundant Fan Option",1,null,"[750-AAFF]"]
[]
[null,"PowerEdge SFP+, 10GbE SR/SX, Optical Tranceiver, LC Connector, for Intel and Broadcom,CusKit",{"$f":"(VLOOKUP(B127,PCI_C2,8,FALSE))+((VLOOKUP(B124,PCI_C1,8,FALSE)))+((VLOOKUP(B130,PCI_C3,8,FALSE)))+((VLOOKUP(B133,PCI_C4,8,FALSE)))+((VLOOKUP(B136,PCI_C5,8,FALSE)))+((VLOOKUP(B139,PCI_C6,8,FALSE)))","v":{"$error":"#VALUE!"}},null,"[407-BBQE]"]
[]
[null,"Opzione RDX"]
[null,"None",{"$f":"VLOOKUP($B$159,RDX, 2, FALSE)","v":0},{"$f":"VLOOKUP($B$159,RDX, 3, FALSE)","v":""},{"$f":"VLOOKUP($B$159,RDX, 4, FALSE)","v":""},{"$f":"VLOOKUP($B$159,RDX, 7, FALSE)","v":0}]
[]
[null,"System Documentation"]
[null,"Electronic System Documentation and OpenManage DVD Kit, PowerEdge T630",1,null,"[343-BBDE]"]
[]
[null,"SHIPPING"]
[null,"PowerEdge T630 Shipping EMEA1 (English/French/German/Spanish/Russian/Hebrew)",1,null,"[340-AMBT]"]
[]
[null,"Order Information"]
[null,"Enterprise Order - EMEA",1,null,"[800-11671]"]
[]
[null,"Base warranty"]
[null,"3Yr Basic Warranty - Next Business Day - Minimum Warranty",1,null,"[709-12798][709-12799]"]
[]
[null,"Servizi di assitenza"]
[null,"Dell Channel Order - Service Info only",1,null,"[710-31085]"]
[]
[null,"Aggiornamenti della garanzia"]
[null,"None",{"$f":"VLOOKUP($B$177,  SO_C1, 2, FALSE)","v":""},{"$f":"VLOOKUP($B$177,  SO_C1, 3, FALSE)","v":""},{"$f":"VLOOKUP($B$177,  SO_C1, 5, FALSE)","v":""},{"$f":"VLOOKUP($B$177,  SO_C1, 6, FALSE)","v":""}]
[]
[null,"Protezione dei dati - Keep Your Hard Drive "]
[null,"None",{"$f":"VLOOKUP($B$180,  SO_C2, 2, FALSE)","v":""},{"$f":"VLOOKUP($B$180,  SO_C2, 3, FALSE)","v":""},{"$f":"VLOOKUP($B$180,  SO_C2,5, FALSE)","v":""},{"$f":"VLOOKUP($B$180,  SO_C2, 6, FALSE)","v":""}]
[]
[null,"Servizi di Installazione"]
[null,"No Installation Service Selected",1,null,"[683-11870]"]
[]
[null,"Channel only - Support Extension"]
[null,"Channel 39M Basic Warranty - Next Business Day",1,null,"[723-28783]"]
[]
[null,"Warranty Upgrades - Non-Std/Local POS"]
[null,"CSTM CONSIP - 39M Onsite Labor Support for CRU for Servers with Basic Warranty",1,null,"[681-24467]"]

{"sheet":"CNV T640 (Rack)","index":5,"n_rows":187,"n_cols":8,"rows_kept":187,"cut":false,"hidden":false,"merged":[[128,1,128,4],[110,1,110,4],[114,2,114,4],[164,2,164,4],[146,1,146,4],[147,2,147,4],[149,1,149,4],[157,1,157,4],[158,2,158,4],[160,1,160,4],[161,2,161,4],[163,1,163,4],[150,2,150,4],[152,1,152,4],[153,2,153,4],[116,1,116,4],[181,1,181,4],[182,2,182,4],[184,1,184,4],[170,2,170,4],[117,2,117,4],[119,1,119,4],[125,1,125,4],[126,2,126,4],[144,2,144,4],[143,1,143,4],[137,1,137,4],[138,2,138,4],[140,1,140,4],[141,2,141,4],[129,2,129,4],[131,1,131,4],[185,2,185,4],[172,1,172,4],[173,2,173,4],[187,1,187,4],[102,2,102,4],[104,1,104,4],[132,2,132,4],[134,1,134,4],[135,2,135,4],[175,1,175,4],[176,2,176,4],[178,1,178,4],[179,2,179,4],[166,1,166,4],[167,2,167,4],[169,1,169,4],[120,2,120,4],[98,1,98,4],[99,2,99,4],[101,1,101,4],[105,2,105,4],[107,1,107,4],[108,2,108,4],[113,1,113,4],[95,2,95,4],[55,2,55,4],[57,1,57,4],[58,2,58,4],[60,1,60,4],[62,1,62,4],[75,2,75,4],[77,1,77,4],[78,2,78,4],[90,1,90,4],[91,2,91,4],[65,1,65,4],[94,1,94,3],[74,1,74,4],[41,2,41,4],[43,1,43,4],[44,2,44,4],[50,1,50,4],[51,2,51,4],[31,2,31,4],[34,1,34,4],[35,2,35,4],[37,1,37,4],[40,1,40,4],[122,1,122,4],[123,2,123,4],[94,7,95,8],[28,2,28,4],[4,0,4,4],[10,0,10,4],[11,0,12,5],[13,0,13,5],[19,2,19,4],[21,1,21,4],[22,2,22,4],[24,1,24,4],[25,2,25,4],[27,1,27,4],[54,1,54,4],[30,1,30,4]]}
[null,null,null,"TOTALE MEPA",null,null,null,{"$f":"F10","v":0}]
[]
[]
[]
["POWEREDGE T640"]
[]
[null,null,null,null,"Totale Server e Opzioni",{"$f":"F18*SRV_C","v":0}]
[null,null,null,null,"Totale Ulteriori Opzioni ",{"$f":"G17*SRV_C-(G74*SRV_C)+G74-(SRV_C*G71)+G71","v":0}]
[]
[null,null,null,null,"TOTALE CONVENZIONE",{"$f":"F8+F7","v":0}]
[]
["Components: \nServer DELL EMC PowerEdge T640 (1CPU Intel® Xeon Silver 4114, RAM 32GB,2 x HDD 600GB 10K RPM SAS 12Gbps 2.5in)"]
[]
[]
[]
[null,"Category: Server",null,null,null,1720]
[null,"Quantity: ",null,null,null,{"$f":"SUM(F21:F185)","v":0},{"$f":"SUM(G21:G185)","v":0}]
[null,null,null,null,null,{"$f":"SUM(F16:F17)","v":1720}]
[]
[null,"Base"]
[null,"PowerEdge T640 Rack ",1,null,"[329-BDMT]"]
[]
[null,"Configurazione dello chassis"]
[null,"Chassis with up to 16, 2.5\" Hard Drives, Rack Configuration",1,null,"[321-BCXL]"]
[]
[null,"Processore"]
[null,"Intel® Xeon® Silver 4114 2.2G, 10C/20T, 9.6GT/s 2UPI, 14M Cache, Turbo, HT\n(85W) DDR4-2400",1,null,"[338-BLUS]"]
[]
[null,"Processore aggiuntivo"]
[null,"No Additional Processor",{"$f":"VLOOKUP($B$30, CPU_C, 2, FALSE)","v":0},{"$f":"VLOOKUP($B$30, CPU_C, 3, FALSE)","v":""},{"$f":"VLOOKUP($B$30, CPU_C, 5, FALSE)","v":"[374-BBBX]"},{"$f":"VLOOKUP(B30, CPU_C, 15, FALSE)","v":0}]
[]
[null,"Processor Thermal Configuration"]
[null,"Standard Heat Sink for Less = 150W",1,null,"[412-AAJW]"]
[null,{"$f":"VLOOKUP($B$30, CPU_C, 6, FALSE)","v":""},{"$f":"VLOOKUP($B$30, CPU_C, 7, FALSE)","v":""},null,{"$f":"VLOOKUP($B$30, CPU_C, 8, FALSE)","v":""}]
[]
[null,"Tipo di configurazione memoria"]
[null,"Performance Optimized",1,null,"[370-AAIP]"]
[]
[null,"Total Memory in GB",{"$f":"IF(F30=728,IF(B40=32,\"ATTENZIONE: AUMENTARE LA RAM\",\"\"),\"\")","v":""}]
[null,32]
[]
[null,"Tipo e velocità della memoria DIMM"]
[null,"2400MT/s RDIMMs",1,null,"[370-ACPH]"]
[]
[null,"Capacità di memoria"]
[null,{"$f":"IF($B$30=\"No Additional Processor\",VLOOKUP($B$40, MEM_A1, 8, FALSE),VLOOKUP($B$40, MEM_A2, 8, FALSE))","v":"Dell 32 GB Modulo di memoria - RDIMM 2666MHz"},{"$f":"IF($B$30=\"No Additional Processor\",VLOOKUP($B$40, MEM_A1, 9, FALSE),VLOOKUP($B$40, MEM_A2, 9, FALSE))","v":1},null,{"$f":"IF($B$30=\"No Additional Processor\",VLOOKUP($B$40, MEM_A1, 10, FALSE),VLOOKUP($B$40, MEM_A2, 10, FALSE))","v":"[370-ADNF]"}]
[]
[null,{"$f":"IF($B$30=\"No Additional Processor\",VLOOKUP($B$40, MEM_A1, 2, FALSE),VLOOKUP($B$40, MEM_A2, 2, FALSE))","v":""},{"$f":"IF($B$30=\"No Additional Processor\",VLOOKUP($B$40, MEM_A1, 3, FALSE),VLOOKUP($B$40, MEM_A2, 3, FALSE))","v":""},{"$f":"IF($B$30=\"No Additional Processor\",VLOOKUP($B$40, MEM_A1, 4, FALSE),VLOOKUP($B$40, MEM_A2, 4, FALSE))","v":""},{"$f":"IF($B$30=\"No Additional Processor\",VLOOKUP($B$40, MEM_A1, 6, FALSE),VLOOKUP($B$40, MEM_A2, 6, FALSE))","v":""},{"$f":"IF($B$30=\"No Additional Processor\",VLOOKUP($B$40, MEM_A1, 7, FALSE),VLOOKUP($B$40, MEM_A2, 7, FALSE))","v":""}]
[]
[null,{"$f":"IF($B$30=\"No Additional Processor\",VLOOKUP($B$40, MEM_A1, 11, FALSE),VLOOKUP($B$40, MEM_A2, 11, FALSE))","v":""},{"$f":"IF($B$30=\"No Additional Processor\",VLOOKUP($B$40, MEM_A1, 12, FALSE),VLOOKUP($B$40, MEM_A2, 12, FALSE))","v":""},{"$f":"IF($B$30=\"No Additional Processor\",VLOOKUP($B$40, MEM_A1, 13, FALSE),VLOOKUP($B$40, MEM_A2, 13, FALSE))","v":""},{"$f":"IF($B$30=\"No Additional Processor\",VLOOKUP($B$40, MEM_A1, 15, FALSE),VLOOKUP($B$40, MEM_A2, 15, FALSE))","v":""},{"$f":"IF($B$30=\"No Additional Processor\",VLOOKUP($B$40, MEM_A1, 16, FALSE),VLOOKUP($B$40, MEM_A2, 16, FALSE))","v":""}]
[]
[null,"Sistema operativo preinstallato"]
[null,"No Operating System",{"$f":"VLOOKUP($B$53, OS_A, 2, FALSE)","v":""},{"$f":"VLOOKUP($B$53, OS_A, 3, FALSE)","v":""},{"$f":"VLOOKUP($B$53, OS_A, 5, FALSE)","v":"[611-BBBF]"},{"$f":"VLOOKUP($B$53, OS_A, 6, FALSE)","v":""}]
[null,{"$f":"IF($B$30=\"No Additional Processor\",VLOOKUP($B$53, OS_A, 20, FALSE),VLOOKUP($B$53, OS_A2, 20, FALSE))","v":""},{"$f":"IF($B$30=\"No Additional Processor\",VLOOKUP($B$53, OS_A, 21, FALSE),VLOOKUP($B$53, OS_A2, 21, FALSE))","v":0},{"$f":"IF($B$30=\"No Additional Processor\",VLOOKUP($B$53, OS_A, 22, FALSE),VLOOKUP($B$53, OS_A2, 22, FALSE))","v":""},{"$f":"IF($B$30=\"No Additional Processor\",VLOOKUP($B$53, OS_A, 24, FALSE),VLOOKUP($B$53, OS_A2, 24, FALSE))","v":""},{"$f":"IF($B$30=\"No Additional Processor\",VLOOKUP($B$53, OS_A, 25, FALSE),VLOOKUP($B$53, OS_A2, 25, FALSE))","v":""}]
[]
[null,"OS Media Kits"]
[null,"No Media Required",1,null,"[605-BBFN]"]
[]
[null,"Client Access Licenses"]
[null,{"$f":"VLOOKUP($B$53, OS_A, 8, FALSE)","v":"None"},null,{"$f":"VLOOKUP($B$53, OS_A, 10, FALSE)","v":""},{"$f":"VLOOKUP($B$53, OS_A, 12, FALSE)","v":""},{"$f":"VLOOKUP($B$53, OS_A, 13, FALSE)*C60","v":0}]
[]
[null,{"$f":"VLOOKUP($B$53, OS_A, 14, FALSE)","v":"None"},null,{"$f":"VLOOKUP($B$53, OS_A, 16, FALSE)","v":""},{"$f":"VLOOKUP($B$53, OS_A, 18, FALSE)","v":""},{"$f":"VLOOKUP($B$53, OS_A, 19, FALSE)*C62","v":0}]
[]
[null,"Sistema operativo SUSE Linux Enterprise Server"]
[null,"None\n",{"$f":"VLOOKUP($B$65,SUSE, 2, FALSE)","v":0},{"$f":"VLOOKUP($B$65,SUSE, 3, FALSE)","v":""},{"$f":"VLOOKUP($B$65,SUSE, 5, FALSE)","v":""},null,{"$f":"VLOOKUP($B$65, SUSE, 6, FALSE)*C65","v":0}]
[]
[null,"Sistema operativo VMware"]
[null,"None",{"$f":"VLOOKUP($B$68,VMWARE, 2, FALSE)+C30","v":0},{"$f":"VLOOKUP($B$68,VMWARE, 3, FALSE)","v":""},{"$f":"VLOOKUP($B$68,VMWARE, 5, FALSE)","v":""},null,{"$f":"VLOOKUP($B$68, VMWARE, 6, FALSE)*C68","v":0}]
[]
[null,"VMware vCenter Server Standard"]
[null,"None",{"$f":"VLOOKUP($B$71,VMWARE2, 2, FALSE)","v":0},{"$f":"VLOOKUP($B$71,VMWARE2, 3, FALSE)","v":""},{"$f":"VLOOKUP($B$71,VMWARE2, 5, FALSE)","v":""},null,{"$f":"VLOOKUP($B$71, VMWARE2, 6, FALSE)*C71","v":0}]
[]
[null,"Essentials Plus Kit"]
[null,"None",{"$f":"IF(SRV_A<4,VLOOKUP($B$74,VMWARE1, 2, FALSE),0)","v":0},{"$f":"VLOOKUP($B$74,VMWARE1, 3, FALSE)","v":""},{"$f":"VLOOKUP($B$74,VMWARE1, 5, FALSE)","v":""},null,{"$f":"VLOOKUP($B$74, VMWARE1, 6, FALSE)*C74","v":0}]
[]
[null,"Controller RAID"]
[null,"PERC H730P+ Adapter RAID Controller, 2GB",1,null,"[405-AANW]"]
[]
[null,"Dischi rigidi (numero massimo totale 16)"]
[null,"600GB 10K RPM SAS 12Gbps 512n 2.5in Hot-plug Hard Drive",2,null,"[400-AOWP]"]
[]
[null,"600GB 10K RPM SAS 12Gbps 512n 2.5in Hot-plug Hard Drive",null,{"$f":"VLOOKUP($B$82, HDD_C,3, FALSE)","v":"CNV-TS1L1-HD600R"},{"$f":"VLOOKUP($B$82, HDD_C,5, FALSE)","v":"400-AUWU"},{"$f":"VLOOKUP($B$82, HDD_C,6, FALSE)*HD300_C","v":0}]
[]
[null,"1.2TB 10K RPM SAS 12Gbps 512n 2.5in Hot-plug Hard Drive",null,{"$f":"VLOOKUP($B$84, HDD_C,3, FALSE)","v":"CNV-TS1L1-HD1200R"},{"$f":"VLOOKUP($B$84, HDD_C,5, FALSE)","v":"400-AOWP"},{"$f":"VLOOKUP($B$84, HDD_C,6, FALSE)*HD1000_c","v":0}]
[]
[null,"1.8TB 10K RPM SAS 12Gbps 512e 2.5in Hot-plug Hard Drive",null,"CNV-TS1L1-HD1800","[400-AJQP]",{"$f":"VLOOKUP($B$86, HDD_B,6, FALSE)*C86","v":0}]
[null,"960GB SSD SAS Mix Use 12Gbps 512n 2.5in Hot-plug Drive,\nPX05SV,3 DWPD,5256 TBW",null,"CNV-TS1L1-SSD800","[400-ANNX]",{"$f":"VLOOKUP($B$87, HDD_B,6, FALSE)*C87","v":0}]
[null,"1.92TB SSD SAS Mix Use 12Gbps 512n 2.5in Hot-plug Drive,\nPX05SV,3 DWPD,10512 TBW",null,"CNV-TS1L1-SSD1920","[400-ANMN]",{"$f":"VLOOKUP($B$88, HDD_B,6, FALSE)*C88","v":0}]
[]
[null,"DISCHI TOTALI",{"$f":"SUM(C80:C89)","v":2},{"$f":"IF(C90<=16,\"      OK\",\"     ERRORE:   Totale n° di dischi superiore al consentito\")","v":"      OK"}]
[]
[null,"Configurazione RAID"]
[null,"C3 - RAID 1 for H330 (2 HDDs)",1,null,{"$f":"VLOOKUP($B$93,  RAID_C1, 2, FALSE)","v":"[780-BBJK]"}]
[null,"Hot Spare for 300GB HDD","No"]
[null,"SCRIVERE QUI' LA CONFIGURAZIONE RAID RICHIESTA.\nT640 Rack Base Alternativo\n",null,null,null,null,null,{"$f":"IF(B95=\"SCRIVERE QUI' LA CONFIGURAZIONE RAID RICHIESTA.\nT640 Rack Base Alternativo\n\",\"ATTENZIONE COMPILARE IL CAMPO DELLA SCELTA RAID\", \"\")","v":"ATTENZIONE COMPILARE IL CAMPO DELLA SCELTA RAID"}]
[null,"Configurazione RAID HDD 1TB"]
[null,"",1,null,{"$f":"VLOOKUP($B$97,  RAID_C2, 2, FALSE)","v":""}]
[null,"Hot Spare for 1TB HDD","No"]
[]
[null,"Impostazioni del BIOS per la gestione dell'alimentazione"]
[null,"Performance BIOS Setting",1,null,"[384-BBBL]"]
[]
[null,"Raffreddamento"]
[null,"Fresh Air Cooling",1,null,"[384-BBDW]"]
[]
[null,"Alimentatore"]
[null,"Dual, Hot-plug, Redundant Power Supply (1+1), 750W, Titanium, 200-240VAC",1,null,"[450-ADWT]"]
[]
[null,"Cavi di alimentazione"]
[null,"C13 to C14, PDU Style, 10 AMP, 6.5 Feet (2m), Power Cord",2,null,"[450-AADY]"]
[]
[null,"TPM Module"]
[null,"Trusted Platform Module 1.2",1,null,"[461-AAEL]"]
[]
[null,"Embedded Systems Management"]
[null,"iDrac9, Enterprise",1,null,"[385-BBHO]"]
[]
[null,"Modulo Doppia SD"]
[null,"None ",{"$f":"VLOOKUP($B$119,upsell_1, 2, FALSE)","v":0},{"$f":"VLOOKUP($B$119,upsell_1, 3, FALSE)","v":""},{"$f":"VLOOKUP($B$119,upsell_1, 4, FALSE)","v":""},{"$f":"VLOOKUP($B$119,upsell_1, 6, FALSE)","v":""},{"$f":"VLOOKUP($B$119,upsell_1, 7, FALSE)","v":0}]
[]
[null,"Adattatore di rete aggiuntivo"]
[null,"PE T640 On-Board LOM",1,null,"[542-BBCT]"]
[]
[null,"Additional Card for PCIe Slot 1 (CPU 1)"]
[null,"Broadcom 5720 DP 1Gb Network Interface Card",1,null,"[540-BBCX]"]
[]
[null,"Additional Card for PCIe Slot 2 (CPU 1)"]
[null,"None",{"$f":"VLOOKUP(B128,  PCI_B1.1, 2, FALSE)","v":""},{"$f":"VLOOKUP(B128,  PCI_B1.1, 3, FALSE)","v":""},{"$f":"VLOOKUP(B128,  PCI_B1.1, 5, FALSE)","v":""},{"$f":"VLOOKUP(B128,  PCI_B1.1, 6, FALSE)","v":""},{"$f":"VLOOKUP(B128,  PCI_B1.1, 7, FALSE)","v":0}]
[]
[null,"Additional Card for PCIe Slot 3 (CPU 1)"]
[null,"None",{"$f":"VLOOKUP(B131,  PCI_B1.1, 2, FALSE)","v":""},{"$f":"VLOOKUP(B131,  PCI_B1.1, 3, FALSE)","v":""},{"$f":"VLOOKUP(B131,  PCI_B1.1, 5, FALSE)","v":""},{"$f":"VLOOKUP(B131,  PCI_B1.1, 6, FALSE)","v":""},{"$f":"VLOOKUP(B131,  PCI_B1.1, 7, FALSE)","v":0}]
[]
[null,"Additional Card for PCIe Slot 4 (CPU 2)"]
[null,"Aggiungere Secondo Processore",{"$f":"IF($B134=Processor!$A$46,\"\",VLOOKUP($B134,  PCI_B1.1, 2, FALSE))","v":""},{"$f":"IF($B134=Processor!$A$46,\"\",VLOOKUP($B134,  PCI_B1.1, 3, FALSE))","v":""},{"$f":"IF($B134=Processor!$A$46,\"\",VLOOKUP($B134,  PCI_B1.1, 5, FALSE))","v":""},{"$f":"IF($B134=Processor!$A$46,\"\",VLOOKUP($B134,  PCI_B1.1, 6, FALSE))","v":""},{"$f":"IF($B134=Processor!$A$46,\"\",VLOOKUP($B134,  PCI_B1.1, 7, FALSE))","v":""}]
[]
[null,"Additional Card for PCIe Slot 5 (CPU 2)"]
[null,"Aggiungere Secondo Processore",{"$f":"IF($B137=Processor!$A$46,\"\",VLOOKUP($B137,  PCI_B1.1, 2, FALSE))","v":""},{"$f":"IF($B137=Processor!$A$46,\"\",VLOOKUP($B137,  PCI_B1.1, 3, FALSE))","v":""},{"$f":"IF($B137=Processor!$A$46,\"\",VLOOKUP($B137,  PCI_B1.1, 5, FALSE))","v":""},{"$f":"IF($B137=Processor!$A$46,\"\",VLOOKUP($B137,  PCI_B1.1, 6, FALSE))","v":""},{"$f":"IF($B137=Processor!$A$46,\"\",VLOOKUP($B137,  PCI_B1.1, 7, FALSE))","v":""}]
[]
[null,"Additional Card for PCIe Slot 6 (CPU 2)"]
[null,"Aggiungere Secondo Processore",{"$f":"IF($B140=Processor!$A$46,\"\",VLOOKUP($B140,  PCI_B1.1, 2, FALSE))","v":""},{"$f":"IF($B140=Processor!$A$46,\"\",VLOOKUP($B140,  PCI_B1.1, 3, FALSE))","v":""},{"$f":"IF($B140=Processor!$A$46,\"\",VLOOKUP($B140,  PCI_B1.1, 5, FALSE))","v":""},{"$f":"IF($B140=Processor!$A$46,\"\",VLOOKUP($B140,  PCI_B1.1, 6, FALSE))","v":""},{"$f":"IF($B140=Processor!$A$46,\"\",VLOOKUP($B140,  PCI_B1.1, 7, FALSE))","v":""}]
[]
[null,"Additional Card for PCIe Slot 7 (CPU 2)"]
[null,"Aggiungere Secondo Processore",{"$f":"IF($B143=Processor!$A$46,\"\",VLOOKUP($B143,  PCI_B1.1, 2, FALSE))","v":""},{"$f":"IF($B143=Processor!$A$46,\"\",VLOOKUP($B143,  PCI_B1.1, 3, FALSE))","v":""},{"$f":"IF($B143=Processor!$A$46,\"\",VLOOKUP($B143,  PCI_B1.1, 5, FALSE))","v":""},{"$f":"IF($B143=Processor!$A$46,\"\",VLOOKUP($B143,  PCI_B1.1, 6, FALSE))","v":""},{"$f":"IF($B143=Processor!$A$46,\"\",VLOOKUP($B143,  PCI_B1.1, 7, FALSE))","v":""}]
[]
[null,"Pannello frontale"]
[null,"No Bezel",1,null,"[350-BBBW]"]
[]
[null,"Guide per rack"]
[null,"Ready Rails Sliding Rails",1,null,"[770-BBJI]"]
[]
[null,"Unità ottica interna"]
[null,"No Internal Optical Drive, 2.5in Chassis",1,null,"[429-ABDL]"]
[]
[null,"Accessori per server"]
[null,"4 Standard Mid Fans for T640",1,null,"[384-BBRY]"]
[]
[null,"PowerEdge SFP+, 10GbE SR/SX, Optical Tranceiver, LC Connector, for Intel and Broadcom,CusKit",{"$f":"(VLOOKUP(B131,PCI_C2,8,FALSE))+((VLOOKUP(B128,PCI_C1,8,FALSE)))+((VLOOKUP(B134,PCI_C3,8,FALSE)))+((VLOOKUP(B137,PCI_C4,8,FALSE)))+((VLOOKUP(B140,PCI_C5,8,FALSE)))+((VLOOKUP(B143,PCI_C6,8,FALSE)))","v":{"$error":"#VALUE!"}},null,"[407-BBQE]"]
[]
[null,"System Documentation"]
[null,"Electronic System Documentation and OpenManage DVD Kit, PowerEdge T630",1,null,"[343-BBDE]"]
[]
[null,"SHIPPING"]
[null,"PowerEdge T630 Shipping EMEA1 (English/French/German/Spanish/Russian/Hebrew)",1,null,"[340-AMBT]"]
[]
[null,"Order Information"]
[null,"Enterprise Order - EMEA",1,null,"[800-11671]"]
[]
[null,"Base warranty"]
[null,"3Yr Basic Warranty - Next Business Day - Minimum Warranty",1,null,"[709-12798][709-12799]"]
[]
[null,"Servizi di assitenza"]
[null,"Dell Channel Order - Service Info only",1,null,"[710-31085]"]
[]
[null,"Aggiornamenti della garanzia"]
[null,"None",{"$f":"VLOOKUP($B$175,  SO_C1, 2, FALSE)","v":""},{"$f":"VLOOKUP($B$175,  SO_C1, 3, FALSE)","v":""},{"$f":"VLOOKUP($B$175,  SO_C1, 5, FALSE)","v":""},{"$f":"VLOOKUP($B$175,  SO_C1, 6, FALSE)","v":""}]
[]
[null,"Protezione dei dati - Keep Your Hard Drive "]
[null,"None",{"$f":"VLOOKUP($B$178,  SO_C2, 2, FALSE)","v":""},{"$f":"VLOOKUP($B$178,  SO_C2, 3, FALSE)","v":""},{"$f":"VLOOKUP($B$178,  SO_C2,5, FALSE)","v":""},{"$f":"VLOOKUP($B$178,  SO_C2, 6, FALSE)","v":""}]
[]
[null,"Servizi di Installazione"]
[null,"No Installation Service Selected",1,null,"[683-11870]"]
[]
[null,"Channel only - Support Extension"]
[null,"Channel 39M Basic Warranty - Next Business Day",1,null,"[723-28783]"]
[]
[null,"Warranty Upgrades - Non-Std/Local POS"]
[null,"CSTM CONSIP - 39M Onsite Labor Support for CRU for Servers with Basic Warranty",1,null,"[681-24467]"]

{"sheet":"RACK, Accessori e Servizi","index":6,"n_rows":83,"n_cols":17,"rows_kept":83,"cut":false,"hidden":false,"merged":[[0,0,0,22],[1,3,1,8],[15,4,15,7],[24,4,24,7],[27,4,27,7],[12,13,30,17],[5,2,5,7],[7,2,7,7],[9,2,9,7],[12,12,30,12],[3,12,10,12],[10,4,10,7],[54,2,54,6],[14,2,14,7],[29,2,29,7],[23,2,23,7],[26,2,26,7],[30,4,30,7],[17,2,17,7],[18,4,18,7],[20,2,20,7],[74,2,74,7],[78,2,78,7],[82,2,82,7],[73,2,73,4],[72,12,83,12]]}
["IN ROSSO LE OPZIONI 20%"]
[null,null,null,"Indicare il numero delle Opzioni"]
[]
[null,null,null,null,null,null,null,null,null,null,null,null,"SERVIZI"]
[null,null,{"$f":"IF(SRV_A+SRV_B+SRV_C>=1,\"Servizi Specialistici\",\"\")","v":""}]
[null,null,{"$f":"IF(SRV_A+SRV_B+SRV_C>=1,\"Servizio Specialistico di System and Network Management per sistema opertivo Windows, erogato on site. (GG/Uomo)\",\"\")","v":""},null,null,null,null,null,null,null,{"$f":"IF(J6>=1,\"10L1-SO-WIN\",\"\")","v":""}]
[]
[null,null,{"$f":"IF(SRV_A+SRV_B+SRV_C>=1,\"Servizio Specialistico di System and Network Management per sistema opertivo Linux, erogato on site. (GG/Uomo)\",\"\")","v":""},null,null,null,null,null,null,null,{"$f":"IF(J8>=1,\"10L1-SO-LINUX\",\"\")","v":""}]
[]
[null,null,{"$f":"IF((SRV_A+SRV_AA+SRV_AAA+SRV_B+SRV_BB+SRV_BBB+SRV_C)>=5,\"Servizi specialistici sistemistici per aggiornare e prevenire malfunzionamenti. \n(Minimo 5 Server)\",\"\")","v":""},null,null,null,null,null,null,null,{"$f":"IF(J10>=1,\"10L1-SO-PREV\",\"\")","v":""}]
[]
[]
[null,null,null,null,null,null,null,null,null,null,null,null,"SERVER RACK"]
[null,null,{"$f":"IF(SRV_A+SRV_B1.1+SRV_B+SRV_C>=1,\"Rack (OpzRack)\",\"\")","v":""}]
[null,null,{"$f":"IF(SRV_A+SRV_B1.1+SRV_B+SRV_C>=1,\"Tecnosteel: armadio Rack 19'' 42U\",\"\")","v":""},null,null,null,null,null,null,null,{"$f":"IF(J15>=1,\"CNV-TS1L1-RACK\",\"\")","v":""}]
[]
[null,null,{"$f":"IF(SRV_A+SRV_B1.1+SRV_B+SRV_C>=1,\"PDU (OpzPDU32A)\",\"\")","v":""}]
[null,null,{"$f":"IF(SRV_A+SRV_B1.1+SRV_B+SRV_C>=1,\"PDU Vertical 20+4 outlets C13 with MCB - IEC60309 input\",\"\")","v":""},null,null,null,null,null,null,null,{"$f":"IF(J18>=1,\"CNV-LG-646861\",\"\")","v":""}]
[]
[null,null,{"$f":"IF(SRV_A+SRV_B1.1+SRV_B+SRV_C>=1,\"PDU (OpzPDU_TRIFASE)\",\"\")","v":""}]
[null,null,{"$f":"IF(SRV_A+SRV_B1.1+SRV_B+SRV_C>=1,\"PDU Vertical  18+6 outlets (C13+C19)  with MCB and ammeter - IEC60309 input - 3 phase\",\"\")","v":""},null,null,null,null,null,null,null,{"$f":"IF(J21>=1,\"CNV-LG-646875\",\"\")","v":""}]
[]
[null,null,{"$f":"IF(SRV_A+SRV_B1.1+SRV_B+SRV_C>=1,\"KVM (OpzGUIRack)\",\"\")","v":""}]
[null,null,{"$f":"IF(SRV_A+SRV_B1.1+SRV_B+SRV_C>=1,\"ORCA: 1U Rackmount Console 17'' with Italian Keyboard\",\"\")","v":""},null,null,null,null,null,null,null,{"$f":"IF(J24>=1,\"CNV-TS1L1-GUI\",\"\")","v":""}]
[]
[null,null,{"$f":"IF(SRV_A+SRV_B1.1+SRV_B+SRV_C>=1,\"KVM Option (OpzSWGUIRack)\",\"\")","v":""}]
[null,null,{"$f":"IF(SRV_A+SRV_B1.1+SRV_B+SRV_C>=1,\"Raritan: 16-port remote KVM switch with one remote user\",\"\")","v":""},null,null,null,null,null,null,null,{"$f":"IF(J27>=1,\"CNV-TS1L1-KVMIP\",\"\")","v":""}]
[]
[null,null,{"$f":"IF(SRV_A+SRV_B1.1+SRV_B+SRV_C>=1,\"Uninterrupted Power Supply (OpzUPS 3000VA)\",\"\")","v":""}]
[null,null,{"$f":"IF(SRV_A+SRV_B1.1+SRV_B+SRV_C>=1,\"Riello - UPS MSR3000EVO 3000VA 2U Rackmount (SNMP+USB+RS232)\",\"\")","v":""},null,null,null,null,null,null,null,{"$f":"IF(J30>=1,\"CNV-TS1L1-UPS\",\"\")","v":""}]
[]
[]
[null,null,null,"Totale-"]
[null,null,null,"RACK A","RACK B","RACK C","RACK D","RACK E","RACK F","RACK G","RACK H","RACK I","RACK J"]
[null,null,{"$f":"J15","v":0},{"$f":"IF(H55>0,IF(C35-H55=0,0,C35-H55),0)","v":0},{"$f":"IF(I55>0,IF(D35-I55=0,0,D35-I55),0)","v":0},0,0,0,0,0,0,0,0]
[]
[]
[null,null,null,"Server Modello 1",null,null,{"$f":"SRV_A","v":0}]
[null,null,null,"Server Modello 2",null,null,{"$f":"SRV_AA","v":0}]
[null,null,null,"Server Modello 3",null,null,{"$f":"SRV_AAA","v":0}]
[null,null,null,"Server Modello 4",null,null,{"$f":"SRV_B","v":0}]
[null,null,null,"Server Modello 5",null,null,{"$f":"SRV_BB","v":0}]
[null,null,null,"Server Modello 6",null,null,{"$f":"SRV_BBB","v":0}]
[]
[null,null,null,null,null,null,null,{"$f":"SUM(H5:H10)+H12+H87*2+H89*2","v":0},0,0,0,0,0,0,0,0,0]
[]
[]
[]
[]
[]
[]
[]
[null,null,"Rack ancora da configurare",null,null,{"$f":"J15-H55-I55-J55-K55-L55-M55-N55-O55-P55-Q55","v":0}]
[]
[null,null,"Indicare il numero di rack per questa configurazione"]
[]
[null,null,null,null,"Totali","da inserire",null,{"$f":"IF(C35>0,\"RACK A\",\"\")","v":""},{"$f":"IF(D35>0,\"RACK B\",\"\")","v":""},{"$f":"IF(E35>0,\"RACK C\",\"\")","v":""},{"$f":"IF(F35>0,\"RACK D\",\"\")","v":""},{"$f":"IF(G35>0,\"RACK E\",\"\")","v":""},{"$f":"IF(H35>0,\"RACK F\",\"\")","v":""},{"$f":"IF(I35>0,\"RACK G\",\"\")","v":""},{"$f":"IF(J35>0,\"RACK H\",\"\")","v":""},{"$f":"IF(K35>0,\"RACK I\",\"\")","v":""},{"$f":"IF(L35>0,\"RACK J\",\"\")","v":""}]
[]
[null,null,"Server Lotto1 R630 Conf.1",null,{"$f":"G38","v":0},{"$f":"(E59-(H59*$H$55)-(I59*$I$55)-(J59*$J$55)-(K59*$K$55)-(L59*$L$55)-(M59*$M$55)-(N59*$N$55)-(O59*$O$55)-(P59*$P$55)-(Q59*$Q$55))","v":0}]
[null,null,{"$f":"IF(G39>0,\"Server Lotto1 R630 Conf.2\",\"\")","v":""},null,0,0]
[null,null,{"$f":"IF(G40>0,\"Server Lotto1 R630 Conf.3\",\"\")","v":""},null,0,0]
[null,null,{"$f":"IF(G41>0,\"Server Lotto1 R730xd Conf.1\",\"\")","v":""},null,0,0]
[null,null,{"$f":"IF(G42>0,\"Server Lotto1 R730xd Conf.2\",\"\")","v":""},null,0,0]
[null,null,{"$f":"IF(G43>0,\"Server Lotto1 R730xd Conf.3\",\"\")","v":""},null,0,0]
[]
[null,null,{"$f":"IF(J24>0,\"OpzGUIRack Disponibili\",\" \")","v":" "},null,{"$f":"J24","v":0},{"$f":"J24-H66*H55-I66*I55-J66*J55-K66*K55-L66*L55-M66*M55-N66*N55-O66*O55-P66*P55-Q66*Q55","v":0}]
[]
[null,null,{"$f":"IF(J27>0,\"OpzSWGUIRack Disponibili\",\" \")","v":" "},null,{"$f":"J27","v":0},{"$f":"J27-H68*H55-I68*I55-J68*J55-K68*K55-L68*L55-M68*M55-N68*N55-O68*O55-P68*P55-Q68*Q55","v":0}]
[]
[null,null,{"$f":"IF(J30>0,\"OpzUPS 3000VA Disponibili\",\" \")","v":" "},null,{"$f":"J30","v":0},{"$f":"J30-H70*H55-I70*I55-J70*J55-K70*K55-L70*L55-M70*M55-N70*N55-O70*O55-P70*P55-Q70*Q55","v":0}]
[]
[]
[null,null,null,null,null,null,null,null,null,null,null,null,"SERVER TOWER"]
[null,null,{"$f":"IF((SRV_D+SRV_E)>=1,\"Uninterrupted Power Supply (UPS)\",\"\")","v":""}]
[null,null,{"$f":"IF((SRV_D+SRV_E)>=1,\"Riello - UPS MSR3000EVO 3000VA Tower (SNMP+USB+RS232)\",\"\")","v":""},null,null,null,null,null,null,null,{"$f":"IF(J75>=1,\"CNV-TS1L1-UPS-T\",\"\")","v":""}]
[]
[]
[null,null,{"$f":"IF((SRV_D+SRV_E)>=1,\"Keyboard Video Mouse\",\"\")","v":""}]
[null,null,{"$f":"IF((SRV_D+SRV_E)>=1,\"Dell: Kit Monitor 19'' + Mouse + Keyboard\",\"\")","v":""},null,null,null,null,null,null,null,{"$f":"IF(J79>=1,\"CNV-TS1L1-GUI-T\",\"\")","v":""}]
[]
[]
[null,null,{"$f":"IF(SRV_C>=1,\"RDX\",\"\")","v":""}]
[null,null,{"$f":"IF(SRV_C>=1,\"Unità di backup RDX (esterno) + 3 cartucce da 500GB\",\"\")","v":""},null,null,null,null,null,null,null,{"$f":"IF(J83>=1,\"10L1-RDX\",\"\")","v":""}]

{"sheet":"Riepilogo","index":7,"n_rows":511,"n_cols":58,"rows_kept":511,"cut":false,"hidden":false,"merged":[[227,16,227,19],[154,19,154,20],[253,2,253,5],[150,19,150,20],[151,2,151,5],[151,6,151,8],[151,9,151,16],[396,9,396,12],[387,16,387,19],[388,16,388,19],[389,16,389,19],[390,16,390,19],[391,16,391,19],[392,16,392,19],[393,16,393,19],[394,16,394,19],[395,16,395,19],[396,16,396,19],[309,16,309,19],[310,16,310,19],[311,16,311,19],[312,16,312,19],[313,16,313,19],[314,16,314,19],[315,16,315,19],[316,16,316,19],[317,16,317,19],[318,16,318,19],[309,9,309,12],[331,2,331,5],[332,2,332,5],[310,9,310,12],[226,2,226,5],[203,17,203,18],[203,19,203,20],[198,2,198,5],[198,6,198,8],[198,9,198,16],[221,9,221,12],[221,16,221,19],[223,2,223,5],[221,2,221,5],[202,17,202,18],[202,19,202,20],[191,2,191,5],[151,19,151,20],[152,19,152,20],[151,17,151,18],[152,2,152,5],[152,6,152,8],[152,9,152,16],[152,17,152,18],[226,16,226,19],[224,16,224,19],[196,6,196,8],[196,19,196,20],[224,9,224,12],[204,19,204,20],[219,2,219,5],[208,1,208,16],[208,17,208,20],[209,1,209,16],[209,17,209,20],[213,3,214,18],[113,17,113,18],[189,2,189,5],[193,17,193,18],[198,17,198,18],[198,19,198,20],[193,19,193,20],[194,2,194,5],[113,6,113,8],[113,9,113,16],[116,19,116,20],[105,17,105,18],[220,2,220,5],[105,19,105,20],[106,2,106,5],[106,6,106,8],[106,9,106,16],[106,17,106,18],[106,19,106,20],[107,2,107,5],[107,6,107,8],[107,9,107,16],[107,17,107,18],[107,19,107,20],[196,9,196,16],[196,17,196,18],[206,1,206,16],[206,17,206,20],[204,9,204,16],[204,17,204,18],[189,9,189,16],[189,17,189,18],[189,19,189,20],[81,9,81,16],[81,17,81,18],[81,19,81,20],[82,2,82,5],[82,6,82,8],[82,9,82,16],[82,17,82,18],[82,19,82,20],[83,2,83,5],[83,6,83,8],[83,9,83,16],[69,9,69,16],[69,17,69,18],[69,19,69,20],[70,2,70,5],[72,17,72,18],[72,19,72,20],[83,17,83,18],[83,19,83,20],[81,2,81,5],[81,6,81,8],[76,17,76,18],[76,19,76,20],[75,17,75,18],[78,2,78,5],[78,6,78,8],[76,6,76,8],[76,9,76,16],[40,9,40,16],[40,17,40,18],[40,19,40,20],[41,2,41,5],[41,6,41,8],[41,9,41,16],[41,17,41,18],[41,19,41,20],[79,2,79,5],[79,6,79,8],[79,9,79,16],[79,17,79,18],[79,19,79,20],[59,2,59,5],[59,6,59,8],[59,9,59,16],[59,17,59,18],[51,9,51,16],[51,17,51,18],[51,19,51,20],[60,2,60,5],[60,6,60,8],[60,9,60,16],[60,17,60,18],[74,1,74,20],[78,17,78,18],[62,17,62,18],[62,19,62,20],[73,6,73,8],[73,9,73,16],[62,6,62,8],[62,9,62,16],[86,9,86,16],[86,17,86,18],[86,19,86,20],[105,2,105,5],[105,6,105,8],[105,9,105,16],[101,6,101,8],[95,17,95,18],[95,19,95,20],[80,6,80,8],[80,9,80,16],[80,17,80,18],[80,19,80,20],[63,2,63,5],[63,6,63,8],[63,9,63,16],[63,17,63,18],[63,19,63,20],[73,19,73,20],[65,2,65,5],[65,6,65,8],[66,2,66,5],[66,6,66,8],[66,9,66,16],[66,17,66,18],[66,19,66,20],[78,19,78,20],[77,17,77,18],[70,6,70,8],[70,9,70,16],[70,17,70,18],[70,19,70,20],[405,16,405,19],[406,2,406,5],[406,9,406,12],[406,16,406,19],[407,2,407,5],[407,9,407,12],[407,16,407,19],[408,2,408,5],[408,9,408,12],[408,16,408,19],[409,2,409,5],[409,9,409,12],[409,16,409,19],[456,2,456,5],[457,2,457,5],[412,2,412,5],[413,2,413,5],[412,16,412,19],[413,16,413,19],[414,16,414,19],[416,15,416,17],[437,8,437,10],[414,2,414,5],[410,9,410,12],[411,9,411,12],[412,9,412,12],[413,9,413,12],[414,9,414,12],[444,2,444,5],[444,9,444,12],[454,2,454,5],[454,9,454,12],[404,16,404,19],[387,2,387,5],[388,2,388,5],[389,2,389,5],[390,2,390,5],[391,2,391,5],[392,2,392,5],[393,2,393,5],[388,9,388,12],[389,9,389,12],[390,9,390,12],[391,9,391,12],[392,9,392,12],[393,9,393,12],[394,9,394,12],[395,9,395,12],[399,9,399,12],[400,2,400,5],[397,9,397,12],[402,2,402,5],[402,9,402,12],[402,16,402,19],[395,2,395,5],[387,9,387,12],[398,16,398,19],[397,16,397,19],[400,9,400,12],[385,2,385,5],[386,16,386,19],[394,2,394,5],[403,2,403,5],[403,9,403,12],[403,16,403,19],[253,9,253,12],[253,16,253,19],[295,9,295,12],[363,2,363,5],[298,2,298,5],[308,16,308,19],[305,2,305,5],[305,9,305,12],[306,2,306,5],[306,9,306,12],[320,9,320,12],[320,16,320,19],[321,2,321,5],[311,9,311,12],[312,9,312,12],[298,9,298,12],[294,9,294,12],[258,9,258,12],[308,9,308,12],[254,9,254,12],[309,2,309,5],[310,2,310,5],[311,2,311,5],[312,2,312,5],[284,9,284,12],[289,2,289,5],[326,2,326,5],[383,2,383,5],[371,9,371,12],[323,2,323,5],[295,2,295,5],[363,9,363,12],[370,2,370,5],[250,16,250,19],[251,2,251,5],[251,9,251,12],[251,16,251,19],[252,2,252,5],[252,9,252,12],[252,16,252,19],[373,16,373,19],[375,16,375,19],[384,16,384,19],[371,16,371,19],[367,2,367,5],[367,9,367,12],[290,2,290,5],[291,2,291,5],[285,2,285,5],[285,9,285,12],[262,1,278,5],[302,2,302,5],[302,9,302,12],[293,9,293,12],[257,9,257,12],[315,2,315,5],[338,1,338,3],[384,9,384,12],[231,2,231,5],[233,2,233,5],[233,9,233,12],[249,16,249,19],[230,16,230,19],[231,16,231,19],[232,16,232,19],[234,16,234,19],[235,16,235,19],[236,16,236,19],[237,2,237,5],[238,2,238,5],[239,2,239,5],[240,2,240,5],[241,2,241,5],[325,2,325,5],[325,9,325,12],[325,16,325,19],[237,9,237,12],[238,9,238,12],[239,9,239,12],[240,9,240,12],[241,9,241,12],[246,2,246,5],[245,16,245,19],[242,9,242,12],[307,2,307,5],[307,9,307,12],[307,16,307,19],[323,16,323,19],[302,16,302,19],[303,2,303,5],[228,16,228,19],[224,2,224,5],[240,16,240,19],[241,16,241,19],[418,15,434,19],[340,1,356,5],[340,8,356,12],[340,15,356,19],[479,1,479,3],[479,8,479,10],[462,2,462,5],[463,2,463,5],[458,9,458,12],[366,2,366,5],[398,9,398,12],[247,2,247,5],[247,9,247,12],[247,16,247,19],[248,2,248,5],[248,9,248,12],[248,16,248,19],[249,2,249,5],[249,9,249,12],[250,2,250,5],[250,9,250,12],[324,2,324,5],[324,9,324,12],[324,16,324,19],[328,2,328,5],[326,9,326,12],[262,15,278,19],[322,16,322,19],[481,1,497,5],[481,8,497,12],[418,1,434,5],[418,8,434,12],[404,2,404,5],[404,9,404,12],[405,2,405,5],[405,9,405,12],[467,2,467,5],[467,9,467,12],[468,2,468,5],[468,9,468,12],[469,2,469,5],[469,9,469,12],[477,2,477,5],[473,9,473,12],[474,9,474,12],[475,9,475,12],[476,9,476,12],[477,9,477,12],[473,2,473,5],[474,2,474,5],[472,9,472,12],[446,9,446,12],[456,9,456,12],[439,2,439,5],[439,9,439,12],[416,1,416,3],[443,2,443,5],[443,9,443,12],[453,9,453,12],[445,2,445,5],[385,9,385,12],[262,8,278,12],[385,16,385,19],[363,16,363,19],[370,16,370,19],[328,9,328,12],[328,16,328,19],[329,16,329,19],[330,2,330,5],[330,9,330,12],[330,16,330,19],[331,9,331,12],[331,16,331,19],[338,8,338,10],[338,15,338,17],[319,2,319,5],[319,9,319,12],[327,2,327,5],[327,9,327,12],[323,9,323,12],[333,2,333,5],[334,2,334,5],[321,9,321,12],[321,16,321,19],[366,16,366,19],[319,16,319,19],[320,2,320,5],[362,2,362,5],[286,2,286,5],[286,9,286,12],[326,16,326,19],[327,16,327,19],[303,9,303,12],[303,16,303,19],[304,2,304,5],[304,9,304,12],[304,16,304,19],[401,16,401,19],[362,9,362,12],[362,16,362,19],[364,2,364,5],[364,9,364,12],[364,16,364,19],[359,1,359,3],[359,8,359,10],[359,15,359,17],[361,2,361,5],[361,9,361,12],[361,16,361,19],[397,2,397,5],[398,2,398,5],[401,2,401,5],[401,9,401,12],[318,2,318,5],[372,16,372,19],[399,16,399,19],[400,16,400,19],[381,2,381,5],[382,2,382,5],[368,16,368,19],[367,16,367,19],[368,9,368,12],[381,9,381,12],[336,16,336,19],[335,9,335,12],[336,9,336,12],[369,2,369,5],[334,16,334,19],[335,16,335,19],[376,16,376,19],[377,16,377,19],[378,16,378,19],[379,16,379,19],[380,16,380,19],[373,9,373,12],[375,9,375,12],[370,9,370,12],[371,2,371,5],[335,2,335,5],[336,2,336,5],[379,9,379,12],[380,9,380,12],[372,2,372,5],[372,9,372,12],[306,16,306,19],[382,9,382,12],[383,9,383,12],[381,16,381,19],[382,16,382,19],[383,16,383,19],[368,2,368,5],[157,2,157,5],[157,6,157,8],[157,9,157,16],[157,17,157,18],[157,19,157,20],[175,19,175,20],[176,2,176,5],[176,6,176,8],[176,9,176,16],[176,17,176,18],[176,19,176,20],[173,2,173,5],[173,6,173,8],[173,9,173,16],[173,17,173,18],[173,19,173,20],[174,2,174,5],[174,6,174,8],[174,9,174,16],[174,17,174,18],[174,19,174,20],[369,9,369,12],[369,16,369,19],[322,9,322,12],[308,2,308,5],[227,2,227,5],[228,2,228,5],[230,2,230,5],[305,16,305,19],[147,17,147,18],[175,17,175,18],[175,2,175,5],[175,6,175,8],[175,9,175,16],[162,2,162,5],[162,6,162,8],[162,9,162,16],[162,17,162,18],[162,19,162,20],[172,2,172,5],[172,6,172,8],[172,9,172,16],[172,17,172,18],[172,19,172,20],[160,2,160,5],[160,6,160,8],[160,9,160,16],[160,17,160,18],[160,19,160,20],[161,2,161,5],[161,6,161,8],[161,9,161,16],[161,17,161,18],[161,19,161,20],[148,2,148,5],[204,2,204,5],[204,6,204,8],[296,16,296,19],[297,2,297,5],[297,9,297,12],[297,16,297,19],[136,6,136,8],[136,9,136,16],[136,17,136,18],[136,19,136,20],[137,2,137,5],[137,6,137,8],[137,9,137,16],[137,17,137,18],[137,19,137,20],[138,9,138,16],[138,17,138,18],[158,6,158,8],[158,9,158,16],[158,17,158,18],[158,19,158,20],[159,2,159,5],[159,6,159,8],[159,9,159,16],[142,9,142,16],[142,17,142,18],[142,19,142,20],[177,19,177,20],[190,1,190,20],[203,2,203,5],[203,6,203,8],[203,9,203,16],[199,17,199,18],[284,16,284,19],[148,6,148,8],[153,2,153,5],[153,6,153,8],[153,9,153,16],[153,17,153,18],[154,2,154,5],[154,6,154,8],[154,9,154,16],[154,17,154,18],[148,9,148,16],[148,17,148,18],[147,9,147,16],[118,2,118,5],[117,2,117,5],[117,6,117,8],[117,9,117,16],[119,2,119,5],[119,6,119,8],[119,9,119,16],[119,17,119,18],[131,6,131,8],[118,17,118,18],[285,16,285,19],[100,17,100,18],[100,19,100,20],[110,2,110,5],[110,6,110,8],[110,9,110,16],[110,17,110,18],[281,1,281,3],[281,8,281,10],[281,15,281,17],[283,2,283,5],[283,9,283,12],[283,16,283,19],[139,19,139,20],[142,2,142,5],[142,6,142,8],[207,17,207,20],[188,2,188,5],[188,6,188,8],[188,9,188,16],[188,17,188,18],[188,19,188,20],[100,2,100,5],[138,6,138,8],[155,6,155,8],[220,9,220,12],[220,16,220,19],[109,2,109,5],[109,6,109,8],[155,9,155,16],[155,17,155,18],[117,17,117,18],[219,9,219,12],[219,16,219,19],[117,19,117,20],[87,2,87,5],[87,9,87,16],[87,17,87,18],[87,19,87,20],[87,6,87,8],[116,6,116,8],[116,9,116,16],[100,9,100,16],[110,19,110,20],[139,17,139,18],[135,17,135,18],[155,19,155,20],[199,19,199,20],[156,1,156,20],[147,19,147,20],[143,2,143,5],[149,9,149,16],[101,9,101,16],[109,17,109,18],[109,19,109,20],[185,9,185,16],[147,2,147,5],[147,6,147,8],[148,19,148,20],[135,2,135,5],[135,6,135,8],[135,9,135,16],[145,9,145,16],[119,19,119,20],[217,1,217,3],[217,8,217,10],[217,15,217,17],[42,19,42,20],[61,19,61,20],[52,2,52,5],[52,6,52,8],[52,9,52,16],[52,17,52,18],[52,19,52,20],[53,2,53,5],[53,6,53,8],[53,9,53,16],[53,17,53,18],[53,19,53,20],[54,2,54,5],[54,6,54,8],[54,9,54,16],[143,19,143,20],[144,2,144,5],[144,6,144,8],[138,2,138,5],[54,17,54,18],[54,19,54,20],[100,6,100,8],[149,2,149,5],[72,9,72,16],[207,1,207,16],[59,19,59,20],[62,2,62,5],[109,9,109,16],[182,17,182,18],[0,17,1,20],[0,1,0,5],[0,6,0,14],[1,1,1,5],[1,6,1,7],[1,8,5,16],[2,1,2,5],[2,6,2,7],[3,1,3,5],[3,6,3,7],[4,1,4,7],[5,1,5,5],[5,6,5,7],[12,2,12,5],[12,6,12,8],[12,9,12,16],[13,1,13,20],[7,1,7,3],[7,4,7,8],[7,9,7,10],[7,11,7,14],[7,15,7,16],[7,17,7,20],[9,1,9,3],[42,17,42,18],[48,9,48,16],[49,2,49,5],[49,6,49,8],[49,9,49,16],[39,17,39,18],[9,4,9,8],[9,9,9,10],[9,11,9,14],[9,15,9,16],[9,17,9,20],[11,1,11,20],[12,17,12,18],[12,19,12,20],[36,17,36,18],[15,17,15,18],[16,2,16,5],[16,6,16,8],[19,19,19,20],[29,2,29,5],[29,6,29,8],[14,19,14,20],[15,19,15,20],[16,17,16,18],[16,19,16,20],[22,2,22,5],[22,6,22,8],[22,9,22,16],[14,2,14,5],[14,6,14,8],[14,9,14,16],[14,17,14,18],[50,19,50,20],[51,2,51,5],[39,6,39,8],[51,6,51,8],[39,9,39,16],[42,2,42,5],[42,6,42,8],[42,9,42,16],[48,2,48,5],[48,6,48,8],[17,9,17,16],[36,9,36,16],[18,19,18,20],[25,2,25,5],[25,6,25,8],[40,2,40,5],[40,6,40,8],[39,19,39,20],[28,6,28,8],[37,1,37,20],[38,2,38,5],[38,6,38,8],[38,9,38,16],[38,17,38,18],[38,19,38,20],[26,6,26,8],[26,9,26,16],[26,17,26,18],[26,19,26,20],[26,2,26,5],[17,17,17,18],[17,19,17,20],[64,2,64,5],[56,6,56,8],[56,9,56,16],[58,17,58,18],[58,19,58,20],[84,6,84,8],[84,9,84,16],[84,17,84,18],[84,19,84,20],[80,2,80,5],[58,2,58,5],[58,6,58,8],[68,19,68,20],[69,2,69,5],[69,6,69,8],[55,19,55,20],[71,9,71,16],[64,6,64,8],[64,9,64,16],[67,2,67,5],[67,6,67,8],[67,9,67,16],[73,2,73,5],[56,17,56,18],[56,2,56,5],[68,9,68,16],[68,17,68,18],[64,19,64,20],[65,9,65,16],[75,2,75,5],[75,6,75,8],[75,9,75,16],[33,2,33,5],[20,6,20,8],[20,9,20,16],[20,17,20,18],[29,9,29,16],[31,2,31,5],[31,6,31,8],[31,9,31,16],[48,17,48,18],[48,19,48,20],[33,9,33,16],[33,17,33,18],[33,19,33,20],[15,2,15,5],[15,6,15,8],[15,9,15,16],[17,2,17,5],[17,6,17,8],[18,17,18,18],[16,9,16,16],[25,9,25,16],[30,19,30,20],[19,2,19,5],[19,6,19,8],[19,9,19,16],[19,17,19,18],[29,19,29,20],[23,2,23,5],[23,6,23,8],[23,9,23,16],[23,17,23,18],[23,19,23,20],[22,17,22,18],[20,2,20,5],[68,2,68,5],[68,6,68,8],[99,9,99,16],[50,2,50,5],[50,6,50,8],[50,9,50,16],[61,2,61,5],[61,6,61,8],[61,9,61,16],[28,2,28,5],[27,2,27,5],[27,6,27,8],[27,9,27,16],[27,17,27,18],[95,2,95,5],[95,6,95,8],[29,17,29,18],[28,9,28,16],[28,17,28,18],[58,9,58,16],[78,9,78,16],[71,2,71,5],[71,6,71,8],[84,2,84,5],[34,2,34,5],[34,6,34,8],[30,6,30,8],[30,9,30,16],[30,17,30,18],[76,2,76,5],[93,19,93,20],[94,2,94,5],[94,6,94,8],[94,9,94,16],[94,17,94,18],[94,19,94,20],[57,2,57,5],[57,6,57,8],[57,9,57,16],[57,17,57,18],[57,19,57,20],[18,9,18,16],[20,19,20,20],[18,2,18,5],[18,6,18,8],[27,19,27,20],[25,17,25,18],[25,19,25,20],[24,2,24,5],[34,9,34,16],[34,17,34,18],[34,19,34,20],[28,19,28,20],[22,19,22,20],[21,2,21,5],[21,6,21,8],[21,9,21,16],[21,17,21,18],[21,19,21,20],[30,2,30,5],[89,17,89,18],[33,6,33,8],[329,2,329,5],[329,9,329,12],[386,9,386,12],[440,2,440,5],[299,9,299,12],[441,9,441,12],[442,2,442,5],[442,9,442,12],[373,2,373,5],[375,2,375,5],[384,2,384,5],[416,8,416,10],[301,2,301,5],[301,9,301,12],[377,9,377,12],[378,9,378,12],[322,2,322,5],[313,9,313,12],[314,9,314,12],[315,9,315,12],[316,9,316,12],[317,9,317,12],[318,9,318,12],[316,2,316,5],[317,2,317,5],[396,2,396,5],[399,2,399,5],[313,2,313,5],[314,2,314,5],[410,2,410,5],[411,2,411,5],[334,9,334,12],[506,2,509,7],[506,14,509,19],[121,2,121,5],[502,3,503,18],[505,2,505,7],[505,14,505,19],[260,8,260,10],[260,1,260,3],[260,15,260,17],[499,14,499,15],[499,16,499,17],[365,2,365,5],[365,9,365,12],[365,16,365,19],[499,18,499,19],[181,2,181,5],[181,6,181,8],[499,2,499,3],[499,4,499,5],[499,6,499,7],[499,8,499,9],[131,17,131,18],[131,19,131,20],[499,10,499,11],[499,12,499,13],[386,2,386,5],[245,9,245,12],[366,9,366,12],[284,2,284,5],[411,16,411,19],[410,16,410,19],[293,2,293,5],[242,16,242,19],[244,16,244,19],[295,16,295,19],[296,2,296,5],[296,9,296,12],[180,19,180,20],[287,9,287,12],[287,16,287,19],[293,16,293,19],[294,2,294,5],[222,2,222,5],[244,2,244,5],[245,2,245,5],[242,2,242,5],[232,2,232,5]],"merged_total":1584,"flags":["merged_cut"]}
[null,"Amministrazione ",null,null,null,null,null,null,null,null,null,null,null,null,null,null,null,"CONFIGURATORE ELETTRONICO MEPA TECNOLOGIE SERVER 1 LOTTO 1",null,null,null,1]
[null,"N° Identificativo Ordine ",null,null,null,null,null,null,{"$f":"IF(G4=R210,\"Configurazione OK\",U4)","v":"Configurazione OK"},null,null,null,null,null,null,null,null,null,null,null,null,1]
[null,"Data Ordine",null,null,null,null,null,null,null,null,null,null,null,null,null,null,null,null,null,null,null,1]
[null,"Tot Ordine Portale CONSIP IVA incl.",null,null,null,null,{"$f":"R210","v":0},null,null,null,null,null,null,null,null,null,null,null,null,null,"Nel \"Tot Ordine Portale CONSIP\" deve essere inserito l'importo totale risultante dall'ordinativo del portale CONSIP.\nQualora l'importo inserito corrisponde al valore ricalcolato dal configuratore viene attivato il pulsante \"Salva in formato PDF\" che permette di generare il file pdf da allegare all'ordinativo.",1]
[null,"LE CELLE IN GIALLO DEVO ESSERE COMPILATE OBBLIGATORIAMENTE",null,null,null,null,null,null,null,null,null,null,null,null,null,null,null,null,null,null,null,1]
[null,"Quantità Server Ordinati",null,null,null,null,{"$f":"IF(B76=\"\",0,B76)+IF(B15=\"\",0,B15)+IF(B113=\"\",0,B113)+IF(B39=\"\",0,B39)+IF(B136=\"\",0,B136)+IF(B158=\"\",0,B158)","v":0},null,null,null,null,null,null,null,null,null,null,null,null,"ver. 4.9 MEPA",null,1]
[null,null,null,null,null,null,null,null,null,null,null,null,null,null,null,null,null,null,null,null,null,1]
[null,"Referente per la Consegna",null,null,null,null,null,null,null,"Telefono",null,null,null,null,null,"email",null,null,null,null,null,1]
[null,null,null,null,null,null,null,null,null,null,null,null,null,null,null,null,null,null,null,null,null,1]
[null,"Referente per l'installazione",null,null,null,null,null,null,null,"Telefono",null,null,null,null,null,"email",null,null,null,null,null,1]
[null,null,null,null,null,null,null,null,null,null,null,null,null,null,null,null,null,null,null,null,null,1]
[null,"ATTENZIONE: I CODICI PRODOTTO DELL'ORDINE MEPA DEVONO ESSERE SPECULARI A QUELLI GENERATI DAL CONFIGURATORE.",null,null,null,null,null,null,null,null,null,null,null,null,null,null,null,null,null,null,null,1]
[null,"Qtà Totale Ordinata","Oggetto di fornitura",null,null,null,"Codice Prodotto",null,null,"Descrizione Sintetica (si faccia riferimento alla guida alla convenzione per la descrizione estesa e per le regole di acquisto delle opzioni)",null,null,null,null,null,null,null,"Costo Unitario",null,"Costo Complessivo",null,1]
[null,"RACK BASE (DELL POWEREDGE R640)",null,null,null,null,null,null,null,null,null,null,null,null,null,null,null,null,null,null,null,{"$f":"IF(B15>=\"\",0,1)","v":0},null,"Server1","Server2","Server3"]
[null,{"$f":"IF(AK15>=1,AK15,\"\")","v":""},{"$f":"IF(AK15>0,(VLOOKUP(G15,COD_A,2,FALSE)),\"\")","v":""},null,null,null,{"$f":"IF(AK15>=1,W15,\"\")","v":""},null,null,{"$f":"IF(AK15>0,(VLOOKUP(G15,COD_A,5,FALSE)),\"\")","v":""},null,null,null,null,null,null,null,{"$f":"IF(AK15>0,(VLOOKUP(G15,COD_A,3,FALSE)),\"\")","v":""},null,{"$f":"IF(B15=\"\",\"\",R15*B15)","v":""},null,{"$f":"IF(B15>=\"\",0,1)","v":0},"CNV-TS1L1-R640",{"$f":"SRV_A","v":0},{"$f":"SRV_AA","v":0},{"$f":"SRV_AAA","v":0},null,null,null,null,null,null,null,null,null,null,{"$f":"SUM(X15:AJ15)","v":0}]
[null,{"$f":"IF(AK16>=1,AK16,\"\")","v":""},"",null,null,null,"",null,null,"",null,null,null,null,null,null,null,"",null,{"$f":"IF(B16=\"\",\"\",R16*B16)","v":""},null,{"$f":"IF(B16>=\"\",0,1)","v":0},"CNV-TS1L1-CPU-R640",{"$f":"'CNV R640 1'!$C$29","v":0},{"$f":"'CNV R640 2'!$C$29","v":0},{"$f":"'CNV R640 3'!$C$29","v":0},null,null,null,null,null,null,null,{"$f":"X16*$X$15","v":0},{"$f":"Y16*$Y$15","v":0},{"$f":"Z16*$Z$15","v":0},{"$f":"SUM(AH16:AJ16)","v":0}]
[null,{"$f":"IF(AK17>=1,AK17,\"\")","v":""},"",null,null,null,"",null,null,"",null,null,null,null,null,null,null,"",null,{"$f":"IF(B17=\"\",\"\",R17*B17)","v":""},null,0,"CNV-TS1L1-32GB-U",{"$f":"IF(MEM_A=\"\",0,MEM_A)","v":0},{"$f":"IF(MEM_AA=\"\",0,MEM_AA)","v":0},{"$f":"IF(MEM_AAA=\"\",0,MEM_AAA)","v":0},null,null,null,null,null,null,null,{"$f":"X17*$X$15","v":0},{"$f":"Y17*$Y$15","v":0},{"$f":"Z17*$Z$15","v":0},0]
[null,"","",null,null,null,"",null,null,"",null,null,null,null,null,null,null,"",null,"",null,0,"CNV-TS1L1-64GB-U",{"$f":"IF(MEM_A32=\"\",0,MEM_A32)","v":0},{"$f":"IF(MEM_AA32=\"\",0,MEM_AA32)","v":0},{"$f":"IF(MEM_AAA32=\"\",0,MEM_AAA32)","v":0},null,null,null,null,null,null,null,{"$f":"X18*$X$15","v":0},{"$f":"Y18*$Y$15","v":0},{"$f":"Z18*$Z$15","v":0},0]
[null,"","",null,null,null,"",null,null,"",null,null,null,null,null,null,null,"",null,"",null,0,"CNV-TS1L1-1GB-L",{"$f":"COUNTIF($AU$19:$AU$29,W19)","v":0},{"$f":"COUNTIF($AV$19:$AV$29,W19)","v":0},{"$f":"COUNTIF($AW$19:$AW$29,W19)","v":0},null,null,null,null,null,null,null,{"$f":"X19*$X$15","v":0},{"$f":"Y19*$Y$15","v":0},{"$f":"Z19*$Z$15","v":0},0,null,null,"slot1",null,null,null,null,null,null,{"$f":"'CNV R640 1'!$D$129","v":""},{"$f":"'CNV R640 2'!$D$129","v":""},{"$f":"'CNV R640 3'!$D$129","v":""}]
[null,"","",null,null,null,"",null,null,"",null,null,null,null,null,null,null,"",null,"",null,0,"CNV-TS1L1-10GB-L",0,0,0,null,null,null,null,null,null,null,{"$f":"X20*$X$15","v":0},{"$f":"Y20*$Y$15","v":0},{"$f":"Z20*$Z$15","v":0},0]
[null,"",{"$f":"IF(AK21>0,(VLOOKUP(G21,COD_A,2,FALSE)),\"\")","v":""},null,null,null,{"$f":"IF(AK21>=1,W21,\"\")","v":""},null,null,{"$f":"IF(AK21>0,(VLOOKUP(G21,COD_A,5,FALSE)),\"\")","v":""},null,null,null,null,null,null,null,{"$f":"IF(AK21>0,(VLOOKUP(G21,COD_A,3,FALSE)),\"\")","v":""},null,{"$f":"IF(B21=\"\",\"\",R21*B21)","v":""},null,0,"CNV-TS1L1-CNA-L",0,0,0,null,null,null,null,null,null,null,{"$f":"X21*$X$15","v":0},{"$f":"Y21*$Y$15","v":0},{"$f":"Z21*$Z$15","v":0},{"$f":"SUM(AH21:AJ21)","v":0}]
[null,"","",null,null,null,"",null,null,"",null,null,null,null,null,null,null,"",null,"",null,0,"CNV-S1-540-BBIU",0,0,0,null,null,null,null,null,null,null,0,0,0,0]
[null,"","",null,null,null,"",null,null,"",null,null,null,null,null,null,null,"",null,"",null,0,"CNV-S1-405-AANN",0,0,0,null,null,null,null,null,null,null,0,0,0,0]
[null,"",{"$f":"IF(AK24>0,(VLOOKUP(G24,COD_A,2,FALSE)),\"\")","v":""},null,null,null,{"$f":"IF(AK24>=1,W24,\"\")","v":""},null,null,{"$f":"IF(AK24>0,(VLOOKUP(G24,COD_A,5,FALSE)),\"\")","v":""},null,null,null,null,null,null,null,{"$f":"IF(AK24>0,(VLOOKUP(G24,COD_A,3,FALSE)),\"\")","v":""},null,{"$f":"IF(B24=\"\",\"\",R24*B24)","v":""},null,0,"CNV-TS1L1-FC-L",0,0,0,null,null,null,null,null,null,null,0,0,0,0]
[null,"",{"$f":"IF(AK25>0,(VLOOKUP(G25,COD_A,2,FALSE)),\"\")","v":""},null,null,null,{"$f":"IF(AK25>=1,W25,\"\")","v":""},null,null,{"$f":"IF(AK25>0,(VLOOKUP(G25,COD_A,5,FALSE)),\"\")","v":""},null,null,null,null,null,null,null,{"$f":"IF(AK25>0,(VLOOKUP(G25,COD_A,3,FALSE)),\"\")","v":""},null,{"$f":"IF(B25=\"\",\"\",R25*B25)","v":""},null,0,"CNV-S1-406-BBEL",0,0,0,null,null,null,null,null,null,null,{"$f":"X25*$X$15","v":0},{"$f":"Y25*$Y$15","v":0},{"$f":"Z25*$Z$15","v":0},{"$f":"SUM(AH25:AJ25)","v":0}]
[null,{"$f":"IF(AK26>=1,AK26,\"\")","v":""},"",null,null,null,"",null,null,"",null,null,null,null,null,null,null,"",null,"",null,0,"CNV-S1-IDSDMCCR",{"$f":"'CNV R640 1'!$C$126","v":0},{"$f":"'CNV R640 2'!$C$126","v":0},{"$f":"'CNV R640 3'!$C$126","v":0},null,null,null,null,null,null,null,0,0,0,0]
[null,"","",null,null,null,"",null,null,"",null,null,null,null,null,null,null,"",null,"",null,0,"CNV-TS1L1-HD600",{"$f":"HD300_A","v":0},{"$f":"HD300_AA","v":0},{"$f":"HD300_AAA","v":0},null,null,null,null,null,null,null,{"$f":"X27*$X$15","v":0},{"$f":"Y27*$Y$15","v":0},{"$f":"Z27*$Z$15","v":0},0]
[null,"","",null,null,null,"",null,null,"",null,null,null,null,null,null,null,"",null,"",null,0,"CNV-TS1L1-HD1200-U",{"$f":"HD1000_A","v":0},{"$f":"HD1000_AA","v":0},{"$f":"HD1000_AAA","v":0},null,null,null,null,null,null,null,0,0,0,0]
[null,{"$f":"IF(AK29>=1,AK29,\"\")","v":""},{"$f":"IF(AK29>0,(VLOOKUP(G29,COD_A,2,FALSE)),\"\")","v":""},null,null,null,{"$f":"IF(AK29>=1,W29,\"\")","v":""},null,null,{"$f":"IF(AK29>0,(VLOOKUP(G29,COD_A,5,FALSE)),\"\")","v":""},null,null,null,null,null,null,null,{"$f":"IF(AK29>0,(VLOOKUP(G29,COD_A,3,FALSE)),\"\")","v":""},null,{"$f":"IF(B29=\"\",\"\",R29*B29)","v":""},null,{"$f":"IF(B29>=\"\",0,1)","v":0},"CNV-TS1L1-HD1800-U",{"$f":"'CNV R640 1'!$C$85","v":0},{"$f":"'CNV R640 2'!$C$85","v":0},{"$f":"'CNV R640 3'!$C$85","v":0},null,null,null,null,null,null,null,0,0,0,{"$f":"SUM(AH29:AJ29)","v":0},null,null,"slot2",null,null,null,null,null,null,{"$f":"'CNV R640 1'!$D$132","v":""},{"$f":"'CNV R640 2'!$D$132","v":""},{"$f":"'CNV R640 3'!$D$132","v":""}]
[null,{"$f":"IF(AK30>=1,AK30,\"\")","v":""},"",null,null,null,{"$f":"IF(AK30>=1,W30,\"\")","v":""},null,null,"",null,null,null,null,null,null,null,"",null,{"$f":"IF(B30=\"\",\"\",R30*B30)","v":""},null,{"$f":"IF(B30>=\"\",0,1)","v":0},"CNV-TS1L1-SSD800-U",{"$f":"'CNV R640 1'!$C$87","v":0},{"$f":"'CNV R640 2'!$C$87","v":0},{"$f":"'CNV R640 3'!$C$87","v":0},null,null,null,null,null,null,null,0,0,0,{"$f":"SUM(AH30:AJ30)","v":0}]
[null,{"$f":"IF(AK31>=1,AK31,\"\")","v":""},"",null,null,null,{"$f":"IF(AK31>=1,W31,\"\")","v":""},null,null,"",null,null,null,null,null,null,null,"",null,{"$f":"IF(B31=\"\",\"\",R31*B31)","v":""},null,{"$f":"IF(B31>=\"\",0,1)","v":0},"CNV-TS1L1-SSD1920-U",{"$f":"'CNV R640 1'!$C$89","v":0},{"$f":"'CNV R640 2'!$C$89","v":0},{"$f":"'CNV R640 3'!$C$89","v":0},null,null,null,null,null,null,null,0,0,0,{"$f":"SUM(AH31:AJ31)","v":0}]
[null,{"$f":"IF(AK32>=1,AK32,\"\")","v":""},"",null,null,null,{"$f":"IF(AK32>=1,W32,\"\")","v":""},null,null,"",null,null,null,null,null,null,null,"",null,{"$f":"IF(B32=\"\",\"\",R32*B32)","v":""},null,{"$f":"IF(B32>=\"\",0,1)","v":0},"CNV-1UBezelSTD",{"$f":"IF('CNV R640 1'!$F$135=25,1,0)","v":0},{"$f":"IF('CNV R640 2'!$F$135=25,1,0)","v":0},{"$f":"IF('CNV R640 3'!$F$135=25,1,0)","v":0},null,null,null,null,null,null,null,{"$f":"X32*$X$15","v":0},{"$f":"Y32*$Y$15","v":0},{"$f":"Z32*$Z$15","v":0},{"$f":"SUM(AH32:AJ32)","v":0}]
[null,"","",null,null,null,"",null,null,"",null,null,null,null,null,null,null,"",null,"",null,0,"CNV-1UBezelLCD",{"$f":"IF('CNV R640 1'!$F$135=50,1,0)","v":0},{"$f":"IF('CNV R640 2'!$F$135=50,1,0)","v":0},{"$f":"IF('CNV R640 3'!$F$135=50,1,0)","v":0},null,null,null,null,null,null,null,0,0,0,0]
[null,"","",null,null,null,{"$f":"IF(AK34>=1,W34,\"\")","v":""},null,null,"",null,null,null,null,null,null,null,"",null,{"$f":"IF(B34=\"\",\"\",R34*B34)","v":""},null,0,"CNV-1UCMA",{"$f":"IF('CNV R640 1'!$F$138>0,1,0)","v":0},{"$f":"IF('CNV R640 2'!$F$138>0,1,0)","v":0},{"$f":"IF('CNV R640 3'!$F$138>0,1,0)","v":0},null,null,null,null,null,null,null,{"$f":"X34*$X$15","v":0},{"$f":"Y34*$Y$15","v":0},{"$f":"Z34*$Z$15","v":0},{"$f":"SUM(AH34:AJ34)","v":0}]
[null,"","",null,null,null,"",null,null,"",null,null,null,null,null,null,null,"",null,"",null,0,"CNV-TS1L1-4Y-R640",{"$f":"IF('CNV R640 1'!$D$162=W35,'CNV R640 1'!$C$162,0)","v":0},{"$f":"IF('CNV R640 2'!$D$162=W35,'CNV R640 2'!$C$162,0)","v":0},{"$f":"IF('CNV R640 3'!$D$162=W35,'CNV R640 3'!$C$162,0)","v":0},null,null,null,null,null,null,null,0,0,0,0]
[null,"","",null,null,null,"",null,null,"",null,null,null,null,null,null,null,"",null,"",null,0,"CNV-TS1L1-5Y-R640",{"$f":"IF('CNV R640 1'!$D$162=W36,'CNV R640 1'!$C$162,0)","v":0},{"$f":"IF('CNV R640 2'!$D$162=W36,'CNV R640 2'!$C$162,0)","v":0},{"$f":"IF('CNV R640 3'!$D$162=W36,'CNV R640 3'!$C$162,0)","v":0},null,null,null,null,null,null,null,0,0,0,0]
[null,"","",null,null,null,"",null,null,"",null,null,null,null,null,null,null,"",null,"",null,0,"10L1-SO-HDD",{"$f":"IF('CNV R640 1'!$D$165=W37,'CNV R640 1'!$C$165,0)","v":0},{"$f":"IF('CNV R640 2'!$D$165=W37,'CNV R640 2'!$C$165,0)","v":0},{"$f":"IF('CNV R640 3'!$D$165=W37,'CNV R640 3'!$C$165,0)","v":0},null,null,null,null,null,null,null,0,0,0,0,null,{"$f":"IF(X37=0,0,IF(X37+X36=2,5,IF(X37+X35=2,4,3)))","v":0},{"$f":"IF(Y37=0,0,IF(Y37+Y36=2,5,IF(Y37+Y35=2,4,3)))","v":0},null,null,null,null,null,null,{"$f":"IF(Z37=0,0,IF(Z37+Z36=2,5,IF(Z37+Z35=2,4,3)))","v":0},{"$f":"IF(AM37=5,$AV$134,IF(AM37=4,$AU$134,IF(AM37=3,$AN$134,\"\")))","v":""},{"$f":"IF(AN37=5,$AV$134,IF(AN37=4,$AU$134,IF(AN37=3,$AN$134,\"\")))","v":""},null,{"$f":"IF(AU37=5,$AV$134,IF(AU37=4,$AU$134,IF(AU37=3,$AN$134,\"\")))","v":""}]
[null,"SERVER RACK PRESTAZIONALE (DELL POWEREDGE R740)",null,null,null,null,null,null,null,null,null,null,null,null,null,null,null,null,null,null,null,{"$f":"IF(B39>=\"\",0,1)","v":0},"R730xd","Server1","Server2","Server3"]
[null,{"$f":"IF(AK39>=1,AK39,\"\")","v":""},{"$f":"IF(AK39>0,(VLOOKUP(G39,COD_B,2,FALSE)),\"\")","v":""},null,null,null,{"$f":"IF(AK39>=1,W39,\"\")","v":""},null,null,{"$f":"IF(AK39>0,(VLOOKUP(G39,COD_B,5,FALSE)),\"\")","v":""},null,null,null,null,null,null,null,{"$f":"IF(AK39>0,(VLOOKUP(G39,COD_B,3,FALSE)),\"\")","v":""},null,{"$f":"IF(B39=\"\",\"\",R39*B39)","v":""},null,{"$f":"IF(B39>=\"\",0,1)","v":0},"CNV-TS1L1-R740",{"$f":"SRV_B1.1","v":0},{"$f":"SRV_B1.2","v":0},{"$f":"SRV_B1.3","v":0},null,null,null,null,null,null,null,null,null,null,{"$f":"SUM(X39:AJ39)","v":0}]
[null,{"$f":"IF(AK40>=1,AK40,\"\")","v":""},"",null,null,null,"",null,null,"",null,null,null,null,null,null,null,"",null,"",null,0,"CNV-TS1L1-CPU-R740",{"$f":"'CNV R740 1'!$C$29","v":0},{"$f":"'CNV R740 2'!$C$29","v":0},{"$f":"'CNV R740 3'!$C$29","v":0},null,null,null,null,null,null,null,{"$f":"X40*$X$39","v":0},{"$f":"Y40*$Y$39","v":0},{"$f":"Z40*$Z$39","v":0},{"$f":"SUM(AH40:AJ40)","v":0}]
[null,"","",null,null,null,"",null,null,"",null,null,null,null,null,null,null,"",null,"",null,0,"CNV-TS1L1-32GB-U",{"$f":"IF(MEM_B1.1=\"\",0,MEM_B1.1)","v":0},{"$f":"IF(MEM_B1.2=\"\",0,MEM_B1.2)","v":0},{"$f":"IF(MEM_B1.3=\"\",0,MEM_B1.3)","v":0},null,null,null,null,null,null,null,{"$f":"X41*$X$39","v":0},{"$f":"Y41*$Y$39","v":0},{"$f":"Z41*$Z$39","v":0},0]
[null,"","",null,null,null,"",null,null,"",null,null,null,null,null,null,null,"",null,"",null,0,"CNV-TS1L1-64GB-U-R74",{"$f":"IF(MEM_B321.1=\"\",0,MEM_B321.1)","v":0},{"$f":"IF(MEM_B321.2=\"\",0,MEM_B321.2)","v":0},{"$f":"IF(MEM_B321.3=\"\",0,MEM_B321.3)","v":0},null,null,null,null,null,null,null,{"$f":"X42*$X$39","v":0},{"$f":"Y42*$Y$39","v":0},{"$f":"Z42*$Z$39","v":0},0,null,null,null,null,null,null,null,null,null,"740 1","740 2","740 3"]
[null,"","",null,null,null,"",null,null,"",null,null,null,null,null,null,null,"",null,"",null,0,"CNV-TS1L1-1GB-L",{"$f":"COUNTIF($AU$43:$AU$61,W43)","v":0},{"$f":"COUNTIF($AV$43:$AV$61,W43)","v":0},{"$f":"COUNTIF($AW$43:$AW$61,W43)","v":0},null,null,null,null,null,null,null,0,0,0,0,null,null,"slot1",null,null,null,null,null,null,{"$f":"'CNV R740 1'!$D$129","v":""},{"$f":"'CNV R740 2'!$D$129","v":""},{"$f":"'CNV R740 3'!$D$129","v":""}]
[null,"",{"$f":"IF(AK44>0,(VLOOKUP(G44,COD_B,2,FALSE)),\"\")","v":""},null,null,null,{"$f":"IF(AK44>=1,W44,\"\")","v":""},null,null,{"$f":"IF(AK44>0,(VLOOKUP(G44,COD_B,5,FALSE)),\"\")","v":""},null,null,null,null,null,null,null,{"$f":"IF(AK44>0,(VLOOKUP(G44,COD_B,3,FALSE)),\"\")","v":""},null,{"$f":"IF(B44=\"\",\"\",R44*B44)","v":""},null,0,"CNV-TS1L1-10GB-L",{"$f":"COUNTIF($AU$43:$AU$61,W44)","v":0},{"$f":"COUNTIF($AV$43:$AV$61,W44)","v":0},{"$f":"COUNTIF($AW$43:$AW$61,W44)","v":0},null,null,null,null,null,null,null,{"$f":"X44*$X$39","v":0},{"$f":"Y44*$Y$39","v":0},{"$f":"Z44*$Z$39","v":0},{"$f":"SUM(AH44:AJ44)","v":0}]
[null,"","",null,null,null,"",null,null,"",null,null,null,null,null,null,null,"",null,"",null,0,"CNV-TS1L1-CNA-L",0,0,0,null,null,null,null,null,null,null,0,0,0,0]
[null,"","",null,null,null,"",null,null,"",null,null,null,null,null,null,null,"",null,"",null,0,"CNV-S1-540-BBIU",0,0,0,null,null,null,null,null,null,null,0,0,0,0]
[null,"","",null,null,null,"",null,null,"",null,null,null,null,null,null,null,"",null,"",null,0,"CNV-S1-405-AANN",0,0,0,null,null,null,null,null,null,null,0,0,0,0]
[null,"","",null,null,null,"",null,null,"",null,null,null,null,null,null,null,"",null,"",null,0,"CNV-TS1L1-FC-L",0,0,0,null,null,null,null,null,null,null,0,0,0,0]
[null,"","",null,null,null,"",null,null,"",null,null,null,null,null,null,null,"",null,"",null,0,"CNV-S1-406-BBEL",{"$f":"COUNTIF($AU$43:$AU$62,W49)","v":0},{"$f":"COUNTIF($AV$43:$AV$62,W49)","v":0},{"$f":"COUNTIF($AW$43:$AW$62,W49)","v":0},null,null,null,null,null,null,null,0,0,0,0,null,null,"slot2",null,null,null,null,null,null,{"$f":"'CNV R740 1'!$D$132","v":""},{"$f":"'CNV R740 2'!$D$132","v":""},{"$f":"'CNV R740 3'!$D$132","v":""}]
[null,"","",null,null,null,"",null,null,"",null,null,null,null,null,null,null,"",null,"",null,0,"CNV-TS1L1-1GB",0,0,0,null,null,null,null,null,null,null,0,0,0,0,null,null,"slot3",null,null,null,null,null,null,{"$f":"'CNV R740 1'!$D$135","v":""},{"$f":"'CNV R740 2'!$D$135","v":""},{"$f":"'CNV R740 3'!$D$135","v":""}]
[null,"","",null,null,null,"",null,null,"",null,null,null,null,null,null,null,"",null,"",null,0,"CNV-TS1L1-10GB",0,0,0,null,null,null,null,null,null,null,0,0,0,0,null,null,"slot4",null,null,null,null,null,null,{"$f":"'CNV R740 1'!$D$138","v":""},{"$f":"'CNV R740 2'!$D$138","v":""},{"$f":"'CNV R740 3'!$D$138","v":""}]
[null,"","",null,null,null,"",null,null,"",null,null,null,null,null,null,null,"",null,"",null,0,"CNV-TS1L1-CNA",0,0,0,null,null,null,null,null,null,null,0,0,0,0,null,null,"slot5",null,null,null,null,null,null,{"$f":"'CNV R740 1'!$D$141","v":""},{"$f":"'CNV R740 2'!$D$141","v":""},{"$f":"'CNV R740 3'!$D$141","v":""}]
[null,{"$f":"IF(AK53>=1,AK53,\"\")","v":""},{"$f":"IF(AK53>0,(VLOOKUP(G53,COD_B,2,FALSE)),\"\")","v":""},null,null,null,{"$f":"IF(AK53>=1,W53,\"\")","v":""},null,null,{"$f":"IF(AK53>0,(VLOOKUP(G53,COD_B,5,FALSE)),\"\")","v":""},null,null,null,null,null,null,null,{"$f":"IF(AK53>0,(VLOOKUP(G53,COD_B,3,FALSE)),\"\")","v":""},null,{"$f":"IF(B53=\"\",\"\",R53*B53)","v":""},null,{"$f":"IF(B53>=\"\",0,1)","v":0},"CNV-S1-540-BBGU",0,0,0,null,null,null,null,null,null,null,{"$f":"X53*$X$39","v":0},{"$f":"Y53*$Y$39","v":0},{"$f":"Z53*$Z$39","v":0},{"$f":"SUM(AH53:AJ53)","v":0},null,null,"slot6",null,null,null,null,null,null,{"$f":"'CNV R740 1'!$D$144","v":""},{"$f":"'CNV R740 2'!$D$144","v":""},{"$f":"'CNV R740 3'!$D$144","v":""}]
[null,"","",null,null,null,"",null,null,"",null,null,null,null,null,null,null,"",null,"",null,0,"CNV-TS1L1-540-BBIW",0,0,0,null,null,null,null,null,null,null,0,0,0,0,null,null,"slot7",null,null,null,null,null,null,{"$f":"'CNV R740 1'!$D$147","v":""},{"$f":"'CNV R740 2'!$D$147","v":""},{"$f":"'CNV R740 3'!$D$147","v":""}]
[null,"","",null,null,null,"",null,null,"",null,null,null,null,null,null,null,"",null,"",null,0,"CNV-TS1L1-540-BBIV",0,0,0,null,null,null,null,null,null,null,0,0,0,0,null,null,"slot8",null,null,null,null,null,null,{"$f":"'CNV R740 1'!$D$150","v":""},{"$f":"'CNV R740 2'!$D$150","v":""},{"$f":"'CNV R740 3'!$D$150","v":""}]
[null,"","",null,null,null,"",null,null,"",null,null,null,null,null,null,null,"",null,"",null,0,"CNV-S1-405-AAMZ",0,0,0,null,null,null,null,null,null,null,0,0,0,0]
[null,"",{"$f":"IF(AK57>0,(VLOOKUP(G57,COD_B,2,FALSE)),\"\")","v":""},null,null,null,{"$f":"IF(AK57>=1,W57,\"\")","v":""},null,null,{"$f":"IF(AK57>0,(VLOOKUP(G57,COD_B,5,FALSE)),\"\")","v":""},null,null,null,null,null,null,null,{"$f":"IF(AK57>0,(VLOOKUP(G57,COD_B,3,FALSE)),\"\")","v":""},null,{"$f":"IF(B57=\"\",\"\",R57*B57)","v":""},null,0,"CNV-TS1-BOSS",0,0,0,null,null,null,null,null,null,null,0,0,0,0]
[null,"","",null,null,null,"",null,null,"",null,null,null,null,null,null,null,"",null,"",null,0,"CNV-TS1-BOSS120",0,0,0,null,null,null,null,null,null,null,0,0,0,0]
[null,"","",null,null,null,"",null,null,"",null,null,null,null,null,null,null,"",null,"",null,0,"CNV-TS1L1-403-BBTM",0,0,0,null,null,null,null,null,null,null,0,0,0,0]
[null,"","",null,null,null,"",null,null,"",null,null,null,null,null,null,null,"",null,"",null,0,"CNV-TS1L1-FC",0,0,0,null,null,null,null,null,null,null,0,0,0,0]
[null,"","",null,null,null,"",null,null,"",null,null,null,null,null,null,null,"",null,"",null,0,"CNV-S1-406-BBEK",0,0,0,null,null,null,null,null,null,null,0,0,0,0]
[null,"","",null,null,null,"",null,null,"",null,null,null,null,null,null,null,"",null,"",null,0,"CNV-S1-IDSDMCCR",{"$f":"'CNV R740 1'!$C$126","v":0},{"$f":"'CNV R740 2'!$C$126","v":0},{"$f":"'CNV R740 3'!$C$126","v":0},null,null,null,null,null,null,null,0,0,0,0]
[null,"",{"$f":"IF(AK63>0,(VLOOKUP(G63,COD_B,2,FALSE)),\"\")","v":""},null,null,null,{"$f":"IF(AK63>=1,W63,\"\")","v":""},null,null,{"$f":"IF(AK63>0,(VLOOKUP(G63,COD_B,5,FALSE)),\"\")","v":""},null,null,null,null,null,null,null,{"$f":"IF(AK63>0,(VLOOKUP(G63,COD_B,3,FALSE)),\"\")","v":""},null,{"$f":"IF(B63=\"\",\"\",R63*B63)","v":""},null,0,"CNV-S1-405-AAJW",{"$f":"'CNV R740 1'!$C$76","v":0},{"$f":"'CNV R740 2'!$C$76","v":0},{"$f":"'CNV R740 3'!$C$76","v":0},null,null,null,null,null,null,null,{"$f":"X63*$X$39","v":0},{"$f":"Y63*$Y$39","v":0},{"$f":"Z63*$Z$39","v":0},{"$f":"SUM(AH63:AJ63)","v":0}]
[null,"","",null,null,null,"",null,null,"",null,null,null,null,null,null,null,"",null,"",null,0,"CNV-TS1L1-HD600",{"$f":"HD300_B1.1","v":0},{"$f":"HD300_B1.2","v":0},{"$f":"HD300_B1.3","v":0},null,null,null,null,null,null,null,0,0,0,0]
[null,"","",null,null,null,"",null,null,"",null,null,null,null,null,null,null,"",null,"",null,0,"CNV-TS1L1-HD1200-U",{"$f":"HD1000_B1.1","v":0},{"$f":"HD1000_B1.2","v":0},{"$f":"HD1000_B1.3","v":0},null,null,null,null,null,null,null,0,0,0,0]
[null,"","",null,null,null,"",null,null,"",null,null,null,null,null,null,null,"",null,"",null,0,"CNV-TS1L1-HD1800-U",{"$f":"'CNV R740 1'!$C$85","v":0},{"$f":"'CNV R740 2'!$C$85","v":0},{"$f":"'CNV R740 3'!$C$85","v":0},null,null,null,null,null,null,null,0,{"$f":"Y66*$Y$39","v":0},{"$f":"Z66*$Z$39","v":0},0]
[null,"","",null,null,null,"",null,null,"",null,null,null,null,null,null,null,"",null,"",null,0,"CNV-TS1L1-SSD800-U",{"$f":"'CNV R740 1'!$C$87","v":0},{"$f":"'CNV R740 2'!$C$87","v":0},{"$f":"'CNV R740 3'!$C$87","v":0},null,null,null,null,null,null,null,0,0,0,0]
[null,"","",null,null,null,"",null,null,"",null,null,null,null,null,null,null,"",null,"",null,0,"CNV-TS1L1-SSD1920-U",{"$f":"'CNV R740 1'!$C$89","v":0},{"$f":"'CNV R740 2'!$C$89","v":0},{"$f":"'CNV R740 3'!$C$89","v":0},null,null,null,null,null,null,null,0,0,0,0]
[null,"",{"$f":"IF(AK69>0,(VLOOKUP(G69,COD_B,2,FALSE)),\"\")","v":""},null,null,null,{"$f":"IF(AK69>=1,W69,\"\")","v":""},null,null,{"$f":"IF(AK69>0,(VLOOKUP(G69,COD_B,5,FALSE)),\"\")","v":""},null,null,null,null,null,null,null,{"$f":"IF(AK69>0,(VLOOKUP(G69,COD_B,3,FALSE)),\"\")","v":""},null,{"$f":"IF(B69=\"\",\"\",R69*B69)","v":""},null,0,"CNV-2UBezelSTD",{"$f":"IF('CNV R740 1'!$F$153=30,1,0)","v":0},{"$f":"IF('CNV R740 2'!$F$153=30,1,0)","v":0},{"$f":"IF('CNV R740 3'!$F$153=30,1,0)","v":0},null,null,null,null,null,null,null,{"$f":"X69*$X$39","v":0},{"$f":"Y69*$Y$39","v":0},{"$f":"Z69*$Z$39","v":0},{"$f":"SUM(AH69:AJ69)","v":0}]
[null,"","",null,null,null,"",null,null,"",null,null,null,null,null,null,null,"",null,"",null,0,"CNV-2UBezelLCD",{"$f":"IF('CNV R740 1'!$F$153=60,1,0)","v":0},{"$f":"IF('CNV R740 2'!$F$153=60,1,0)","v":0},{"$f":"IF('CNV R740 3'!$F$153=60,1,0)","v":0},null,null,null,null,null,null,null,0,0,0,0]
[null,"","",null,null,null,"",null,null,"",null,null,null,null,null,null,null,"",null,"",null,0,"CNV-2UCMA",{"$f":"IF('CNV R740 1'!$F$156>0,1,0)","v":0},{"$f":"IF('CNV R740 2'!$F$156>0,1,0)","v":0},{"$f":"IF('CNV R740 3'!$F$156>0,1,0)","v":0},null,null,null,null,null,null,null,0,0,0,0]
[null,"","",null,null,null,"",null,null,"",null,null,null,null,null,null,null,"",null,"",null,0,"CNV-TS1L1-4Y-R740",{"$f":"IF('CNV R740 1'!$D$177=$W$72,'CNV R740 1'!$C$177,0)","v":0},{"$f":"IF('CNV R740 2'!$D$177=$W$72,'CNV R740 2'!$C$177,0)","v":0},{"$f":"IF('CNV R740 3'!$D$177=$W$72,'CNV R740 3'!$C$177,0)","v":0},null,null,null,null,null,null,null,0,0,0,0]
[null,"","",null,null,null,"",null,null,"",null,null,null,null,null,null,null,"",null,"",null,0,"CNV-TS1L1-5Y-R740",{"$f":"IF('CNV R740 1'!$D$177=$W$73,'CNV R740 1'!$C$177,0)","v":0},{"$f":"IF('CNV R740 2'!$D$177=$W$73,'CNV R740 2'!$C$177,0)","v":0},{"$f":"IF('CNV R740 3'!$D$177=$W$73,'CNV R740 3'!$C$177,0)","v":0},null,null,null,null,null,null,null,0,0,0,0,null,"R730 1 HDDr"]
[null,"","",null,null,null,"",null,null,"",null,null,null,null,null,null,null,"",null,"",null,0,"10L1-SO-HDD",{"$f":"IF('CNV R740 1'!$D$177=W74,'CNV R740 1'!$C$177,0)","v":0},{"$f":"IF('CNV R740 2'!$D$177=$W$111,'CNV R740 2'!$C$177,0)","v":0},{"$f":"IF('CNV R740 3'!$D$177=$W$111,'CNV R740 3'!$C$177,0)","v":0},null,null,null,null,null,null,null,0,0,0,0,null,{"$f":"IF(X74=0,0,IF(X74+X73=2,5,IF(X74+X72=2,4,3)))","v":0},{"$f":"IF(Y74=0,0,IF(Y74+Y73=2,5,IF(Y74+Y72=2,4,3)))","v":0},null,null,null,null,null,null,{"$f":"IF(Z74=0,0,IF(Z74+Z73=2,5,IF(Z74+Z72=2,4,3)))","v":0},{"$f":"IF(AM74=5,$AV$134,IF(AM74=4,$AU$134,IF(AM74=3,$AN$134,\"\")))","v":""},{"$f":"IF(AN74=5,$AV$134,IF(AN74=4,$AU$134,IF(AN74=3,$AN$134,\"\")))","v":""},null,{"$f":"IF(AU74=5,$AV$134,IF(AU74=4,$AU$134,IF(AU74=3,$AN$134,\"\")))","v":""}]
[null,"SERVER RACK PRESTAZIONALE ALTERNATIVO (DELL POWEREDGE R740XD)",null,null,null,null,null,null,null,null,null,null,null,null,null,null,null,null,null,null,null,{"$f":"IF(B76>=\"\",0,1)","v":0},"R740xd","Server1","Server2","Server3"]
[null,{"$f":"IF(AK76>=1,AK76,\"\")","v":""},{"$f":"IF(AK76>0,(VLOOKUP(G76,COD_B,2,FALSE)),\"\")","v":""},null,null,null,{"$f":"IF(AK76>=1,W76,\"\")","v":""},null,null,{"$f":"IF(AK76>0,(VLOOKUP(G76,COD_B,5,FALSE)),\"\")","v":""},null,null,null,null,null,null,null,{"$f":"IF(AK76>0,(VLOOKUP(G76,COD_B,3,FALSE)),\"\")","v":""},null,{"$f":"IF(B76=\"\",\"\",R76*B76)","v":""},null,0,"CNV-TS1L1-R740XD",{"$f":"SRV_B","v":0},{"$f":"SRV_BB","v":0},{"$f":"SRV_BBB","v":0},null,null,null,null,null,null,null,null,null,null,{"$f":"SUM(X76:AJ76)","v":0}]
[null,{"$f":"IF(AK77>=1,AK77,\"\")","v":""},"",null,null,null,"",null,null,"",null,null,null,null,null,null,null,"",null,"",null,0,"CNV-TS1L1-CPU-R740X",{"$f":"'CNV R740xd 1'!$C$29","v":0},{"$f":"'CNV R740xd 2'!$C$29","v":0},{"$f":"'CNV R740xd 3'!$C$29","v":0},null,null,null,null,null,null,null,{"$f":"X77*$X$76","v":0},{"$f":"Y77*$Y$76","v":0},{"$f":"Z77*$Z$76","v":0},{"$f":"SUM(AH77:AJ77)","v":0}]
[null,"","",null,null,null,"",null,null,"",null,null,null,null,null,null,null,"",null,{"$f":"IF(B78=\"\",\"\",R78*B78)","v":""},null,0,"CNV-TS1L1-32GB-U",{"$f":"IF(MEM_B=\"\",0,MEM_B)","v":0},{"$f":"IF(MEM_BB=\"\",0,MEM_BB)","v":0},{"$f":"IF(MEM_BBB=\"\",0,MEM_BBB)","v":0},null,null,null,null,null,null,null,{"$f":"X78*$X$76","v":0},{"$f":"Y78*$Y$76","v":0},{"$f":"Z78*$Z$76","v":0},0]
[null,"","",null,null,null,"",null,null,"",null,null,null,null,null,null,null,"",null,"",null,0,"CNV-TS1L1-64GB-U-R74",{"$f":"IF(MEM_B32=\"\",0,MEM_B32)","v":0},{"$f":"IF(MEM_BB32=\"\",0,MEM_BB32)","v":0},{"$f":"IF(MEM_BBB32=\"\",0,MEM_BBB32)","v":0},null,null,null,null,null,null,null,{"$f":"X79*$X$76","v":0},{"$f":"Y79*$Y$76","v":0},{"$f":"Z79*$Z$76","v":0},0]
[null,{"$f":"IF(AK80>=1,AK80,\"\")","v":""},{"$f":"IF(AK80>0,(VLOOKUP(G80,COD_B,2,FALSE)),\"\")","v":""},null,null,null,{"$f":"IF(AK80>=1,W80,\"\")","v":""},null,null,{"$f":"IF(AK80>0,(VLOOKUP(G80,COD_B,5,FALSE)),\"\")","v":""},null,null,null,null,null,null,null,{"$f":"IF(AK80>0,(VLOOKUP(G80,COD_B,3,FALSE)),\"\")","v":""},null,{"$f":"IF(B80=\"\",\"\",R80*B80)","v":""},null,{"$f":"IF(B80>=\"\",0,1)","v":0},"CNV-TS1L1-1GB-L",{"$f":"COUNTIF($AU$88:$AU$101,W80)","v":0},{"$f":"COUNTIF($AV$88:$AV$101,W80)","v":0},{"$f":"COUNTIF($AW$88:$AW$101,W80)","v":0},null,null,null,null,null,null,null,{"$f":"X80*$X$76","v":0},{"$f":"Y80*$Y$76","v":0},{"$f":"Z80*$Z$76","v":0},{"$f":"SUM(AH80:AJ80)","v":0},null,null,"slot1",null,null,null,null,null,null,{"$f":"'CNV R740xd 1'!$D$130","v":""},{"$f":"'CNV R740xd 2'!$D$130","v":""},{"$f":"'CNV R740xd 3'!$D$127","v":""}]
[null,"","",null,null,null,"",null,null,"",null,null,null,null,null,null,null,"",null,"",null,0,"CNV-TS1L1-10GB-L",0,0,0,null,null,null,null,null,null,null,0,0,0,0]
[null,"","",null,null,null,"",null,null,"",null,null,null,null,null,null,null,"",null,"",null,0,"CNV-TS1L1-CNA-L",0,0,0,null,null,null,null,null,null,null,0,0,0,0]
[null,"","",null,null,null,"",null,null,"",null,null,null,null,null,null,null,"",null,"",null,0,"CNV-S1-540-BBIU",0,0,0,null,null,null,null,null,null,null,0,0,0,0]
[null,"","",null,null,null,"",null,null,"",null,null,null,null,null,null,null,"",null,"",null,0,"CNV-S1-405-AANN",0,0,0,null,null,null,null,null,null,null,0,0,0,0]
[null,"","",null,null,null,"",null,null,"",null,null,null,null,null,null,null,"",null,"",null,0,"CNV-TS1L1-FC-L",0,0,0,null,null,null,null,null,null,null,0,0,0,0]
[null,"","",null,null,null,"",null,null,"",null,null,null,null,null,null,null,"",null,"",null,0,"CNV-S1-406-BBEL",0,0,0,null,null,null,null,null,null,null,0,0,0,0]
[null,"","",null,null,null,"",null,null,"",null,null,null,null,null,null,null,"",null,"",null,0,"CNV-TS1L1-1GB",0,0,0,null,null,null,null,null,null,null,0,0,0,0]
[null,"","",null,null,null,"",null,null,"",null,null,null,null,null,null,null,"",null,"",null,0,"CNV-TS1L1-10GB",0,0,0,null,null,null,null,null,null,null,{"$f":"X88*$X$76","v":0},{"$f":"Y88*$Y$76","v":0},{"$f":"Z88*$Z$76","v":0},0,null,null,"slot1",null,null,null,null,null,null,{"$f":"'CNV R740xd 1'!$D$130","v":""},{"$f":"'CNV R740xd 2'!$D$130","v":""},{"$f":"'CNV R740xd 3'!$D$127","v":""}]
[null,"",{"$f":"IF(AK89>0,(VLOOKUP(G89,COD_B,2,FALSE)),\"\")","v":""},null,null,null,{"$f":"IF(AK89>=1,W89,\"\")","v":""},null,null,{"$f":"IF(AK89>0,(VLOOKUP(G89,COD_B,5,FALSE)),\"\")","v":""},null,null,null,null,null,null,null,{"$f":"IF(AK89>0,(VLOOKUP(G89,COD_B,3,FALSE)),\"\")","v":""},null,{"$f":"IF(B89=\"\",\"\",R89*B89)","v":""},null,0,"CNV-TS1L1-CNA",0,0,0,null,null,null,null,null,null,null,{"$f":"X89*$X$76","v":0},{"$f":"Y89*$Y$76","v":0},{"$f":"Z89*$Z$76","v":0},{"$f":"SUM(AH89:AJ89)","v":0}]
[null,"","",null,null,null,"",null,null,"",null,null,null,null,null,null,null,"",null,"",null,0,"CNV-S1-540-BBGU",0,0,0,null,null,null,null,null,null,null,{"$f":"X90*$X$76","v":0},{"$f":"Y90*$Y$76","v":0},{"$f":"Z90*$Z$76","v":0},0,null,null,"slot2",null,null,null,null,null,null,{"$f":"'CNV R740xd 1'!$D$133","v":""},{"$f":"'CNV R740xd 2'!$D$133","v":""},{"$f":"'CNV R740xd 3'!$D$133","v":""}]
[null,"",{"$f":"IF(AK91>0,(VLOOKUP(G91,COD_B,2,FALSE)),\"\")","v":""},null,null,null,{"$f":"IF(AK91>=1,W91,\"\")","v":""},null,null,{"$f":"IF(AK91>0,(VLOOKUP(G91,COD_B,5,FALSE)),\"\")","v":""},null,null,null,null,null,null,null,{"$f":"IF(AK91>0,(VLOOKUP(G91,COD_B,3,FALSE)),\"\")","v":""},null,{"$f":"IF(B91=\"\",\"\",R91*B91)","v":""},null,0,"CNV-TS1L1-540-BBIW",{"$f":"COUNTIF($AU$88:$AU$101,W91)","v":0},{"$f":"COUNTIF($AV$88:$AV$101,W91)","v":0},{"$f":"COUNTIF($AW$88:$AW$101,W91)","v":0},null,null,null,null,null,null,null,{"$f":"X91*$X$76","v":0},{"$f":"Y91*$Y$76","v":0},{"$f":"Z91*$Z$76","v":0},{"$f":"SUM(AH91:AJ91)","v":0}]
[null,"","",null,null,null,"",null,null,"",null,null,null,null,null,null,null,"",null,"",null,0,"CNV-TS1L1-540-BBIV",0,0,0,null,null,null,null,null,null,null,0,0,0,0]
[null,"","",null,null,null,"",null,null,"",null,null,null,null,null,null,null,"",null,"",null,0,"CNV-S1-405-AAMZ",0,0,0,null,null,null,null,null,null,null,0,0,0,0]
[null,"","",null,null,null,"",null,null,"",null,null,null,null,null,null,null,"",null,"",null,0,"CNV-TS1-BOSS",0,0,0,null,null,null,null,null,null,null,0,0,0,0]
[null,"","",null,null,null,"",null,null,"",null,null,null,null,null,null,null,"",null,"",null,0,"CNV-TS1-BOSS120",0,0,0,null,null,null,null,null,null,null,0,0,0,0]
[null,"","",null,null,null,"",null,null,"",null,null,null,null,null,null,null,"",null,"",null,0,"CNV-TS1L1-403-BBTM",{"$f":"COUNTIF($AU$88:$AU$101,W96)","v":0},{"$f":"COUNTIF($AV$88:$AV$101,W96)","v":0},{"$f":"COUNTIF($AW$88:$AW$101,W96)","v":0},null,null,null,null,null,null,null,0,0,0,0,null,null,"slot3",null,null,null,null,null,null,{"$f":"'CNV R740xd 1'!$D$136","v":""},{"$f":"'CNV R740xd 2'!$D$136","v":""},{"$f":"'CNV R740xd 3'!$D$136","v":""}]
[null,"","",null,null,null,"",null,null,"",null,null,null,null,null,null,null,"",null,"",null,0,"CNV-TS1L1-FC",{"$f":"COUNTIF($AU$88:$AU$101,W97)","v":0},{"$f":"COUNTIF($AV$88:$AV$101,W97)","v":0},{"$f":"COUNTIF($AW$88:$AW$101,W97)","v":0},null,null,null,null,null,null,null,0,0,0,0,null,null,"slot4",null,null,null,null,null,null,{"$f":"'CNV R740xd 1'!$D$139","v":""},{"$f":"'CNV R740xd 2'!$D$139","v":""},{"$f":"'CNV R740xd 3'!$D$139","v":""}]
[null,"","",null,null,null,"",null,null,"",null,null,null,null,null,null,null,"",null,"",null,0,"CNV-S1-406-BBEK",{"$f":"COUNTIF($AU$88:$AU$101,W98)","v":0},{"$f":"COUNTIF($AV$88:$AV$101,W98)","v":0},{"$f":"COUNTIF($AW$88:$AW$101,W98)","v":0},null,null,null,null,null,null,null,0,0,0,0,null,null,"slot5",null,null,null,null,null,null,{"$f":"'CNV R740xd 1'!$D$142","v":""},{"$f":"'CNV R740xd 2'!$D$142","v":""},{"$f":"'CNV R740xd 3'!$D$142","v":""}]
[null,"","",null,null,null,"",null,null,"",null,null,null,null,null,null,null,"",null,"",null,0,"CNV-S1-IDSDMCCR",{"$f":"'CNV R740xd 1'!$C$127","v":0},{"$f":"'CNV R740xd 2'!$C$127","v":0},{"$f":"'CNV R740xd 3'!$C$127","v":0},null,null,null,null,null,null,null,0,0,0,0,null,null,"slot6",null,null,null,null,null,null,{"$f":"'CNV R740xd 1'!$D$145","v":""},{"$f":"'CNV R740xd 2'!$D$145","v":""},{"$f":"'CNV R740xd 3'!$D$145","v":""}]
[null,"",{"$f":"IF(AK100>0,(VLOOKUP(G100,COD_B,2,FALSE)),\"\")","v":""},null,null,null,{"$f":"IF(AK100>=1,W100,\"\")","v":""},null,null,{"$f":"IF(AK100>0,(VLOOKUP(G100,COD_B,5,FALSE)),\"\")","v":""},null,null,null,null,null,null,null,{"$f":"IF(AK100>0,(VLOOKUP(G100,COD_B,3,FALSE)),\"\")","v":""},null,{"$f":"IF(B100=\"\",\"\",R100*B100)","v":""},null,0,"CNV-S1-405-AAJW",{"$f":"'CNV R740xd 1'!$C$77","v":0},{"$f":"'CNV R740xd 2'!$C$77","v":0},{"$f":"'CNV R740xd 3'!$C$77","v":0},null,null,null,null,null,null,null,{"$f":"X100*$X$76","v":0},{"$f":"Y100*$Y$76","v":0},{"$f":"Z100*$Z$76","v":0},{"$f":"SUM(AH100:AJ100)","v":0},null,null,"slot7",null,null,null,null,null,null,{"$f":"'CNV R740xd 1'!$D$148","v":""},{"$f":"'CNV R740xd 2'!$D$148","v":""},{"$f":"'CNV R740xd 3'!$D$148","v":""}]
[null,"","",null,null,null,"",null,null,"",null,null,null,null,null,null,null,"",null,{"$f":"IF(B101=\"\",\"\",R101*B101)","v":""},null,0,"CNV-TS1L1-HD600",{"$f":"HD300_B","v":0},{"$f":"HD300_BB","v":0},{"$f":"HD300_BBB","v":0},null,null,null,null,null,null,null,{"$f":"X101*$X$76","v":0},{"$f":"Y101*$Y$76","v":0},{"$f":"Z101*$Z$76","v":0},0,null,null,"slot8",null,null,null,null,null,null,{"$f":"'CNV R740xd 1'!$D$151","v":""},{"$f":"'CNV R740xd 2'!$D$151","v":""},{"$f":"'CNV R740xd 3'!$D$151","v":""}]
[null,"","",null,null,null,"",null,null,"",null,null,null,null,null,null,null,"",null,"",null,0,"CNV-TS1L1-HD1200-U",{"$f":"HD1000_B","v":0},{"$f":"HD1000_BB","v":0},{"$f":"HD1000_BBB","v":0},null,null,null,null,null,null,null,0,0,0,0]
[null,"","",null,null,null,"",null,null,"",null,null,null,null,null,null,null,"",null,"",null,0,"CNV-TS1L1-HD1800-U",{"$f":"'CNV R740xd 1'!$C$86","v":0},{"$f":"'CNV R740xd 2'!$C$86","v":0},{"$f":"'CNV R740xd 3'!$C$86","v":0},null,null,null,null,null,null,null,0,0,0,0]
[null,"","",null,null,null,"",null,null,"",null,null,null,null,null,null,null,"",null,"",null,0,"CNV-TS1L1-SSD800-U",{"$f":"'CNV R740xd 1'!$C$88","v":0},{"$f":"'CNV R740xd 2'!$C$88","v":0},{"$f":"'CNV R740xd 3'!$C$88","v":0},null,null,null,null,null,null,null,0,0,0,0]
[null,"","",null,null,null,"",null,null,"",null,null,null,null,null,null,null,"",null,"",null,0,"CNV-TS1L1-SSD1920-U",{"$f":"'CNV R740xd 1'!$C$90","v":0},{"$f":"'CNV R740xd 2'!$C$90","v":0},{"$f":"'CNV R740xd 3'!$C$90","v":0},null,null,null,null,null,null,null,0,0,0,0]
[null,"",{"$f":"IF(AK106>0,(VLOOKUP(G106,COD_B,2,FALSE)),\"\")","v":""},null,null,null,{"$f":"IF(AK106>=1,W106,\"\")","v":""},null,null,{"$f":"IF(AK106>0,(VLOOKUP(G106,COD_B,5,FALSE)),\"\")","v":""},null,null,null,null,null,null,null,{"$f":"IF(AK106>0,(VLOOKUP(G106,COD_B,3,FALSE)),\"\")","v":""},null,{"$f":"IF(B106=\"\",\"\",R106*B106)","v":""},null,0,"CNV-2UBezelSTD",{"$f":"IF('CNV R740xd 1'!$F$154=30,1,0)","v":0},{"$f":"IF('CNV R740xd 2'!$F$154=30,1,0)","v":0},{"$f":"IF('CNV R740xd 3'!$F$154=30,1,0)","v":0},null,null,null,null,null,null,null,{"$f":"X106*$X$76","v":0},{"$f":"Y106*$Y$76","v":0},{"$f":"Z106*$Z$76","v":0},{"$f":"SUM(AH106:AJ106)","v":0}]
[null,"","",null,null,null,"",null,null,"",null,null,null,null,null,null,null,"",null,"",null,0,"CNV-2UBezelLCD",{"$f":"IF('CNV R740xd 1'!$F$154=60,1,0)","v":0},{"$f":"IF('CNV R740xd 2'!$F$154=60,1,0)","v":0},{"$f":"IF('CNV R740xd 3'!$F$154=60,1,0)","v":0},null,null,null,null,null,null,null,0,0,0,0]
[null,"","",null,null,null,"",null,null,"",null,null,null,null,null,null,null,"",null,"",null,0,"CNV-2UCMA",{"$f":"IF('CNV R740xd 1'!$F$157>0,1,0)","v":0},{"$f":"IF('CNV R740xd 2'!$F$157>0,1,0)","v":0},{"$f":"IF('CNV R740xd 3'!$F$157>0,1,0)","v":0},null,null,null,null,null,null,null,0,0,0,0]
[null,"","",null,null,null,"",null,null,"",null,null,null,null,null,null,null,"",null,"",null,0,"CNV-TS1L1-4Y-R740XD",{"$f":"IF('CNV R740xd 1'!$D$178=$W$109,'CNV R740xd 1'!$C$178,0)","v":0},{"$f":"IF('CNV R740xd 2'!$D$178=$W$109,'CNV R740xd 2'!$C$178,0)","v":0},{"$f":"IF('CNV R740xd 3'!$D$178=$W$109,'CNV R740xd 3'!$C$178,0)","v":0},null,null,null,null,null,null,null,0,0,0,0]
[null,"","",null,null,null,"",null,null,"",null,null,null,null,null,null,null,"",null,"",null,0,"CNV-TS1L1-5Y-R740XD",{"$f":"IF('CNV R740xd 1'!$D$178=$W$110,'CNV R740xd 1'!$C$178,0)","v":0},{"$f":"IF('CNV R740xd 2'!$D$178=$W$110,'CNV R740xd 2'!$C$178,0)","v":0},{"$f":"IF('CNV R740xd 3'!$D$178=$W$110,'CNV R740xd 3'!$C$178,0)","v":0},null,null,null,null,null,null,null,0,0,0,0,null,"R730 1 HDDr"]
[null,"","",null,null,null,"",null,null,"",null,null,null,null,null,null,null,"",null,"",null,0,"10L1-SO-HDD",{"$f":"IF('CNV R740xd 1'!$D$181=$W$111,'CNV R740xd 1'!$C$181,0)","v":0},{"$f":"IF('CNV R740xd 2'!$D$175=$W$111,'CNV R740xd 2'!$C$175,0)","v":0},{"$f":"IF('CNV R740xd 3'!$D$172=$W$111,'CNV R740xd 3'!$C$172,0)","v":0},null,null,null,null,null,null,null,0,0,0,0,null,{"$f":"IF(X111=0,0,IF(X111+X110=2,5,IF(X111+X109=2,4,3)))","v":0},{"$f":"IF(Y111=0,0,IF(Y111+Y110=2,5,IF(Y111+Y109=2,4,3)))","v":0},null,null,null,null,null,null,{"$f":"IF(Z111=0,0,IF(Z111+Z110=2,5,IF(Z111+Z109=2,4,3)))","v":0},{"$f":"IF(AM111=5,$AV$134,IF(AM111=4,$AU$134,IF(AM111=3,$AN$134,\"\")))","v":""},{"$f":"IF(AN111=5,$AV$134,IF(AN111=4,$AU$134,IF(AN111=3,$AN$134,\"\")))","v":""},null,{"$f":"IF(AU111=5,$AV$134,IF(AU111=4,$AU$134,IF(AU111=3,$AN$134,\"\")))","v":""}]
[null,"RACK BASE ALTERNATIVO (DELL POWEREDGE T640)",null,null,null,null,null,null,null,null,null,null,null,null,null,null,null,null,null,null,null,{"$f":"IF(B113>=\"\",0,1)","v":0},null,"Server1","Server2","Server3"]
[null,{"$f":"IF(AK113>=1,AK113,\"\")","v":""},{"$f":"IF(AK113>0,(VLOOKUP(G113,COD_B,2,FALSE)),\"\")","v":""},null,null,null,{"$f":"IF(AK113>=1,W113,\"\")","v":""},null,null,{"$f":"IF(AK113>0,(VLOOKUP(G113,COD_B,5,FALSE)),\"\")","v":""},null,null,null,null,null,null,null,{"$f":"IF(AK113>0,(VLOOKUP(G113,COD_B,3,FALSE)),\"\")","v":""},null,{"$f":"IF(B113=\"\",\"\",R113*B113)","v":""},null,0,"CNV-TS1L1-T640R",{"$f":"SRV_C","v":0},null,null,null,null,null,null,null,null,null,null,null,null,{"$f":"SUM(X113:AJ113)","v":0}]
[null,{"$f":"IF(AK114>=1,AK114,\"\")","v":""},"",null,null,null,{"$f":"IF(AK114>=1,W114,\"\")","v":""},null,null,"",null,null,null,null,null,null,null,"",null,{"$f":"IF(B114=\"\",\"\",R114*B114)","v":""},null,0,"CNV-TS1L1-CPU-T640R",{"$f":"'CNV T640 (Rack)'!$C$30","v":0},null,null,null,null,null,null,null,null,null,{"$f":"X114*$X$113","v":0},{"$f":"Y114*$Y$113","v":0},{"$f":"Z114*$Z$113","v":0},{"$f":"SUM(AH114:AJ114)","v":0}]
[null,"","",null,null,null,"",null,null,"",null,null,null,null,null,null,null,"",null,"",null,0,"CNV-TS1L1-32GB-U",{"$f":"IF(MEM_C=\"\",0,MEM_C)","v":0},null,null,null,null,null,null,null,null,null,{"$f":"X115*$X$113","v":0},{"$f":"Y115*$Y$113","v":0},{"$f":"Z115*$Z$113","v":0},0]
[null,"",{"$f":"IF(AK116>0,(VLOOKUP(G116,COD_C,2,FALSE)),\"\")","v":""},null,null,null,"",null,null,{"$f":"IF(AK116>0,(VLOOKUP(G116,COD_C,5,FALSE)),\"\")","v":""},null,null,null,null,null,null,null,{"$f":"IF(AK116>0,(VLOOKUP(G116,COD_C,3,FALSE)),\"\")","v":""},null,"",null,0,"CNV-TS1L1-64GB-U",{"$f":"IF(MEM_C32=\"\",0,MEM_C32)","v":0},null,null,null,null,null,null,null,null,null,{"$f":"X116*$X$113","v":0},0,0,0]
[null,"",{"$f":"IF(AK117>0,(VLOOKUP(G117,COD_B,2,FALSE)),\"\")","v":""},null,null,null,{"$f":"IF(AK117>=1,W117,\"\")","v":""},null,null,{"$f":"IF(AK117>0,(VLOOKUP(G117,COD_B,5,FALSE)),\"\")","v":""},null,null,null,null,null,null,null,{"$f":"IF(AK117>0,(VLOOKUP(G117,COD_B,3,FALSE)),\"\")","v":""},null,{"$f":"IF(B117=\"\",\"\",R117*B117)","v":""},null,{"$f":"IF(B117>=\"\",0,1)","v":0},"CNV-TS1L1-1GB",{"$f":"COUNTIF($AU$119:$AU$132,W117)","v":0},null,null,null,null,null,null,null,null,null,{"$f":"X117*$X$113","v":0},{"$f":"Y117*$Y$113","v":0},{"$f":"Z117*$Z$113","v":0},{"$f":"SUM(AH117:AJ117)","v":0},null,null,null,null,null,null,null,null,null,{"$f":"'CNV T640 (Rack)'!$D$82","v":"CNV-TS1L1-HD600R"},{"$f":"'Lotto1 T630R 2'!$D$138","v":""},{"$f":"'Lotto1 T630R 3'!$D$138","v":""}]
[null,"",{"$f":"IF(AK118>0,(VLOOKUP(G118,COD_B,2,FALSE)),\"\")","v":""},null,null,null,{"$f":"IF(AK118>=1,W118,\"\")","v":""},null,null,{"$f":"IF(AK118>0,(VLOOKUP(G118,COD_B,5,FALSE)),\"\")","v":""},null,null,null,null,null,null,null,{"$f":"IF(AK118>0,(VLOOKUP(G118,COD_B,3,FALSE)),\"\")","v":""},null,{"$f":"IF(B118=\"\",\"\",R118*B118)","v":""},null,{"$f":"IF(B118>=\"\",0,1)","v":0},"CNV-TS1L1-10GB",0,null,null,null,null,null,null,null,null,null,{"$f":"X118*$X$113","v":0},{"$f":"Y118*$Y$113","v":0},{"$f":"Z118*$Z$113","v":0},{"$f":"SUM(AH118:AJ118)","v":0},null,null,null,null,null,null,null,null,null,{"$f":"'CNV T640 (Rack)'!$D$84","v":"CNV-TS1L1-HD1200R"},{"$f":"'Lotto1 T630R 2'!$D$141","v":""},{"$f":"'Lotto1 T630R 3'!$D$141","v":""}]
[null,"","",null,null,null,"",null,null,"",null,null,null,null,null,null,null,"",null,"",null,0,"CNV-TS1L1-CNA",0,null,null,null,null,null,null,null,null,null,0,0,0,0,null,null,"slot2",null,null,null,null,null,null,{"$f":"'CNV T640 (Rack)'!$D$128","v":""},{"$f":"'Lotto1 T630R 2'!$D$129","v":""},{"$f":"'Lotto1 T630R 3'!$D$129","v":""}]
[null,"","",null,null,null,"",null,null,"",null,null,null,null,null,null,null,"",null,"",null,{"$f":"IF(B120>=\"\",0,1)","v":0},"CNV-S1-540-BBGU",0,null,null,null,null,null,null,null,null,null,0,{"$f":"Y120*$Y$113","v":0},{"$f":"Z120*$Z$113","v":0},{"$f":"SUM(AH120:AJ120)","v":0},null,null,"slot3",null,null,null,null,null,null,{"$f":"'CNV T640 (Rack)'!$D$131","v":""},"T630R 2","T630R 3"]
[null,"","",null,null,null,"",null,null,"",null,null,null,null,null,null,null,"",null,"",null,0,"CNV-TS1L1-540-BBIW",0,null,null,null,null,null,null,null,null,null,0,0,0,0,null,null,"slot4",null,null,null,null,null,null,{"$f":"'CNV T640 (Rack)'!$D$134","v":""},{"$f":"'Lotto1 T630R 2'!$D$132","v":""},{"$f":"'Lotto1 T630R 3'!$D$132","v":""}]
[null,"","",null,null,null,"",null,null,"",null,null,null,null,null,null,null,"",null,"",null,0,"CNV-TS1L1-540-BBIV",0,null,null,null,null,null,null,null,null,null,0,0,0,0,null,null,"slot5",null,null,null,null,null,null,{"$f":"'CNV T640 (Rack)'!$D$137","v":""},{"$f":"'Lotto1 T630R 2'!$D$135","v":""},{"$f":"'Lotto1 T630R 3'!$D$135","v":""}]
[null,"","",null,null,null,"",null,null,"",null,null,null,null,null,null,null,"",null,"",null,0,"CNV-S1-405-AAMZ",0,null,null,null,null,null,null,null,null,null,0,null,null,0,null,null,"slot6",null,null,null,null,null,null,{"$f":"'CNV T640 (Rack)'!$D$140","v":""}]
[null,"","",null,null,null,"",null,null,"",null,null,null,null,null,null,null,"",null,"",null,0,"CNV-TS1-BOSS",0,null,null,null,null,null,null,null,null,null,0,null,null,0,null,null,"slot7",null,null,null,null,null,null,{"$f":"'CNV T640 (Rack)'!$D$143","v":""}]
[null,"","",null,null,null,"",null,null,"",null,null,null,null,null,null,null,"",null,"",null,0,"CNV-TS1-BOSS120",{"$f":"COUNTIF($AU$119:$AU$132,W125)","v":0},null,null,null,null,null,null,null,null,null,0,null,null,0]
[null,"","",null,null,null,"",null,null,"",null,null,null,null,null,null,null,"",null,"",null,0,"CNV-TS1L1-403-BBTM",0,null,null,null,null,null,null,null,null,null,0,null,null,0]
[null,"","",null,null,null,"",null,null,"",null,null,null,null,null,null,null,"",null,"",null,0,"CNV-TS1L1-FC",0,null,null,null,null,null,null,null,null,null,0,null,null,0]
[null,"","",null,null,null,"",null,null,"",null,null,null,null,null,null,null,"",null,"",null,0,"CNV-S1-406-BBEK",0,null,null,null,null,null,null,null,null,null,0,null,null,0]
[null,{"$f":"IF(AK129>=1,AK129,\"\")","v":""},{"$f":"IF(AK129>0,(VLOOKUP(G129,COD_C,2,FALSE)),\"\")","v":""},null,null,null,{"$f":"IF(AK129>=1,W129,\"\")","v":""},null,null,{"$f":"IF(AK129>0,(VLOOKUP(G129,COD_C,5,FALSE)),\"\")","v":""},null,null,null,null,null,null,null,{"$f":"IF(AK129>0,(VLOOKUP(G129,COD_C,3,FALSE)),\"\")","v":""},null,{"$f":"IF(B129=\"\",\"\",R129*B129)","v":""},null,0,"CNV-TS1L1-HD600R",{"$f":"HD300_C","v":0},null,null,null,null,null,null,null,null,null,0,null,null,0]
[null,"","",null,null,null,"",null,null,"",null,null,null,null,null,null,null,"",null,"",null,0,"CNV-TS1L1-HD1200R",{"$f":"HD1000_c","v":0},null,null,null,null,null,null,null,null,null,0,null,null,0]
[null,"",{"$f":"IF(AK131>0,(VLOOKUP(G131,COD_B,2,FALSE)),\"\")","v":""},null,null,null,"",null,null,{"$f":"IF(AK131>0,(VLOOKUP(G131,COD_B,5,FALSE)),\"\")","v":""},null,null,null,null,null,null,null,{"$f":"IF(AK131>0,(VLOOKUP(G131,COD_B,3,FALSE)),\"\")","v":""},null,"",null,0,"CNV-TS1L1-4Y-T640",{"$f":"COUNTIF($AU$119:$AU$132,W131)","v":0},null,null,null,null,null,null,null,null,null,0,null,null,0,null,null,"slot7"]
[null,"","",null,null,null,"",null,null,"",null,null,null,null,null,null,null,"",null,"",null,0,"CNV-TS1L1-5Y-T640",{"$f":"COUNTIF($AU$119:$AU$132,W132)","v":0},null,null,null,null,null,null,null,null,null,0,null,null,0]
[null,"","",null,null,null,"",null,null,"",null,null,null,null,null,null,null,"",null,"",null,0,"10L1-SO-HDD",{"$f":"IF('CNV T640 (Rack)'!$D$175=W133,'CNV T640 (Rack)'!$C$175,0)","v":0},null,null,null,null,null,null,null,null,null,0,0,0,0]
[null,"","",null,null,null,"",null,null,"",null,null,null,null,null,null,null,"",null,"",null,0,"10L1-SO-HDD",{"$f":"IF('CNV T640 (Rack)'!$D$178=W134,'CNV T640 (Rack)'!$C$178,0)","v":0},null,null,null,null,null,null,null,null,null,0,0,0,0,{"$f":"IF(Y134=5,$AV$134,IF(Y134=4,$AU$134,IF(Y134=3,$AN$134,\"\")))","v":""},null,"10L1-SO-HDD3",null,null,null,null,null,null,"10L1-SO-HDD4","10L1-SO-HDD5"]
[null,"TOWER BASE (DELL POWEREDGE T640)",null,null,null,null,null,null,null,null,null,null,null,null,null,null,null,null,null,null,null,{"$f":"IF(B136>=\"\",0,1)","v":0}]
[null,{"$f":"IF(AK136>=1,AK136,\"\")","v":""},{"$f":"IF(AK136>0,(VLOOKUP(G136,COD_C,2,FALSE)),\"\")","v":""},null,null,null,{"$f":"IF(AK136>=1,W136,\"\")","v":""},null,null,{"$f":"IF(AK136>0,(VLOOKUP(G136,COD_C,5,FALSE)),\"\")","v":""},null,null,null,null,null,null,null,{"$f":"IF(AK136>0,(VLOOKUP(G136,COD_C,3,FALSE)),\"\")","v":""},null,{"$f":"IF(B136=\"\",\"\",R136*B136)","v":""},null,{"$f":"IF(B136>=\"\",0,1)","v":0},"CNV-TS1L1-T640",{"$f":"SRV_D","v":0},null,null,null,null,null,null,null,null,null,null,null,null,{"$f":"SUM(X136:AJ136)","v":0}]
[null,{"$f":"IF(AK137>=1,AK137,\"\")","v":""},"",null,null,null,"",null,null,"",null,null,null,null,null,null,null,"",null,"",null,0,"CNV-TS1L1-CPU-T640",{"$f":"'CNV T640 (Tower)'!$C$29","v":0},null,null,null,null,null,null,null,null,null,{"$f":"X137*$X$136","v":0},null,null,{"$f":"SUM(AH137:AJ137)","v":0}]
[null,"","",null,null,null,"",null,null,"",null,null,null,null,null,null,null,"",null,"",null,0,"CNV-TS1L1-32GB-U",{"$f":"IF(MEM_D=\"\",0,MEM_D)","v":0},null,null,null,null,null,null,null,null,null,0,null,null,0]
[null,"","",null,null,null,"",null,null,"",null,null,null,null,null,null,null,"",null,"",null,0,"CNV-TS1L1-64GB-U",{"$f":"IF(MEM_D32=\"\",0,MEM_D32)","v":0},null,null,null,null,null,null,null,null,null,0,null,null,0,null,null,null,null,null,null,null,null,null,"T630 1","T630 2","T630 3"]
[null,"",{"$f":"IF(AK140>0,(VLOOKUP(G140,COD_C,2,FALSE)),\"\")","v":""},null,null,null,{"$f":"IF(AK140>=1,W140,\"\")","v":""},null,null,{"$f":"IF(AK140>0,(VLOOKUP(G140,COD_C,5,FALSE)),\"\")","v":""},null,null,null,null,null,null,null,{"$f":"IF(AK140>0,(VLOOKUP(G140,COD_C,3,FALSE)),\"\")","v":""},null,{"$f":"IF(B140=\"\",\"\",R140*B140)","v":""},null,0,"CNV-TS1L1-1GB",{"$f":"COUNTIF($AU$140:$AU$147,W140)","v":0},null,null,null,null,null,null,null,null,null,0,null,null,0,null,null,"slot1",null,null,null,null,null,null,{"$f":"'CNV T640 (Tower)'!$D$118","v":""}]
[null,"","",null,null,null,"",null,null,"",null,null,null,null,null,null,null,"",null,"",null,0,"CNV-TS1L1-10GB",{"$f":"COUNTIF($AU$140:$AU$147,W141)","v":0},null,null,null,null,null,null,null,null,null,0,null,null,0]
[null,"","",null,null,null,"",null,null,"",null,null,null,null,null,null,null,"",null,"",null,0,"CNV-TS1L1-CNA",0,null,null,null,null,null,null,null,null,null,0,null,null,0]
[null,"","",null,null,null,"",null,null,"",null,null,null,null,null,null,null,"",null,"",null,0,"CNV-S1-540-BBGU",0,null,null,null,null,null,null,null,null,null,0,null,null,0,null,null,"slot2",null,null,null,null,null,null,{"$f":"'CNV T640 (Tower)'!$D$121","v":""}]
[null,"","",null,null,null,"",null,null,"",null,null,null,null,null,null,null,"",null,"",null,0,"CNV-TS1L1-540-BBIW",0,null,null,null,null,null,null,null,null,null,0,null,null,0,null,null,"slot3",null,null,null,null,null,null,{"$f":"'CNV T640 (Tower)'!$D$124","v":""}]
[null,"","",null,null,null,"",null,null,"",null,null,null,null,null,null,null,"",null,"",null,0,"CNV-TS1L1-540-BBIV",0,null,null,null,null,null,null,null,null,null,0,null,null,0,null,null,"slot4",null,null,null,null,null,null,{"$f":"'CNV T640 (Tower)'!$D$127","v":""}]
[null,"","",null,null,null,"",null,null,"",null,null,null,null,null,null,null,"",null,"",null,0,"CNV-S1-405-AAMZ",0,null,null,null,null,null,null,null,null,null,0,null,null,0,null,null,"slot5",null,null,null,null,null,null,{"$f":"'CNV T640 (Tower)'!$D$130","v":""}]
[null,"","",null,null,null,"",null,null,"",null,null,null,null,null,null,null,"",null,"",null,0,"CNV-TS1-BOSS",0,null,null,null,null,null,null,null,null,null,0,null,null,0,null,null,"slot6",null,null,null,null,null,null,{"$f":"'CNV T640 (Tower)'!$D$133","v":""}]
[null,"","",null,null,null,"",null,null,"",null,null,null,null,null,null,null,"",null,"",null,0,"CNV-TS1-BOSS120",0,null,null,null,null,null,null,null,null,null,0,null,null,0]
[null,"","",null,null,null,"",null,null,"",null,null,null,null,null,null,null,"",null,"",null,0,"CNV-TS1L1-403-BBTM",0,null,null,null,null,null,null,null,null,null,0,null,null,0]
[null,"","",null,null,null,"",null,null,"",null,null,null,null,null,null,null,"",null,"",null,0,"CNV-TS1L1-FC",0,null,null,null,null,null,null,null,null,null,0,null,null,0]
[null,"","",null,null,null,"",null,null,"",null,null,null,null,null,null,null,"",null,"",null,{"$f":"IF(B151>=\"\",0,1)","v":0},"CNV-S1-406-BBEK",0,null,null,null,null,null,null,null,null,null,0,null,null,0,null,null,"slot3",null,null,null,null,null,null,{"$f":"'CNV T640 1 (Tower) Prest'!$D$130","v":""}]
[null,{"$f":"IF(AK152>=1,AK152,\"\")","v":""},{"$f":"IF(AK152>0,(VLOOKUP(G152,COD_C,2,FALSE)),\"\")","v":""},null,null,null,"",null,null,{"$f":"IF(AK152>0,(VLOOKUP(G152,COD_C,5,FALSE)),\"\")","v":""},null,null,null,null,null,null,null,{"$f":"IF(AK152>0,(VLOOKUP(G152,COD_C,3,FALSE)),\"\")","v":""},null,{"$f":"IF(B152=\"\",\"\",R152*B152)","v":""},null,0,"CNV-TS1L1-HD600T",{"$f":"HD300_D","v":0},null,null,null,null,null,null,null,null,null,0,null,null,0,null,null,"slot4",null,null,null,null,null,null,{"$f":"'CNV T640 1 (Tower) Prest'!$D$133","v":""}]
[null,"","",null,null,null,"",null,null,"",null,null,null,null,null,null,null,"",null,"",null,0,"CNV-TS1L1-HD1200T-U",{"$f":"HD1000_D","v":0},null,null,null,null,null,null,null,null,null,0,null,null,0,null,null,"slot5",null,null,null,null,null,null,{"$f":"'CNV T640 1 (Tower) Prest'!$D$136","v":""}]
[null,"","",null,null,null,{"$f":"IF(AK154>=1,W154,\"\")","v":""},null,null,"",null,null,null,null,null,null,null,"",null,"",null,0,"CNV-TS1L1-4Y-T640",{"$f":"IF('CNV T640 (Tower)'!$D$170=W154,'CNV T640 (Tower)'!$C$170,0)","v":0},null,null,null,null,null,null,null,null,null,0,null,null,0,null,null,"slot6",null,null,null,null,null,null,{"$f":"'CNV T640 1 (Tower) Prest'!$D$139","v":""}]
[null,"","",null,null,null,"",null,null,"",null,null,null,null,null,null,null,"",null,"",null,0,"CNV-TS1L1-5Y-T640",{"$f":"IF('CNV T640 (Tower)'!$D$170=W155,'CNV T640 (Tower)'!$C$170,0)","v":0},null,null,null,null,null,null,null,null,null,0,null,null,0]
[null,"","",null,null,null,"",null,null,"",null,null,null,null,null,null,null,"",null,"",null,0,"10L1-SO-HDD",{"$f":"IF('CNV T640 (Rack)'!$D$178=W156,'CNV T640 (Rack)'!$C$178,0)","v":0},{"$f":"IF(X156=0,0,IF(X148+X156=2,5,IF(X156+X147=2,4,3)))","v":0},null,null,null,null,null,null,null,null,{"$f":"X156*$X$113","v":0},null,null,0,{"$f":"IF(Y156=5,$AV$134,IF(Y156=4,$AU$134,IF(Y156=3,$AN$134,\"\")))","v":""},null,"10L1-SO-HDD3",null,null,null,null,null,null,"10L1-SO-HDD4","10L1-SO-HDD5"]
[null,"TOWER PRESTAZIONALE (DELL POWEREDGE T640)",null,null,null,null,null,null,null,null,null,null,null,null,null,null,null,null,null,null,null,{"$f":"IF(B158>=\"\",0,1)","v":0}]
[null,{"$f":"IF(AK158>=1,AK158,\"\")","v":""},{"$f":"IF(AK158>0,(VLOOKUP(G158,COD_C,2,FALSE)),\"\")","v":""},null,null,null,{"$f":"IF(AK158>=1,W158,\"\")","v":""},null,null,{"$f":"IF(AK158>0,(VLOOKUP(G158,COD_C,5,FALSE)),\"\")","v":""},null,null,null,null,null,null,null,{"$f":"IF(AK158>0,(VLOOKUP(G158,COD_C,3,FALSE)),\"\")","v":""},null,{"$f":"IF(B158=\"\",\"\",R158*B158)","v":""},null,{"$f":"IF(B158>=\"\",0,1)","v":0},"CNV-TS1L1-T640P",{"$f":"SRV_E","v":0},null,null,null,null,null,null,null,null,null,null,null,null,{"$f":"SUM(X158:AJ158)","v":0}]
[null,{"$f":"IF(AK159>=1,AK159,\"\")","v":""},"",null,null,null,"",null,null,"",null,null,null,null,null,null,null,"",null,"",null,0,"CNV-TS1L1-CPU-T640P",{"$f":"'CNV T640 1 (Tower) Prest'!$C$29","v":0},null,null,null,null,null,null,null,null,null,{"$f":"X159*$X$158","v":0},null,null,{"$f":"SUM(AH159:AJ159)","v":0}]
[null,"","",null,null,null,"",null,null,"",null,null,null,null,null,null,null,"",null,"",null,0,"CNV-TS1L1-32GB-U",{"$f":"IF(MEM_E=\"\",0,MEM_E)","v":0},null,null,null,null,null,null,null,null,null,{"$f":"X160*$X$158","v":0},null,null,0]
[null,"","",null,null,null,"",null,null,"",null,null,null,null,null,null,null,"",null,"",null,0,"CNV-TS1L1-64GB-U",{"$f":"IF(MEM_E32=\"\",0,MEM_E32)","v":0},null,null,null,null,null,null,null,null,null,0,null,null,0,null,null,null,null,null,null,null,null,null,"T630 1","T630 2","T630 3"]
[null,"","",null,null,null,"",null,null,"",null,null,null,null,null,null,null,"",null,"",null,0,"CNV-TS1L1-1GB",{"$f":"COUNTIF($AU$162:$AU$175,W162)","v":0},null,null,null,null,null,null,null,null,null,0,null,null,0,null,null,"slot1",null,null,null,null,null,null,{"$f":"'CNV T640 1 (Tower) Prest'!$D$124","v":""}]
[null,"","",null,null,null,"",null,null,"",null,null,null,null,null,null,null,"",null,"",null,0,"CNV-TS1L1-10GB",0,null,null,null,null,null,null,null,null,null,0,null,null,0,null,null,"slot2",null,null,null,null,null,null,{"$f":"'CNV T640 1 (Tower) Prest'!$D$127","v":""}]
[null,"",{"$f":"IF(AK164>0,(VLOOKUP(G164,COD_C,2,FALSE)),\"\")","v":""},null,null,null,{"$f":"IF(AK164>=1,W164,\"\")","v":""},null,null,{"$f":"IF(AK164>0,(VLOOKUP(G164,COD_C,5,FALSE)),\"\")","v":""},null,null,null,null,null,null,null,{"$f":"IF(AK164>0,(VLOOKUP(G164,COD_C,3,FALSE)),\"\")","v":""},null,{"$f":"IF(B164=\"\",\"\",R164*B164)","v":""},null,0,"CNV-TS1L1-CNA",0,null,null,null,null,null,null,null,null,null,{"$f":"X164*$X$158","v":0},null,null,{"$f":"SUM(AH164:AJ164)","v":0},null,null,"slot3",null,null,null,null,null,null,{"$f":"'CNV T640 1 (Tower) Prest'!$D$130","v":""}]
[null,"","",null,null,null,"",null,null,"",null,null,null,null,null,null,null,"",null,"",null,0,"CNV-S1-540-BBGU",0,null,null,null,null,null,null,null,null,null,0,null,null,0,null,null,"slot4",null,null,null,null,null,null,{"$f":"'CNV T640 1 (Tower) Prest'!$D$133","v":""}]
[null,"","",null,null,null,"",null,null,"",null,null,null,null,null,null,null,"",null,"",null,0,"CNV-TS1L1-540-BBIW",0,null,null,null,null,null,null,null,null,null,0,null,null,0,null,null,"slot5",null,null,null,null,null,null,{"$f":"'CNV T640 1 (Tower) Prest'!$D$136","v":""}]
[null,"",{"$f":"IF(AK167>0,(VLOOKUP(G167,COD_C,2,FALSE)),\"\")","v":""},null,null,null,{"$f":"IF(AK167>=1,W167,\"\")","v":""},null,null,{"$f":"IF(AK167>0,(VLOOKUP(G167,COD_C,5,FALSE)),\"\")","v":""},null,null,null,null,null,null,null,{"$f":"IF(AK167>0,(VLOOKUP(G167,COD_C,3,FALSE)),\"\")","v":""},null,{"$f":"IF(B167=\"\",\"\",R167*B167)","v":""},null,0,"CNV-TS1L1-540-BBIV",0,null,null,null,null,null,null,null,null,null,0,null,null,0,null,null,"slot6",null,null,null,null,null,null,{"$f":"'CNV T640 1 (Tower) Prest'!$D$139","v":""}]
[null,"","",null,null,null,"",null,null,"",null,null,null,null,null,null,null,"",null,"",null,0,"CNV-S1-405-AAMZ",{"$f":"COUNTIF($AU$162:$AU$175,W168)","v":0},null,null,null,null,null,null,null,null,null,0,null,null,0]
[null,"","",null,null,null,"",null,null,"",null,null,null,null,null,null,null,"",null,"",null,0,"CNV-TS1-BOSS",0,null,null,null,null,null,null,null,null,null,0,null,null,0]
[null,"","",null,null,null,"",null,null,"",null,null,null,null,null,null,null,"",null,"",null,0,"CNV-TS1-BOSS120",0,null,null,null,null,null,null,null,null,null,0,null,null,0]
[null,"","",null,null,null,"",null,null,"",null,null,null,null,null,null,null,"",null,"",null,0,"CNV-TS1L1-403-BBTM",0,null,null,null,null,null,null,null,null,null,0,null,null,0,null,null,"slot7",null,null,null,null,null,null,{"$f":"'CNV T640 1 (Tower) Prest'!$D$142","v":""}]
[null,"","",null,null,null,"",null,null,"",null,null,null,null,null,null,null,"",null,"",null,0,"CNV-TS1L1-FC",0,null,null,null,null,null,null,null,null,null,0,null,null,0]
[null,"",{"$f":"IF(AK173>0,(VLOOKUP(G173,COD_C,2,FALSE)),\"\")","v":""},null,null,null,"",null,null,"",null,null,null,null,null,null,null,"",null,"",null,0,"CNV-S1-406-BBEK",0,null,null,null,null,null,null,null,null,null,0,null,null,0]
[null,"","",null,null,null,"",null,null,"",null,null,null,null,null,null,null,"",null,"",null,0,"CNV-TS1L1-HD600T",{"$f":"HD300_E","v":0},null,null,null,null,null,null,null,null,null,0,null,null,0]
[null,"","",null,null,null,"",null,null,"",null,null,null,null,null,null,null,"",null,"",null,0,"CNV-TS1L1-HD1200T-U",{"$f":"HD1000_E","v":0},null,null,null,null,null,null,null,null,null,0,null,null,0]
[null,"","",null,null,null,"",null,null,"",null,null,null,null,null,null,null,"",null,"",null,0,"CNV-TS1L1-4Y-T640P",{"$f":"IF('CNV T640 1 (Tower) Prest'!D177=W176,'CNV T640 1 (Tower) Prest'!C177,0)","v":0},null,null,null,null,null,null,null,null,null,0,null,null,0]
[null,"","",null,null,null,"",null,null,"",null,null,null,null,null,null,null,"",null,"",null,0,"CNV-TS1L1-5Y-T640P",{"$f":"IF('CNV T640 1 (Tower) Prest'!D177=W177,'CNV T640 1 (Tower) Prest'!C177,0)","v":0},null,null,null,null,null,null,null,null,null,0,null,null,0]
[null,"","",null,null,null,"",null,null,"",null,null,null,null,null,null,null,"",null,"",null,0,"10L1-SO-HDD",{"$f":"IF('CNV T640 (Rack)'!$D$178=W178,'CNV T640 (Rack)'!$C$178,0)","v":0},{"$f":"IF(X178=0,0,IF(X177+X178=2,5,IF(X178+X176=2,4,3)))","v":0},null,null,null,null,null,null,null,null,{"$f":"X178*$X$113","v":0},null,null,0,{"$f":"IF(Y178=5,$AV$134,IF(Y178=4,$AU$134,IF(Y178=3,$AN$134,\"\")))","v":""},null,"10L1-SO-HDD3",null,null,null,null,null,null,"10L1-SO-HDD4","10L1-SO-HDD5"]
[null,"OPZIONI COMUNI",null,null,null,null,null,null,null,null,null,null,null,null,null,null,null,null,null,null,null,{"$f":"IF(SUM(V180:V190)=0,0,1)","v":0},null,"R630 1","R630 2","R630 3","T630R 1","T630R 2","T630R 3","R730 1","R730 2","R730 3","R730xd 1","R730xd 2","R730xd 3","T630","T630P","R630 1","R630 2","R630 3","T630R",null,null,"R730 1","R730 2","R730 3","R730xd 1","R730xd 2","R730xd 3","T630","T630P","R630","T630R","R730","R730xd","T630","T630P","Totale"]
[null,{"$f":"IF(BF180=0,\"\",BF180)","v":""},{"$f":"IF(BF180=0,\"\",(VLOOKUP(G180,COD_A,2,FALSE)))","v":""},null,null,null,{"$f":"IF(BF180>0,W180,\"\")","v":""},null,null,{"$f":"IF(BF180>0,(VLOOKUP(G180,COD_A,5,FALSE)),\"\")","v":""},null,null,null,null,null,null,null,{"$f":"IF(BF180>0,(VLOOKUP(G180,COD_A,3,FALSE)),\"\")","v":""},null,{"$f":"IF(B180=\"\",\"\",R180*B180)","v":""},null,0,"CNV-TS1L1-WIN1",{"$f":"IF('CNV R640 1'!$D$52=W180,1,0)","v":0},{"$f":"IF('CNV R640 2'!$D$52=W180,1,0)","v":0},{"$f":"IF('CNV R640 3'!$D$52=W180,1,0)","v":0},{"$f":"IF('CNV T640 (Rack)'!$D$53=$W$180,1,0)","v":0},{"$f":"IF('Lotto1 T630R 2'!$D$53=$W$180,1,0)","v":0},{"$f":"IF('Lotto1 T630R 3'!$D$53=$W$180,1,0)","v":0},{"$f":"IF('CNV R740 1'!$D$52=W180,1,0)","v":0},{"$f":"IF('CNV R740 2'!$D$52=$W$180,1,0)","v":0},{"$f":"IF('CNV R740 3'!$D$52=W180,1,0)","v":0},{"$f":"IF('CNV R740xd 1'!$D$52=W180,1,0)","v":0},{"$f":"IF('CNV R740xd 2'!$D$52=$W$180,1,0)","v":0},{"$f":"IF('CNV R740xd 3'!$D$52=W180,1,0)","v":0},{"$f":"IF('CNV T640 (Tower)'!$D$52=W180,1,0)","v":0},{"$f":"IF('CNV T640 1 (Tower) Prest'!$D$52=W180,1,0)","v":0},{"$f":"X180*$X$15","v":0},{"$f":"Y180*$Y$15","v":0},{"$f":"Z180*$Z$15","v":0},{"$f":"AA180*$X$113","v":0},{"$f":"AB180*$Y$113","v":0},{"$f":"AC180*$Z$113","v":0},{"$f":"AD180*$X$39","v":0},{"$f":"AE180*$Y$39","v":0},{"$f":"AF180*$Z$39","v":0},{"$f":"AG180*$X$76","v":0},{"$f":"AH180*$Y$76","v":0},{"$f":"AI180*$Z$76","v":0},{"$f":"AJ180*$X$136","v":0},{"$f":"AK180*$X$158","v":0},{"$f":"SUM(X180:Z180)","v":0},{"$f":"SUM(AA180:AC180)","v":0},{"$f":"SUM(AD180:AF180)","v":0},{"$f":"SUM(AG180:AI180)","v":0},{"$f":"AX180","v":0},0,{"$f":"SUM(AL180:AY180)","v":0}]
[null,{"$f":"IF(BF181=0,\"\",BF181)","v":""},{"$f":"IF(BF181=0,\"\",(VLOOKUP(G181,COD_A,2,FALSE)))","v":""},null,null,null,{"$f":"IF(BF181>0,W181,\"\")","v":""},null,null,{"$f":"IF(BF181>0,(VLOOKUP(G181,COD_A,5,FALSE)),\"\")","v":""},null,null,null,null,null,null,null,{"$f":"IF(BF181>0,(VLOOKUP(G181,COD_A,3,FALSE)),\"\")","v":""},null,"",null,0,"CNV-TS1L1-WIN2CORE",{"$f":"IF('CNV R640 1'!C53,2,0)","v":0},{"$f":"IF('CNV R640 2'!C53,2,0)","v":0},{"$f":"IF('CNV R640 3'!C53,2,0)","v":0},{"$f":"IF('CNV T640 (Rack)'!$C$54,2,0)","v":0},{"$f":"IF('Lotto1 T630R 2'!$C$54,2,0)","v":0},{"$f":"IF('Lotto1 T630R 3'!$C$54,2,0)","v":0},{"$f":"IF('CNV R740 1'!$C$53,6,0)","v":0},{"$f":"IF('CNV R740 2'!$C$53,6,0)","v":0},{"$f":"IF('CNV R740 3'!$C$53,6,0)","v":0},{"$f":"IF('CNV R740xd 1'!$C$53,6,0)","v":0},{"$f":"IF('CNV R740xd 2'!$C$53,6,0)","v":0},{"$f":"IF('CNV R740xd 3'!$C$53,6,0)","v":0},{"$f":"IF('CNV T640 (Tower)'!C53,2,0)","v":0},{"$f":"IF('CNV T640 1 (Tower) Prest'!C53,4,0)","v":0},{"$f":"X181*$X$15","v":0},{"$f":"Y181*$Y$15","v":0},{"$f":"Z181*$Z$15","v":0},{"$f":"AA181*$X$113","v":0},{"$f":"AB181*$Y$113","v":0},{"$f":"AC181*$Z$113","v":0},{"$f":"AD181*$X$39","v":0},{"$f":"AE181*$Y$39","v":0},{"$f":"AF181*$Z$39","v":0},{"$f":"AG181*$X$76","v":0},{"$f":"AH181*$Y$76","v":0},{"$f":"AI181*$Z$76","v":0},{"$f":"AJ181*$X$136","v":0},{"$f":"AK181*$X$158","v":0},{"$f":"SUM(X181:Z181)","v":0},{"$f":"SUM(AA181:AC181)","v":0},{"$f":"SUM(AD181:AF181)","v":0},{"$f":"SUM(AG181:AI181)","v":0},0,0,{"$f":"SUM(AL181:AY181)","v":0}]
[null,{"$f":"IF(BF182=0,\"\",BF182)","v":""},{"$f":"IF(BF182=0,\"\",(VLOOKUP(G182,COD_A,2,FALSE)))","v":""},null,null,null,{"$f":"IF(BF182>0,W182,\"\")","v":""},null,null,{"$f":"IF(BF182>0,(VLOOKUP(G182,COD_A,5,FALSE)),\"\")","v":""},null,null,null,null,null,null,null,{"$f":"IF(BF182>0,(VLOOKUP(G182,COD_A,3,FALSE)),\"\")","v":""},null,"",null,0,"CNV-TS1L1-LINUX",{"$f":"IF('CNV R640 1'!$D$52=W182,1,0)","v":0},{"$f":"IF('CNV R640 2'!$D$52=W182,1,0)","v":0},{"$f":"IF('CNV R640 3'!$D$52=W182,1,0)","v":0},{"$f":"IF('CNV T640 (Rack)'!$D$53=$W$182,1,0)","v":0},{"$f":"IF('Lotto1 T630R 2'!$D$53=$W$182,1,0)","v":0},{"$f":"IF('Lotto1 T630R 3'!$D$53=$W$182,1,0)","v":0},{"$f":"IF('CNV R740 1'!$D$52=W182,1,0)","v":0},{"$f":"IF('CNV R740 2'!$D$52=W182,1,0)","v":0},{"$f":"IF('CNV R740 3'!$D$52=W182,1,0)","v":0},{"$f":"IF('CNV R740xd 1'!$D$52=W182,1,0)","v":0},{"$f":"IF('CNV R740xd 2'!$D$52=W182,1,0)","v":0},{"$f":"IF('CNV R740xd 3'!$D$52=W182,1,0)","v":0},{"$f":"IF('CNV T640 (Tower)'!$D$52=W182,1,0)","v":0},{"$f":"IF('CNV T640 1 (Tower) Prest'!$D$52=W182,1,0)","v":0},{"$f":"X182*$X$15","v":0},{"$f":"Y182*$Y$15","v":0},{"$f":"Z182*$Z$15","v":0},{"$f":"AA182*$X$113","v":0},{"$f":"AB182*$Y$113","v":0},{"$f":"AC182*$Z$113","v":0},{"$f":"AD182*$X$39","v":0},{"$f":"AE182*$Y$39","v":0},{"$f":"AF182*$Z$39","v":0},{"$f":"AG182*$X$76","v":0},{"$f":"AH182*$Y$76","v":0},{"$f":"AI182*$Z$76","v":0},{"$f":"AJ182*$X$136","v":0},{"$f":"AK182*$X$158","v":0},{"$f":"SUM(X182:Z182)","v":0},{"$f":"SUM(AA182:AC182)","v":0},{"$f":"SUM(AD182:AF182)","v":0},{"$f":"SUM(AG182:AI182)","v":0},0,0,{"$f":"SUM(AL182:AY182)","v":0}]
[null,{"$f":"IF(BF183=0,\"\",BF183)","v":""},{"$f":"IF(BF183=0,\"\",(VLOOKUP(G183,COD_A,2,FALSE)))","v":""},null,null,null,{"$f":"IF(BF183>0,W183,\"\")","v":""},null,null,{"$f":"IF(BF183>0,(VLOOKUP(G183,COD_A,5,FALSE)),\"\")","v":""},null,null,null,null,null,null,null,{"$f":"IF(BF183>0,(VLOOKUP(G183,COD_A,3,FALSE)),\"\")","v":""},null,"",null,0,"CNV-TS1L1-CALUSER",{"$f":"'CNV R640 1'!$C$59","v":0},{"$f":"'CNV R640 2'!$C$59","v":0},{"$f":"'CNV R640 3'!$C$59","v":0},{"$f":"'CNV T640 (Rack)'!$C$60","v":0},{"$f":"'Lotto1 T630R 2'!$C$60","v":0},{"$f":"'Lotto1 T630R 3'!$C$60","v":0},{"$f":"'CNV R740 1'!$C$59","v":0},{"$f":"'CNV R740 2'!$C$59","v":0},{"$f":"'CNV R740 3'!$C$59","v":0},{"$f":"'CNV R740xd 1'!$C$60","v":0},{"$f":"'CNV R740xd 2'!$C$60","v":0},{"$f":"'CNV R740xd 3'!$C$60","v":0},{"$f":"'CNV T640 (Tower)'!$C$60","v":0},{"$f":"'CNV T640 1 (Tower) Prest'!$C$60","v":0},{"$f":"X183*$X$15","v":0},{"$f":"Y183*$Y$15","v":0},{"$f":"Z183*$Z$15","v":0},{"$f":"AA183*$X$113","v":0},{"$f":"AB183*$Y$113","v":0},{"$f":"AC183*$Z$113","v":0},{"$f":"AD183*$X$39","v":0},{"$f":"AE183*$Y$39","v":0},{"$f":"AF183*$Z$39","v":0},{"$f":"AG183*$X$76","v":0},{"$f":"AH183*$Y$76","v":0},{"$f":"AI183*$Z$76","v":0},{"$f":"AJ183*$X$136","v":0},{"$f":"AK183*$X$158","v":0},{"$f":"SUM(X183:Z183)","v":0},{"$f":"SUM(AA183:AC183)","v":0},{"$f":"SUM(AD183:AF183)","v":0},{"$f":"SUM(AG183:AI183)","v":0},0,0,{"$f":"SUM(AL183:AY183)","v":0}]
[null,{"$f":"IF(BF184=0,\"\",BF184)","v":""},{"$f":"IF(BF184=0,\"\",(VLOOKUP(G184,COD_A,2,FALSE)))","v":""},null,null,null,{"$f":"IF(BF184>0,W184,\"\")","v":""},null,null,{"$f":"IF(BF184>0,(VLOOKUP(G184,COD_A,5,FALSE)),\"\")","v":""},null,null,null,null,null,null,null,{"$f":"IF(BF184>0,(VLOOKUP(G184,COD_A,3,FALSE)),\"\")","v":""},null,"",null,0,"CNV-TS1L1-CALDEV",{"$f":"'CNV R640 1'!$C$61","v":0},{"$f":"'CNV R640 2'!$C$61","v":0},{"$f":"'CNV R640 3'!$C$61","v":0},{"$f":"'CNV T640 (Rack)'!$C$62","v":0},{"$f":"'Lotto1 T630R 2'!$C$62","v":0},{"$f":"'Lotto1 T630R 3'!$C$62","v":0},{"$f":"'CNV R740 1'!$C$61","v":0},{"$f":"'CNV R740 2'!$C$61","v":0},{"$f":"'CNV R740 3'!$C$61","v":0},{"$f":"'CNV R740xd 1'!$C$62","v":0},{"$f":"'CNV R740xd 2'!$C$62","v":0},{"$f":"'CNV R740xd 3'!$C$62","v":0},{"$f":"'CNV T640 (Tower)'!$C$62","v":0},{"$f":"'CNV T640 1 (Tower) Prest'!$C$62","v":0},{"$f":"X184*$X$15","v":0},{"$f":"Y184*$Y$15","v":0},{"$f":"Z184*$Z$15","v":0},{"$f":"AA184*$X$113","v":0},{"$f":"AB184*$Y$113","v":0},{"$f":"AC184*$Z$113","v":0},{"$f":"AD184*$X$39","v":0},{"$f":"AE184*$Y$39","v":0},{"$f":"AF184*$Z$39","v":0},{"$f":"AG184*$X$76","v":0},{"$f":"AH184*$Y$76","v":0},{"$f":"AI184*$Z$76","v":0},{"$f":"AJ184*$X$136","v":0},{"$f":"AK184*$X$158","v":0},{"$f":"SUM(X184:Z184)","v":0},{"$f":"SUM(AA184:AC184)","v":0},{"$f":"SUM(AD184:AF184)","v":0},{"$f":"SUM(AG184:AI184)","v":0},0,0,{"$f":"SUM(AL184:AY184)","v":0}]
[null,{"$f":"IF('RACK, Accessori e Servizi'!J15=0,\"\",'RACK, Accessori e Servizi'!J15)","v":""},{"$f":"IF(B185=\"\",\"\",(VLOOKUP(G185,COD_A,2,FALSE)))","v":""},null,null,null,{"$f":"IF('RACK, Accessori e Servizi'!J15>0,'RACK, Accessori e Servizi'!K15,\"\")","v":""},null,null,{"$f":"IF(B185=\"\",\"\",(VLOOKUP(G185,COD_A,5,FALSE)))","v":""},null,null,null,null,null,null,null,{"$f":"IF(B185>=\"\",\"\",(VLOOKUP(G185,COD_A,3,FALSE)))","v":""},null,"",null,0]
[null,{"$f":"IF('RACK, Accessori e Servizi'!J24=0,\"\",'RACK, Accessori e Servizi'!J24)","v":""},{"$f":"IF(B186=\"\",\"\",(VLOOKUP(G186,COD_A,2,FALSE)))","v":""},null,null,null,{"$f":"IF('RACK, Accessori e Servizi'!J24>0,'RACK, Accessori e Servizi'!K24,\"\")","v":""},null,null,{"$f":"IF(B186=\"\",\"\",(VLOOKUP(G186,COD_A,5,FALSE)))","v":""},null,null,null,null,null,null,null,{"$f":"IF(B186>=\"\",\"\",(VLOOKUP(G186,COD_A,3,FALSE)))","v":""},null,"",null,0]
[null,{"$f":"IF('RACK, Accessori e Servizi'!J27=0,\"\",'RACK, Accessori e Servizi'!J27)","v":""},{"$f":"IF(B187=\"\",\"\",(VLOOKUP(G187,COD_A,2,FALSE)))","v":""},null,null,null,{"$f":"IF('RACK, Accessori e Servizi'!J27>0,'RACK, Accessori e Servizi'!K27,\"\")","v":""},null,null,{"$f":"IF(B187=\"\",\"\",(VLOOKUP(G187,COD_A,5,FALSE)))","v":""},null,null,null,null,null,null,null,{"$f":"IF(B187>=\"\",\"\",(VLOOKUP(G187,COD_A,3,FALSE)))","v":""},null,"",null,0]
[null,{"$f":"IF('RACK, Accessori e Servizi'!J30=0,\"\",'RACK, Accessori e Servizi'!J30)","v":""},{"$f":"IF(B188=\"\",\"\",(VLOOKUP(G188,COD_A,2,FALSE)))","v":""},null,null,null,{"$f":"IF('RACK, Accessori e Servizi'!J30>0,'RACK, Accessori e Servizi'!K30,\"\")","v":""},null,null,{"$f":"IF(B188=\"\",\"\",(VLOOKUP(G188,COD_A,5,FALSE)))","v":""},null,null,null,null,null,null,null,{"$f":"IF(B188>=\"\",\"\",(VLOOKUP(G188,COD_A,3,FALSE)))","v":""},null,"",null,0]
[null,{"$f":"IF('RACK, Accessori e Servizi'!J75=0,\"\",'RACK, Accessori e Servizi'!J75)","v":""},{"$f":"IF(B189>0,(VLOOKUP(G189,COD_C,2,FALSE)),\"\")","v":""},null,null,null,{"$f":"IF('RACK, Accessori e Servizi'!J75>0,'RACK, Accessori e Servizi'!K75,\"\")","v":""},null,null,{"$f":"IF(B189>0,(VLOOKUP(G189,COD_C,5,FALSE)),\"\")","v":""},null,null,null,null,null,null,null,{"$f":"IF(B189>0,(VLOOKUP(G189,COD_C,3,FALSE)),\"\")","v":""},null,"",null,0]
[null,{"$f":"IF('RACK, Accessori e Servizi'!J79=0,\"\",'RACK, Accessori e Servizi'!J79)","v":""},{"$f":"IF(B190>0,(VLOOKUP(G190,COD_C,2,FALSE)),\"\")","v":""},null,null,null,{"$f":"IF('RACK, Accessori e Servizi'!J79>0,'RACK, Accessori e Servizi'!K79,\"\")","v":""},null,null,{"$f":"IF(B190>0,(VLOOKUP(G190,COD_C,5,FALSE)),\"\")","v":""},null,null,null,null,null,null,null,{"$f":"IF(B190>0,(VLOOKUP(G190,COD_C,3,FALSE)),\"\")","v":""},null,"",null,0]
[null,"ULTERIORI OPZIONI",null,null,null,null,null,null,null,null,null,null,null,null,null,null,null,null,null,null,null,{"$f":"IF(SUM(V192:V200)=0,0,1)","v":0},null,"R630 1","R630 2","R630 3","T630R 1","T630R 2","T630R 3","R730 1","R730 2","R730 3","R730xd 1","R730xd 2","R730xd 3","T630","T630P","R630 1","R630 2","R630 3","T630R",null,null,"R730 1","R730 2","R730 3","R730xd 1","R730xd 2","R730xd 3","T630","T630P","R630","T630R","R730","R730xd","T630","T630P","Totale"]
[null,{"$f":"IF(BF192>=1,BF192,\"\")","v":""},{"$f":"IF(BF192>0,(VLOOKUP(G192,COD_B,2,FALSE)),\"\")","v":""},null,null,null,{"$f":"IF(BF192>=1,W192,\"\")","v":""},null,null,{"$f":"IF(BF192>0,(VLOOKUP(G192,COD_B,5,FALSE)),\"\")","v":""},null,null,null,null,null,null,null,{"$f":"IF(BF192>0,(VLOOKUP(G192,COD_B,3,FALSE)),\"\")","v":""},null,{"$f":"IF(B192=\"\",\"\",R192*B192)","v":""},null,{"$f":"IF(B192>=\"\",0,1)","v":0},"CNV-S1-RDXCC",null,null,null,null,null,null,null,null,null,null,null,null,{"$f":"'CNV T640 (Tower)'!C152","v":0},{"$f":"'CNV T640 1 (Tower) Prest'!C159","v":0},{"$f":"X192*$X$15","v":0},{"$f":"Y192*$Y$15","v":0},{"$f":"Z192*$Z$15","v":0},{"$f":"AA192*$X$113","v":0},{"$f":"AB192*$Y$113","v":0},{"$f":"AC192*$Z$113","v":0},{"$f":"AD192*$X$39","v":0},{"$f":"AE192*$Y$39","v":0},{"$f":"AF192*$Z$39","v":0},{"$f":"AG192*$X$76","v":0},{"$f":"AH192*$Y$76","v":0},{"$f":"AI192*$Z$76","v":0},{"$f":"AJ192*$X$136","v":0},{"$f":"AK192*$X$158","v":0},{"$f":"SUM(X192:Z192)","v":0},{"$f":"SUM(AA192:AC192)","v":0},{"$f":"SUM(AD192:AF192)","v":0},{"$f":"SUM(AG192:AI192)","v":0},{"$f":"AX192","v":0},{"$f":"AY192","v":0},{"$f":"SUM(AL192:AY192)","v":0}]
[null,"","",null,null,null,"",null,null,"",null,null,null,null,null,null,null,"",null,"",null,0,"CNV-874-006887",{"$f":"IF('CNV R640 1'!$D$64=Riepilogo!$W$193,'CNV R640 1'!$C$64,0)","v":0},{"$f":"IF('CNV R640 2'!$D$64=Riepilogo!$W193,'CNV R640 2'!$C$64,0)","v":0},{"$f":"IF('CNV R640 3'!$D$64=Riepilogo!$W193,'CNV R640 3'!$C$64,0)","v":0},{"$f":"IF('CNV T640 (Rack)'!$D$65=Riepilogo!$W$193,'CNV T640 (Rack)'!$C$65,0)","v":0},{"$f":"IF('Lotto1 T630R 2'!$D$65=Riepilogo!W193,'Lotto1 T630R 2'!$C$65,0)","v":0},{"$f":"IF('Lotto1 T630R 3'!$D$65=Riepilogo!W193,'Lotto1 T630R 3'!$C$65,0)","v":0},{"$f":"IF('CNV R740 1'!$D$64=Riepilogo!$W193,'CNV R740 1'!$C$64,0)","v":0},{"$f":"IF('CNV R740 2'!$D$64=Riepilogo!$W193,'CNV R740 2'!$C$64,0)","v":0},{"$f":"IF('CNV R740 3'!$D$64=Riepilogo!$W193,'CNV R740 3'!$C$64,0)","v":0},{"$f":"IF('CNV R740xd 1'!$D$65=Riepilogo!$W193,'CNV R740xd 1'!$C$65,0)","v":0},{"$f":"IF('CNV R740xd 2'!$D$65=Riepilogo!$W193,'CNV R740xd 2'!$C$65,0)","v":0},{"$f":"IF('CNV R740xd 3'!$D$65=Riepilogo!$W193,'CNV R740xd 3'!$C$65,0)","v":0},{"$f":"IF('CNV T640 (Tower)'!$D$64=Riepilogo!$W193,'CNV T640 (Tower)'!$C$64,0)","v":0},{"$f":"IF('CNV T640 1 (Tower) Prest'!$D$65=Riepilogo!$W193,'CNV T640 1 (Tower) Prest'!$C$65,0)","v":0},0,0,0,0,0,0,0,0,0,0,0,0,0,0,0,0,0,0,0,0,0]
[null,"","",null,null,null,"",null,null,"",null,null,null,null,null,null,null,"",null,"",null,0,"CNV-874-006898",{"$f":"IF('CNV R640 1'!$D$64=Riepilogo!$W$194,'CNV R640 1'!$C$64,0)","v":0},{"$f":"IF('CNV R640 2'!$D$64=Riepilogo!$W194,'CNV R640 2'!$C$64,0)","v":0},{"$f":"IF('CNV R640 3'!$D$64=Riepilogo!$W194,'CNV R640 3'!$C$64,0)","v":0},{"$f":"IF('CNV T640 (Rack)'!$D$65=Riepilogo!W194,'CNV T640 (Rack)'!$C$65,0)","v":0},{"$f":"IF('Lotto1 T630R 2'!$D$65=Riepilogo!W194,'Lotto1 T630R 2'!$C$65,0)","v":0},{"$f":"IF('Lotto1 T630R 3'!$D$65=Riepilogo!W194,'Lotto1 T630R 3'!$C$65,0)","v":0},{"$f":"IF('CNV R740 1'!$D$64=Riepilogo!$W194,'CNV R740 1'!$C$64,0)","v":0},{"$f":"IF('CNV R740 2'!$D$64=Riepilogo!$W194,'CNV R740 2'!$C$64,0)","v":0},{"$f":"IF('CNV R740 3'!$D$64=Riepilogo!$W194,'CNV R740 3'!$C$64,0)","v":0},{"$f":"IF('CNV R740xd 1'!$D$65=Riepilogo!$W194,'CNV R740xd 1'!$C$65,0)","v":0},{"$f":"IF('CNV R740xd 2'!$D$65=Riepilogo!$W194,'CNV R740xd 2'!$C$65,0)","v":0},{"$f":"IF('CNV R740xd 3'!$D$65=Riepilogo!$W194,'CNV R740xd 3'!$C$65,0)","v":0},{"$f":"IF('CNV T640 (Tower)'!$D$64=Riepilogo!$W194,'CNV T640 (Tower)'!$C$64,0)","v":0},{"$f":"IF('CNV T640 1 (Tower) Prest'!$D$65=Riepilogo!$W194,'CNV T640 1 (Tower) Prest'!$C$65,0)","v":0},0,0,0,0,0,0,0,0,0,0,0,0,0,0,0,0,0,0,0,0,0]
[null,"","",null,null,null,"",null,null,"",null,null,null,null,null,null,null,"",null,"",null,0,"CNV-874-006888",{"$f":"IF('CNV R640 1'!$D$64=Riepilogo!$W$195,'CNV R640 1'!$C$64,0)","v":0},{"$f":"IF('CNV R640 2'!$D$64=Riepilogo!$W195,'CNV R640 2'!$C$64,0)","v":0},{"$f":"IF('CNV R640 3'!$D$64=Riepilogo!$W195,'CNV R640 3'!$C$64,0)","v":0},{"$f":"IF('CNV T640 (Rack)'!$D$65=Riepilogo!W195,'CNV T640 (Rack)'!$C$65,0)","v":0},{"$f":"IF('Lotto1 T630R 2'!$D$65=Riepilogo!W195,'Lotto1 T630R 2'!$C$65,0)","v":0},{"$f":"IF('Lotto1 T630R 3'!$D$65=Riepilogo!W195,'Lotto1 T630R 3'!$C$65,0)","v":0},{"$f":"IF('CNV R740 1'!$D$64=Riepilogo!$W195,'CNV R740 1'!$C$64,0)","v":0},{"$f":"IF('CNV R740 2'!$D$64=Riepilogo!$W195,'CNV R740 2'!$C$64,0)","v":0},{"$f":"IF('CNV R740 3'!$D$64=Riepilogo!$W195,'CNV R740 3'!$C$64,0)","v":0},{"$f":"IF('CNV R740xd 1'!$D$65=Riepilogo!$W195,'CNV R740xd 1'!$C$65,0)","v":0},{"$f":"IF('CNV R740xd 2'!$D$65=Riepilogo!$W195,'CNV R740xd 2'!$C$65,0)","v":0},{"$f":"IF('CNV R740xd 3'!$D$65=Riepilogo!$W195,'CNV R740xd 3'!$C$65,0)","v":0},{"$f":"IF('CNV T640 (Tower)'!$D$64=Riepilogo!$W195,'CNV T640 (Tower)'!$C$64,0)","v":0},{"$f":"IF('CNV T640 1 (Tower) Prest'!$D$65=Riepilogo!$W195,'CNV T640 1 (Tower) Prest'!$C$65,0)","v":0},0,0,0,0,0,0,0,0,0,0,0,0,0,0,0,0,0,0,0,0,0]
[null,"","",null,null,null,"",null,null,"",null,null,null,null,null,null,null,"",null,"",null,0,"CNV-874-006902",{"$f":"IF('CNV R640 1'!$D$64=Riepilogo!$W$196,'CNV R640 1'!$C$64,0)","v":0},{"$f":"IF('CNV R640 2'!$D$64=Riepilogo!$W196,'CNV R640 2'!$C$64,0)","v":0},{"$f":"IF('CNV R640 3'!$D$64=Riepilogo!$W196,'CNV R640 3'!$C$64,0)","v":0},{"$f":"IF('CNV T640 (Rack)'!$D$65=Riepilogo!W196,'CNV T640 (Rack)'!$C$65,0)","v":0},{"$f":"IF('Lotto1 T630R 2'!$D$65=Riepilogo!W196,'Lotto1 T630R 2'!$C$65,0)","v":0},{"$f":"IF('Lotto1 T630R 3'!$D$65=Riepilogo!W196,'Lotto1 T630R 3'!$C$65,0)","v":0},{"$f":"IF('CNV R740 1'!$D$64=Riepilogo!$W196,'CNV R740 1'!$C$64,0)","v":0},{"$f":"IF('CNV R740 2'!$D$64=Riepilogo!$W196,'CNV R740 2'!$C$64,0)","v":0},{"$f":"IF('CNV R740 3'!$D$64=Riepilogo!$W196,'CNV R740 3'!$C$64,0)","v":0},{"$f":"IF('CNV R740xd 1'!$D$65=Riepilogo!$W196,'CNV R740xd 1'!$C$65,0)","v":0},{"$f":"IF('CNV R740xd 2'!$D$65=Riepilogo!$W196,'CNV R740xd 2'!$C$65,0)","v":0},{"$f":"IF('CNV R740xd 3'!$D$65=Riepilogo!$W196,'CNV R740xd 3'!$C$65,0)","v":0},{"$f":"IF('CNV T640 (Tower)'!$D$64=Riepilogo!$W196,'CNV T640 (Tower)'!$C$64,0)","v":0},{"$f":"IF('CNV T640 1 (Tower) Prest'!$D$65=Riepilogo!$W196,'CNV T640 1 (Tower) Prest'!$C$65,0)","v":0},0,0,0,0,0,0,0,0,0,0,0,0,0,0,0,0,0,0,0,0,0]
[null,"","",null,null,null,"",null,null,"",null,null,null,null,null,null,null,"",null,"",null,0,"CNV-874-006883",{"$f":"IF('CNV R640 1'!$D$64=Riepilogo!$W$197,'CNV R640 1'!$C$64,0)","v":0},{"$f":"IF('CNV R640 2'!$D$64=Riepilogo!$W197,'CNV R640 2'!$C$64,0)","v":0},{"$f":"IF('CNV R640 3'!$D$64=Riepilogo!$W197,'CNV R640 3'!$C$64,0)","v":0},{"$f":"IF('CNV T640 (Rack)'!$D$65=Riepilogo!W197,'CNV T640 (Rack)'!$C$65,0)","v":0},{"$f":"IF('Lotto1 T630R 2'!$D$65=Riepilogo!W197,'Lotto1 T630R 2'!$C$65,0)","v":0},{"$f":"IF('Lotto1 T630R 3'!$D$65=Riepilogo!W197,'Lotto1 T630R 3'!$C$65,0)","v":0},{"$f":"IF('CNV R740 1'!$D$64=Riepilogo!$W197,'CNV R740 1'!$C$64,0)","v":0},{"$f":"IF('CNV R740 2'!$D$64=Riepilogo!$W197,'CNV R740 2'!$C$64,0)","v":0},{"$f":"IF('CNV R740 3'!$D$64=Riepilogo!$W197,'CNV R740 3'!$C$64,0)","v":0},{"$f":"IF('CNV R740xd 1'!$D$65=Riepilogo!$W197,'CNV R740xd 1'!$C$65,0)","v":0},{"$f":"IF('CNV R740xd 2'!$D$65=Riepilogo!$W197,'CNV R740xd 2'!$C$65,0)","v":0},{"$f":"IF('CNV R740xd 3'!$D$65=Riepilogo!$W197,'CNV R740xd 3'!$C$65,0)","v":0},{"$f":"IF('CNV T640 (Tower)'!$D$64=Riepilogo!$W197,'CNV T640 (Tower)'!$C$64,0)","v":0},{"$f":"IF('CNV T640 1 (Tower) Prest'!$D$65=Riepilogo!$W197,'CNV T640 1 (Tower) Prest'!$C$65,0)","v":0},0,0,0,0,0,0,0,0,0,0,0,0,0,0,0,0,0,0,0,0,0]
[null,"","",null,null,null,"",null,null,"",null,null,null,null,null,null,null,"",null,"",null,0,"CNV-874-006894",{"$f":"IF('CNV R640 1'!$D$64=Riepilogo!$W$198,'CNV R640 1'!$C$64,0)","v":0},{"$f":"IF('CNV R640 2'!$D$64=Riepilogo!$W198,'CNV R640 2'!$C$64,0)","v":0},{"$f":"IF('CNV R640 3'!$D$64=Riepilogo!$W198,'CNV R640 3'!$C$64,0)","v":0},{"$f":"IF('CNV T640 (Rack)'!$D$65=Riepilogo!W198,'CNV T640 (Rack)'!$C$65,0)","v":0},{"$f":"IF('Lotto1 T630R 2'!$D$65=Riepilogo!W198,'Lotto1 T630R 2'!$C$65,0)","v":0},{"$f":"IF('Lotto1 T630R 3'!$D$65=Riepilogo!W198,'Lotto1 T630R 3'!$C$65,0)","v":0},{"$f":"IF('CNV R740 1'!$D$64=Riepilogo!$W198,'CNV R740 1'!$C$64,0)","v":0},{"$f":"IF('CNV R740 2'!$D$64=Riepilogo!$W198,'CNV R740 2'!$C$64,0)","v":0},{"$f":"IF('CNV R740 3'!$D$64=Riepilogo!$W198,'CNV R740 3'!$C$64,0)","v":0},{"$f":"IF('CNV R740xd 1'!$D$65=Riepilogo!$W198,'CNV R740xd 1'!$C$65,0)","v":0},{"$f":"IF('CNV R740xd 2'!$D$65=Riepilogo!$W198,'CNV R740xd 2'!$C$65,0)","v":0},{"$f":"IF('CNV R740xd 3'!$D$65=Riepilogo!$W198,'CNV R740xd 3'!$C$65,0)","v":0},{"$f":"IF('CNV T640 (Tower)'!$D$64=Riepilogo!$W198,'CNV T640 (Tower)'!$C$64,0)","v":0},{"$f":"IF('CNV T640 1 (Tower) Prest'!$D$65=Riepilogo!$W198,'CNV T640 1 (Tower) Prest'!$C$65,0)","v":0},0,0,0,0,0,0,0,0,0,0,0,0,0,0,0,0,0,0,0,0,0]
[null,"","",null,null,null,"",null,null,"",null,null,null,null,null,null,null,"",null,"",null,0,"CNV-874-006884",{"$f":"IF('CNV R640 1'!$D$64=Riepilogo!$W$199,'CNV R640 1'!$C$64,0)","v":0},{"$f":"IF('CNV R640 2'!$D$64=Riepilogo!$W199,'CNV R640 2'!$C$64,0)","v":0},{"$f":"IF('CNV R640 3'!$D$64=Riepilogo!$W199,'CNV R640 3'!$C$64,0)","v":0},{"$f":"IF('CNV T640 (Rack)'!$D$65=Riepilogo!W199,'CNV T640 (Rack)'!$C$65,0)","v":0},{"$f":"IF('Lotto1 T630R 2'!$D$65=Riepilogo!W199,'Lotto1 T630R 2'!$C$65,0)","v":0},{"$f":"IF('Lotto1 T630R 3'!$D$65=Riepilogo!W199,'Lotto1 T630R 3'!$C$65,0)","v":0},{"$f":"IF('CNV R740 1'!$D$64=Riepilogo!$W199,'CNV R740 1'!$C$64,0)","v":0},{"$f":"IF('CNV R740 2'!$D$64=Riepilogo!$W199,'CNV R740 2'!$C$64,0)","v":0},{"$f":"IF('CNV R740 3'!$D$64=Riepilogo!$W199,'CNV R740 3'!$C$64,0)","v":0},{"$f":"IF('CNV R740xd 1'!$D$65=Riepilogo!$W199,'CNV R740xd 1'!$C$65,0)","v":0},{"$f":"IF('CNV R740xd 2'!$D$65=Riepilogo!$W199,'CNV R740xd 2'!$C$65,0)","v":0},{"$f":"IF('CNV R740xd 3'!$D$65=Riepilogo!$W199,'CNV R740xd 3'!$C$65,0)","v":0},{"$f":"IF('CNV T640 (Tower)'!$D$64=Riepilogo!$W199,'CNV T640 (Tower)'!$C$64,0)","v":0},{"$f":"IF('CNV T640 1 (Tower) Prest'!$D$65=Riepilogo!$W199,'CNV T640 1 (Tower) Prest'!$C$65,0)","v":0},0,0,0,0,0,0,0,0,0,0,0,0,0,0,0,0,0,0,0,0,0]
[null,"","",null,null,null,"",null,null,"",null,null,null,null,null,null,null,{"$f":"IF(BF200>0,(VLOOKUP(G200,COD_B,3,FALSE)),\"\")","v":""},null,"",null,0,"CNV-874-006895",{"$f":"IF('CNV R640 1'!$D$64=Riepilogo!$W$200,'CNV R640 1'!$C$64,0)","v":0},{"$f":"IF('CNV R640 2'!$D$64=Riepilogo!$W200,'CNV R640 2'!$C$64,0)","v":0},{"$f":"IF('CNV R640 3'!$D$64=Riepilogo!$W200,'CNV R640 3'!$C$64,0)","v":0},{"$f":"IF('CNV T640 (Rack)'!$D$65=Riepilogo!W200,'CNV T640 (Rack)'!$C$65,0)","v":0},{"$f":"IF('Lotto1 T630R 2'!$D$65=Riepilogo!W200,'Lotto1 T630R 2'!$C$65,0)","v":0},{"$f":"IF('Lotto1 T630R 3'!$D$65=Riepilogo!W200,'Lotto1 T630R 3'!$C$65,0)","v":0},{"$f":"IF('CNV R740 1'!$D$64=Riepilogo!$W200,'CNV R740 1'!$C$64,0)","v":0},{"$f":"IF('CNV R740 2'!$D$64=Riepilogo!$W200,'CNV R740 2'!$C$64,0)","v":0},{"$f":"IF('CNV R740 3'!$D$64=Riepilogo!$W200,'CNV R740 3'!$C$64,0)","v":0},{"$f":"IF('CNV R740xd 1'!$D$65=Riepilogo!$W200,'CNV R740xd 1'!$C$65,0)","v":0},{"$f":"IF('CNV R740xd 2'!$D$65=Riepilogo!$W200,'CNV R740xd 2'!$C$65,0)","v":0},{"$f":"IF('CNV R740xd 3'!$D$65=Riepilogo!$W200,'CNV R740xd 3'!$C$65,0)","v":0},{"$f":"IF('CNV T640 (Tower)'!$D$64=Riepilogo!$W200,'CNV T640 (Tower)'!$C$64,0)","v":0},{"$f":"IF('CNV T640 1 (Tower) Prest'!$D$65=Riepilogo!$W200,'CNV T640 1 (Tower) Prest'!$C$65,0)","v":0},0,0,0,0,0,0,0,0,0,0,0,0,0,0,0,0,0,0,0,0,0]
[null,"",{"$f":"IF(BF201>0,(VLOOKUP(G201,COD_B,2,FALSE)),\"\")","v":""},null,null,null,{"$f":"IF(BF201>=1,W201,\"\")","v":""},null,null,{"$f":"IF(BF201>0,(VLOOKUP(G201,COD_B,5,FALSE)),\"\")","v":""},null,null,null,null,null,null,null,"",null,{"$f":"IF(B201=\"\",\"\",R201*B201)","v":""},null,0,"CNV-210-AHRT",{"$f":"IF('CNV R640 1'!$D$67=Riepilogo!$W$201,'CNV R640 1'!$C$67,0)","v":0},{"$f":"IF('CNV R640 2'!$D$67=Riepilogo!$W$201,'CNV R640 2'!$C$67,0)","v":0},{"$f":"IF('CNV R640 3'!$D$67=Riepilogo!$W$201,'CNV R640 3'!$C$67,0)","v":0},{"$f":"IF('CNV T640 (Rack)'!$D$68=Riepilogo!W201,'CNV T640 (Rack)'!$C$68,0)","v":0},{"$f":"IF('Lotto1 T630R 2'!$D$68=Riepilogo!W201,'Lotto1 T630R 2'!$C$68,0)","v":0},{"$f":"IF('Lotto1 T630R 3'!$D$68=Riepilogo!W201,'Lotto1 T630R 3'!$C$68,0)","v":0},{"$f":"IF('CNV R740 1'!$D$67=Riepilogo!$W201,'CNV R740 1'!$C$67,0)","v":0},{"$f":"IF('CNV R740 2'!$D$67=Riepilogo!$W201,'CNV R740 2'!$C$67,0)","v":0},{"$f":"IF('CNV R740 3'!$D$67=Riepilogo!$W201,'CNV R740 3'!$C$67,0)","v":0},{"$f":"IF('CNV R740xd 1'!$D$68=Riepilogo!$W201,'CNV R740xd 1'!$C$68,0)","v":0},{"$f":"IF('CNV R740xd 2'!$D$68=Riepilogo!$W201,'CNV R740xd 2'!$C$68,0)","v":0},{"$f":"IF('CNV R740xd 3'!$D$68=Riepilogo!$W201,'CNV R740xd 3'!$C$68,0)","v":0},{"$f":"IF('CNV T640 (Tower)'!$D$67=Riepilogo!$W201,'CNV T640 (Tower)'!$C$67,0)","v":0},{"$f":"IF('CNV T640 1 (Tower) Prest'!$D$68=Riepilogo!$W201,'CNV T640 1 (Tower) Prest'!$C$68,0)","v":0},{"$f":"X201*$X$15","v":0},{"$f":"Y201*$Y$15","v":0},{"$f":"Z201*$Z$15","v":0},{"$f":"AA201*$X$113","v":0},{"$f":"AB201*$Y$113","v":0},{"$f":"AC201*$Z$113","v":0},{"$f":"AD201*$X$39","v":0},{"$f":"AE201*$Y$39","v":0},{"$f":"AF201*$Z$39","v":0},{"$f":"AG201*$X$76","v":0},{"$f":"AH201*$Y$76","v":0},{"$f":"AI201*$Z$76","v":0},{"$f":"AJ201*$X$136","v":0},{"$f":"AK201*$X$158","v":0},{"$f":"SUM(X201:Z201)","v":0},{"$f":"SUM(AA201:AC201)","v":0},{"$f":"SUM(AD201:AF201)","v":0},{"$f":"SUM(AG201:AI201)","v":0},{"$f":"AX201","v":0},{"$f":"AY201","v":0},{"$f":"SUM(AL201:AY201)","v":0}]
[null,"","",null,null,null,"",null,null,{"$f":"IF(BF202>0,(VLOOKUP(G202,COD_B,5,FALSE)),\"\")","v":""},null,null,null,null,null,null,null,"",null,"",null,0,"CNV-210-AHRP",{"$f":"IF('CNV R640 1'!$D$67=Riepilogo!$W$202,'CNV R640 1'!$C$67,0)","v":0},{"$f":"IF('CNV R640 2'!$D$67=Riepilogo!$W$202,'CNV R640 2'!$C$67,0)","v":0},{"$f":"IF('CNV R640 3'!$D$67=Riepilogo!$W$202,'CNV R640 3'!$C$67,0)","v":0},{"$f":"IF('CNV T640 (Rack)'!$D$68=Riepilogo!W202,'CNV T640 (Rack)'!$C$68,0)","v":0},{"$f":"IF('CNV T640 (Rack)'!$D$68=Riepilogo!W202,'CNV T640 (Rack)'!$C$68,0)","v":0},{"$f":"IF('CNV T640 (Rack)'!$D$68=Riepilogo!W202,'CNV T640 (Rack)'!$C$68,0)","v":0},{"$f":"IF('CNV R740 1'!$D$67=Riepilogo!$W202,'CNV R740 1'!$C$67,0)","v":0},{"$f":"IF('CNV R740 2'!$D$67=Riepilogo!$W202,'CNV R740 2'!$C$67,0)","v":0},{"$f":"IF('CNV R740 3'!$D$67=Riepilogo!$W202,'CNV R740 3'!$C$67,0)","v":0},{"$f":"IF('CNV R740xd 1'!$D$68=Riepilogo!$W202,'CNV R740xd 1'!$C$68,0)","v":0},{"$f":"IF('CNV R740xd 2'!$D$68=Riepilogo!$W202,'CNV R740xd 2'!$C$68,0)","v":0},{"$f":"IF('CNV R740xd 3'!$D$68=Riepilogo!$W202,'CNV R740xd 3'!$C$68,0)","v":0},{"$f":"IF('CNV T640 (Tower)'!$D$67=Riepilogo!$W202,'CNV T640 (Tower)'!$C$67,0)","v":0},{"$f":"IF('CNV T640 1 (Tower) Prest'!$D$68=Riepilogo!$W202,'CNV T640 1 (Tower) Prest'!$C$68,0)","v":0},0,0,0,0,0,0,0,0,0,0,0,0,0,0,0,0,0,0,0,0,0]
[null,"","",null,null,null,"",null,null,"",null,null,null,null,null,null,null,"",null,"",null,0,"CNV-210-AHRF",{"$f":"'CNV R640 1'!$C$70","v":0},{"$f":"'CNV R640 2'!$C$70","v":0},{"$f":"'CNV R640 3'!$C$70","v":0},{"$f":"'CNV T640 (Rack)'!$C$71","v":0},{"$f":"'Lotto1 T630R 2'!$C$71","v":0},{"$f":"'Lotto1 T630R 3'!$C$71","v":0},{"$f":"'CNV R740 1'!$C$70","v":0},{"$f":"'CNV R740 2'!$C$70","v":0},{"$f":"'CNV R740 3'!$C$70","v":0},{"$f":"'CNV R740xd 1'!$C$71","v":0},{"$f":"'CNV R740xd 2'!$C$71","v":0},{"$f":"'CNV R740xd 3'!$C$71","v":0},{"$f":"'CNV T640 (Tower)'!C70","v":0},{"$f":"'CNV T640 1 (Tower) Prest'!C71","v":0},{"$f":"X203","v":0},{"$f":"Y203","v":0},0,0,0,0,0,0,0,0,0,0,0,0,{"$f":"SUM(X203:Z203)","v":0},{"$f":"SUM(AA203:AC203)","v":0},{"$f":"SUM(AD203:AF203)","v":0},{"$f":"SUM(AG203:AI203)","v":0},{"$f":"AX203","v":0},{"$f":"AY203","v":0},{"$f":"SUM(AL203:AY203)","v":0}]
[null,"","",null,null,null,"",null,null,"",null,null,null,null,null,null,null,"",null,"",null,0,"CNV-210-AIKY",{"$f":"'CNV R640 1'!$C$73","v":0},{"$f":"'CNV R640 2'!$C$73","v":0},{"$f":"'CNV R640 3'!$C$73","v":0},{"$f":"'CNV T640 (Rack)'!$C$74","v":0},{"$f":"'Lotto1 T630R 2'!$C$74","v":0},{"$f":"'Lotto1 T630R 3'!$C$74","v":0},{"$f":"'CNV R740 1'!$C$73","v":0},{"$f":"'CNV R740 2'!$C$73","v":0},{"$f":"'CNV R740 3'!$C$73","v":0},{"$f":"'CNV R740xd 1'!$C$74","v":0},{"$f":"'CNV R740xd 2'!$C$74","v":0},{"$f":"'CNV R740xd 3'!$C$74","v":0},{"$f":"'CNV T640 (Tower)'!C73","v":0},{"$f":"'CNV T640 1 (Tower) Prest'!C74","v":0},{"$f":"X204","v":0},0,0,0,0,0,0,0,0,0,0,0,0,0,0,0,0,0,0,0,0]
[null,{"$f":"IF('RACK, Accessori e Servizi'!J18=0,\"\",'RACK, Accessori e Servizi'!J18)","v":""},{"$f":"IF(B205=\"\",\"\",(VLOOKUP(G205,COD_B,2,FALSE)))","v":""},null,null,null,{"$f":"IF('RACK, Accessori e Servizi'!J18>0,'RACK, Accessori e Servizi'!K18,\"\")","v":""},null,null,{"$f":"IF(B205=\"\",\"\",(VLOOKUP(G205,COD_B,5,FALSE)))","v":""},null,null,null,null,null,null,null,{"$f":"IF(B205=\"\",\"\",(VLOOKUP(G205,COD_B,3,FALSE)))","v":""},null,{"$f":"IF(B205=\"\",\"\",R205*B205)","v":""},null,0]
[null,{"$f":"IF('RACK, Accessori e Servizi'!J21=0,\"\",'RACK, Accessori e Servizi'!J21)","v":""},{"$f":"IF(B206=\"\",\"\",(VLOOKUP(G206,COD_B,2,FALSE)))","v":""},null,null,null,{"$f":"IF('RACK, Accessori e Servizi'!J21>0,'RACK, Accessori e Servizi'!K21,\"\")","v":""},null,null,{"$f":"IF(B206=\"\",\"\",(VLOOKUP(G206,COD_B,5,FALSE)))","v":""},null,null,null,null,null,null,null,{"$f":"IF(B206=\"\",\"\",(VLOOKUP(G206,COD_B,3,FALSE)))","v":""},null,{"$f":"IF(B206=\"\",\"\",R206*B206)","v":""},null,0]
[null,"TOTALE ULTERIORI OPZIONI (I.V.A. Esclusa)",null,null,null,null,null,null,null,null,null,null,null,null,null,null,null,{"$f":"SUM(T192:U206)","v":0},null,null,null,{"$f":"IF(R207>0,1,0)","v":0}]
[null,"TOTALE COSTO (I.V.A. Esclusa)",null,null,null,null,null,null,null,null,null,null,null,null,null,null,null,{"$f":"SUM(T15:U190)","v":0},null,null,null,1]
[null,"I.V.A.",null,null,null,null,null,null,null,null,null,null,null,null,null,null,null,{"$f":"(R208+R207)*22%","v":0},null,null,null,1]
[null,"TOTALE ORDINE",null,null,null,null,null,null,null,null,null,null,null,null,null,null,null,{"$f":"SUM(R207:U209)","v":0},null,null,null,1]
[null,null,null,null,null,null,null,null,null,null,null,null,null,null,null,null,null,null,null,null,null,1]
[null,null,null,null,null,null,null,null,null,null,null,null,null,null,null,null,null,null,null,null,null,1]
[null,null,null,null,null,null,null,null,null,null,null,null,null,null,null,null,null,null,null,null,null,1]
[null,null,null,{"$f":"IF(G6>0,\"DETTAGLIO CONFIGURAZIONI SERVER LOTTO 1 \",\"\")","v":""},null,null,null,null,null,null,null,null,null,null,null,null,null,null,null,null,null,1]
[null,null,null,null,null,null,null,null,null,null,null,null,null,null,null,null,null,null,null,null,null,1]
[null,null,null,null,null,null,null,null,null,null,null,null,null,null,null,null,null,null,null,null,null,1]
[null,null,null,null,null,null,null,null,null,null,null,null,null,null,null,null,null,null,null,null,null,{"$f":"IF($B$15>=\"\",0,1)","v":0}]
[null,"PowerEdge R640 Conf.1",null,null,{"$f":"SRV_A","v":0},"Server",null,null,"PowerEdge R640 Conf.2",null,null,{"$f":"SRV_AA","v":0},"Server",null,null,"PowerEdge R640 Conf.3",null,null,{"$f":"SRV_AAA","v":0},"Server",null,{"$f":"IF($B$15>=\"\",0,1)","v":0}]
[null,null,null,null,null,null,null,null,null,null,null,null,null,null,null,null,null,null,null,null,null,{"$f":"IF($B$15>=\"\",0,1)","v":0}]
[null,{"$f":"IF(SRV_A>0,\"1\",\"-\")","v":"-"},{"$f":"IF(B220=\"-\",\"-\",CONCATENATE(MID($C$15,1,21),\" - \",$G$15))","v":"-"},null,null,null,null,null,{"$f":"IF(SRV_AA>0,\"1\",\"-\")","v":"-"},{"$f":"IF(I220=\"-\",\"-\",CONCATENATE(MID($C$15,1,21),\" - \",$G$15))","v":"-"},null,null,null,null,null,{"$f":"IF(SRV_AAA>0,\"1\",\"-\")","v":"-"},{"$f":"IF(P220=\"-\",\"-\",CONCATENATE(MID($C$15,1,21),\" - \",$G$15))","v":"-"},null,null,null,null,{"$f":"IF((Y220+X220+W220)>0,1,0)","v":0},{"$f":"IF(B220=\"-\",0,B220)","v":0},{"$f":"IF(I220=\"-\",0,I220)","v":0},{"$f":"IF(P220=\"-\",0,P220)","v":0}]
[null,{"$f":"IF(X16=0,\"-\",X16)","v":"-"},{"$f":"IF(B221=\"-\",\"-\",CONCATENATE(MID($C$16,1,21),\" - \",$G$16))","v":"-"},null,null,null,null,null,{"$f":"IF(Y16=0,\"-\",Y16)","v":"-"},{"$f":"IF(I221=\"-\",\"-\",CONCATENATE(MID(C16,1,21),\" - \",G16))","v":"-"},null,null,null,null,null,{"$f":"IF(Z16=0,\"-\",Z16)","v":"-"},{"$f":"IF(P221=\"-\",\"-\",CONCATENATE(MID(C16,1,21),\" - \",G16))","v":"-"},null,null,null,null,{"$f":"IF((Y221+X221+W221)>0,1,0)","v":0},{"$f":"IF(B221=\"-\",0,B221)","v":0},{"$f":"IF(I221=\"-\",0,I221)","v":0},{"$f":"IF(P221=\"-\",0,P221)","v":0}]
[null,"-",{"$f":"IF(B222=\"-\",\"-\",CONCATENATE(MID($C$17,1,21),\" - \",$G$17))","v":"-"},null,null,null,null,null,"-","-",null,null,null,null,null,"-","-",null,null,null,null,0,0,0,0]
[null,"-",{"$f":"IF(B223=\"-\",\"-\",CONCATENATE(MID($C$18,1,21),\" - \",$G$18))","v":"-"},null,null,null,null,null,"-","-",null,null,null,null,null,"-","-",null,null,null,null,0,0,0,0]
[null,"-",{"$f":"IF(B224=\"-\",\"-\",CONCATENATE(MID(C19,1,21),\" - \",G19))","v":"-"},null,null,null,null,null,"-","-",null,null,null,null,null,"-","-",null,null,null,null,0,0,0,0]
[null,"-","-",null,null,null,null,null,"-","-",null,null,null,null,null,"-","-",null,null,null,null,0,{"$f":"IF(B225=\"-\",0,B225)","v":0},{"$f":"IF(I225=\"-\",0,I225)","v":0},{"$f":"IF(P225=\"-\",0,P225)","v":0}]
[null,"-","-",null,null,null,null,null,"-","-",null,null,null,null,null,"-","-",null,null,null,null,{"$f":"IF((Y226+X226+W226)>0,1,0)","v":0},{"$f":"IF(B226=\"-\",0,B226)","v":0},{"$f":"IF(I226=\"-\",0,I226)","v":0},{"$f":"IF(P226=\"-\",0,P226)","v":0}]
[null,"-","-",null,null,null,null,null,"-","-",null,null,null,null,null,"-","-",null,null,null,null,0,0,0,0]
[null,"-","-",null,null,null,null,null,"-","-",null,null,null,null,null,"-","-",null,null,null,null,0,0,0,0]
[null,"-","-",null,null,null,null,null,"-","-",null,null,null,null,null,"-","-",null,null,null,null,0,0,0,0]
[null,"-","-",null,null,null,null,null,"-","-",null,null,null,null,null,"-","-",null,null,null,null,{"$f":"IF((Y230+X230+W230)>0,1,0)","v":0},{"$f":"IF(B230=\"-\",0,B230)","v":0},{"$f":"IF(I230=\"-\",0,I230)","v":0},{"$f":"IF(P230=\"-\",0,P230)","v":0}]
[null,"-","-",null,null,null,null,null,"-","-",null,null,null,null,null,"-","-",null,null,null,null,0,0,0,0]
[null,"-","-",null,null,null,null,null,"-","-",null,null,null,null,null,"-","-",null,null,null,null,0,0,0,0]
[null,"-","-",null,null,null,null,null,"-","-",null,null,null,null,null,"-","-",null,null,null,null,0,0,0,0]
[null,"-","-",null,null,null,null,null,"-","-",null,null,null,null,null,"-","-",null,null,null,null,0,0,0,0]
[null,"-","-",null,null,null,null,null,"-","-",null,null,null,null,null,"-","-",null,null,null,null,0,0,0,0]
[null,"-","-",null,null,null,null,null,"-","-",null,null,null,null,null,"-","-",null,null,null,null,0,0,0,0]
[null,"-","-",null,null,null,null,null,"-","-",null,null,null,null,null,"-","-",null,null,null,null,0,0,0,0]
[null,"-","-",null,null,null,null,null,"-","-",null,null,null,null,null,"-","-",null,null,null,null,0,0,0,0]
[null,"-","-",null,null,null,null,null,"-","-",null,null,null,null,null,"-","-",null,null,null,null,0,0,0,0]
[null,"-","-",null,null,null,null,null,"-","-",null,null,null,null,null,"-","-",null,null,null,null,0,0,0,0]
[null,"-","-",null,null,null,null,null,"-","-",null,null,null,null,null,"-","-",null,null,null,null,0,0,0,0]
[null,"-","-",null,null,null,null,null,"-","-",null,null,null,null,null,"-","-",null,null,null,null,0,0,0,0]
[null,{"$f":"IF(X180=0,\"-\",X180)","v":"-"},{"$f":"IF(B243=\"-\",\"-\",CONCATENATE(MID(C180,1,21),\" - \",G180))","v":"-"},null,null,null,null,null,{"$f":"IF(Y180=0,\"-\",Y180)","v":"-"},{"$f":"IF(I243=\"-\",\"-\",CONCATENATE(MID(C180,1,21),\" - \",G180))","v":"-"},null,null,null,null,null,{"$f":"IF(Z180=0,\"-\",Z180)","v":"-"},{"$f":"IF(P243=\"-\",\"-\",CONCATENATE(MID(C180,1,21),\" - \",G180))","v":"-"},null,null,null,null,0,0,0,0]
[null,{"$f":"IF(X181=0,\"-\",X181)","v":"-"},{"$f":"IF(B244=\"-\",\"-\",CONCATENATE(MID(C181,1,21),\" - \",G181))","v":"-"},null,null,null,null,null,{"$f":"IF(Y181=0,\"-\",Y181)","v":"-"},{"$f":"IF(I244=\"-\",\"-\",CONCATENATE(MID(C181,1,21),\" - \",G181))","v":"-"},null,null,null,null,null,{"$f":"IF(Z181=0,\"-\",Z181)","v":"-"},{"$f":"IF(P244=\"-\",\"-\",CONCATENATE(MID(C181,1,21),\" - \",G181))","v":"-"},null,null,null,null,0,0,0,0]
[null,{"$f":"IF(X182=0,\"-\",X182)","v":"-"},{"$f":"IF(B245=\"-\",\"-\",CONCATENATE(MID(C182,1,21),\" - \",G182))","v":"-"},null,null,null,null,null,{"$f":"IF(Y182=0,\"-\",Y182)","v":"-"},{"$f":"IF(I245=\"-\",\"-\",CONCATENATE(MID(C182,1,21),\" - \",G182))","v":"-"},null,null,null,null,null,{"$f":"IF(Z182=0,\"-\",Z182)","v":"-"},{"$f":"IF(P245=\"-\",\"-\",CONCATENATE(MID(C182,1,21),\" - \",G182))","v":"-"},null,null,null,null,0,0,0,0]
[null,{"$f":"IF(X183=0,\"-\",X183)","v":"-"},{"$f":"IF(B246=\"-\",\"-\",CONCATENATE(MID(C183,1,21),\" - \",G183))","v":"-"},null,null,null,null,null,{"$f":"IF(Y183=0,\"-\",Y183)","v":"-"},{"$f":"IF(I246=\"-\",\"-\",CONCATENATE(MID(C183,1,21),\" - \",G183))","v":"-"},null,null,null,null,null,{"$f":"IF(Z183=0,\"-\",Z183)","v":"-"},{"$f":"IF(P246=\"-\",\"-\",CONCATENATE(MID(C183,1,21),\" - \",G183))","v":"-"},null,null,null,null,0,0,0,0]
[null,{"$f":"IF(X184=0,\"-\",X184)","v":"-"},{"$f":"IF(B247=\"-\",\"-\",CONCATENATE(MID(C184,1,21),\" - \",G184))","v":"-"},null,null,null,null,null,{"$f":"IF(Y184=0,\"-\",Y184)","v":"-"},{"$f":"IF(I247=\"-\",\"-\",CONCATENATE(MID(C184,1,21),\" - \",G184))","v":"-"},null,null,null,null,null,{"$f":"IF(Z184=0,\"-\",Z184)","v":"-"},{"$f":"IF(P247=\"-\",\"-\",CONCATENATE(MID(C184,1,21),\" - \",G184))","v":"-"},null,null,null,null,0,0,0,0]
[null,{"$f":"IF(X193=0,\"-\",X193)","v":"-"},{"$f":"IF(B248=\"-\",\"-\",CONCATENATE(MID(C193,1,21),\" - \",G193))","v":"-"},null,null,null,null,null,{"$f":"IF(Y193=0,\"-\",Y193)","v":"-"},{"$f":"IF(I248=\"-\",\"-\",CONCATENATE(MID(C193,1,21),\" - \",G193))","v":"-"},null,null,null,null,null,{"$f":"IF(Z193=0,\"-\",Z193)","v":"-"},{"$f":"IF(P248=\"-\",\"-\",CONCATENATE(MID(C193,1,21),\" - \",G193))","v":"-"},null,null,null,null,0,0,0,0]
[null,"-","-",null,null,null,null,null,"-","-",null,null,null,null,null,"-","-",null,null,null,null,0,0,0,0]
[null,"-","-",null,null,null,null,null,"-","-",null,null,null,null,null,"-","-",null,null,null,null,0,0,0,0]
[null,"-","-",null,null,null,null,null,"-","-",null,null,null,null,null,"-","-",null,null,null,null,0,0,0,0]
[null,"-","-",null,null,null,null,null,"-","-",null,null,null,null,null,"-","-",null,null,null,null,0,0,0,0]
[null,"-","-",null,null,null,null,null,"-","-",null,null,null,null,null,"-","-",null,null,null,null,0,0,0,0]
[null,"-","-",null,null,null,null,null,"-","-",null,null,null,null,null,"-","-",null,null,null,null,0,0,0,0]
[null,"-","-",null,null,null,null,null,"-","-",null,null,null,null,null,"-","-",null,null,null,null,{"$f":"IF((Y255+X255+W255)>0,1,0)","v":0},{"$f":"IF(B255=\"-\",0,B255)","v":0},{"$f":"IF(I255=\"-\",0,I255)","v":0},{"$f":"IF(P255=\"-\",0,P255)","v":0}]
[null,"-","-",null,null,null,null,null,"-","-",null,null,null,null,null,"-","-",null,null,null,null,0,0,0,0]
[null,"-","-",null,null,null,null,null,"-","-",null,null,null,null,null,"-","-",null,null,null,null,0,0,0,0]
[null,"-","-",null,null,null,null,null,"-","-",null,null,null,null,null,"-","-",null,null,null,null,0,0,0,0]
[null,"-","-",null,null,null,null,null,"-","-",null,null,null,null,null,"-","-",null,null,null,null,0,0,0,0]
[null,null,null,null,null,null,null,null,null,null,null,null,null,null,null,null,null,null,null,null,null,{"$f":"IF($B$15>=\"\",0,1)","v":0}]
[null,"Configurazione RAID",null,null,null,null,null,null,"Configurazione RAID",null,null,null,null,null,null,"Configurazione RAID",null,null,null,null,null,0]
[null,null,null,null,null,null,null,null,null,null,null,null,null,null,null,null,null,null,null,null,null,0]
[null,{"$f":"'CNV R640 1'!$B$96","v":"SCRIVERE QUI' LA CONFIGURAZIONE RAID RICHIESTA.\nR640 1\n"},null,null,null,null,null,null,{"$f":"'CNV R640 2'!$B$96","v":"SCRIVERE QUI' LA CONFIGURAZIONE RAID RICHIESTA.\nR640 2\n"},null,null,null,null,null,null,{"$f":"'CNV R640 3'!$B$96","v":"SCRIVERE QUI' LA CONFIGURAZIONE RAID RICHIESTA.\nR640 3\n"},null,null,null,null,null,0]
[null,null,null,null,null,null,null,null,null,null,null,null,null,null,null,null,null,null,null,null,null,0]
[null,null,null,null,null,null,null,null,null,null,null,null,null,null,null,null,null,null,null,null,null,0]
[null,null,null,null,null,null,null,null,null,null,null,null,null,null,null,null,null,null,null,null,null,0]
[null,null,null,null,null,null,null,null,null,null,null,null,null,null,null,null,null,null,null,null,null,0]
[null,null,null,null,null,null,null,null,null,null,null,null,null,null,null,null,null,null,null,null,null,0]
[null,null,null,null,null,null,null,null,null,null,null,null,null,null,null,null,null,null,null,null,null,0]
[null,null,null,null,null,null,null,null,null,null,null,null,null,null,null,null,null,null,null,null,null,0]
[null,null,null,null,null,null,null,null,null,null,null,null,null,null,null,null,null,null,null,null,null,0]
[null,null,null,null,null,null,null,null,null,null,null,null,null,null,null,null,null,null,null,null,null,0]
[null,null,null,null,null,null,null,null,null,null,null,null,null,null,null,null,null,null,null,null,null,0]
[null,null,null,null,null,null,null,null,null,null,null,null,null,null,null,null,null,null,null,null,null,0]
[null,null,null,null,null,null,null,null,null,null,null,null,null,null,null,null,null,null,null,null,null,0]
[null,null,null,null,null,null,null,null,null,null,null,null,null,null,null,null,null,null,null,null,null,0]
[null,null,null,null,null,null,null,null,null,null,null,null,null,null,null,null,null,null,null,null,null,0]
[null,null,null,null,null,null,null,null,null,null,null,null,null,null,null,null,null,null,null,null,null,0]
[null,null,null,null,null,null,null,null,null,null,null,null,null,null,null,null,null,null,null,null,null,0]
[null,null,null,null,null,null,null,null,null,null,null,null,null,null,null,null,null,null,null,null,null,0]
[null,null,null,null,null,null,null,null,null,null,null,null,null,null,null,null,null,null,null,null,null,{"$f":"IF($B$39>=\"\",0,1)","v":0}]
[null,"PowerEdge 740 Conf.1",null,null,{"$f":"SRV_B1.1","v":0},"Server",null,null,"PowerEdge 740 Conf.2",null,null,{"$f":"SRV_B1.2","v":0},"Server",null,null,"PowerEdge 740 Conf.3",null,null,{"$f":"SRV_B1.3","v":0},"Server",null,{"$f":"IF($B$39>=\"\",0,1)","v":0}]
[null,null,null,null,null,null,null,null,null,null,null,null,null,null,null,null,null,null,null,null,null,{"$f":"IF($B$39>=\"\",0,1)","v":0}]
[null,{"$f":"IF(SRV_B1.1>0,\"1\",\"-\")","v":"-"},{"$f":"IF(B284=\"-\",\"-\",CONCATENATE(MID(C39,1,24),\" - \",G39))","v":"-"},null,null,null,null,null,{"$f":"IF(SRV_B1.2>0,\"1\",\"-\")","v":"-"},{"$f":"IF(I284=\"-\",\"-\",CONCATENATE(MID(C39,1,24),\" - \",G39))","v":"-"},null,null,null,null,null,{"$f":"IF(SRV_B1.3>0,\"1\",\"-\")","v":"-"},{"$f":"IF(P284=\"-\",\"-\",CONCATENATE(MID(C39,1,24),\" - \",G39))","v":"-"},null,null,null,null,{"$f":"IF((Y284+X284+W284)>0,1,0)","v":0},{"$f":"IF(B284=\"-\",0,B284)","v":0},{"$f":"IF(I284=\"-\",0,I284)","v":0},{"$f":"IF(P284=\"-\",0,P284)","v":0}]
[null,{"$f":"IF(X40=0,\"-\",X40)","v":"-"},"-",null,null,null,null,null,{"$f":"IF(Y40=0,\"-\",Y40)","v":"-"},"-",null,null,null,null,null,{"$f":"IF(Z40=0,\"-\",Z40)","v":"-"},"-",null,null,null,null,{"$f":"IF((Y285+X285+W285)>0,1,0)","v":0},{"$f":"IF(B285=\"-\",0,B285)","v":0},{"$f":"IF(I285=\"-\",0,I285)","v":0},{"$f":"IF(P285=\"-\",0,P285)","v":0}]
[null,"-","-",null,null,null,null,null,"-","-",null,null,null,null,null,"-","-",null,null,null,null,0,0,0,0]
[null,"-","-",null,null,null,null,null,"-","-",null,null,null,null,null,"-","-",null,null,null,null,0,0,0,0]
[null,"-","-",null,null,null,null,null,"-","-",null,null,null,null,null,"-","-",null,null,null,null,0,0,0,0]
[null,"-","-",null,null,null,null,null,"-","-",null,null,null,null,null,"-","-",null,null,null,null,{"$f":"IF((Y289+X289+W289)>0,1,0)","v":0},{"$f":"IF(B289=\"-\",0,B289)","v":0},{"$f":"IF(I289=\"-\",0,I289)","v":0},{"$f":"IF(P289=\"-\",0,P289)","v":0}]
[null,"-","-",null,null,null,null,null,"-","-",null,null,null,null,null,"-","-",null,null,null,null,0,0,0,0]
[null,"-","-",null,null,null,null,null,"-","-",null,null,null,null,null,"-","-",null,null,null,null,0,0,0,0]
[null,"-","-",null,null,null,null,null,"-","-",null,null,null,null,null,"-","-",null,null,null,null,0,0,0,0]
[null,"-","-",null,null,null,null,null,"-","-",null,null,null,null,null,"-","-",null,null,null,null,0,0,0,0]
[null,"-","-",null,null,null,null,null,"-","-",null,null,null,null,null,"-","-",null,null,null,null,0,0,0,0]
[null,"-","-",null,null,null,null,null,"-","-",null,null,null,null,null,"-","-",null,null,null,null,0,0,0,0]
[null,"-","-",null,null,null,null,null,"-","-",null,null,null,null,null,"-","-",null,null,null,null,0,0,0,0]
[null,"-","-",null,null,null,null,null,"-","-",null,null,null,null,null,"-","-",null,null,null,null,0,0,0,0]
[null,"-","-",null,null,null,null,null,"-","-",null,null,null,null,null,"-","-",null,null,null,null,0,0,0,0]
[null,"-","-",null,null,null,null,null,"-","-",null,null,null,null,null,"-","-",null,null,null,null,0,0,0,0]
[null,"-","-",null,null,null,null,null,"-","-",null,null,null,null,null,"-","-",null,null,null,null,0,0,0,0]
[null,"-","-",null,null,null,null,null,"-","-",null,null,null,null,null,"-","-",null,null,null,null,0,0,0,0]
[null,"-","-",null,null,null,null,null,"-","-",null,null,null,null,null,"-","-",null,null,null,null,{"$f":"IF((Y302+X302+W302)>0,1,0)","v":0},{"$f":"IF(B302=\"-\",0,B302)","v":0},{"$f":"IF(I302=\"-\",0,I302)","v":0},{"$f":"IF(P302=\"-\",0,P302)","v":0}]
[null,"-","-",null,null,null,null,null,"-","-",null,null,null,null,null,"-","-",null,null,null,null,0,0,0,0]
[null,"-","-",null,null,null,null,null,"-","-",null,null,null,null,null,"-","-",null,null,null,null,0,0,0,0]
[null,"-","-",null,null,null,null,null,"-","-",null,null,null,null,null,"-","-",null,null,null,null,0,0,0,0]
[null,"-","-",null,null,null,null,null,"-","-",null,null,null,null,null,"-","-",null,null,null,null,0,0,0,0]
[null,"-","-",null,null,null,null,null,"-","-",null,null,null,null,null,"-","-",null,null,null,null,0,0,0,0]
[null,"-","-",null,null,null,null,null,"-","-",null,null,null,null,null,"-","-",null,null,null,null,0,0,0,0]
[null,"-","-",null,null,null,null,null,"-","-",null,null,null,null,null,"-","-",null,null,null,null,0,0,0,0]
[null,"-","-",null,null,null,null,null,"-","-",null,null,null,null,null,"-","-",null,null,null,null,{"$f":"IF((Y310+X310+W310)>0,1,0)","v":0},{"$f":"IF(B310=\"-\",0,B310)","v":0},{"$f":"IF(I310=\"-\",0,I310)","v":0},{"$f":"IF(P310=\"-\",0,P310)","v":0}]
[null,"-","-",null,null,null,null,null,"-","-",null,null,null,null,null,"-","-",null,null,null,null,0,0,0,0]
[null,"-","-",null,null,null,null,null,"-","-",null,null,null,null,null,"-","-",null,null,null,null,0,0,0,0]
[null,"-","-",null,null,null,null,null,"-","-",null,null,null,null,null,"-","-",null,null,null,null,0,0,0,0]
[null,"-","-",null,null,null,null,null,"-","-",null,null,null,null,null,"-","-",null,null,null,null,0,0,0,0]
[null,"-","-",null,null,null,null,null,"-","-",null,null,null,null,null,"-","-",null,null,null,null,0,0,0,0]
[null,"-","-",null,null,null,null,null,"-","-",null,null,null,null,null,"-","-",null,null,null,null,0,0,0,0]
[null,"-","-",null,null,null,null,null,"-","-",null,null,null,null,null,"-","-",null,null,null,null,0,0,0,0]
[null,"-","-",null,null,null,null,null,"-","-",null,null,null,null,null,"-","-",null,null,null,null,0,0,0,0]
[null,"-","-",null,null,null,null,null,"-","-",null,null,null,null,null,"-","-",null,null,null,null,0,0,0,0]
[null,{"$f":"IF(AD180=0,\"-\",AD180)","v":"-"},"-",null,null,null,null,null,{"$f":"IF(AE180=0,\"-\",AE180)","v":"-"},{"$f":"IF(I320=\"-\",\"-\",CONCATENATE(MID(C180,1,21),\" - \",G180))","v":"-"},null,null,null,null,null,{"$f":"IF(AF180=0,\"-\",AF180)","v":"-"},{"$f":"IF(P320=\"-\",\"-\",CONCATENATE(MID(C180,1,21),\" - \",G180))","v":"-"},null,null,null,null,0,0,0,0]
[null,{"$f":"IF(AD181=0,\"-\",AD181)","v":"-"},"-",null,null,null,null,null,{"$f":"IF(AE181=0,\"-\",AE181)","v":"-"},{"$f":"IF(I321=\"-\",\"-\",CONCATENATE(MID(C181,1,21),\" - \",G181))","v":"-"},null,null,null,null,null,{"$f":"IF(AF181=0,\"-\",AF181)","v":"-"},{"$f":"IF(P321=\"-\",\"-\",CONCATENATE(MID(C181,1,21),\" - \",G181))","v":"-"},null,null,null,null,0,0,0,0]
[null,{"$f":"IF(AD182=0,\"-\",AD182)","v":"-"},"-",null,null,null,null,null,{"$f":"IF(AE182=0,\"-\",AE182)","v":"-"},{"$f":"IF(I322=\"-\",\"-\",CONCATENATE(MID(C182,1,21),\" - \",G182))","v":"-"},null,null,null,null,null,{"$f":"IF(AF182=0,\"-\",AF182)","v":"-"},{"$f":"IF(P322=\"-\",\"-\",CONCATENATE(MID(C182,1,21),\" - \",G182))","v":"-"},null,null,null,null,0,{"$f":"IF(B322=\"-\",0,B322)","v":0},{"$f":"IF(I322=\"-\",0,I322)","v":0},{"$f":"IF(P322=\"-\",0,P322)","v":0}]
[null,{"$f":"IF(AD183=0,\"-\",AD183)","v":"-"},"-",null,null,null,null,null,{"$f":"IF(AE183=0,\"-\",AE183)","v":"-"},{"$f":"IF(I323=\"-\",\"-\",CONCATENATE(MID(C183,1,21),\" - \",G183))","v":"-"},null,null,null,null,null,{"$f":"IF(AF183=0,\"-\",AF183)","v":"-"},{"$f":"IF(P323=\"-\",\"-\",CONCATENATE(MID(C183,1,21),\" - \",G183))","v":"-"},null,null,null,null,0,{"$f":"IF(B323=\"-\",0,B323)","v":0},{"$f":"IF(I323=\"-\",0,I323)","v":0},{"$f":"IF(P323=\"-\",0,P323)","v":0}]
[null,{"$f":"IF(AD184=0,\"-\",AD184)","v":"-"},"-",null,null,null,null,null,{"$f":"IF(AE184=0,\"-\",AE184)","v":"-"},{"$f":"IF(I324=\"-\",\"-\",CONCATENATE(MID(#REF!,1,21),\" - \",#REF!))","v":"-"},null,null,null,null,null,{"$f":"IF(AF184=0,\"-\",AF184)","v":"-"},{"$f":"IF(P324=\"-\",\"-\",CONCATENATE(MID(C184,1,21),\" - \",G184))","v":"-"},null,null,null,null,0,{"$f":"IF(B324=\"-\",0,B324)","v":0},{"$f":"IF(I324=\"-\",0,I324)","v":0},{"$f":"IF(P324=\"-\",0,P324)","v":0}]
[null,{"$f":"IF(AD192=0,\"-\",AD192)","v":"-"},{"$f":"IF(B325=\"-\",\"-\",CONCATENATE(MID(C192,1,21),\" - \",G192))","v":"-"},null,null,null,null,null,{"$f":"IF(AE192=0,\"-\",AE192)","v":"-"},{"$f":"IF(I325=\"-\",\"-\",CONCATENATE(MID(C192,1,21),\" - \",G192))","v":"-"},null,null,null,null,null,{"$f":"IF(AF192=0,\"-\",AF192)","v":"-"},{"$f":"IF(P325=\"-\",\"-\",CONCATENATE(MID(C192,1,21),\" - \",G192))","v":"-"},null,null,null,null,0,0,0,0]
[null,"-","-",null,null,null,null,null,"-","-",null,null,null,null,null,"-","-",null,null,null,null,0,0,0,0]
[null,"-","-",null,null,null,null,null,"-","-",null,null,null,null,null,"-","-",null,null,null,null,0,0,0,0]
[null,"-","-",null,null,null,null,null,"-","-",null,null,null,null,null,"-","-",null,null,null,null,0,0,0,0]
[null,"-","-",null,null,null,null,null,"-","-",null,null,null,null,null,"-","-",null,null,null,null,0,0,0,0]
[null,"-","-",null,null,null,null,null,"-","-",null,null,null,null,null,"-","-",null,null,null,null,0,0,0,0]
[null,"-","-",null,null,null,null,null,"-","-",null,null,null,null,null,"-","-",null,null,null,null,0,0,0,0]
[null,"-","-",null,null,null,null,null,"-","-",null,null,null,null,null,"-","-",null,null,null,null,0,0,0,0]
[null,"-","-",null,null,null,null,null,"-","-",null,null,null,null,null,"-","-",null,null,null,null,{"$f":"IF((Y333+X333+W333)>0,1,0)","v":0},{"$f":"IF(B333=\"-\",0,B333)","v":0},{"$f":"IF(I333=\"-\",0,I333)","v":0},{"$f":"IF(P333=\"-\",0,P333)","v":0}]
[null,"-","-",null,null,null,null,null,"-","-",null,null,null,null,null,"-","-",null,null,null,null,0,0,0,0]
[null,"-","-",null,null,null,null,null,"-","-",null,null,null,null,null,"-","-",null,null,null,null,0,0,0,0]
[null,"-","-",null,null,null,null,null,"-","-",null,null,null,null,null,"-","-",null,null,null,null,0,0,0,0]
[null,"-","-",null,null,null,null,null,"-","-",null,null,null,null,null,"-","-",null,null,null,null,0,0,0,0]
[null,null,null,null,null,null,null,null,null,null,null,null,null,null,null,null,null,null,null,null,null,{"$f":"IF($B$39>=\"\",0,1)","v":0}]
[null,"Configurazione RAID",null,null,null,null,null,null,"Configurazione RAID",null,null,null,null,null,null,"Configurazione RAID",null,null,null,null,null,0]
[null,null,null,null,null,null,null,null,null,null,null,null,null,null,null,null,null,null,null,null,null,0]
[null,{"$f":"'CNV R740 1'!$B$96","v":"SCRIVERE QUI' LA CONFIGURAZIONE RAID RICHIESTA.\nR740 1\n"},null,null,null,null,null,null,{"$f":"'CNV R740 2'!$B$96","v":"SCRIVERE QUI' LA CONFIGURAZIONE RAID RICHIESTA.\nR740 2\n"},null,null,null,null,null,null,{"$f":"'CNV R740 3'!$B$96","v":"SCRIVERE QUI' LA CONFIGURAZIONE RAID RICHIESTA.\nR740 3\n"},null,null,null,null,null,0]
[null,null,null,null,null,null,null,null,null,null,null,null,null,null,null,null,null,null,null,null,null,0]
[null,null,null,null,null,null,null,null,null,null,null,null,null,null,null,null,null,null,null,null,null,0]
[null,null,null,null,null,null,null,null,null,null,null,null,null,null,null,null,null,null,null,null,null,0]
[null,null,null,null,null,null,null,null,null,null,null,null,null,null,null,null,null,null,null,null,null,0]
[null,null,null,null,null,null,null,null,null,null,null,null,null,null,null,null,null,null,null,null,null,0]
[null,null,null,null,null,null,null,null,null,null,null,null,null,null,null,null,null,null,null,null,null,0]
[null,null,null,null,null,null,null,null,null,null,null,null,null,null,null,null,null,null,null,null,null,0]
[null,null,null,null,null,null,null,null,null,null,null,null,null,null,null,null,null,null,null,null,null,0]
[null,null,null,null,null,null,null,null,null,null,null,null,null,null,null,null,null,null,null,null,null,0]
[null,null,null,null,null,null,null,null,null,null,null,null,null,null,null,null,null,null,null,null,null,0]
[null,null,null,null,null,null,null,null,null,null,null,null,null,null,null,null,null,null,null,null,null,0]
[null,null,null,null,null,null,null,null,null,null,null,null,null,null,null,null,null,null,null,null,null,0]
[null,null,null,null,null,null,null,null,null,null,null,null,null,null,null,null,null,null,null,null,null,0]
[null,null,null,null,null,null,null,null,null,null,null,null,null,null,null,null,null,null,null,null,null,0]
[null,null,null,null,null,null,null,null,null,null,null,null,null,null,null,null,null,null,null,null,null,0]
[null,null,null,null,null,null,null,null,null,null,null,null,null,null,null,null,null,null,null,null,null,0]
[null,null,null,null,null,null,null,null,null,null,null,null,null,null,null,null,null,null,null,null,null,0]
[null,null,null,null,null,null,null,null,null,null,null,null,null,null,null,null,null,null,null,null,null,{"$f":"IF($B$76>=\"\",0,1)","v":0}]
[null,"PowerEdge 740xd Conf.1",null,null,{"$f":"SRV_B","v":0},"Server",null,null,"PowerEdge 740xd Conf.2",null,null,{"$f":"SRV_BB","v":0},"Server",null,null,"PowerEdge 740xd Conf.3",null,null,{"$f":"SRV_BBB","v":0},"Server",null,{"$f":"IF($B$76>=\"\",0,1)","v":0}]
[null,null,null,null,null,null,null,null,null,null,null,null,null,null,null,null,null,null,null,null,null,{"$f":"IF($B$76>=\"\",0,1)","v":0}]
[null,{"$f":"IF(SRV_B>0,\"1\",\"-\")","v":"-"},{"$f":"IF(B362=\"-\",\"-\",CONCATENATE(MID(C76,1,24),\" - \",G76))","v":"-"},null,null,null,null,null,{"$f":"IF(SRV_BB>0,\"1\",\"-\")","v":"-"},{"$f":"IF(I362=\"-\",\"-\",CONCATENATE(MID(C76,1,24),\" - \",G76))","v":"-"},null,null,null,null,null,{"$f":"IF(SRV_BBB>0,\"1\",\"-\")","v":"-"},{"$f":"IF(P362=\"-\",\"-\",CONCATENATE(MID(C76,1,24),\" - \",G76))","v":"-"},null,null,null,null,{"$f":"IF((Y362+X362+W362)>0,1,0)","v":0},{"$f":"IF(B362=\"-\",0,B362)","v":0},{"$f":"IF(I362=\"-\",0,I362)","v":0},{"$f":"IF(P362=\"-\",0,P362)","v":0}]
[null,{"$f":"IF(X77=0,\"-\",X77)","v":"-"},"-",null,null,null,null,null,{"$f":"IF(Y77=0,\"-\",Y77)","v":"-"},"-",null,null,null,null,null,{"$f":"IF(Z77=0,\"-\",Z77)","v":"-"},"-",null,null,null,null,{"$f":"IF((Y363+X363+W363)>0,1,0)","v":0},{"$f":"IF(B363=\"-\",0,B363)","v":0},{"$f":"IF(I363=\"-\",0,I363)","v":0},{"$f":"IF(P363=\"-\",0,P363)","v":0}]
[null,"-","-",null,null,null,null,null,"-","-",null,null,null,null,null,"-","-",null,null,null,null,0,0,0,0]
[null,"-","-",null,null,null,null,null,"-","-",null,null,null,null,null,"-","-",null,null,null,null,0,0,0,0]
[null,"-","-",null,null,null,null,null,"-","-",null,null,null,null,null,"-","-",null,null,null,null,0,0,0,0]
[null,"-","-",null,null,null,null,null,"-","-",null,null,null,null,null,"-","-",null,null,null,null,0,0,0,0]
[null,"-","-",null,null,null,null,null,"-","-",null,null,null,null,null,"-","-",null,null,null,null,0,0,0,0]
[null,"-","-",null,null,null,null,null,"-","-",null,null,null,null,null,"-","-",null,null,null,null,0,0,0,0]
[null,"-","-",null,null,null,null,null,"-","-",null,null,null,null,null,"-","-",null,null,null,null,0,0,0,0]
[null,"-","-",null,null,null,null,null,"-","-",null,null,null,null,null,"-","-",null,null,null,null,0,0,0,0]
[null,"-","-",null,null,null,null,null,"-","-",null,null,null,null,null,"-","-",null,null,null,null,0,0,0,0]
[null,"-","-",null,null,null,null,null,"-","-",null,null,null,null,null,"-","-",null,null,null,null,0,0,0,0]
[null,"-","-",null,null,null,null,null,"-","-",null,null,null,null,null,"-","-",null,null,null,null,0,0,0,0]
[null,"-","-",null,null,null,null,null,"-","-",null,null,null,null,null,"-","-",null,null,null,null,{"$f":"IF((Y375+X375+W375)>0,1,0)","v":0},{"$f":"IF(B375=\"-\",0,B375)","v":0},{"$f":"IF(I375=\"-\",0,I375)","v":0},{"$f":"IF(P375=\"-\",0,P375)","v":0}]
[null,"-","-",null,null,null,null,null,"-","-",null,null,null,null,null,"-","-",null,null,null,null,0,0,0,0]
[null,"-","-",null,null,null,null,null,"-","-",null,null,null,null,null,"-","-",null,null,null,null,0,0,0,0]
[null,"-","-",null,null,null,null,null,"-","-",null,null,null,null,null,"-","-",null,null,null,null,0,0,0,0]
[null,"-","-",null,null,null,null,null,"-","-",null,null,null,null,null,"-","-",null,null,null,null,0,0,0,0]
[null,"-","-",null,null,null,null,null,"-","-",null,null,null,null,null,"-","-",null,null,null,null,0,0,0,0]
[null,"-","-",null,null,null,null,null,"-","-",null,null,null,null,null,"-","-",null,null,null,null,0,0,0,0]
[null,"-","-",null,null,null,null,null,"-","-",null,null,null,null,null,"-","-",null,null,null,null,0,0,0,0]
[null,"-","-",null,null,null,null,null,"-","-",null,null,null,null,null,"-","-",null,null,null,null,0,0,0,0]
[null,"-","-",null,null,null,null,null,"-","-",null,null,null,null,null,"-","-",null,null,null,null,0,0,0,0]
[null,"-","-",null,null,null,null,null,"-","-",null,null,null,null,null,"-","-",null,null,null,null,0,0,0,0]
[null,"-","-",null,null,null,null,null,"-","-",null,null,null,null,null,"-","-",null,null,null,null,0,0,0,0]
[null,"-","-",null,null,null,null,null,"-","-",null,null,null,null,null,"-","-",null,null,null,null,0,0,0,0]
[null,"-","-",null,null,null,null,null,"-","-",null,null,null,null,null,"-","-",null,null,null,null,{"$f":"IF((Y388+X388+W388)>0,1,0)","v":0},{"$f":"IF(B388=\"-\",0,B388)","v":0},{"$f":"IF(I388=\"-\",0,I388)","v":0},{"$f":"IF(P388=\"-\",0,P388)","v":0}]
[null,"-","-",null,null,null,null,null,"-","-",null,null,null,null,null,"-","-",null,null,null,null,0,0,0,0]
[null,"-","-",null,null,null,null,null,"-","-",null,null,null,null,null,"-","-",null,null,null,null,0,0,0,0]
[null,"-","-",null,null,null,null,null,"-","-",null,null,null,null,null,"-","-",null,null,null,null,0,0,0,0]
[null,"-","-",null,null,null,null,null,"-","-",null,null,null,null,null,"-","-",null,null,null,null,0,0,0,0]
[null,"-","-",null,null,null,null,null,"-","-",null,null,null,null,null,"-","-",null,null,null,null,0,0,0,0]
[null,"-","-",null,null,null,null,null,"-","-",null,null,null,null,null,"-","-",null,null,null,null,0,0,0,0]
[null,"-","-",null,null,null,null,null,"-","-",null,null,null,null,null,"-","-",null,null,null,null,0,0,0,0]
[null,"-","-",null,null,null,null,null,"-","-",null,null,null,null,null,"-","-",null,null,null,null,0,0,0,0]
[null,"-","-",null,null,null,null,null,"-","-",null,null,null,null,null,"-","-",null,null,null,null,0,0,0,0]
[null,{"$f":"IF(AG180=0,\"-\",AG180)","v":"-"},{"$f":"IF(B398=\"-\",\"-\",CONCATENATE(MID(C180,1,21),\" - \",G180))","v":"-"},null,null,null,null,null,{"$f":"IF(AH180=0,\"-\",AH180)","v":"-"},{"$f":"IF(I398=\"-\",\"-\",CONCATENATE(MID(C180,1,21),\" - \",G180))","v":"-"},null,null,null,null,null,{"$f":"IF(AI180=0,\"-\",AI180)","v":"-"},{"$f":"IF(P398=\"-\",\"-\",CONCATENATE(MID(C180,1,21),\" - \",G180))","v":"-"},null,null,null,null,0,0,0,0]
[null,{"$f":"IF(AG181=0,\"-\",AG181)","v":"-"},{"$f":"IF(B399=\"-\",\"-\",CONCATENATE(MID(C181,1,21),\" - \",G181))","v":"-"},null,null,null,null,null,{"$f":"IF(AH181=0,\"-\",AH181)","v":"-"},{"$f":"IF(I399=\"-\",\"-\",CONCATENATE(MID(C181,1,21),\" - \",G181))","v":"-"},null,null,null,null,null,{"$f":"IF(AI181=0,\"-\",AI181)","v":"-"},{"$f":"IF(P399=\"-\",\"-\",CONCATENATE(MID(C181,1,21),\" - \",G181))","v":"-"},null,null,null,null,0,0,0,0]
[null,{"$f":"IF(AG182=0,\"-\",AG182)","v":"-"},{"$f":"IF(B400=\"-\",\"-\",CONCATENATE(MID(C182,1,21),\" - \",G182))","v":"-"},null,null,null,null,null,{"$f":"IF(AH182=0,\"-\",AH182)","v":"-"},{"$f":"IF(I400=\"-\",\"-\",CONCATENATE(MID(C182,1,21),\" - \",G182))","v":"-"},null,null,null,null,null,{"$f":"IF(AI182=0,\"-\",AI182)","v":"-"},{"$f":"IF(P400=\"-\",\"-\",CONCATENATE(MID(C182,1,21),\" - \",G182))","v":"-"},null,null,null,null,0,0,0,0]
[null,{"$f":"IF(AG183=0,\"-\",AG183)","v":"-"},{"$f":"IF(B401=\"-\",\"-\",CONCATENATE(MID(C183,1,21),\" - \",G183))","v":"-"},null,null,null,null,null,{"$f":"IF(AH184=0,\"-\",AH184)","v":"-"},{"$f":"IF(I401=\"-\",\"-\",CONCATENATE(MID(C184,1,21),\" - \",G184))","v":"-"},null,null,null,null,null,{"$f":"IF(AI184=0,\"-\",AI184)","v":"-"},{"$f":"IF(P401=\"-\",\"-\",CONCATENATE(MID(C184,1,21),\" - \",G184))","v":"-"},null,null,null,null,0,0,0,0]
[null,{"$f":"IF(AG184=0,\"-\",AG184)","v":"-"},{"$f":"IF(B402=\"-\",\"-\",CONCATENATE(MID(C184,1,21),\" - \",G184))","v":"-"},null,null,null,null,null,{"$f":"IF(AH185=0,\"-\",AH185)","v":"-"},{"$f":"IF(I402=\"-\",\"-\",CONCATENATE(MID(C185,1,21),\" - \",G185))","v":"-"},null,null,null,null,null,{"$f":"IF(AI185=0,\"-\",AI185)","v":"-"},{"$f":"IF(P402=\"-\",\"-\",CONCATENATE(MID(C185,1,21),\" - \",G185))","v":"-"},null,null,null,null,0,0,0,0]
[null,{"$f":"IF(AG192=0,\"-\",AG192)","v":"-"},{"$f":"IF(B403=\"-\",\"-\",CONCATENATE(MID(C192,1,21),\" - \",G192))","v":"-"},null,null,null,null,null,{"$f":"IF(AH192=0,\"-\",AH192)","v":"-"},{"$f":"IF(I403=\"-\",\"-\",CONCATENATE(MID(C192,1,21),\" - \",G192))","v":"-"},null,null,null,null,null,{"$f":"IF(AI192=0,\"-\",AI192)","v":"-"},{"$f":"IF(P403=\"-\",\"-\",CONCATENATE(MID(C192,1,21),\" - \",G192))","v":"-"},null,null,null,null,0,0,0,0]
[null,"-","-",null,null,null,null,null,"-","-",null,null,null,null,null,"-","-",null,null,null,null,0,0,0,0]
[null,"-","-",null,null,null,null,null,"-","-",null,null,null,null,null,"-","-",null,null,null,null,0,0,0,0]
[null,"-","-",null,null,null,null,null,"-","-",null,null,null,null,null,"-","-",null,null,null,null,0,0,0,0]
[null,"-","-",null,null,null,null,null,"-","-",null,null,null,null,null,"-","-",null,null,null,null,0,0,0,0]
[null,"-","-",null,null,null,null,null,"-","-",null,null,null,null,null,"-","-",null,null,null,null,0,0,0,0]
[null,"-","-",null,null,null,null,null,"-","-",null,null,null,null,null,"-","-",null,null,null,null,0,0,0,0]
[null,"-","-",null,null,null,null,null,"-","-",null,null,null,null,null,"-","-",null,null,null,null,0,0,0,0]
[null,"-","-",null,null,null,null,null,"-","-",null,null,null,null,null,"-","-",null,null,null,null,{"$f":"IF((Y411+X411+W411)>0,1,0)","v":0},{"$f":"IF(B411=\"-\",0,B411)","v":0},{"$f":"IF(I411=\"-\",0,I411)","v":0},{"$f":"IF(P411=\"-\",0,P411)","v":0}]
[null,"-","-",null,null,null,null,null,"-","-",null,null,null,null,null,"-","-",null,null,null,null,0,0,0,0]
[null,"-","-",null,null,null,null,null,"-","-",null,null,null,null,null,"-","-",null,null,null,null,0,0,0,0]
[null,"-","-",null,null,null,null,null,"-","-",null,null,null,null,null,"-","-",null,null,null,null,0,0,0,0]
[null,"-","-",null,null,null,null,null,"-","-",null,null,null,null,null,"-","-",null,null,null,null,0,0,0,0]
[null,null,null,null,null,null,null,null,null,null,null,null,null,null,null,null,null,null,null,null,null,{"$f":"IF($B$76>=\"\",0,1)","v":0}]
[null,"Configurazione RAID",null,null,null,null,null,null,"Configurazione RAID",null,null,null,null,null,null,"Configurazione RAID",null,null,null,null,null,0]
[null,null,null,null,null,null,null,null,null,null,null,null,null,null,null,null,null,null,null,null,null,0]
[null,{"$f":"'CNV R740xd 1'!$B$97","v":"SCRIVERE QUI' LA CONFIGURAZIONE RAID RICHIESTA.\nR740XD 1\n"},null,null,null,null,null,null,{"$f":"'CNV R740xd 2'!$B$97","v":"SCRIVERE QUI' LA CONFIGURAZIONE RAID RICHIESTA.\nR740XD 2\n"},null,null,null,null,null,null,{"$f":"'CNV R740xd 3'!$B$97","v":"SCRIVERE QUI' LA CONFIGURAZIONE RAID RICHIESTA.\nR740XD 3\n"},null,null,null,null,null,0]
[null,null,null,null,null,null,null,null,null,null,null,null,null,null,null,null,null,null,null,null,null,0]
[null,null,null,null,null,null,null,null,null,null,null,null,null,null,null,null,null,null,null,null,null,0]
[null,null,null,null,null,null,null,null,null,null,null,null,null,null,null,null,null,null,null,null,null,0]
[null,null,null,null,null,null,null,null,null,null,null,null,null,null,null,null,null,null,null,null,null,0]
[null,null,null,null,null,null,null,null,null,null,null,null,null,null,null,null,null,null,null,null,null,0]
[null,null,null,null,null,null,null,null,null,null,null,null,null,null,null,null,null,null,null,null,null,0]
[null,null,null,null,null,null,null,null,null,null,null,null,null,null,null,null,null,null,null,null,null,0]
[null,null,null,null,null,null,null,null,null,null,null,null,null,null,null,null,null,null,null,null,null,0]
[null,null,null,null,null,null,null,null,null,null,null,null,null,null,null,null,null,null,null,null,null,0]
[null,null,null,null,null,null,null,null,null,null,null,null,null,null,null,null,null,null,null,null,null,0]
[null,null,null,null,null,null,null,null,null,null,null,null,null,null,null,null,null,null,null,null,null,0]
[null,null,null,null,null,null,null,null,null,null,null,null,null,null,null,null,null,null,null,null,null,0]
[null,null,null,null,null,null,null,null,null,null,null,null,null,null,null,null,null,null,null,null,null,0]
[null,null,null,null,null,null,null,null,null,null,null,null,null,null,null,null,null,null,null,null,null,0]
[null,null,null,null,null,null,null,null,null,null,null,null,null,null,null,null,null,null,null,null,null,0]
[null,null,null,null,null,null,null,null,null,null,null,null,null,null,null,null,null,null,null,null,null,0]
[null,null,null,null,null,null,null,null,null,null,null,null,null,null,null,null,null,null,null,null,null,0]
[null,null,null,null,null,null,null,null,null,null,null,null,null,null,null,null,null,null,null,null,null,{"$f":"$W$437+$X$437+$Y$437","v":0},{"$f":"IF($B$136>=\"\",0,1)","v":0},{"$f":"IF($B$158>=\"\",0,1)","v":0},{"$f":"IF($B$113>=\"\",0,1)","v":0}]
[null,"PowerEdge T640 Tower Base",null,null,{"$f":"SRV_D","v":0},"Server",null,null,"PowerEdge T640 Tower Prest",null,null,{"$f":"SRV_E","v":0},"Server",null,null,"PowerEdge T640 Rack Base",null,null,{"$f":"SRV_C","v":0},"Server",null,{"$f":"$W$437+$X$437+$Y$437","v":0}]
[null,null,null,null,null,null,null,null,null,null,null,null,null,null,null,null,null,null,null,null,null,0]
[null,{"$f":"IF(SRV_D>0,\"1\",\"-\")","v":"-"},{"$f":"IF(B440=\"-\",\"-\",CONCATENATE(MID(C136,1,24),\" - \",G136))","v":"-"},null,null,null,null,null,{"$f":"IF(SRV_E>0,\"1\",\"-\")","v":"-"},{"$f":"IF(I440=\"-\",\"-\",CONCATENATE(MID(C158,1,24),\" - \",G158))","v":"-"},null,null,null,null,null,{"$f":"IF(SRV_C>0,\"1\",\"-\")","v":"-"},{"$f":"IF(P440=\"-\",\"-\",CONCATENATE(MID(C113,1,24),\" - \",G113))","v":"-"},null,null,null,null,{"$f":"IF((Y440+X440+W440)>0,1,0)","v":0},{"$f":"IF(B440=\"-\",0,B440)","v":0},{"$f":"IF(I440=\"-\",0,I440)","v":0},{"$f":"IF(P440=\"-\",0,P440)","v":0}]
[null,{"$f":"IF(X137=0,\"-\",X137)","v":"-"},{"$f":"IF(B441=\"-\",\"-\",CONCATENATE(MID(C137,1,24),\" - \",G137))","v":"-"},null,null,null,null,null,{"$f":"IF(X159=0,\"-\",X159)","v":"-"},"-",null,null,null,null,null,{"$f":"IF(X114=0,\"-\",X114)","v":"-"},"-",null,null,null,null,{"$f":"IF((Y441+X441+W441)>0,1,0)","v":0},{"$f":"IF(B441=\"-\",0,B441)","v":0},{"$f":"IF(I441=\"-\",0,I441)","v":0},{"$f":"IF(P441=\"-\",0,P441)","v":0}]
[null,{"$f":"IF(X138=0,\"-\",X138)","v":"-"},{"$f":"IF(B442=\"-\",\"-\",CONCATENATE(MID(C138,1,24),\" - \",G138))","v":"-"},null,null,null,null,null,"-","-",null,null,null,null,null,"-","-",null,null,null,null,0,0,0,0]
[null,{"$f":"IF(X139=0,\"-\",X139)","v":"-"},{"$f":"IF(B443=\"-\",\"-\",CONCATENATE(MID(C139,1,24),\" - \",G139))","v":"-"},null,null,null,null,null,"-","-",null,null,null,null,null,"-","-",null,null,null,null,0,0,0,0]
[null,{"$f":"IF(X140=0,\"-\",X140)","v":"-"},{"$f":"IF(B444=\"-\",\"-\",CONCATENATE(MID(C140,1,24),\" - \",G140))","v":"-"},null,null,null,null,null,"-","-",null,null,null,null,null,"-","-",null,null,null,null,0,0,0,0]
[null,{"$f":"IF(X143=0,\"-\",X143)","v":"-"},{"$f":"IF(B445=\"-\",\"-\",CONCATENATE(MID(C143,1,24),\" - \",G143))","v":"-"},null,null,null,null,null,"-","-",null,null,null,null,null,"-","-",null,null,null,null,0,0,0,0]
[null,"-","-",null,null,null,null,null,"-","-",null,null,null,null,null,"-","-",null,null,null,null,0,{"$f":"IF(B446=\"-\",0,B446)","v":0},{"$f":"IF(I446=\"-\",0,I446)","v":0},{"$f":"IF(P446=\"-\",0,P446)","v":0}]
[null,"-","-",null,null,null,null,null,"-","-",null,null,null,null,null,"-","-",null,null,null,null,0,0,0,0]
[null,"-","-",null,null,null,null,null,"-","-",null,null,null,null,null,"-","-",null,null,null,null,0,0,0,0]
[null,"-","-",null,null,null,null,null,"-","-",null,null,null,null,null,"-","-",null,null,null,null,0,0,0,0]
[null,null,null,null,null,null,null,null,"-","-",null,null,null,null,null,"-","-",null,null,null,null,0,{"$f":"IF(B450=\"-\",0,B450)","v":0},{"$f":"IF(I450=\"-\",0,I450)","v":0},{"$f":"IF(P450=\"-\",0,P450)","v":0}]
[null,null,null,null,null,null,null,null,"-","-",null,null,null,null,null,"-","-",null,null,null,null,0,0,0,0]
[null,null,null,null,null,null,null,null,"-","-",null,null,null,null,null,{"$f":"IF(X127=0,\"-\",X127)","v":"-"},{"$f":"IF(P452=\"-\",\"-\",CONCATENATE(MID(C127,1,24),\" - \",G127))","v":"-"},null,null,null,null,0,0,0,0]
[null,{"$f":"IF(X148=0,\"-\",X148)","v":"-"},{"$f":"IF(B453=\"-\",\"-\",CONCATENATE(MID(C148,1,24),\" - \",G148))","v":"-"},null,null,null,null,null,"-","-",null,null,null,null,null,"-","-",null,null,null,null,0,0,0,0]
[null,{"$f":"IF(X156=0,\"-\",X156)","v":"-"},{"$f":"IF(B454=\"-\",\"-\",CONCATENATE(MID(C156,1,24),\" - \",G156))","v":"-"},null,null,null,null,null,"-","-",null,null,null,null,null,"-","-",null,null,null,null,0,0,0,0]
[null,{"$f":"IF(X144=0,\"-\",X144)","v":"-"},{"$f":"IF(B455=\"-\",\"-\",CONCATENATE(MID(C144,1,24),\" - \",G144))","v":"-"},null,null,null,null,null,"-","-",null,null,null,null,null,"-","-",null,null,null,null,0,0,0,0]
[null,{"$f":"IF(X145=0,\"-\",X145)","v":"-"},{"$f":"IF(B456=\"-\",\"-\",CONCATENATE(MID(C145,1,24),\" - \",G145))","v":"-"},null,null,null,null,null,"-","-",null,null,null,null,null,"-","-",null,null,null,null,0,{"$f":"IF(B456=\"-\",0,B456)","v":0},{"$f":"IF(I456=\"-\",0,I456)","v":0},{"$f":"IF(P456=\"-\",0,P456)","v":0}]
[null,{"$f":"IF(X146=0,\"-\",X146)","v":"-"},{"$f":"IF(B457=\"-\",\"-\",CONCATENATE(MID(C146,1,24),\" - \",G146))","v":"-"},null,null,null,null,null,"-","-",null,null,null,null,null,"-","-",null,null,null,null,0,0,0,0]
[null,{"$f":"IF(X147=0,\"-\",X147)","v":"-"},{"$f":"IF(B458=\"-\",\"-\",CONCATENATE(\"TS1L1-4Y-T630 - \",MID(C147,1,24),\" - \",G147))","v":"-"},null,null,null,null,null,"-",{"$f":"IF(I458=\"-\",\"-\",CONCATENATE(\"TS1L1-4Y-T630 - \",MID(C176,1,24),\" - \",G176))","v":"-"},null,null,null,null,null,"-","-",null,null,null,null,0,0,0,0]
[null,{"$f":"IF(X148=0,\"-\",X148)","v":"-"},{"$f":"IF(B459=\"-\",\"-\",CONCATENATE(\"TS1L1-5Y-T630 - \",MID(C148,1,24),\" - \",G148))","v":"-"},null,null,null,null,null,"-",{"$f":"IF(I459=\"-\",\"-\",CONCATENATE(\"TS1L1-5Y-T630 - \",MID(C177,1,24),\" - \",G177))","v":"-"},null,null,null,null,null,"-","-",null,null,null,null,0,0,0,0]
[null,{"$f":"IF(X156=0,\"-\",X156)","v":"-"},{"$f":"IF(B460=\"-\",\"-\",CONCATENATE(MID(C156,1,24),\" - \",G156))","v":"-"},null,null,null,null,null,"-",{"$f":"IF(I460=\"-\",\"-\",CONCATENATE(MID(C178,1,24),\" - \",G178))","v":"-"},null,null,null,null,null,"-","-",null,null,null,null,0,0,0,0]
[null,{"$f":"IF(AJ180=0,\"-\",AJ180)","v":"-"},{"$f":"IF(B461=\"-\",\"-\",CONCATENATE(MID($C$180,1,24),\" - \",$G$180))","v":"-"},null,null,null,null,null,{"$f":"IF(AK180=0,\"-\",AK180)","v":"-"},{"$f":"IF(I461=\"-\",\"-\",CONCATENATE(MID($C$180,1,24),\" - \",$G$180))","v":"-"},null,null,null,null,null,{"$f":"IF(AA180=0,\"-\",AA180)","v":"-"},{"$f":"IF(P461=\"-\",\"-\",CONCATENATE(MID(C180,1,24),\" - \",G180))","v":"-"},null,null,null,null,0,0,0,0]
[null,{"$f":"IF(AJ181=0,\"-\",AJ181)","v":"-"},{"$f":"IF(B462=\"-\",\"-\",CONCATENATE(MID($C$181,1,24),\" - \",$G$181))","v":"-"},null,null,null,null,null,{"$f":"IF(AK181=0,\"-\",AK181)","v":"-"},{"$f":"IF(I462=\"-\",\"-\",CONCATENATE(MID($C$181,1,24),\" - \",$G$181))","v":"-"},null,null,null,null,null,{"$f":"IF(AA181=0,\"-\",AA181)","v":"-"},{"$f":"IF(P462=\"-\",\"-\",CONCATENATE(MID(C181,1,24),\" - \",G181))","v":"-"},null,null,null,null,0,0,0,0]
[null,{"$f":"IF(AJ182=0,\"-\",AJ182)","v":"-"},{"$f":"IF(B463=\"-\",\"-\",CONCATENATE(MID($C$182,1,24),\" - \",$G$182))","v":"-"},null,null,null,null,null,{"$f":"IF(AK182=0,\"-\",AK182)","v":"-"},{"$f":"IF(I463=\"-\",\"-\",CONCATENATE(MID($C$182,1,24),\" - \",$G$182))","v":"-"},null,null,null,null,null,{"$f":"IF(AA182=0,\"-\",AA182)","v":"-"},{"$f":"IF(P463=\"-\",\"-\",CONCATENATE(MID(C182,1,24),\" - \",G182))","v":"-"},null,null,null,null,0,0,0,0]
[null,{"$f":"IF(AJ183=0,\"-\",AJ183)","v":"-"},{"$f":"IF(B464=\"-\",\"-\",CONCATENATE(MID($C$183,1,24),\" - \",$G$183))","v":"-"},null,null,null,null,null,{"$f":"IF(AK183=0,\"-\",AK183)","v":"-"},{"$f":"IF(I464=\"-\",\"-\",CONCATENATE(MID($C$183,1,24),\" - \",$G$183))","v":"-"},null,null,null,null,null,{"$f":"IF(AA183=0,\"-\",AA183)","v":"-"},{"$f":"IF(P464=\"-\",\"-\",CONCATENATE(MID(C183,1,24),\" - \",G183))","v":"-"},null,null,null,null,0,0,0,0]
[null,{"$f":"IF(AJ184=0,\"-\",AJ184)","v":"-"},{"$f":"IF(B465=\"-\",\"-\",CONCATENATE(MID($C$184,1,24),\" - \",$G$184))","v":"-"},null,null,null,null,null,{"$f":"IF(AK184=0,\"-\",AK184)","v":"-"},{"$f":"IF(I465=\"-\",\"-\",CONCATENATE(MID($C$184,1,24),\" - \",$G$184))","v":"-"},null,null,null,null,null,{"$f":"IF(AA184=0,\"-\",AA184)","v":"-"},{"$f":"IF(P465=\"-\",\"-\",CONCATENATE(MID(C184,1,24),\" - \",G184))","v":"-"},null,null,null,null,0,0,0,0]
[null,{"$f":"IF(AJ192=0,\"-\",AJ192)","v":"-"},{"$f":"IF(B466=\"-\",\"-\",CONCATENATE(MID(C192,1,21),\" - \",G192))","v":"-"},null,null,null,null,null,{"$f":"IF(AK192=0,\"-\",AK192)","v":"-"},{"$f":"IF(I466=\"-\",\"-\",CONCATENATE(MID(C192,1,21),\" - \",G192))","v":"-"},null,null,null,null,null,{"$f":"IF(AA192=0,\"-\",AA192)","v":"-"},{"$f":"IF(P466=\"-\",\"-\",CONCATENATE(MID(C192,1,24),\" - \",G192))","v":"-"},null,null,null,null,0,0,0,0]
[null,"-","-",null,null,null,null,null,"-","-",null,null,null,null,null,"-","-",null,null,null,null,0,0,0,0]
[null,"-","-",null,null,null,null,null,"-","-",null,null,null,null,null,"-","-",null,null,null,null,0,0,0,0]
[null,"-","-",null,null,null,null,null,"-","-",null,null,null,null,null,"-","-",null,null,null,null,0,0,0,0]
[null,"-","-",null,null,null,null,null,"-","-",null,null,null,null,null,"-","-",null,null,null,null,0,0,0,0]
[null,"-","-",null,null,null,null,null,"-","-",null,null,null,null,null,"-","-",null,null,null,null,0,0,0,0]
[null,"-","-",null,null,null,null,null,"-","-",null,null,null,null,null,"-","-",null,null,null,null,0,0,0,0]
[null,"-","-",null,null,null,null,null,"-","-",null,null,null,null,null,"-","-",null,null,null,null,0,0,0,0]
[null,"-","-",null,null,null,null,null,"-","-",null,null,null,null,null,"-","-",null,null,null,null,0,{"$f":"IF(B474=\"-\",0,B474)","v":0},{"$f":"IF(I474=\"-\",0,I474)","v":0},{"$f":"IF(P474=\"-\",0,P474)","v":0}]
[null,"-","-",null,null,null,null,null,"-","-",null,null,null,null,null,"-","-",null,null,null,null,0,0,0,0]
[null,"-","-",null,null,null,null,null,"-","-",null,null,null,null,null,"-","-",null,null,null,null,0,0,0,0]
[null,"-","-",null,null,null,null,null,"-","-",null,null,null,null,null,"-","-",null,null,null,null,0,0,0,0]
[null,"-","-",null,null,null,null,null,"-","-",null,null,null,null,null,"-","-",null,null,null,null,0,0,0,0]
[null,null,null,null,null,null,null,null,null,null,null,null,null,null,null,null,null,null,null,null,null,{"$f":"$W$437+$X$437+$Y$437","v":0}]
[null,"Configurazione RAID",null,null,null,null,null,null,"Configurazione RAID",null,null,null,null,null,null,"Configurazione RAID",null,null,null,null,null,0]
[null,null,null,null,null,null,null,null,null,null,null,null,null,null,null,null,null,null,null,null,null,0]
[null,{"$f":"'CNV T640 (Tower)'!$B$91","v":"SCRIVERE QUI' LA CONFIGURAZIONE RAID RICHIESTA.\nT630 Tower Base\n"},null,null,null,null,null,null,{"$f":"'CNV T640 1 (Tower) Prest'!$B$91","v":"SCRIVERE QUI' LA CONFIGURAZIONE RAID RICHIESTA.\nT640 Tower Prestazionale\n"},null,null,null,null,null,null,{"$f":"'CNV T640 (Rack)'!B95","v":"SCRIVERE QUI' LA CONFIGURAZIONE RAID RICHIESTA.\nT640 Rack Base Alternativo\n"},null,null,null,null,null,0]
[null,null,null,null,null,null,null,null,null,null,null,null,null,null,null,null,null,null,null,null,null,0]
[null,null,null,null,null,null,null,null,null,null,null,null,null,null,null,null,null,null,null,null,null,0]
[null,null,null,null,null,null,null,null,null,null,null,null,null,null,null,null,null,null,null,null,null,0]
[null,null,null,null,null,null,null,null,null,null,null,null,null,null,null,null,null,null,null,null,null,0]
[null,null,null,null,null,null,null,null,null,null,null,null,null,null,null,null,null,null,null,null,null,0]
[null,null,null,null,null,null,null,null,null,null,null,null,null,null,null,null,null,null,null,null,null,0]
[null,null,null,null,null,null,null,null,null,null,null,null,null,null,null,null,null,null,null,null,null,0]
[null,null,null,null,null,null,null,null,null,null,null,null,null,null,null,null,null,null,null,null,null,0]
[null,null,null,null,null,null,null,null,null,null,null,null,null,null,null,null,null,null,null,null,null,0]
[null,null,null,null,null,null,null,null,null,null,null,null,null,null,null,null,null,null,null,null,null,0]
[null,null,null,null,null,null,null,null,null,null,null,null,null,null,null,null,null,null,null,null,null,0]
[null,null,null,null,null,null,null,null,null,null,null,null,null,null,null,null,null,null,null,null,null,0]
[null,null,null,null,null,null,null,null,null,null,null,null,null,null,null,null,null,null,null,null,null,0]
[null,null,null,null,null,null,null,null,null,null,null,null,null,null,null,null,null,null,null,null,null,0]
[null,null,null,null,null,null,null,null,null,null,null,null,null,null,null,null,null,null,null,null,null,0]
[null,null,null,null,null,null,null,null,null,null,null,null,null,null,null,null,null,null,null,null,null,0]
[null,null,null,null,null,null,null,null,null,null,null,null,null,null,null,null,null,null,null,null,null,0]
[null,null,null,null,null,null,null,null,null,null,null,null,null,null,null,null,null,null,null,null,null,1]
[null,null,null,null,null,null,null,null,null,null,null,null,null,null,null,null,null,null,null,null,null,1]
[null,null,null,{"$f":"MID(C500,13,5)","v":""},null,{"$f":"MID(E500,13,5)","v":""},null,"",null,"",null,"",null,"",null,"",null,"",null,"",null,1]
[null,null,null,"AREA RISERVATA AL FORNITORE",null,null,null,null,null,null,null,null,null,null,null,null,null,null,null,null,null,1]
[null,null,null,null,null,null,null,null,null,null,null,null,null,null,null,null,null,null,null,null,null,1]
[null,null,null,null,null,null,null,null,null,null,null,null,null,null,null,null,null,null,null,null,null,1]
[null,null,"VERIFICA STAGING",null,null,null,null,null,null,null,null,null,null,null,"VERIFICA INSTALLATORE",null,null,null,null,null,null,1]
[null,null,null,null,null,null,null,null,null,null,null,null,null,null,null,null,null,null,null,null,null,1]
[null,null,null,null,null,null,null,null,null,null,null,null,null,null,null,null,null,null,null,null,null,1]
[null,null,null,null,null,null,null,null,null,null,null,null,null,null,null,null,null,null,null,null,null,1]
[null,null,null,null,null,null,null,null,null,null,null,null,null,null,null,null,null,null,null,null,null,1]
[null,null,null,null,null,null,null,null,null,null,null,null,null,null,null,null,null,null,null,null,null,1]

{"sheet":"CNV R640 2","index":8,"n_rows":174,"n_cols":8,"rows_kept":174,"cut":false,"hidden":false,"merged":[[172,2,172,4],[174,1,174,4],[163,2,163,4],[165,1,165,4],[166,2,166,4],[168,1,168,4],[169,2,169,4],[171,1,171,4],[162,1,162,4],[145,2,145,4],[147,1,147,4],[148,2,148,4],[150,1,150,4],[151,2,151,4],[153,1,153,4],[154,2,154,4],[156,1,156,4],[157,2,157,4],[159,1,159,4],[160,2,160,4],[144,1,144,4],[127,2,127,4],[129,1,129,4],[130,2,130,4],[132,1,132,4],[133,2,133,4],[135,1,135,4],[136,2,136,4],[138,1,138,4],[139,2,139,4],[141,1,141,4],[142,2,142,4],[126,1,126,4],[105,1,105,4],[106,2,106,4],[108,1,108,4],[109,2,109,4],[111,1,111,4],[114,1,114,4],[115,2,115,4],[117,1,117,4],[121,2,121,4],[123,1,123,4],[124,2,124,4],[118,2,118,4],[120,1,120,4],[103,2,103,4],[76,1,76,4],[77,2,77,4],[91,1,91,4],[92,2,92,4],[96,2,96,4],[99,1,99,4],[100,2,100,4],[102,1,102,4],[74,2,74,4],[64,1,64,4],[95,1,95,3],[73,1,73,4],[95,7,96,8],[54,2,54,4],[56,1,56,4],[57,2,57,4],[59,1,59,4],[61,1,61,4],[53,1,53,4],[29,1,29,4],[30,2,30,4],[33,1,33,4],[34,2,34,4],[36,1,36,4],[39,1,39,4],[40,2,40,4],[42,1,42,4],[43,2,43,4],[49,1,49,4],[50,2,50,4],[27,2,27,4],[4,0,4,4],[5,0,5,4],[10,0,11,5],[12,0,12,5],[18,2,18,4],[20,1,20,4],[21,2,21,4],[23,1,23,4],[24,2,24,4],[26,1,26,4]]}
[null,null,null,"TOTALE MEPA",null,null,null,{"$f":"G10","v":0}]
[]
[]
[]
["POWEREDGE R640"]
[]
[null,null,null,null,null,"Totale Server e Opzioni",{"$f":"F18*SRV_AA","v":0}]
[null,null,null,null,null,"Totale Ulteriori Opzioni ",{"$f":"G17*SRV_AA-(G73*SRV_AA)+G73-(SRV_AA*G70)+G70","v":0}]
[]
[null,null,null,null,null,"TOTALE CONVENZIONE",{"$f":"G8+G7","v":0}]
["Components: \nServer DELL PowerEdge R640 (1CPU Intel® Xeon® Silver 4114, 32GB RDIMM, 2xHDD 600GB 10K RPM SAS 12Gbps 2.5in)"]
[]
[]
[]
[null,"Category: Server"]
[null,"Quantity: ",null,null,null,1720,{"$f":"SUM(F16:F17)","v":1720}]
[null,null,null,null,null,{"$f":"SUM(F21:F192)","v":0},{"$f":"SUM(G21:G192)","v":0}]
[null,null,null,null,null,{"$f":"SUM(F16:F17)","v":1720}]
[null,"Base"]
[null,"PowerEdge R640 Server, 8HDD",1,null,"[210-AKWU][329-BDKC]"]
[]
[null,"Configurazione dello chassis"]
[null,"2.5 Chassis with up to 8 Hard Drives and 2PCIe slots",1,null,"[321-BCQJ]"]
[]
[null,"Processore"]
[null,"Intel® Xeon® Silver 4114 2.2G, 10C/20T, 9.6GT/s 2UPI, 14M Cache, Turbo, HT\n(85W)",1,null,"[338-BLUS]"]
[]
[null,"Processore aggiuntivo"]
[null,"No Additional Processor",{"$f":"VLOOKUP($B$29, CPU_A, 2, FALSE)","v":0},{"$f":"VLOOKUP($B$29, CPU_A, 3, FALSE)","v":""},{"$f":"VLOOKUP($B$29, CPU_A, 5, FALSE)","v":"[374-BBBX]"},{"$f":"VLOOKUP(B29, CPU_A, 15, FALSE)","v":0}]
[]
[null,"Processor Thermal Configuration"]
[null,"Standard 1U Heatsink",1,null,"[412-AAIQ]"]
[null,{"$f":"VLOOKUP($B$29, CPU_A, 6, FALSE)","v":""},{"$f":"VLOOKUP($B$29, CPU_A, 7, FALSE)","v":""},null,{"$f":"VLOOKUP($B$29, CPU_A, 8, FALSE)","v":""}]
[]
[null,"Tipo di configurazione memoria"]
[null,"Performance Optimized",1,null,"[370-AAIP]"]
[]
[null,"Memoria Totale in GB",{"$f":"IF(F29=728,IF(B39=32,\"ATTENZIONE: AUMENTARE LA RAM\",\"\"),\"\")","v":""}]
[null,32]
[]
[null,"Tipo e velocità della memoria DIMM"]
[null,"2667MT/s RDIMMs",1,null,"[370-ADNU]"]
[]
[null,"Capacità di memoria"]
[null,{"$f":"IF($B$29=\"No Additional Processor\",VLOOKUP($B$39, MEM_A1, 8, FALSE),VLOOKUP($B$39, MEM_A2, 8, FALSE))","v":"Dell 32 GB Modulo di memoria - RDIMM 2666MHz"},{"$f":"IF($B$29=\"No Additional Processor\",VLOOKUP($B$39, MEM_A1, 9, FALSE),VLOOKUP($B$39, MEM_A2, 9, FALSE))","v":1},null,{"$f":"IF($B$29=\"No Additional Processor\",VLOOKUP($B$39, MEM_A1, 10, FALSE),VLOOKUP($B$39, MEM_A2, 10, FALSE))","v":"[370-ADNF]"}]
[]
[null,{"$f":"IF($B$29=\"No Additional Processor\",VLOOKUP($B$39, MEM_A1, 2, FALSE),VLOOKUP($B$39, MEM_A2, 2, FALSE))","v":""},{"$f":"IF($B$29=\"No Additional Processor\",VLOOKUP($B$39, MEM_A1, 3, FALSE),VLOOKUP($B$39, MEM_A2, 3, FALSE))","v":""},{"$f":"IF($B$29=\"No Additional Processor\",VLOOKUP($B$39, MEM_A1, 4, FALSE),VLOOKUP($B$39, MEM_A2, 4, FALSE))","v":""},{"$f":"IF($B$29=\"No Additional Processor\",VLOOKUP($B$39, MEM_A1, 6, FALSE),VLOOKUP($B$39, MEM_A2, 6, FALSE))","v":""},{"$f":"IF($B$29=\"No Additional Processor\",VLOOKUP($B$39, MEM_A1, 7, FALSE),VLOOKUP($B$39, MEM_A2, 7, FALSE))","v":""}]
[]
[null,{"$f":"IF($B$29=\"No Additional Processor\",VLOOKUP($B$39, MEM_A1, 11, FALSE),VLOOKUP($B$39, MEM_A2, 11, FALSE))","v":""},{"$f":"IF($B$29=\"No Additional Processor\",VLOOKUP($B$39, MEM_A1, 12, FALSE),VLOOKUP($B$39, MEM_A2, 12, FALSE))","v":""},{"$f":"IF($B$29=\"No Additional Processor\",VLOOKUP($B$39, MEM_A1, 13, FALSE),VLOOKUP($B$39, MEM_A2, 13, FALSE))","v":""},{"$f":"IF($B$29=\"No Additional Processor\",VLOOKUP($B$39, MEM_A1, 15, FALSE),VLOOKUP($B$39, MEM_A2, 15, FALSE))","v":""},{"$f":"IF($B$29=\"No Additional Processor\",VLOOKUP($B$39, MEM_A1, 16, FALSE),VLOOKUP($B$39, MEM_A2, 16, FALSE))","v":""}]
[]
[null,"Sistema operativo preinstallato"]
[null,"No Operating System",{"$f":"VLOOKUP($B$52, OS_A, 2, FALSE)","v":""},{"$f":"VLOOKUP($B$52, OS_A, 3, FALSE)","v":""},{"$f":"VLOOKUP($B$52, OS_A, 5, FALSE)","v":"[611-BBBF]"},{"$f":"VLOOKUP($B$52, OS_A, 6, FALSE)","v":""}]
[null,{"$f":"IF($B$29=\"No Additional Processor\",VLOOKUP($B$52, OS_A, 20, FALSE),VLOOKUP($B$52, OS_A2, 20, FALSE))","v":""},{"$f":"IF($B$29=\"No Additional Processor\",VLOOKUP($B$52, OS_A, 21, FALSE),VLOOKUP($B$52, OS_A2, 21, FALSE))","v":0},{"$f":"IF($B$29=\"No Additional Processor\",VLOOKUP($B$52, OS_A, 22, FALSE),VLOOKUP($B$52, OS_A2, 22, FALSE))","v":""},{"$f":"IF($B$29=\"No Additional Processor\",VLOOKUP($B$52, OS_A, 24, FALSE),VLOOKUP($B$52, OS_A2, 24, FALSE))","v":""},{"$f":"IF($B$29=\"No Additional Processor\",VLOOKUP($B$52, OS_A, 25, FALSE),VLOOKUP($B$52, OS_A2, 25, FALSE))","v":""}]
[]
[null,"OS Media Kits"]
[null,"No Media Required",1,null,"[605-BBFN]"]
[]
[null,"Client Access Licenses"]
[null,{"$f":"VLOOKUP($B$52, OS_A, 8, FALSE)","v":"None"},null,{"$f":"VLOOKUP($B$52, OS_A, 10, FALSE)","v":""},{"$f":"VLOOKUP($B$52, OS_A, 12, FALSE)","v":""},{"$f":"VLOOKUP($B$52, OS_A, 13, FALSE)*C59","v":0}]
[]
[null,{"$f":"VLOOKUP($B$52, OS_A, 14, FALSE)","v":"None"},null,{"$f":"VLOOKUP($B$52, OS_A, 16, FALSE)","v":""},{"$f":"VLOOKUP($B$52, OS_A, 18, FALSE)","v":""},{"$f":"VLOOKUP($B$52, OS_A, 19, FALSE)*C61","v":0}]
[]
[null,"Sistema operativo SUSE Linux Enterprise Server"]
[null,"None\n",{"$f":"VLOOKUP($B$64,SUSE, 2, FALSE)","v":0},{"$f":"VLOOKUP($B$64,SUSE, 3, FALSE)","v":""},{"$f":"VLOOKUP($B$64,SUSE, 5, FALSE)","v":""},{"$f":"VLOOKUP($B$64, SUSE, 6, FALSE)*C64","v":0}]
[]
[null,"Sistema operativo VMware"]
[null,"None",{"$f":"VLOOKUP($B$67,VMWARE, 2, FALSE)+C29","v":0},{"$f":"VLOOKUP($B$67,VMWARE, 3, FALSE)","v":""},{"$f":"VLOOKUP($B$67,VMWARE, 5, FALSE)","v":""},{"$f":"VLOOKUP($B$67, VMWARE, 6, FALSE)*C67","v":0}]
[]
[null,"VMware vCenter Server Standard"]
[null,"None",{"$f":"VLOOKUP($B$70,VMWARE2, 2, FALSE)","v":0},{"$f":"VLOOKUP($B$70,VMWARE2, 3, FALSE)","v":""},{"$f":"VLOOKUP($B$70,VMWARE2, 5, FALSE)","v":""},null,{"$f":"VLOOKUP($B$70, VMWARE2, 6, FALSE)*C70","v":0}]
[]
[null,"Essentials Plus Kit"]
[null,"None",{"$f":"IF(SRV_A<4,VLOOKUP($B$73,VMWARE1, 2, FALSE),0)","v":0},{"$f":"VLOOKUP($B$73,VMWARE1, 3, FALSE)","v":""},{"$f":"VLOOKUP($B$73,VMWARE1, 5, FALSE)","v":""},null,{"$f":"VLOOKUP($B$73, VMWARE1, 6, FALSE)*C73","v":0}]
[]
[null,"Controller RAID"]
[null,"PERC H730P RAID Controller, 2Gb NV Cache, Minicard",1,null,"[405-AAQU]"]
[]
[null,"Dischi rigidi (numero massimo totale 8)"]
[null,"600GB 10K RPM SAS 12Gbps 512n 2.5in Hot-plug Hard Drive",2,null,"[400-ASGS]"]
[]
[null,"600GB 10K RPM SAS 12Gbps 512n 2.5in Hot-plug Hard Drive",null,{"$f":"VLOOKUP($B$81, HDD_A,3, FALSE)","v":"CNV-TS1L1-HD600"},{"$f":"VLOOKUP($B$81, HDD_A,5, FALSE)","v":"[400-AUNQ]"},{"$f":"VLOOKUP($B$81, HDD_B,6, FALSE)*C81","v":0}]
[]
[null,"1.2TB 10K RPM SAS 12Gbps 512n 2.5in Hot-plug Hard Drive",null,{"$f":"VLOOKUP($B$83, HDD_A,3, FALSE)","v":"CNV-TS1L1-HD1200-U"},{"$f":"VLOOKUP($B$83, HDD_A,5, FALSE)","v":"[400-ATJL]"},{"$f":"VLOOKUP($B$83, HDD_B,6, FALSE)*C83","v":0}]
[]
[null,"1.8TB 10K RPM SAS 12Gbps 512e 2.5in Hot-plug Hard Drive",null,"CNV-TS1L1-HD1800-U","[400-ATJR]",{"$f":"VLOOKUP($B$85, HDD_B,6, FALSE)*C85","v":0}]
[]
[null,"960GB SSD SAS Mix Use 12Gbps 512n 2.5in Hot-plug Drive,\nPX05SV,3 DWPD,5256 TBW",null,"CNV-TS1L1-SSD800-U","[400-ATLR]",{"$f":"VLOOKUP($B$87, HDD_B,6, FALSE)*C87","v":0}]
[]
[null,"1.92TB SSD SAS Mix Use 12Gbps 512n 2.5in Hot-plug Drive,\nPX05SV,3 DWPD,10512 TBW",null,"CNV-TS1L1-SSD1920-U","[400-ATNG]",{"$f":"VLOOKUP($B$89, HDD_B,6, FALSE)*C89","v":0}]
[]
[null,"DISCHI TOTALI",{"$f":"SUM(C79:C90)","v":2},{"$f":"IF(C91<=8,\"      OK\",\"     ERRORE:   Totale n° di dischi superiore al consentito\")","v":"      OK"}]
[]
[null,"Configurazione RAID"]
[null,"C3 - RAID 1 for H330 (2 HDDs)",1,null,{"$f":"VLOOKUP($B$94,  RAID_A1, 2, FALSE)","v":"[780-BBJK]"}]
[null,"Hot Spare for 300GB HDD","No"]
[null,"SCRIVERE QUI' LA CONFIGURAZIONE RAID RICHIESTA.\nR640 2\n",null,null,null,null,null,{"$f":"IF(B96=\"SCRIVERE QUI' LA CONFIGURAZIONE RAID RICHIESTA.\nR640 2\n\",\"ATTENZIONE COMPILARE IL CAMPO DELLA SCELTA RAID\", \"\")","v":"ATTENZIONE COMPILARE IL CAMPO DELLA SCELTA RAID"}]
[null,"Configurazione RAID HDD 1TB"]
[null,"",1,null,{"$f":"VLOOKUP($B$98,  RAID_A2, 2, FALSE)","v":""}]
[null,"Hot Spare for 1TB HDD","No"]
[]
[null,"Impostazioni del BIOS per la gestione dell'alimentazione"]
[null,"Performance BIOS Setting",1,null,"[384-BBBL]"]
[]
[null,"Alimentatore"]
[null,"Dual, Hot-plug, Redundant Power Supply (1+1), 750W, Titanium, 200-240VAC",{"$f":"VLOOKUP(B105,upsell_1, 2, FALSE)","v":1},{"$f":"VLOOKUP(B105,upsell_1, 3, FALSE)","v":""},{"$f":"VLOOKUP(B105,upsell_1, 5, FALSE)","v":"[450-ADWT]"},{"$f":"VLOOKUP(B105,upsell_1, 6, FALSE)","v":0},{"$f":"VLOOKUP(B105,upsell_1, 7, FALSE)","v":0}]
[]
[null,"Cavi di alimentazione"]
[null,"Rack Power Cord 2M (C13/C14 12A)",2,null,"[450-AADY]"]
[]
[null,"Fans"]
[null,{"$f":"VLOOKUP(B29, CPU_A, 12, FALSE)","v":"5 Standard Fans for R640"},{"$f":"VLOOKUP($B$29, CPU_A, 13, FALSE)","v":1},null,{"$f":"VLOOKUP($B$29, CPU_A, 14, FALSE)","v":"[384-BBPR]"}]
[]
[null,"TPM Module"]
[null,"Trusted Platform Module 1.2",1,null,"[461-AAEL]"]
[]
[null,"Embedded Systems Management"]
[null,"iDRAC9,Enterprise",1,null,"[385-BBKT]"]
[]
[null,"PCIe Riser"]
[null,"Riser Config 4, 2x16 LP",1,null,"[330-BBGY]"]
[]
[null,"Adattatore di rete"]
[null,"Intel Ethernet i350 QP 1Gb Network Daughter Card",{"$f":"VLOOKUP($B$123,upsell_1, 2, FALSE)","v":1},{"$f":"VLOOKUP($B$123,upsell_1, 3, FALSE)","v":""},{"$f":"VLOOKUP($B$123,upsell_1, 5, FALSE)","v":"[540-BBCB]"},{"$f":"VLOOKUP($B$123,upsell_1, 6, FALSE)","v":""},{"$f":"VLOOKUP($B$123,upsell_1, 7, FALSE)","v":0}]
[]
[null,"Modulo Doppia SD"]
[null,"None ",{"$f":"VLOOKUP($B$126,upsell_1, 2, FALSE)","v":0},{"$f":"VLOOKUP($B$126,upsell_1, 3, FALSE)","v":""},{"$f":"VLOOKUP($B$126,upsell_1, 4, FALSE)","v":""},{"$f":"VLOOKUP($B$126,upsell_1, 7, FALSE)","v":0}]
[]
[null,"Additional Card for PCIe Slot 1 (Low Profile)"]
[null,"None",{"$f":"VLOOKUP($B$129,  PCI_A1, 2, FALSE)","v":""},{"$f":"VLOOKUP($B$129,  PCI_A1, 3, FALSE)","v":""},{"$f":"VLOOKUP($B$129,  PCI_A1, 5, FALSE)","v":""},{"$f":"VLOOKUP($B$129,  PCI_A1, 6, FALSE)","v":""},{"$f":"VLOOKUP($B$129,  PCI_A1, 7, FALSE)","v":0}]
[]
[null,"Additional Card for PCIe Slot 2 (Full height)"]
[null,"None",{"$f":"VLOOKUP($B$132,  PCI_A1, 2, FALSE)","v":""},{"$f":"VLOOKUP($B$132,  PCI_A1, 3, FALSE)","v":""},{"$f":"VLOOKUP($B$132,  PCI_A1, 5, FALSE)","v":""},{"$f":"VLOOKUP($B$132,  PCI_A1, 6, FALSE)","v":""},{"$f":"VLOOKUP($B$132,  PCI_A1, 7, FALSE)","v":0}]
[]
[null,"Pannello frontale"]
[null,"No Bezel Option",{"$f":"VLOOKUP(B135,upsell_1, 2, FALSE)","v":1},{"$f":"VLOOKUP(B135,upsell_1, 3, FALSE)","v":""},{"$f":"VLOOKUP(B135,upsell_1, 5, FALSE)","v":"[350-BBBW]"},{"$f":"VLOOKUP(B135,upsell_1, 6, FALSE)","v":0},{"$f":"VLOOKUP(B135,upsell_1, 7, FALSE)","v":0}]
[]
[null,"Guide per rack"]
[null,"ReadyRails™ Sliding Rails Without Cable Management Arm 1U",{"$f":"VLOOKUP(B138,upsell_1, 2, FALSE)","v":1},{"$f":"VLOOKUP(B138,upsell_1, 3, FALSE)","v":""},{"$f":"VLOOKUP(B138,upsell_1, 5, FALSE)","v":"[770-BBBC]"},{"$f":"VLOOKUP(B138,upsell_1, 6, FALSE)","v":0},{"$f":"VLOOKUP(B138,upsell_1, 7, FALSE)","v":0}]
[]
[null,"Unità ottica interna"]
[null,"No Internal Optical Drive for 8 HDD Chassis",1,"","[429-AAQN]",null,""]
[]
[null,"Accessori Server"]
[null,"PowerEdge SFP+, 10GbE SR/SX, Optical Tranceiver, LC Connector, for Intel and Broadcom,CusKit",{"$f":"(VLOOKUP(B132,PCI_A2,9,FALSE))+((VLOOKUP(B129,PCI_A1,9,FALSE)))","v":0},null,"[407-BBQE]"]
[]
[null,"Sistema documentazione"]
[null,"Electronic System Documentation and OpenManage DVD Kit",1,null,"[343-BBDK]"]
[]
[null,"SHIPPING"]
[null,"R630 Shipping - 8 Drive Chassis, EMEA1 (English/French/German/Spanish/Russian/Hebrew)",1,null,"[340-AMIN]"]
[]
[null,"Order Information"]
[null,"PowerEdge Order - EMEA",1,null,"[800-11671]"]
[]
[null,"Base warranty"]
[null,"3Yr Basic Warranty - Next Business Day - Minimum Warranty",1,null,"[709-12767][709-12768]"]
[]
[null,"Servizi di assitenza"]
[null,"Dell Channel Order - Service Info only",1,null,"[710-31085]"]
[]
[null,"Estenzione di Garanzia"]
[null,"None",{"$f":"VLOOKUP($B$162,  SO_A1, 2, FALSE)","v":""},{"$f":"VLOOKUP($B$162,  SO_A1, 3, FALSE)","v":""},{"$f":"VLOOKUP($B$162,  SO_A1, 5, FALSE)","v":""},{"$f":"VLOOKUP($B$162,  SO_A1, 6, FALSE)","v":""}]
[]
[null,"Protezione dei dati - Keep Your Hard Drive "]
[null,"None",{"$f":"VLOOKUP($B$165,  SO_A2, 2, FALSE)","v":""},{"$f":"VLOOKUP($B$165,  SO_A2, 3, FALSE)","v":""},{"$f":"VLOOKUP($B$165,  SO_A2,5, FALSE)","v":""},{"$f":"VLOOKUP($B$165,  SO_A2, 6, FALSE)","v":""}]
[]
[null,"Servizi di Installazione"]
[null,"No Installation Service Selected",1,null,"[683-11870]"]
[]
[null,"Channel only - Support Extension"]
[null,"Channel 39M Basic Warranty - Next Business Day",1,null,"[723-28776]"]
[]
[null,"Warranty Upgrades - Non-Std/Local POS"]
[null,"CSTM CONSIP - 39M Onsite Labor Support for CRU for Servers with Basic Warranty",1,null,"[681-24467]"]

{"sheet":"CNV R640 3","index":9,"n_rows":174,"n_cols":8,"rows_kept":174,"cut":false,"hidden":false,"merged":[[172,2,172,4],[174,1,174,4],[163,2,163,4],[165,1,165,4],[166,2,166,4],[168,1,168,4],[169,2,169,4],[171,1,171,4],[162,1,162,4],[145,2,145,4],[147,1,147,4],[148,2,148,4],[150,1,150,4],[151,2,151,4],[153,1,153,4],[154,2,154,4],[156,1,156,4],[157,2,157,4],[159,1,159,4],[160,2,160,4],[144,1,144,4],[127,2,127,4],[129,1,129,4],[130,2,130,4],[132,1,132,4],[133,2,133,4],[135,1,135,4],[136,2,136,4],[138,1,138,4],[139,2,139,4],[141,1,141,4],[142,2,142,4],[126,1,126,4],[105,1,105,4],[106,2,106,4],[108,1,108,4],[109,2,109,4],[111,1,111,4],[114,1,114,4],[115,2,115,4],[117,1,117,4],[121,2,121,4],[123,1,123,4],[124,2,124,4],[118,2,118,4],[120,1,120,4],[74,2,74,4],[64,1,64,4],[73,1,73,4],[95,7,96,8],[103,2,103,4],[76,1,76,4],[77,2,77,4],[91,1,91,4],[92,2,92,4],[96,2,96,4],[95,1,95,3],[99,1,99,4],[100,2,100,4],[102,1,102,4],[54,2,54,4],[56,1,56,4],[57,2,57,4],[59,1,59,4],[61,1,61,4],[53,1,53,4],[29,1,29,4],[30,2,30,4],[33,1,33,4],[34,2,34,4],[36,1,36,4],[39,1,39,4],[40,2,40,4],[42,1,42,4],[43,2,43,4],[49,1,49,4],[50,2,50,4],[27,2,27,4],[4,0,4,4],[5,0,5,4],[10,0,11,5],[12,0,12,5],[18,2,18,4],[20,1,20,4],[21,2,21,4],[23,1,23,4],[24,2,24,4],[26,1,26,4]]}
[null,null,null,"TOTALE MEPA",null,null,null,{"$f":"G10","v":0}]
[]
[]
[]
["POWEREDGE R640"]
[]
[null,null,null,null,null,"Totale Server e Opzioni",{"$f":"G16*SRV_AAA","v":0}]
[null,null,null,null,null,"Totale Ulteriori Opzioni ",{"$f":"G17*SRV_AAA-(G73*SRV_AAA)+G73-(SRV_AAA*G70)+G70","v":0}]
[]
[null,null,null,null,null,"TOTALE CONVENZIONE",{"$f":"G8+G7","v":0}]
["Components: \nServer DELL PowerEdge R640 (1CPU Intel® Xeon® Silver 4114, 32GB RDIMM, 2xHDD 600GB 10K RPM SAS 12Gbps 2.5in)"]
[]
[]
[]
[null,"Category: Server"]
[null,"Quantity: ",null,null,null,1720,{"$f":"SUM(F16:F17)","v":1720}]
[null,null,null,null,null,{"$f":"SUM(F21:F192)","v":0},{"$f":"SUM(G21:G192)","v":0}]
[null,null,null,null,null,{"$f":"SUM(F16:F17)","v":1720}]
[null,"Base"]
[null,"PowerEdge R640 Server, 8HDD",1,null,"[210-AKWU][329-BDKC]"]
[]
[null,"Configurazione dello chassis"]
[null,"2.5 Chassis with up to 8 Hard Drives and 2PCIe slots",1,null,"[321-BCQJ]"]
[]
[null,"Processore"]
[null,"Intel® Xeon® Silver 4114 2.2G, 10C/20T, 9.6GT/s 2UPI, 14M Cache, Turbo, HT\n(85W)",1,null,"[338-BLUS]"]
[]
[null,"Processore aggiuntivo"]
[null,"No Additional Processor",{"$f":"VLOOKUP($B$29, CPU_A, 2, FALSE)","v":0},{"$f":"VLOOKUP($B$29, CPU_A, 3, FALSE)","v":""},{"$f":"VLOOKUP($B$29, CPU_A, 5, FALSE)","v":"[374-BBBX]"},{"$f":"VLOOKUP(B29, CPU_A, 15, FALSE)","v":0}]
[]
[null,"Processor Thermal Configuration"]
[null,"Standard 1U Heatsink",1,null,"[412-AAIQ]"]
[null,{"$f":"VLOOKUP($B$29, CPU_A, 6, FALSE)","v":""},{"$f":"VLOOKUP($B$29, CPU_A, 7, FALSE)","v":""},null,{"$f":"VLOOKUP($B$29, CPU_A, 8, FALSE)","v":""}]
[]
[null,"Tipo di configurazione memoria"]
[null,"Performance Optimized",1,null,"[370-AAIP]"]
[]
[null,"Memoria Totale in GB",{"$f":"IF(F29=728,IF(B39=32,\"ATTENZIONE: AUMENTARE LA RAM\",\"\"),\"\")","v":""}]
[null,32]
[]
[null,"Tipo e velocità della memoria DIMM"]
[null,"2667MT/s RDIMMs",1,null,"[370-ADNU]"]
[]
[null,"Capacità di memoria"]
[null,{"$f":"IF($B$29=\"No Additional Processor\",VLOOKUP($B$39, MEM_A1, 8, FALSE),VLOOKUP($B$39, MEM_A2, 8, FALSE))","v":"Dell 32 GB Modulo di memoria - RDIMM 2666MHz"},{"$f":"IF($B$29=\"No Additional Processor\",VLOOKUP($B$39, MEM_A1, 9, FALSE),VLOOKUP($B$39, MEM_A2, 9, FALSE))","v":1},null,{"$f":"IF($B$29=\"No Additional Processor\",VLOOKUP($B$39, MEM_A1, 10, FALSE),VLOOKUP($B$39, MEM_A2, 10, FALSE))","v":"[370-ADNF]"}]
[]
[null,{"$f":"IF($B$29=\"No Additional Processor\",VLOOKUP($B$39, MEM_A1, 2, FALSE),VLOOKUP($B$39, MEM_A2, 2, FALSE))","v":""},{"$f":"IF($B$29=\"No Additional Processor\",VLOOKUP($B$39, MEM_A1, 3, FALSE),VLOOKUP($B$39, MEM_A2, 3, FALSE))","v":""},{"$f":"IF($B$29=\"No Additional Processor\",VLOOKUP($B$39, MEM_A1, 4, FALSE),VLOOKUP($B$39, MEM_A2, 4, FALSE))","v":""},{"$f":"IF($B$29=\"No Additional Processor\",VLOOKUP($B$39, MEM_A1, 6, FALSE),VLOOKUP($B$39, MEM_A2, 6, FALSE))","v":""},{"$f":"IF($B$29=\"No Additional Processor\",VLOOKUP($B$39, MEM_A1, 7, FALSE),VLOOKUP($B$39, MEM_A2, 7, FALSE))","v":""}]
[]
[null,{"$f":"IF($B$29=\"No Additional Processor\",VLOOKUP($B$39, MEM_A1, 11, FALSE),VLOOKUP($B$39, MEM_A2, 11, FALSE))","v":""},{"$f":"IF($B$29=\"No Additional Processor\",VLOOKUP($B$39, MEM_A1, 12, FALSE),VLOOKUP($B$39, MEM_A2, 12, FALSE))","v":""},{"$f":"IF($B$29=\"No Additional Processor\",VLOOKUP($B$39, MEM_A1, 13, FALSE),VLOOKUP($B$39, MEM_A2, 13, FALSE))","v":""},{"$f":"IF($B$29=\"No Additional Processor\",VLOOKUP($B$39, MEM_A1, 15, FALSE),VLOOKUP($B$39, MEM_A2, 15, FALSE))","v":""},{"$f":"IF($B$29=\"No Additional Processor\",VLOOKUP($B$39, MEM_A1, 16, FALSE),VLOOKUP($B$39, MEM_A2, 16, FALSE))","v":""}]
[]
[null,"Sistema operativo preinstallato"]
[null,"No Operating System",{"$f":"VLOOKUP($B$52, OS_A, 2, FALSE)","v":""},{"$f":"VLOOKUP($B$52, OS_A, 3, FALSE)","v":""},{"$f":"VLOOKUP($B$52, OS_A, 5, FALSE)","v":"[611-BBBF]"},{"$f":"VLOOKUP($B$52, OS_A, 6, FALSE)","v":""}]
[null,{"$f":"IF($B$29=\"No Additional Processor\",VLOOKUP($B$52, OS_A, 20, FALSE),VLOOKUP($B$52, OS_A2, 20, FALSE))","v":""},{"$f":"IF($B$29=\"No Additional Processor\",VLOOKUP($B$52, OS_A, 21, FALSE),VLOOKUP($B$52, OS_A2, 21, FALSE))","v":0},{"$f":"IF($B$29=\"No Additional Processor\",VLOOKUP($B$52, OS_A, 22, FALSE),VLOOKUP($B$52, OS_A2, 22, FALSE))","v":""},{"$f":"IF($B$29=\"No Additional Processor\",VLOOKUP($B$52, OS_A, 24, FALSE),VLOOKUP($B$52, OS_A2, 24, FALSE))","v":""},{"$f":"IF($B$29=\"No Additional Processor\",VLOOKUP($B$52, OS_A, 25, FALSE),VLOOKUP($B$52, OS_A2, 25, FALSE))","v":""}]
[]
[null,"OS Media Kits"]
[null,"No Media Required",1,null,"[605-BBFN]"]
[]
[null,"Client Access Licenses"]
[null,{"$f":"VLOOKUP($B$52, OS_A, 8, FALSE)","v":"None"},null,{"$f":"VLOOKUP($B$52, OS_A, 10, FALSE)","v":""},{"$f":"VLOOKUP($B$52, OS_A, 12, FALSE)","v":""},{"$f":"VLOOKUP($B$52, OS_A, 13, FALSE)*C59","v":0}]
[]
[null,{"$f":"VLOOKUP($B$52, OS_A, 14, FALSE)","v":"None"},null,{"$f":"VLOOKUP($B$52, OS_A, 16, FALSE)","v":""},{"$f":"VLOOKUP($B$52, OS_A, 18, FALSE)","v":""},{"$f":"VLOOKUP($B$52, OS_A, 19, FALSE)*C61","v":0}]
[]
[null,"Sistema operativo SUSE Linux Enterprise Server"]
[null,"None\n",{"$f":"VLOOKUP($B$64,SUSE, 2, FALSE)","v":0},{"$f":"VLOOKUP($B$64,SUSE, 3, FALSE)","v":""},{"$f":"VLOOKUP($B$64,SUSE, 5, FALSE)","v":""},{"$f":"VLOOKUP($B$64, SUSE, 6, FALSE)*C64","v":0}]
[]
[null,"Sistema operativo VMware"]
[null,"None",{"$f":"VLOOKUP($B$67,VMWARE, 2, FALSE)+C29","v":0},{"$f":"VLOOKUP($B$67,VMWARE, 3, FALSE)","v":""},{"$f":"VLOOKUP($B$67,VMWARE, 5, FALSE)","v":""},{"$f":"VLOOKUP($B$67, VMWARE, 6, FALSE)*C67","v":0}]
[]
[null,"VMware vCenter Server Standard"]
[null,"None",{"$f":"VLOOKUP($B$70,VMWARE2, 2, FALSE)","v":0},{"$f":"VLOOKUP($B$70,VMWARE2, 3, FALSE)","v":""},{"$f":"VLOOKUP($B$70,VMWARE2, 5, FALSE)","v":""},null,{"$f":"VLOOKUP($B$70, VMWARE2, 6, FALSE)*C70","v":0}]
[]
[null,"Essentials Plus Kit"]
[null,"None",{"$f":"IF(SRV_A<4,VLOOKUP($B$73,VMWARE1, 2, FALSE),0)","v":0},{"$f":"VLOOKUP($B$73,VMWARE1, 3, FALSE)","v":""},{"$f":"VLOOKUP($B$73,VMWARE1, 5, FALSE)","v":""},null,{"$f":"VLOOKUP($B$73, VMWARE1, 6, FALSE)*C73","v":0}]
[]
[null,"Controller RAID"]
[null,"PERC H730P RAID Controller, 2Gb NV Cache, Minicard",1,null,"[405-AAQU]"]
[]
[null,"Dischi rigidi (numero massimo totale 8)"]
[null,"600GB 10K RPM SAS 12Gbps 512n 2.5in Hot-plug Hard Drive",2,null,"[400-ASGS]"]
[]
[null,"600GB 10K RPM SAS 12Gbps 512n 2.5in Hot-plug Hard Drive",null,{"$f":"VLOOKUP($B$81, HDD_A,3, FALSE)","v":"CNV-TS1L1-HD600"},{"$f":"VLOOKUP($B$81, HDD_A,5, FALSE)","v":"[400-AUNQ]"},{"$f":"VLOOKUP($B$81, HDD_B,6, FALSE)*C81","v":0}]
[]
[null,"1.2TB 10K RPM SAS 12Gbps 512n 2.5in Hot-plug Hard Drive",null,{"$f":"VLOOKUP($B$83, HDD_A,3, FALSE)","v":"CNV-TS1L1-HD1200-U"},{"$f":"VLOOKUP($B$83, HDD_A,5, FALSE)","v":"[400-ATJL]"},{"$f":"VLOOKUP($B$83, HDD_B,6, FALSE)*C83","v":0}]
[]
[null,"1.8TB 10K RPM SAS 12Gbps 512e 2.5in Hot-plug Hard Drive",null,"CNV-TS1L1-HD1800-U","[400-ATJR]",{"$f":"VLOOKUP($B$85, HDD_B,6, FALSE)*C85","v":0}]
[]
[null,"960GB SSD SAS Mix Use 12Gbps 512n 2.5in Hot-plug Drive,\nPX05SV,3 DWPD,5256 TBW",null,"CNV-TS1L1-SSD800-U","[400-ATLR]",{"$f":"VLOOKUP($B$87, HDD_B,6, FALSE)*C87","v":0}]
[]
[null,"1.92TB SSD SAS Mix Use 12Gbps 512n 2.5in Hot-plug Drive,\nPX05SV,3 DWPD,10512 TBW",null,"CNV-TS1L1-SSD1920-U","[400-ATNG]",{"$f":"VLOOKUP($B$89, HDD_B,6, FALSE)*C89","v":0}]
[]
[null,"DISCHI TOTALI",{"$f":"SUM(C79:C90)","v":2},{"$f":"IF(C91<=8,\"      OK\",\"     ERRORE:   Totale n° di dischi superiore al consentito\")","v":"      OK"}]
[]
[null,"Configurazione RAID"]
[null,"C3 - RAID 1 for H330 (2 HDDs)",1,null,{"$f":"VLOOKUP($B$94,  RAID_A1, 2, FALSE)","v":"[780-BBJK]"}]
[null,"Hot Spare for 300GB HDD","No"]
[null,"SCRIVERE QUI' LA CONFIGURAZIONE RAID RICHIESTA.\nR640 3\n",null,null,null,null,null,{"$f":"IF(B96=\"SCRIVERE QUI' LA CONFIGURAZIONE RAID RICHIESTA.\nR640 3\n\",\"ATTENZIONE COMPILARE IL CAMPO DELLA SCELTA RAID\", \"\")","v":"ATTENZIONE COMPILARE IL CAMPO DELLA SCELTA RAID"}]
[null,"Configurazione RAID HDD 1TB"]
[null,"",1,null,{"$f":"VLOOKUP($B$98,  RAID_A2, 2, FALSE)","v":""}]
[null,"Hot Spare for 1TB HDD","No"]
[]
[null,"Impostazioni del BIOS per la gestione dell'alimentazione"]
[null,"Performance BIOS Setting",1,null,"[384-BBBL]"]
[]
[null,"Alimentatore"]
[null,"Dual, Hot-plug, Redundant Power Supply (1+1), 750W, Titanium, 200-240VAC",{"$f":"VLOOKUP(B105,upsell_1, 2, FALSE)","v":1},{"$f":"VLOOKUP(B105,upsell_1, 3, FALSE)","v":""},{"$f":"VLOOKUP(B105,upsell_1, 5, FALSE)","v":"[450-ADWT]"},{"$f":"VLOOKUP(B105,upsell_1, 6, FALSE)","v":0},{"$f":"VLOOKUP(B105,upsell_1, 7, FALSE)","v":0}]
[]
[null,"Cavi di alimentazione"]
[null,"Rack Power Cord 2M (C13/C14 12A)",2,null,"[450-AADY]"]
[]
[null,"Fans"]
[null,{"$f":"VLOOKUP(B29, CPU_A, 12, FALSE)","v":"5 Standard Fans for R640"},{"$f":"VLOOKUP($B$29, CPU_A, 13, FALSE)","v":1},null,{"$f":"VLOOKUP($B$29, CPU_A, 14, FALSE)","v":"[384-BBPR]"}]
[]
[null,"TPM Module"]
[null,"Trusted Platform Module 1.2",1,null,"[461-AAEL]"]
[]
[null,"Embedded Systems Management"]
[null,"iDRAC9,Enterprise",1,null,"[385-BBKT]"]
[]
[null,"PCIe Riser"]
[null,"Riser Config 4, 2x16 LP",1,null,"[330-BBGY]"]
[]
[null,"Adattatore di rete"]
[null,"Intel Ethernet i350 QP 1Gb Network Daughter Card",{"$f":"VLOOKUP($B$123,upsell_1, 2, FALSE)","v":1},{"$f":"VLOOKUP($B$123,upsell_1, 3, FALSE)","v":""},{"$f":"VLOOKUP($B$123,upsell_1, 5, FALSE)","v":"[540-BBCB]"},{"$f":"VLOOKUP($B$123,upsell_1, 6, FALSE)","v":""},{"$f":"VLOOKUP($B$123,upsell_1, 7, FALSE)","v":0}]
[]
[null,"Modulo Doppia SD"]
[null,"None ",{"$f":"VLOOKUP($B$126,upsell_1, 2, FALSE)","v":0},{"$f":"VLOOKUP($B$126,upsell_1, 3, FALSE)","v":""},{"$f":"VLOOKUP($B$126,upsell_1, 4, FALSE)","v":""},{"$f":"VLOOKUP($B$126,upsell_1, 7, FALSE)","v":0}]
[]
[null,"Additional Card for PCIe Slot 1 (Low Profile)"]
[null,"None",{"$f":"VLOOKUP($B$129,  PCI_A1, 2, FALSE)","v":""},{"$f":"VLOOKUP($B$129,  PCI_A1, 3, FALSE)","v":""},{"$f":"VLOOKUP($B$129,  PCI_A1, 5, FALSE)","v":""},{"$f":"VLOOKUP($B$129,  PCI_A1, 6, FALSE)","v":""},{"$f":"VLOOKUP($B$129,  PCI_A1, 7, FALSE)","v":0}]
[]
[null,"Additional Card for PCIe Slot 2 (Full height)"]
[null,"None",{"$f":"VLOOKUP($B$132,  PCI_A1, 2, FALSE)","v":""},{"$f":"VLOOKUP($B$132,  PCI_A1, 3, FALSE)","v":""},{"$f":"VLOOKUP($B$132,  PCI_A1, 5, FALSE)","v":""},{"$f":"VLOOKUP($B$132,  PCI_A1, 6, FALSE)","v":""},{"$f":"VLOOKUP($B$132,  PCI_A1, 7, FALSE)","v":0}]
[]
[null,"Pannello frontale"]
[null,"No Bezel Option",{"$f":"VLOOKUP(B135,upsell_1, 2, FALSE)","v":1},{"$f":"VLOOKUP(B135,upsell_1, 3, FALSE)","v":""},{"$f":"VLOOKUP(B135,upsell_1, 5, FALSE)","v":"[350-BBBW]"},{"$f":"VLOOKUP(B135,upsell_1, 6, FALSE)","v":0},{"$f":"VLOOKUP(B135,upsell_1, 7, FALSE)","v":0}]
[]
[null,"Guide per rack"]
[null,"ReadyRails™ Sliding Rails Without Cable Management Arm 1U",{"$f":"VLOOKUP(B138,upsell_1, 2, FALSE)","v":1},{"$f":"VLOOKUP(B138,upsell_1, 3, FALSE)","v":""},{"$f":"VLOOKUP(B138,upsell_1, 5, FALSE)","v":"[770-BBBC]"},{"$f":"VLOOKUP(B138,upsell_1, 6, FALSE)","v":0},{"$f":"VLOOKUP(B138,upsell_1, 7, FALSE)","v":0}]
[]
[null,"Unità ottica interna"]
[null,"No Internal Optical Drive for 8 HDD Chassis",1,"","[429-AAQN]",null,""]
[]
[null,"Accessori Server"]
[null,"PowerEdge SFP+, 10GbE SR/SX, Optical Tranceiver, LC Connector, for Intel and Broadcom,CusKit",{"$f":"(VLOOKUP(B132,PCI_A2,9,FALSE))+((VLOOKUP(B129,PCI_A1,9,FALSE)))","v":0},null,"[407-BBQE]"]
[]
[null,"Sistema documentazione"]
[null,"Electronic System Documentation and OpenManage DVD Kit",1,null,"[343-BBDK]"]
[]
[null,"SHIPPING"]
[null,"R630 Shipping - 8 Drive Chassis, EMEA1 (English/French/German/Spanish/Russian/Hebrew)",1,null,"[340-AMIN]"]
[]
[null,"Order Information"]
[null,"PowerEdge Order - EMEA",1,null,"[800-11671]"]
[]
[null,"Base warranty"]
[null,"3Yr Basic Warranty - Next Business Day - Minimum Warranty",1,null,"[709-12767][709-12768]"]
[]
[null,"Servizi di assitenza"]
[null,"Dell Channel Order - Service Info only",1,null,"[710-31085]"]
[]
[null,"Estenzione di Garanzia"]
[null,"None",{"$f":"VLOOKUP($B$162,  SO_A1, 2, FALSE)","v":""},{"$f":"VLOOKUP($B$162,  SO_A1, 3, FALSE)","v":""},{"$f":"VLOOKUP($B$162,  SO_A1, 5, FALSE)","v":""},{"$f":"VLOOKUP($B$162,  SO_A1, 6, FALSE)","v":""}]
[]
[null,"Protezione dei dati - Keep Your Hard Drive "]
[null,"None",{"$f":"VLOOKUP($B$165,  SO_A2, 2, FALSE)","v":""},{"$f":"VLOOKUP($B$165,  SO_A2, 3, FALSE)","v":""},{"$f":"VLOOKUP($B$165,  SO_A2,5, FALSE)","v":""},{"$f":"VLOOKUP($B$165,  SO_A2, 6, FALSE)","v":""}]
[]
[null,"Servizi di Installazione"]
[null,"No Installation Service Selected",1,null,"[683-11870]"]
[]
[null,"Channel only - Support Extension"]
[null,"Channel 39M Basic Warranty - Next Business Day",1,null,"[723-28776]"]
[]
[null,"Warranty Upgrades - Non-Std/Local POS"]
[null,"CSTM CONSIP - 39M Onsite Labor Support for CRU for Servers with Basic Warranty",1,null,"[681-24467]"]

{"sheet":"CNV R740 2","index":10,"n_rows":189,"n_cols":8,"rows_kept":189,"cut":false,"hidden":false,"merged":[[183,1,183,4],[184,2,184,4],[186,1,186,4],[187,2,187,4],[189,1,189,4],[181,2,181,4],[165,1,165,4],[166,2,166,4],[168,1,168,4],[169,2,169,4],[171,1,171,4],[172,2,172,4],[174,1,174,4],[175,2,175,4],[177,1,177,4],[178,2,178,4],[180,1,180,4],[163,2,163,4],[147,1,147,4],[148,2,148,4],[150,1,150,4],[151,2,151,4],[153,1,153,4],[154,2,154,4],[156,1,156,4],[157,2,157,4],[159,1,159,4],[160,2,160,4],[162,1,162,4],[145,2,145,4],[123,1,123,4],[127,2,127,4],[129,1,129,4],[133,2,133,4],[135,1,135,4],[136,2,136,4],[138,1,138,4],[139,2,139,4],[141,1,141,4],[142,2,142,4],[144,1,144,4],[124,2,124,4],[126,1,126,4],[130,2,130,4],[132,1,132,4],[121,2,121,4],[100,2,100,4],[102,1,102,4],[103,2,103,4],[105,1,105,4],[106,2,106,4],[108,1,108,4],[112,2,112,4],[114,1,114,4],[117,1,117,4],[118,2,118,4],[120,1,120,4],[109,2,109,4],[111,1,111,4],[92,2,92,4],[96,2,96,4],[99,1,99,4],[95,1,95,3],[95,7,96,8],[91,1,91,4],[54,2,54,4],[56,1,56,4],[57,2,57,4],[59,1,59,4],[61,1,61,4],[74,2,74,4],[76,1,76,4],[77,2,77,4],[83,1,83,4],[85,1,85,4],[87,1,87,4],[64,1,64,4],[73,1,73,4],[53,1,53,4],[29,1,29,4],[30,2,30,4],[33,1,33,4],[34,2,34,4],[36,1,36,4],[39,1,39,4],[40,2,40,4],[42,1,42,4],[43,2,43,4],[49,1,49,4],[50,2,50,4],[27,2,27,4],[4,0,4,4],[5,0,5,4],[10,0,11,5],[12,0,12,5],[18,2,18,4],[20,1,20,4],[21,2,21,4],[23,1,23,4],[24,2,24,4],[26,1,26,4]]}
[null,null,null,"TOTALE MEPA",null,null,null,{"$f":"G10","v":0}]
[]
[]
[]
["POWEREDGE R740"]
[]
[null,null,null,null,null,"Totale Server e Opzioni",{"$f":"F17*SRV_B1.2","v":0}]
[null,null,null,null,null,"Totale Ulteriori Opzioni ",{"$f":"G16*SRV_B1.2-(G73*SRV_B1.1)+G73-(SRV_B1.2*G70)+G70","v":0}]
[]
[null,null,null,null,null,"TOTALE CONVENZIONE",{"$f":"G8+G7","v":0}]
["Components: \nServer DELL PowerEdge R740 (1CPU Intel® Xeon® Gold 5120, 64GB RDIMM, 2xHDD 600GB 10K RPM SAS 12Gbps 2.5in)"]
[]
[]
[]
[null,"Category: Server",null,null,null,{"$f":"2371","v":2371}]
[null,"Quantity: ",null,null,null,{"$f":"SUM(F20:F191)","v":0},{"$f":"SUM(G20:G191)","v":0}]
[null,null,null,null,null,{"$f":"SUM(F15:F16)","v":2371}]
[]
[null,"Base"]
[null,"PowerEdge R740 Server",1,null,"[210-AKXJ]"]
[]
[null,"Configurazione dello chassis"]
[null,"Chassis with up to 16 x 2.5\" SAS/SATA Hard Drives for 1CPU Configuration",1,null,"[321-BCSL]"]
[]
[null,"Processore"]
[null,"Intel® Xeon® Gold 5120 2.2G, 14C/28T, 10.4GT/s, 19M Cache, Turbo, HT (105W)",1,null,"[338-BLUX]"]
[]
[null,"Processore aggiuntivo"]
[null,"No Additional Processor",{"$f":"VLOOKUP($B$29, CPU_B.1, 2, FALSE)","v":0},{"$f":"VLOOKUP($B$29, CPU_B.1, 3, FALSE)","v":""},{"$f":"VLOOKUP($B$29, CPU_B.1, 5, FALSE)","v":"[374-BBBX]"},{"$f":"VLOOKUP(B29, CPU_B.1, 15, FALSE)","v":0}]
[]
[null,"Processor Thermal Configuration"]
[null,"1 CPU Standard",1,null,"[370-ABWF][374-BBHM][750-AAEL]"]
[null,{"$f":"VLOOKUP($B$29, CPU_B, 6, FALSE)","v":""},{"$f":"VLOOKUP($B$29, CPU_B, 7, FALSE)","v":""},null,{"$f":"VLOOKUP($B$29, CPU_B, 8, FALSE)","v":""}]
[]
[null,"Tipo di configurazione memoria"]
[null,"Performance Optimized",1,null,"[370-AAIP]"]
[]
[null,"Memoria Totale in GB",null,{"$f":"IF(('CNV R740 1'!$D$12=0),\"\",'CNV R740 1'!#REF!)","v":""}]
[null,64]
[]
[null,"Tipo e velocità della memoria DIMM"]
[null,"2666MT/s RDIMMs",1,null,"[370-ADNU]"]
[]
[null,"Capacità di memoria"]
[null,{"$f":"IF($B$29=\"No Additional Processor\",VLOOKUP($B$39, MEM_B1, 8, FALSE),VLOOKUP($B$39, MEM_B2, 8, FALSE))","v":"Dell 32 GB Modulo di memoria - RDIMM 2666MHz"},{"$f":"IF($B$29=\"No Additional Processor\",VLOOKUP($B$39, MEM_B1, 9, FALSE),VLOOKUP($B$39, MEM_B2, 9, FALSE))","v":2},null,{"$f":"IF($B$29=\"No Additional Processor\",VLOOKUP($B$39, MEM_B1, 10, FALSE),VLOOKUP($B$39, MEM_B2, 10, FALSE))","v":"[370-ADNF]"}]
[]
[null,{"$f":"IF($B$29=\"No Additional Processor\",VLOOKUP($B$39, MEM_B1, 2, FALSE),VLOOKUP($B$39, MEM_B2, 2, FALSE))","v":""},{"$f":"IF($B$29=\"No Additional Processor\",VLOOKUP($B$39, MEM_B1, 3, FALSE),VLOOKUP($B$39, MEM_B2, 3, FALSE))","v":""},{"$f":"IF($B$29=\"No Additional Processor\",VLOOKUP($B$39, MEM_B1, 4, FALSE),VLOOKUP($B$39, MEM_B2, 4, FALSE))","v":""},{"$f":"IF($B$29=\"No Additional Processor\",VLOOKUP($B$39, MEM_B1, 6, FALSE),VLOOKUP($B$39, MEM_B2, 6, FALSE))","v":""},{"$f":"IF($B$29=\"No Additional Processor\",VLOOKUP($B$39, MEM_B1, 7, FALSE),VLOOKUP($B$39, MEM_B2, 7, FALSE))","v":""}]
[]
[null,{"$f":"IF($B$29=\"No Additional Processor\",VLOOKUP($B$39, MEM_B1, 11, FALSE),VLOOKUP($B$39, MEM_B2, 11, FALSE))","v":""},{"$f":"IF($B$29=\"No Additional Processor\",VLOOKUP($B$39, MEM_B1, 12, FALSE),VLOOKUP($B$39, MEM_B2, 12, FALSE))","v":""},{"$f":"IF($B$29=\"No Additional Processor\",VLOOKUP($B$39, MEM_B1, 13, FALSE),VLOOKUP($B$39, MEM_B2, 13, FALSE))","v":""},{"$f":"IF($B$29=\"No Additional Processor\",VLOOKUP($B$39, MEM_B1, 15, FALSE),VLOOKUP($B$39, MEM_B2, 15, FALSE))","v":""},{"$f":"IF($B$29=\"No Additional Processor\",VLOOKUP($B$39, MEM_B1, 16, FALSE),VLOOKUP($B$39, MEM_B2, 16, FALSE))","v":""}]
[]
[null,"Sistema operativo preinstallato"]
[null,"No Operating System",{"$f":"VLOOKUP($B$52, OS_B, 2, FALSE)","v":""},{"$f":"VLOOKUP($B$52, OS_B, 3, FALSE)","v":""},{"$f":"VLOOKUP($B$52, OS_B, 5, FALSE)","v":"[611-BBBF]"},{"$f":"VLOOKUP($B$52, OS_B, 6, FALSE)","v":""}]
[null,{"$f":"IF($B$29=\"No Additional Processor\",VLOOKUP($B$52, OS_B, 20, FALSE),VLOOKUP($B$52, OS_B2, 20, FALSE))","v":""},{"$f":"IF($B$29=\"No Additional Processor\",VLOOKUP($B$52, OS_B, 21, FALSE),VLOOKUP($B$52, OS_B2, 21, FALSE))","v":0},{"$f":"IF($B$29=\"No Additional Processor\",VLOOKUP($B$52, OS_A, 22, FALSE),VLOOKUP($B$52, OS_B2, 22, FALSE))","v":""},{"$f":"IF($B$29=\"No Additional Processor\",VLOOKUP($B$52, OS_B, 24, FALSE),VLOOKUP($B$52, OS_B2, 24, FALSE))","v":""},{"$f":"IF($B$29=\"No Additional Processor\",VLOOKUP($B$52, OS_B, 25, FALSE),VLOOKUP($B$52, OS_B2, 25, FALSE))","v":""}]
[]
[null,"OS Media Kits"]
[null,"No Media Required",1,null,"[605-BBFN]"]
[]
[null,"Client Access Licenses"]
[null,{"$f":"VLOOKUP($B$52, OS_B, 8, FALSE)","v":"None"},null,{"$f":"VLOOKUP($B$52, OS_A, 10, FALSE)","v":""},{"$f":"VLOOKUP($B$52, OS_A, 12, FALSE)","v":""},{"$f":"VLOOKUP($B$52, OS_A, 13, FALSE)*C59","v":0}]
[]
[null,{"$f":"VLOOKUP($B$52, OS_A, 14, FALSE)","v":"None"},null,{"$f":"VLOOKUP($B$52, OS_A, 16, FALSE)","v":""},{"$f":"VLOOKUP($B$52, OS_A, 18, FALSE)","v":""},{"$f":"VLOOKUP($B$52, OS_A, 19, FALSE)*C61","v":0}]
[]
[null,"Sistema operativo SUSE Linux Enterprise Server"]
[null,"None\n",{"$f":"VLOOKUP($B$64,SUSE, 2, FALSE)","v":0},{"$f":"VLOOKUP($B$64,SUSE, 3, FALSE)","v":""},{"$f":"VLOOKUP($B$64,SUSE, 5, FALSE)","v":""},{"$f":"VLOOKUP($B$64, SUSE, 6, FALSE)*C64","v":0}]
[]
[null,"Sistema operativo VMware"]
[null,"None",{"$f":"VLOOKUP($B$67,VMWARE, 2, FALSE)+C29","v":0},{"$f":"VLOOKUP($B$67,VMWARE, 3, FALSE)","v":""},{"$f":"VLOOKUP($B$67,VMWARE, 5, FALSE)","v":""},{"$f":"VLOOKUP($B$67, VMWARE, 6, FALSE)*C67","v":0}]
[]
[null,"VMware vCenter Server Standard"]
[null,"None",{"$f":"VLOOKUP($B$70,VMWARE2, 2, FALSE)","v":0},{"$f":"VLOOKUP($B$70,VMWARE2, 3, FALSE)","v":""},{"$f":"VLOOKUP($B$70,VMWARE2, 5, FALSE)","v":""},null,{"$f":"VLOOKUP($B$70, VMWARE2, 6, FALSE)*C70","v":0}]
[]
[null,"Essentials Plus Kit"]
[null,"None",{"$f":"IF(SRV_A<4,VLOOKUP($B$73,VMWARE1, 2, FALSE),0)","v":0},{"$f":"VLOOKUP($B$73,VMWARE1, 3, FALSE)","v":""},{"$f":"VLOOKUP($B$73,VMWARE1, 5, FALSE)","v":""},null,{"$f":"VLOOKUP($B$73, VMWARE1, 6, FALSE)*C73","v":0}]
[]
[null,"Controller"]
[null,"PERC H730P RAID Controller, 2Gb NV Cache, Minicard",{"$f":"VLOOKUP($B$76,PERC, 2, FALSE)","v":0},{"$f":"VLOOKUP($B$76,PERC, 3, FALSE)","v":""},{"$f":"VLOOKUP($B$76,PERC, 4, FALSE)","v":""},{"$f":"VLOOKUP($B$76,PERC, 7, FALSE)","v":0}]
[]
[null,"Dischi rigidi (numero massimo totale 16)"]
[null,"600GB 10K RPM SAS 12Gbps 512n 2.5in Hot-plug Hard Drive",2,null,"[400-AJPK]"]
[]
[null,"600GB 10K RPM SAS 12Gbps 512n 2.5in Hot-plug Hard Drive",null,{"$f":"VLOOKUP($B$81, HDD_A,3, FALSE)","v":"CNV-TS1L1-HD600"},{"$f":"VLOOKUP($B$81, HDD_A,5, FALSE)","v":"[400-AUNQ]"},{"$f":"VLOOKUP($B$81, HDD_B,6, FALSE)*C81","v":0}]
[]
[null,"1.2TB 10K RPM SAS 12Gbps 512n 2.5in Hot-plug Hard Drive",null,{"$f":"VLOOKUP($B$83, HDD_A,3, FALSE)","v":"CNV-TS1L1-HD1200-U"},{"$f":"VLOOKUP($B$83, HDD_A,5, FALSE)","v":"[400-ATJL]"},{"$f":"VLOOKUP($B$83, HDD_B,6, FALSE)*C83","v":0}]
[]
[null,"1.8TB 10K RPM SAS 12Gbps 512e 2.5in Hot-plug Hard Drive",null,"CNV-TS1L1-HD1800","[400-AJQP]",{"$f":"VLOOKUP($B$85, HDD_B,6, FALSE)*C85","v":0}]
[]
[null,"960GB SSD SAS Mix Use 12Gbps 512n 2.5in Hot-plug Drive,\nPX05SV,3 DWPD,5256 TBW",null,"CNV-TS1L1-SSD800","[400-ANNX]",{"$f":"VLOOKUP($B$87, HDD_B,6, FALSE)*C87","v":0}]
[]
[null,"1.92TB SSD SAS Mix Use 12Gbps 512n 2.5in Hot-plug Drive,\nPX05SV,3 DWPD,10512 TBW",null,"CNV-TS1L1-SSD1920","[400-ANMN]",{"$f":"VLOOKUP($B$89, HDD_B,6, FALSE)*C89","v":0}]
[]
[null,"DISCHI TOTALI",{"$f":"SUM(C79:C90)","v":2},{"$f":"IF(C91<=16,\"      OK\",\"     ERRORE:   Totale n° di dischi superiore al consentito\")","v":"      OK"}]
[]
[null,"Configurazione RAID"]
[null,"C3 - RAID 1 for H330 (2 HDDs)",1,null,{"$f":"VLOOKUP($B$94,  RAID_B1, 2, FALSE)","v":"[780-BBJK]"}]
[null,"Hot Spare for 300GB HDD","No"]
[null,"SCRIVERE QUI' LA CONFIGURAZIONE RAID RICHIESTA.\nR740 2\n",null,null,null,null,null,{"$f":"IF(B96=\"SCRIVERE QUI' LA CONFIGURAZIONE RAID RICHIESTA.\nR740 2\n\",\"ATTENZIONE COMPILARE IL CAMPO DELLA SCELTA RAID\", \"\")","v":"ATTENZIONE COMPILARE IL CAMPO DELLA SCELTA RAID"}]
[null,"Configurazione RAID HDD 1TB"]
[null,"",1,null,{"$f":"VLOOKUP($B$98,  RAID_B2, 2, FALSE)","v":""}]
[null,"Hot Spare for 1TB HDD","No"]
[]
[null,"Impostazioni del BIOS per la gestione dell'alimentazione"]
[null,"Performance BIOS Setting",1,null,"[384-BBBL]"]
[]
[null,"Alimentatore"]
[null,"Dual, Hot-plug, Redundant Power Supply (1+1), 750W, Titanium, 200-240VAC",1,null,"[450-ADWT]"]
[]
[null,"Cavi di alimentazione"]
[null,"Rack Power Cord 2M (C13/C14 12A)",2,null,"[450-AADY]"]
[]
[null,"Fans"]
[null,{"$f":"VLOOKUP(B29, CPU_B.1, 9, FALSE)","v":"4 Standard Fans for R740/740XD"},{"$f":"VLOOKUP($B$29, CPU_B.1, 10, FALSE)","v":1},null,{"$f":"VLOOKUP($B$29, CPU_B.1, 11, FALSE)","v":"[384-BBQB]"}]
[]
[null,"PCIe Riser"]
[null,{"$f":"VLOOKUP(B29, CPU_B.1, 12, FALSE)","v":"Riser Config 1, 4 x8 slots"},{"$f":"VLOOKUP($B$29, CPU_B.1, 13, FALSE)","v":1},null,{"$f":"VLOOKUP($B$29, CPU_B.1, 14, FALSE)","v":"[330-BBGZ]"}]
[]
[null,"TPM Module"]
[null,"Trusted Platform Module 1.2",1,null,"[461-AAEL]"]
[]
[null,"Embedded Systems Management"]
[null,"iDRAC9,Enterprise",1,null,"[385-BBKT]"]
[]
[null,"Adattatore di rete"]
[null,"Broadcom 5720 QP 1Gb Network Daughter Card",1,null,"[540-BBBW]"]
[]
[null,"Modulo Doppia SD"]
[null,"None ",{"$f":"VLOOKUP($B$126,upsell_1, 2, FALSE)","v":0},{"$f":"VLOOKUP($B$126,upsell_1, 3, FALSE)","v":""},{"$f":"VLOOKUP($B$126,upsell_1, 4, FALSE)","v":""},{"$f":"VLOOKUP($B$126,upsell_1, 7, FALSE)","v":0}]
[]
[null,"Additional Card for PCIe Slot 1 (Full height) (CPU 1)"]
[null,"Broadcom 5720 DP 1Gb Network Interface Card",null,{"$f":"\"\"","v":""},"540-BBCX"]
[]
[null,"Additional Card for PCIe Slot 2 (Full height) (CPU 1)"]
[null,"None",{"$f":"VLOOKUP(B132,  PCI_B1.1, 2, FALSE)","v":""},{"$f":"VLOOKUP(B132,  PCI_B1.1, 3, FALSE)","v":""},{"$f":"VLOOKUP(B132,  PCI_B1.1, 5, FALSE)","v":""},{"$f":"VLOOKUP(B132,  PCI_B1.1, 6, FALSE)","v":""},{"$f":"VLOOKUP(B132,  PCI_B1.1, 7, FALSE)","v":0}]
[]
[null,"Additional Card for PCIe Slot 3 (Full height) (CPU 1)"]
[null,"None",{"$f":"VLOOKUP(B135,  PCI_B1.1, 2, FALSE)","v":""},{"$f":"VLOOKUP(B135,  PCI_B1.1, 3, FALSE)","v":""},{"$f":"VLOOKUP(B135,  PCI_B1.1, 5, FALSE)","v":""},{"$f":"VLOOKUP(B135,  PCI_B1.1, 6, FALSE)","v":""},{"$f":"VLOOKUP(B135,  PCI_B1.1, 7, FALSE)","v":0}]
[]
[null,"Additional Card for PCIe Slot 4 (Full height) (CPU 2)"]
[null,"None",{"$f":"VLOOKUP(B138,  PCI_B1.1, 2, FALSE)","v":""},{"$f":"VLOOKUP(B138,  PCI_B1.1, 3, FALSE)","v":""},{"$f":"VLOOKUP(B138,  PCI_B1.1, 5, FALSE)","v":""},{"$f":"VLOOKUP(B138,  PCI_B1.1, 6, FALSE)","v":""},{"$f":"VLOOKUP(B138,  PCI_B1.1, 7, FALSE)","v":0}]
[]
[null,"Additional Card for PCIe Slot 5 (Full height) (CPU 2)"]
[null,"None",{"$f":"VLOOKUP(B141,  PCI_B1.1, 2, FALSE)","v":""},{"$f":"VLOOKUP(B141,  PCI_B1.1, 3, FALSE)","v":""},{"$f":"VLOOKUP(B141,  PCI_B1.1, 5, FALSE)","v":""},{"$f":"VLOOKUP(B141,  PCI_B1.1, 6, FALSE)","v":""},{"$f":"VLOOKUP(B141,  PCI_B1.1, 7, FALSE)","v":0}]
[]
[null,"Additional Card for PCIe Slot 6 (Low Profile) (CPU 1)"]
[null,"None",{"$f":"VLOOKUP(B144,PCI_B5, 2, FALSE)","v":""},{"$f":"VLOOKUP(B144,  PCI_B5, 3, FALSE)","v":""},{"$f":"VLOOKUP($B$144,PCI_B5,5,FALSE)","v":""},{"$f":"VLOOKUP($B$144,PCI_B5,6,FALSE)","v":""},{"$f":"VLOOKUP($B$144,PCI_B5,7,FALSE)","v":0}]
[]
[null,"Additional Card for PCIe Slot 7 (Full height) (CPU 2)"]
[null,"None",{"$f":"VLOOKUP(B147,  PCI_B1.1, 2, FALSE)","v":""},{"$f":"VLOOKUP(B147,  PCI_B1.1, 3, FALSE)","v":""},{"$f":"VLOOKUP(B147,  PCI_B1.1, 5, FALSE)","v":""},{"$f":"VLOOKUP(B147,  PCI_B1.1, 6, FALSE)","v":""},{"$f":"VLOOKUP(B147,  PCI_B1.1, 7, FALSE)","v":0}]
[]
[null,"Additional Card for PCIe Slot 8 (Full height) (CPU 2)"]
[null,"None",{"$f":"VLOOKUP(B150,  PCI_B1.1, 2, FALSE)","v":""},{"$f":"VLOOKUP(B150,  PCI_B1.1, 3, FALSE)","v":""},{"$f":"VLOOKUP(B150,  PCI_B1.1, 5, FALSE)","v":""},{"$f":"VLOOKUP(B150,  PCI_B1.1, 6, FALSE)","v":""},{"$f":"VLOOKUP(B150,  PCI_B1.1, 7, FALSE)","v":0}]
[]
[null,"Pannello frontale"]
[null,"No Bezel Option",{"$f":"VLOOKUP(B153,upsell_1, 2, FALSE)","v":1},{"$f":"VLOOKUP(B153,upsell_1, 3, FALSE)","v":""},{"$f":"VLOOKUP(B153,upsell_1, 5, FALSE)","v":"[350-BBBW]"},{"$f":"VLOOKUP(B153,upsell_1, 6, FALSE)","v":0},{"$f":"VLOOKUP(B153,upsell_1, 7, FALSE)","v":0}]
[]
[null,"Guide per rack"]
[null,"ReadyRails™ Sliding Rails Without Cable Management Arm 2U",{"$f":"VLOOKUP(B156,upsell_1, 2, FALSE)","v":1},{"$f":"VLOOKUP(B156,upsell_1, 3, FALSE)","v":""},{"$f":"VLOOKUP(B156,upsell_1, 5, FALSE)","v":"[770-BBBQ]"},{"$f":"VLOOKUP(B156,upsell_1, 6, FALSE)","v":0},{"$f":"VLOOKUP(B156,upsell_1, 7, FALSE)","v":0}]
[]
[null,"Server Accessories"]
[null,"PowerEdge SFP+, 10GbE SR/SX, Optical Tranceiver, LC Connector, for Intel and Broadcom,CusKit",{"$f":"(VLOOKUP(B150,PCI_A2,8,FALSE))+((VLOOKUP(B135,PCI_B1.1,8,FALSE)))","v":{"$error":"#VALUE!"}},null,"[407-BBQE]"]
[]
[null,"System Documentation"]
[null,"Electronic System Documentation and OpenManage DVD Kit",1,null,"[631-AAJG]"]
[]
[null,"SHIPPING"]
[null,"PowerEdge R730 Shipping EMEA1 (English/French/German/Spanish/Russian/Hebrew)",1,null,"340-ALXX"]
[]
[null,"Order Information"]
[null,"PowerEdge Order - EMEA",1,null,"[800-11671]"]
[]
[null,"Base warranty"]
[null,"3Yr Basic Warranty - Next Business Day - Minimum Warranty",1,null,"[709-12777][709-12778]"]
[]
[null,"Servizi di assitenza"]
[null,"Dell Channel Order - Service Info only",1,null,"[710-31085]"]
[]
[null,"Aggiornamenti della garanzia"]
[null,"None",{"$f":"VLOOKUP($B$177,  SO_B1,2, FALSE)","v":""},{"$f":"VLOOKUP($B$177,  SO_B1, 3, FALSE)","v":""},{"$f":"VLOOKUP($B$177,  SO_B1, 5, FALSE)","v":""},{"$f":"VLOOKUP($B$177,  SO_B1, 6, FALSE)","v":""}]
[]
[null,"Protezione dei dati - Keep Your Hard Drive "]
[null,"None",{"$f":"VLOOKUP($B$180,  SO_B2, 2, FALSE)","v":""},{"$f":"VLOOKUP($B$180,  SO_B2, 3, FALSE)","v":""},{"$f":"VLOOKUP($B$180,  SO_B2,5, FALSE)","v":""},{"$f":"VLOOKUP($B$180,  SO_B2, 6, FALSE)","v":""}]
[]
[null,"Servizi di Installazione"]
[null,"No Installation Service Selected",1,null,"[683-11870]"]
[]
[null,"Channel only - Support Extension"]
[null,"Channel 39M Basic Warranty - Next Business Day",1,null,"[723-38675]"]
[]
[null,"Warranty Upgrades - Non-Std/Local POS"]
[null,"CSTM CONSIP - 39M Onsite Labor Support for CRU for Servers with Basic Warranty",1,null,"[681-24467]"]

{"sheet":"CNV R740 3","index":11,"n_rows":189,"n_cols":8,"rows_kept":189,"cut":false,"hidden":false,"merged":[[183,1,183,4],[184,2,184,4],[186,1,186,4],[187,2,187,4],[189,1,189,4],[181,2,181,4],[165,1,165,4],[166,2,166,4],[168,1,168,4],[169,2,169,4],[171,1,171,4],[172,2,172,4],[174,1,174,4],[175,2,175,4],[177,1,177,4],[178,2,178,4],[180,1,180,4],[163,2,163,4],[144,1,144,4],[148,2,148,4],[150,1,150,4],[151,2,151,4],[153,1,153,4],[154,2,154,4],[156,1,156,4],[157,2,157,4],[159,1,159,4],[160,2,160,4],[162,1,162,4],[145,2,145,4],[147,1,147,4],[142,2,142,4],[123,1,123,4],[127,2,127,4],[129,1,129,4],[130,2,130,4],[132,1,132,4],[133,2,133,4],[135,1,135,4],[136,2,136,4],[138,1,138,4],[139,2,139,4],[141,1,141,4],[124,2,124,4],[126,1,126,4],[121,2,121,4],[100,2,100,4],[102,1,102,4],[103,2,103,4],[105,1,105,4],[109,2,109,4],[111,1,111,4],[112,2,112,4],[114,1,114,4],[117,1,117,4],[118,2,118,4],[120,1,120,4],[106,2,106,4],[108,1,108,4],[92,2,92,4],[96,2,96,4],[99,1,99,4],[95,1,95,3],[95,7,96,8],[91,1,91,4],[54,2,54,4],[56,1,56,4],[57,2,57,4],[59,1,59,4],[61,1,61,4],[74,2,74,4],[76,1,76,4],[77,2,77,4],[83,1,83,4],[85,1,85,4],[87,1,87,4],[64,1,64,4],[73,1,73,4],[53,1,53,4],[29,1,29,4],[30,2,30,4],[33,1,33,4],[34,2,34,4],[36,1,36,4],[39,1,39,4],[40,2,40,4],[42,1,42,4],[43,2,43,4],[49,1,49,4],[50,2,50,4],[27,2,27,4],[4,0,4,4],[5,0,5,4],[10,0,11,5],[12,0,12,5],[18,2,18,4],[20,1,20,4],[21,2,21,4],[23,1,23,4],[24,2,24,4],[26,1,26,4]]}
[null,null,null,"TOTALE MEPA",null,null,null,{"$f":"G10","v":0}]
[]
[]
[]
["POWEREDGE R740"]
[]
[null,null,null,null,null,"Totale Server e Opzioni",{"$f":"F17*SRV_B1.3","v":0}]
[null,null,null,null,null,"Totale Ulteriori Opzioni ",{"$f":"G16*SRV_B1.2-(G73*SRV_B1.1)+G73-(SRV_B1.2*G70)+G70","v":0}]
[]
[null,null,null,null,null,"TOTALE CONVENZIONE",{"$f":"G8+G7","v":0}]
["Components: \nServer DELL PowerEdge R740 (1CPU Intel® Xeon® Gold 5120, 64GB RDIMM, 2xHDD 600GB 10K RPM SAS 12Gbps 2.5in)"]
[]
[]
[]
[null,"Category: Server",null,null,null,{"$f":"2371","v":2371}]
[null,"Quantity: ",null,null,null,{"$f":"SUM(F20:F197)","v":0},{"$f":"SUM(G20:G197)","v":0}]
[null,null,null,null,null,{"$f":"SUM(F15:F16)","v":2371}]
[]
[null,"Base"]
[null,"PowerEdge R740 Server",1,null,"[210-AKXJ]"]
[]
[null,"Configurazione dello chassis"]
[null,"Chassis with up to 16 x 2.5\" SAS/SATA Hard Drives for 1CPU Configuration",1,null,"[321-BCSL]"]
[]
[null,"Processore"]
[null,"Intel® Xeon® Gold 5120 2.2G, 14C/28T, 10.4GT/s, 19M Cache, Turbo, HT (105W)",1,null,"[338-BLUX]"]
[]
[null,"Processore aggiuntivo"]
[null,"No Additional Processor",{"$f":"VLOOKUP($B$29, CPU_B.1, 2, FALSE)","v":0},{"$f":"VLOOKUP($B$29, CPU_B.1, 3, FALSE)","v":""},{"$f":"VLOOKUP($B$29, CPU_B.1, 5, FALSE)","v":"[374-BBBX]"},{"$f":"VLOOKUP(B29, CPU_B.1, 15, FALSE)","v":0}]
[]
[null,"Processor Thermal Configuration"]
[null,"1 CPU Standard",1,null,"[370-ABWF][374-BBHM][750-AAEL]"]
[null,{"$f":"VLOOKUP($B$29, CPU_B, 6, FALSE)","v":""},{"$f":"VLOOKUP($B$29, CPU_B, 7, FALSE)","v":""},null,{"$f":"VLOOKUP($B$29, CPU_B, 8, FALSE)","v":""}]
[]
[null,"Tipo di configurazione memoria"]
[null,"Performance Optimized",1,null,"[370-AAIP]"]
[]
[null,"Memoria Totale in GB",null,{"$f":"IF(('CNV R740 1'!$D$12=0),\"\",'CNV R740 1'!#REF!)","v":""}]
[null,64]
[]
[null,"Tipo e velocità della memoria DIMM"]
[null,"2666MT/s RDIMMs",1,null,"[370-ADNU]"]
[]
[null,"Capacità di memoria"]
[null,{"$f":"IF($B$29=\"No Additional Processor\",VLOOKUP($B$39, MEM_B1, 8, FALSE),VLOOKUP($B$39, MEM_B2, 8, FALSE))","v":"Dell 32 GB Modulo di memoria - RDIMM 2666MHz"},{"$f":"IF($B$29=\"No Additional Processor\",VLOOKUP($B$39, MEM_B1, 9, FALSE),VLOOKUP($B$39, MEM_B2, 9, FALSE))","v":2},null,{"$f":"IF($B$29=\"No Additional Processor\",VLOOKUP($B$39, MEM_B1, 10, FALSE),VLOOKUP($B$39, MEM_B2, 10, FALSE))","v":"[370-ADNF]"}]
[]
[null,{"$f":"IF($B$29=\"No Additional Processor\",VLOOKUP($B$39, MEM_B1, 2, FALSE),VLOOKUP($B$39, MEM_B2, 2, FALSE))","v":""},{"$f":"IF($B$29=\"No Additional Processor\",VLOOKUP($B$39, MEM_B1, 3, FALSE),VLOOKUP($B$39, MEM_B2, 3, FALSE))","v":""},{"$f":"IF($B$29=\"No Additional Processor\",VLOOKUP($B$39, MEM_B1, 4, FALSE),VLOOKUP($B$39, MEM_B2, 4, FALSE))","v":""},{"$f":"IF($B$29=\"No Additional Processor\",VLOOKUP($B$39, MEM_B1, 6, FALSE),VLOOKUP($B$39, MEM_B2, 6, FALSE))","v":""},{"$f":"IF($B$29=\"No Additional Processor\",VLOOKUP($B$39, MEM_B1, 7, FALSE),VLOOKUP($B$39, MEM_B2, 7, FALSE))","v":""}]
[]
[null,{"$f":"IF($B$29=\"No Additional Processor\",VLOOKUP($B$39, MEM_B1, 11, FALSE),VLOOKUP($B$39, MEM_B2, 11, FALSE))","v":""},{"$f":"IF($B$29=\"No Additional Processor\",VLOOKUP($B$39, MEM_B1, 12, FALSE),VLOOKUP($B$39, MEM_B2, 12, FALSE))","v":""},{"$f":"IF($B$29=\"No Additional Processor\",VLOOKUP($B$39, MEM_B1, 13, FALSE),VLOOKUP($B$39, MEM_B2, 13, FALSE))","v":""},{"$f":"IF($B$29=\"No Additional Processor\",VLOOKUP($B$39, MEM_B1, 15, FALSE),VLOOKUP($B$39, MEM_B2, 15, FALSE))","v":""},{"$f":"IF($B$29=\"No Additional Processor\",VLOOKUP($B$39, MEM_B1, 16, FALSE),VLOOKUP($B$39, MEM_B2, 16, FALSE))","v":""}]
[]
[null,"Sistema operativo preinstallato"]
[null,"No Operating System",{"$f":"VLOOKUP($B$52, OS_B, 2, FALSE)","v":""},{"$f":"VLOOKUP($B$52, OS_B, 3, FALSE)","v":""},{"$f":"VLOOKUP($B$52, OS_B, 5, FALSE)","v":"[611-BBBF]"},{"$f":"VLOOKUP($B$52, OS_B, 6, FALSE)","v":""}]
[null,{"$f":"IF($B$29=\"No Additional Processor\",VLOOKUP($B$52, OS_B, 20, FALSE),VLOOKUP($B$52, OS_B2, 20, FALSE))","v":""},{"$f":"IF($B$29=\"No Additional Processor\",VLOOKUP($B$52, OS_B, 21, FALSE),VLOOKUP($B$52, OS_B2, 21, FALSE))","v":0},{"$f":"IF($B$29=\"No Additional Processor\",VLOOKUP($B$52, OS_A, 22, FALSE),VLOOKUP($B$52, OS_B2, 22, FALSE))","v":""},{"$f":"IF($B$29=\"No Additional Processor\",VLOOKUP($B$52, OS_B, 24, FALSE),VLOOKUP($B$52, OS_B2, 24, FALSE))","v":""},{"$f":"IF($B$29=\"No Additional Processor\",VLOOKUP($B$52, OS_B, 25, FALSE),VLOOKUP($B$52, OS_B2, 25, FALSE))","v":""}]
[]
[null,"OS Media Kits"]
[null,"No Media Required",1,null,"[605-BBFN]"]
[]
[null,"Client Access Licenses"]
[null,{"$f":"VLOOKUP($B$52, OS_B, 8, FALSE)","v":"None"},null,{"$f":"VLOOKUP($B$52, OS_A, 10, FALSE)","v":""},{"$f":"VLOOKUP($B$52, OS_A, 12, FALSE)","v":""},{"$f":"VLOOKUP($B$52, OS_A, 13, FALSE)*C59","v":0}]
[]
[null,{"$f":"VLOOKUP($B$52, OS_A, 14, FALSE)","v":"None"},null,{"$f":"VLOOKUP($B$52, OS_A, 16, FALSE)","v":""},{"$f":"VLOOKUP($B$52, OS_A, 18, FALSE)","v":""},{"$f":"VLOOKUP($B$52, OS_A, 19, FALSE)*C61","v":0}]
[]
[null,"Sistema opertivo SUSE Linux Enterprise Server"]
[null,"None\n",{"$f":"VLOOKUP($B$64,SUSE, 2, FALSE)","v":0},{"$f":"VLOOKUP($B$64,SUSE, 3, FALSE)","v":""},{"$f":"VLOOKUP($B$64,SUSE, 5, FALSE)","v":""},{"$f":"VLOOKUP($B$64, SUSE, 6, FALSE)*C64","v":0}]
[]
[null,"Sistema opertivo VMware"]
[null,"None",{"$f":"VLOOKUP($B$67,VMWARE, 2, FALSE)+C29","v":0},{"$f":"VLOOKUP($B$67,VMWARE, 3, FALSE)","v":""},{"$f":"VLOOKUP($B$67,VMWARE, 5, FALSE)","v":""},{"$f":"VLOOKUP($B$67, VMWARE, 6, FALSE)*C67","v":0}]
[]
[null,"VMware vCenter Server Standard"]
[null,"None",{"$f":"VLOOKUP($B$70,VMWARE2, 2, FALSE)","v":0},{"$f":"VLOOKUP($B$70,VMWARE2, 3, FALSE)","v":""},{"$f":"VLOOKUP($B$70,VMWARE2, 5, FALSE)","v":""},null,{"$f":"VLOOKUP($B$70, VMWARE2, 6, FALSE)*C70","v":0}]
[]
[null,"Essentials Plus Kit"]
[null,"None",{"$f":"IF(SRV_A<4,VLOOKUP($B$73,VMWARE1, 2, FALSE),0)","v":0},{"$f":"VLOOKUP($B$73,VMWARE1, 3, FALSE)","v":""},{"$f":"VLOOKUP($B$73,VMWARE1, 5, FALSE)","v":""},null,{"$f":"VLOOKUP($B$73, VMWARE1, 6, FALSE)*C73","v":0}]
[]
[null,"Controller"]
[null,"PERC H730P RAID Controller, 2Gb NV Cache, Minicard",{"$f":"VLOOKUP($B$76,PERC, 2, FALSE)","v":0},{"$f":"VLOOKUP($B$76,PERC, 3, FALSE)","v":""},{"$f":"VLOOKUP($B$76,PERC, 4, FALSE)","v":""},{"$f":"VLOOKUP($B$76,PERC, 7, FALSE)","v":0}]
[]
[null,"Dischi rigidi (numero massimo totale 16)"]
[null,"600GB 10K RPM SAS 12Gbps 512n 2.5in Hot-plug Hard Drive",2,null,"[400-AJPK]"]
[]
[null,"600GB 10K RPM SAS 12Gbps 512n 2.5in Hot-plug Hard Drive",null,{"$f":"VLOOKUP($B$81, HDD_A,3, FALSE)","v":"CNV-TS1L1-HD600"},{"$f":"VLOOKUP($B$81, HDD_A,5, FALSE)","v":"[400-AUNQ]"},{"$f":"VLOOKUP($B$81, HDD_B,6, FALSE)*C81","v":0}]
[]
[null,"1.2TB 10K RPM SAS 12Gbps 512n 2.5in Hot-plug Hard Drive",null,{"$f":"VLOOKUP($B$83, HDD_A,3, FALSE)","v":"CNV-TS1L1-HD1200-U"},{"$f":"VLOOKUP($B$83, HDD_A,5, FALSE)","v":"[400-ATJL]"},{"$f":"VLOOKUP($B$83, HDD_B,6, FALSE)*C83","v":0}]
[]
[null,"1.8TB 10K RPM SAS 12Gbps 512e 2.5in Hot-plug Hard Drive",null,"CNV-TS1L1-HD1800","[400-AJQP]",{"$f":"VLOOKUP($B$85, HDD_B,6, FALSE)*C85","v":0}]
[]
[null,"960GB SSD SAS Mix Use 12Gbps 512n 2.5in Hot-plug Drive,\nPX05SV,3 DWPD,5256 TBW",null,"CNV-TS1L1-SSD800","[400-ANNX]",{"$f":"VLOOKUP($B$87, HDD_B,6, FALSE)*C87","v":0}]
[]
[null,"1.92TB SSD SAS Mix Use 12Gbps 512n 2.5in Hot-plug Drive,\nPX05SV,3 DWPD,10512 TBW",null,"CNV-TS1L1-SSD1920","[400-ANMN]",{"$f":"VLOOKUP($B$89, HDD_B,6, FALSE)*C89","v":0}]
[]
[null,"DISCHI TOTALI",{"$f":"SUM(C79:C90)","v":2},{"$f":"IF(C91<=16,\"      OK\",\"     ERRORE:   Totale n° di dischi superiore al consentito\")","v":"      OK"}]
[]
[null,"Configurazione RAID"]
[null,"C3 - RAID 1 for H330 (2 HDDs)",1,null,{"$f":"VLOOKUP($B$94,  RAID_B1, 2, FALSE)","v":"[780-BBJK]"}]
[null,"Hot Spare for 300GB HDD","No"]
[null,"SCRIVERE QUI' LA CONFIGURAZIONE RAID RICHIESTA.\nR740 3\n",null,null,null,null,null,{"$f":"IF(B96=\"SCRIVERE QUI' LA CONFIGURAZIONE RAID RICHIESTA.\nR740 3\n\",\"ATTENZIONE COMPILARE IL CAMPO DELLA SCELTA RAID\", \"\")","v":"ATTENZIONE COMPILARE IL CAMPO DELLA SCELTA RAID"}]
[null,"Configurazione RAID HDD 1TB"]
[null,"",1,null,{"$f":"VLOOKUP($B$98,  RAID_B2, 2, FALSE)","v":""}]
[null,"Hot Spare for 1TB HDD","No"]
[]
[null,"Impostazioni del BIOS per la gestione dell'alimentazione"]
[null,"Performance BIOS Setting",1,null,"[384-BBBL]"]
[]
[null,"Alimentatore"]
[null,"Dual, Hot-plug, Redundant Power Supply (1+1), 750W, Titanium, 200-240VAC",1,null,"[450-ADWT]"]
[]
[null,"Cavi di alimentazione"]
[null,"Rack Power Cord 2M (C13/C14 12A)",2,null,"[450-AADY]"]
[]
[null,"Fans"]
[null,{"$f":"VLOOKUP(B29, CPU_B.1, 9, FALSE)","v":"4 Standard Fans for R740/740XD"},{"$f":"VLOOKUP($B$29, CPU_B.1, 10, FALSE)","v":1},null,{"$f":"VLOOKUP($B$29, CPU_B.1, 11, FALSE)","v":"[384-BBQB]"}]
[]
[null,"PCIe Riser"]
[null,{"$f":"VLOOKUP(B29, CPU_B.1, 12, FALSE)","v":"Riser Config 1, 4 x8 slots"},{"$f":"VLOOKUP($B$29, CPU_B.1, 13, FALSE)","v":1},null,{"$f":"VLOOKUP($B$29, CPU_B.1, 14, FALSE)","v":"[330-BBGZ]"}]
[]
[null,"TPM Module"]
[null,"Trusted Platform Module 1.2",1,null,"[461-AAEL]"]
[]
[null,"Embedded Systems Management"]
[null,"iDRAC9,Enterprise",1,null,"[385-BBKT]"]
[]
[null,"Adattatore di rete"]
[null,"Broadcom 5720 QP 1Gb Network Daughter Card",1,null,"[540-BBBW]"]
[]
[null,"Modulo Doppia SD"]
[null,"None ",{"$f":"VLOOKUP($B$126,upsell_1, 2, FALSE)","v":0},{"$f":"VLOOKUP($B$126,upsell_1, 3, FALSE)","v":""},{"$f":"VLOOKUP($B$126,upsell_1, 4, FALSE)","v":""},{"$f":"VLOOKUP($B$126,upsell_1, 7, FALSE)","v":0}]
[]
[null,"Additional Card for PCIe Slot 1 (Full height) (CPU 1)"]
[null,"Broadcom 5720 DP 1Gb Network Interface Card",null,{"$f":"\"\"","v":""},"540-BBCX"]
[]
[null,"Additional Card for PCIe Slot 2 (Full height) (CPU 1)"]
[null,"None",{"$f":"VLOOKUP(B132,  PCI_B1.1, 2, FALSE)","v":""},{"$f":"VLOOKUP(B132,  PCI_B1.1, 3, FALSE)","v":""},{"$f":"VLOOKUP(B132,  PCI_B1.1, 5, FALSE)","v":""},{"$f":"VLOOKUP(B132,  PCI_B1.1, 6, FALSE)","v":""},{"$f":"VLOOKUP(B132,  PCI_B1.1, 7, FALSE)","v":0}]
[]
[null,"Additional Card for PCIe Slot 3 (Full height) (CPU 1)"]
[null,"None",{"$f":"VLOOKUP(B135,  PCI_B1.1, 2, FALSE)","v":""},{"$f":"VLOOKUP(B135,  PCI_B1.1, 3, FALSE)","v":""},{"$f":"VLOOKUP(B135,  PCI_B1.1, 5, FALSE)","v":""},{"$f":"VLOOKUP(B135,  PCI_B1.1, 6, FALSE)","v":""},{"$f":"VLOOKUP(B135,  PCI_B1.1, 7, FALSE)","v":0}]
[]
[null,"Additional Card for PCIe Slot 4 (Full height) (CPU 2)"]
[null,"None",{"$f":"VLOOKUP(B138,  PCI_B1.1, 2, FALSE)","v":""},{"$f":"VLOOKUP(B138,  PCI_B1.1, 3, FALSE)","v":""},{"$f":"VLOOKUP(B138,  PCI_B1.1, 5, FALSE)","v":""},{"$f":"VLOOKUP(B138,  PCI_B1.1, 6, FALSE)","v":""},{"$f":"VLOOKUP(B138,  PCI_B1.1, 7, FALSE)","v":0}]
[]
[null,"Additional Card for PCIe Slot 5 (Full height) (CPU 2)"]
[null,"None",{"$f":"VLOOKUP(B141,  PCI_B1.1, 2, FALSE)","v":""},{"$f":"VLOOKUP(B141,  PCI_B1.1, 3, FALSE)","v":""},{"$f":"VLOOKUP(B141,  PCI_B1.1, 5, FALSE)","v":""},{"$f":"VLOOKUP(B141,  PCI_B1.1, 6, FALSE)","v":""},{"$f":"VLOOKUP(B141,  PCI_B1.1, 7, FALSE)","v":0}]
[]
[null,"Additional Card for PCIe Slot 6 (Low Profile) (CPU 1)"]
[null,"None",{"$f":"VLOOKUP(B144,PCI_B5, 2, FALSE)","v":""},{"$f":"VLOOKUP(B144,  PCI_B5, 3, FALSE)","v":""},{"$f":"VLOOKUP($B$144,PCI_B5,5,FALSE)","v":""},{"$f":"VLOOKUP($B$144,PCI_B5,6,FALSE)","v":""},{"$f":"VLOOKUP($B$144,PCI_B5,7,FALSE)","v":0}]
[]
[null,"Additional Card for PCIe Slot 7 (Full height) (CPU 2)"]
[null,"None",{"$f":"VLOOKUP(B147,  PCI_B1.1, 2, FALSE)","v":""},{"$f":"VLOOKUP(B147,  PCI_B1.1, 3, FALSE)","v":""},{"$f":"VLOOKUP(B147,  PCI_B1.1, 5, FALSE)","v":""},{"$f":"VLOOKUP(B147,  PCI_B1.1, 6, FALSE)","v":""},{"$f":"VLOOKUP(B147,  PCI_B1.1, 7, FALSE)","v":0}]
[]
[null,"Additional Card for PCIe Slot 8 (Full height) (CPU 2)"]
[null,"None",{"$f":"VLOOKUP(B150,  PCI_B1.1, 2, FALSE)","v":""},{"$f":"VLOOKUP(B150,  PCI_B1.1, 3, FALSE)","v":""},{"$f":"VLOOKUP(B150,  PCI_B1.1, 5, FALSE)","v":""},{"$f":"VLOOKUP(B150,  PCI_B1.1, 6, FALSE)","v":""},{"$f":"VLOOKUP(B150,  PCI_B1.1, 7, FALSE)","v":0}]
[]
[null,"Pannello frontale"]
[null,"No Bezel Option",{"$f":"VLOOKUP(B153,upsell_1, 2, FALSE)","v":1},{"$f":"VLOOKUP(B153,upsell_1, 3, FALSE)","v":""},{"$f":"VLOOKUP(B153,upsell_1, 5, FALSE)","v":"[350-BBBW]"},{"$f":"VLOOKUP(B153,upsell_1, 6, FALSE)","v":0},{"$f":"VLOOKUP(B153,upsell_1, 7, FALSE)","v":0}]
[]
[null,"Guide per rack"]
[null,"ReadyRails™ Sliding Rails Without Cable Management Arm 2U",{"$f":"VLOOKUP(B156,upsell_1, 2, FALSE)","v":1},{"$f":"VLOOKUP(B156,upsell_1, 3, FALSE)","v":""},{"$f":"VLOOKUP(B156,upsell_1, 5, FALSE)","v":"[770-BBBQ]"},{"$f":"VLOOKUP(B156,upsell_1, 6, FALSE)","v":0},{"$f":"VLOOKUP(B156,upsell_1, 7, FALSE)","v":0}]
[]
[null,"Server Accessories"]
[null,"PowerEdge SFP+, 10GbE SR/SX, Optical Tranceiver, LC Connector, for Intel and Broadcom,CusKit",{"$f":"(VLOOKUP(B150,PCI_A2,8,FALSE))+((VLOOKUP(B132,PCI_B1.1,8,FALSE)))","v":{"$error":"#VALUE!"}},null,"[407-BBQE]"]
[]
[null,"System Documentation"]
[null,"Electronic System Documentation and OpenManage DVD Kit",1,null,"[631-AAJG]"]
[]
[null,"SHIPPING"]
[null,"PowerEdge R730 Shipping EMEA1 (English/French/German/Spanish/Russian/Hebrew)",1,null,"340-ALXX"]
[]
[null,"Order Information"]
[null,"PowerEdge Order - EMEA",1,null,"[800-11671]"]
[]
[null,"Base warranty"]
[null,"3Yr Basic Warranty - Next Business Day - Minimum Warranty",1,null,"[709-12777][709-12778]"]
[]
[null,"Servizi di assitenza"]
[null,"Dell Channel Order - Service Info only",1,null,"[710-31085]"]
[]
[null,"Aggiornamenti della garanzia"]
[null,"None",{"$f":"VLOOKUP($B$177,  SO_B1,2, FALSE)","v":""},{"$f":"VLOOKUP($B$177,  SO_B1, 3, FALSE)","v":""},{"$f":"VLOOKUP($B$177,  SO_B1, 5, FALSE)","v":""},{"$f":"VLOOKUP($B$177,  SO_B1, 6, FALSE)","v":""}]
[]
[null,"Protezione dei dati - Keep Your Hard Drive "]
[null,"None",{"$f":"VLOOKUP($B$180,  SO_B2, 2, FALSE)","v":""},{"$f":"VLOOKUP($B$180,  SO_B2, 3, FALSE)","v":""},{"$f":"VLOOKUP($B$180,  SO_B2,5, FALSE)","v":""},{"$f":"VLOOKUP($B$180,  SO_B2, 6, FALSE)","v":""}]
[]
[null,"Servizi di Installazione"]
[null,"No Installation Service Selected",1,null,"[683-11870]"]
[]
[null,"Channel only - Support Extension"]
[null,"Channel 39M Basic Warranty - Next Business Day",1,null,"[723-38675]"]
[]
[null,"Warranty Upgrades - Non-Std/Local POS"]
[null,"CSTM CONSIP - 39M Onsite Labor Support for CRU for Servers with Basic Warranty",1,null,"[681-24467]"]

{"sheet":"CNV R740xd 2","index":12,"n_rows":184,"n_cols":8,"rows_kept":184,"cut":false,"hidden":false,"merged":[[27,2,27,4],[4,0,4,4],[5,0,5,4],[10,0,11,5],[12,0,12,5],[18,2,18,4],[20,1,20,4],[21,2,21,4],[23,1,23,4],[24,2,24,4],[26,1,26,4],[53,1,53,4],[29,1,29,4],[30,2,30,4],[33,1,33,4],[34,2,34,4],[36,1,36,4],[39,1,39,4],[40,2,40,4],[42,1,42,4],[43,2,43,4],[49,1,49,4],[50,2,50,4],[96,7,97,8],[92,1,92,4],[54,2,54,4],[57,1,57,4],[58,2,58,4],[60,1,60,4],[62,1,62,4],[75,2,75,4],[77,1,77,4],[78,2,78,4],[84,1,84,4],[86,1,86,4],[88,1,88,4],[65,1,65,4],[74,1,74,4],[109,1,109,4],[93,2,93,4],[97,2,97,4],[100,1,100,4],[101,2,101,4],[103,1,103,4],[104,2,104,4],[106,1,106,4],[107,2,107,4],[96,1,96,3],[134,2,134,4],[110,2,110,4],[112,1,112,4],[118,1,118,4],[119,2,119,4],[121,1,121,4],[122,2,122,4],[124,1,124,4],[128,2,128,4],[130,1,130,4],[131,2,131,4],[133,1,133,4],[125,2,125,4],[127,1,127,4],[113,2,113,4],[115,1,115,4],[152,2,152,4],[136,1,136,4],[137,2,137,4],[139,1,139,4],[140,2,140,4],[142,1,142,4],[143,2,143,4],[145,1,145,4],[146,2,146,4],[148,1,148,4],[149,2,149,4],[151,1,151,4],[170,2,170,4],[154,1,154,4],[155,2,155,4],[157,1,157,4],[158,2,158,4],[160,1,160,4],[161,2,161,4],[163,1,163,4],[164,2,164,4],[166,1,166,4],[167,2,167,4],[169,1,169,4],[181,1,181,4],[182,2,182,4],[184,1,184,4],[172,1,172,4],[173,2,173,4],[175,1,175,4],[176,2,176,4],[178,1,178,4],[179,2,179,4]]}
[null,null,null,"TOTALE MEPA",null,null,null,{"$f":"G10","v":0}]
[]
[]
[]
["POWEREDGE R740xd"]
[]
[null,null,null,null,null,"Totale Server e Opzioni",{"$f":"F17*SRV_BB","v":0}]
[null,null,null,null,null,"Totale Ulteriori Opzioni "]
[]
[null,null,null,null,null,"TOTALE CONVENZIONE",{"$f":"G8+G7","v":0}]
["Components: \nServer DELL PowerEdge R740xd (1CPU Intel® Xeon® Gold 5120, 64GB RDIMM, 2xHDD 600GB 10K RPM SAS 12Gbps 2.5in)"]
[]
[]
[]
[null,"Category: Server",null,null,null,{"$f":"2371","v":2371}]
[null,"Quantity: ",null,null,null,{"$f":"SUM(F20:F185)","v":0},{"$f":"SUM(G20:G194)","v":0}]
[null,null,null,null,null,{"$f":"SUM(F15:F16)","v":2371}]
[]
[null,"Base"]
[null,"PowerEdge R740XD Server",1,null,"[210-AKZR]"]
[]
[null,"Configurazione dello chassis"]
[null,"Chassis with Up to 24 x 2.5” Hard Drives for 1CPU Configuration",1,null,"[321-BCPX]"]
[]
[null,"Processore"]
[null,"Intel® Xeon® Gold 5120 2.2G, 14C/28T, 10.4GT/s, 19M Cache, Turbo, HT (105W) DDR4-2400",1,null,"[338-BLUX]"]
[]
[null,"Processore aggiuntivo"]
[null,"No Additional Processor",{"$f":"VLOOKUP($B$29, CPU_B, 2, FALSE)","v":0},{"$f":"VLOOKUP($B$29, CPU_B, 3, FALSE)","v":""},{"$f":"VLOOKUP($B$29, CPU_B, 5, FALSE)","v":"[374-BBBX]"},{"$f":"VLOOKUP(B29, CPU_B, 15, FALSE)","v":0}]
[]
[null,"Processor Thermal Configuration"]
[null,"1 CPU Standard",1,null,"[370-ABWF][374-BBHM][750-AAEL]"]
[null,{"$f":"VLOOKUP($B$29, CPU_B, 6, FALSE)","v":""},{"$f":"VLOOKUP($B$29, CPU_B, 7, FALSE)","v":""},null,{"$f":"VLOOKUP($B$29, CPU_B, 8, FALSE)","v":""}]
[]
[null,"Tipo di configurazione memoria"]
[null,"Performance Optimized",1,null,"[370-AAIP]"]
[]
[null,"Memoria Totale in GB",null,{"$f":"IF(('CNV R740 1'!$D$12=0),\"\",'CNV R740 1'!#REF!)","v":""}]
[null,64]
[]
[null,"Tipo e velocità della memoria DIMM"]
[null,"2666MT/s RDIMMs",1,null,"[370-ADNU]"]
[]
[null,"Capacità di memoria"]
[null,{"$f":"IF($B$29=\"No Additional Processor\",VLOOKUP($B$39, MEM_B1, 8, FALSE),VLOOKUP($B$39, MEM_B2, 8, FALSE))","v":"Dell 32 GB Modulo di memoria - RDIMM 2666MHz"},{"$f":"IF($B$29=\"No Additional Processor\",VLOOKUP($B$39, MEM_B1, 9, FALSE),VLOOKUP($B$39, MEM_B2, 9, FALSE))","v":2},null,{"$f":"IF($B$29=\"No Additional Processor\",VLOOKUP($B$39, MEM_B1, 10, FALSE),VLOOKUP($B$39, MEM_B2, 10, FALSE))","v":"[370-ADNF]"}]
[]
[null,{"$f":"IF($B$29=\"No Additional Processor\",VLOOKUP($B$39, MEM_B1, 2, FALSE),VLOOKUP($B$39, MEM_B2, 2, FALSE))","v":""},{"$f":"IF($B$29=\"No Additional Processor\",VLOOKUP($B$39, MEM_B1, 3, FALSE),VLOOKUP($B$39, MEM_B2, 3, FALSE))","v":""},{"$f":"IF($B$29=\"No Additional Processor\",VLOOKUP($B$39, MEM_B1, 4, FALSE),VLOOKUP($B$39, MEM_B2, 4, FALSE))","v":""},{"$f":"IF($B$29=\"No Additional Processor\",VLOOKUP($B$39, MEM_B1, 6, FALSE),VLOOKUP($B$39, MEM_B2, 6, FALSE))","v":""},{"$f":"IF($B$29=\"No Additional Processor\",VLOOKUP($B$39, MEM_B1, 7, FALSE),VLOOKUP($B$39, MEM_B2, 7, FALSE))","v":""}]
[]
[null,{"$f":"IF($B$29=\"No Additional Processor\",VLOOKUP($B$39, MEM_B1, 11, FALSE),VLOOKUP($B$39, MEM_B2, 11, FALSE))","v":""},{"$f":"IF($B$29=\"No Additional Processor\",VLOOKUP($B$39, MEM_B1, 12, FALSE),VLOOKUP($B$39, MEM_B2, 12, FALSE))","v":""},{"$f":"IF($B$29=\"No Additional Processor\",VLOOKUP($B$39, MEM_B1, 13, FALSE),VLOOKUP($B$39, MEM_B2, 13, FALSE))","v":""},{"$f":"IF($B$29=\"No Additional Processor\",VLOOKUP($B$39, MEM_B1, 15, FALSE),VLOOKUP($B$39, MEM_B2, 15, FALSE))","v":""},{"$f":"IF($B$29=\"No Additional Processor\",VLOOKUP($B$39, MEM_B1, 16, FALSE),VLOOKUP($B$39, MEM_B2, 16, FALSE))","v":""}]
[]
[null,"Sistema operativo preinstallato"]
[null,"No Operating System",{"$f":"VLOOKUP($B$52, OS_B, 2, FALSE)","v":""},{"$f":"VLOOKUP($B$52, OS_B, 3, FALSE)","v":""},{"$f":"VLOOKUP($B$52, OS_B, 5, FALSE)","v":"[611-BBBF]"},{"$f":"VLOOKUP($B$52, OS_B, 6, FALSE)","v":""}]
[null,{"$f":"IF($B$29=\"No Additional Processor\",VLOOKUP($B$52, OS_B, 20, FALSE),VLOOKUP($B$52, OS_B2, 20, FALSE))","v":""},{"$f":"IF($B$29=\"No Additional Processor\",VLOOKUP($B$52, OS_B, 21, FALSE),VLOOKUP($B$52, OS_B2, 21, FALSE))","v":0},{"$f":"IF($B$29=\"No Additional Processor\",VLOOKUP($B$52, OS_A, 22, FALSE),VLOOKUP($B$52, OS_B2, 22, FALSE))","v":""},{"$f":"IF($B$29=\"No Additional Processor\",VLOOKUP($B$52, OS_B, 24, FALSE),VLOOKUP($B$52, OS_B2, 24, FALSE))","v":""},{"$f":"IF($B$29=\"No Additional Processor\",VLOOKUP($B$52, OS_B, 25, FALSE),VLOOKUP($B$52, OS_B2, 25, FALSE))","v":""}]
[]
[null,"OS Media Kits"]
[null,"No Media Required",1,null,"[605-BBFN]"]
[]
[]
[null,"Client Access Licenses"]
[null,{"$f":"VLOOKUP($B$52, OS_B, 8, FALSE)","v":"None"},null,{"$f":"VLOOKUP($B$52, OS_A, 10, FALSE)","v":""},{"$f":"VLOOKUP($B$52, OS_A, 12, FALSE)","v":""},{"$f":"VLOOKUP($B$52, OS_A, 13, FALSE)*C60","v":0}]
[]
[null,{"$f":"VLOOKUP($B$52, OS_A, 14, FALSE)","v":"None"},null,{"$f":"VLOOKUP($B$52, OS_A, 16, FALSE)","v":""},{"$f":"VLOOKUP($B$52, OS_A, 18, FALSE)","v":""},{"$f":"VLOOKUP($B$52, OS_A, 19, FALSE)*C62","v":0}]
[]
[null,"Sistema operativo SUSE Linux Enterprise Server"]
[null,"None\n",{"$f":"VLOOKUP($B$65,SUSE, 2, FALSE)","v":0},{"$f":"VLOOKUP($B$65,SUSE, 3, FALSE)","v":""},{"$f":"VLOOKUP($B$65,SUSE, 5, FALSE)","v":""},{"$f":"VLOOKUP($B$65, SUSE, 6, FALSE)*C65","v":0}]
[]
[null,"Sistema operativo VMware"]
[null,"None",{"$f":"VLOOKUP($B$68,VMWARE, 2, FALSE)+C29","v":0},{"$f":"VLOOKUP($B$68,VMWARE, 3, FALSE)","v":""},{"$f":"VLOOKUP($B$68,VMWARE, 5, FALSE)","v":""},{"$f":"VLOOKUP($B$68, VMWARE, 6, FALSE)*C68","v":0}]
[]
[null,"VMware vCenter Server Standard"]
[null,"None",{"$f":"VLOOKUP($B$71,VMWARE2, 2, FALSE)","v":0},{"$f":"VLOOKUP($B$71,VMWARE2, 3, FALSE)","v":""},{"$f":"VLOOKUP($B$71,VMWARE2, 5, FALSE)","v":""},null,{"$f":"VLOOKUP($B$71, VMWARE2, 6, FALSE)*C71","v":0}]
[]
[null,"Essentials Plus Kit"]
[null,"None",{"$f":"IF(SRV_A<4,VLOOKUP($B$74,VMWARE1, 2, FALSE),0)","v":0},{"$f":"VLOOKUP($B$74,VMWARE1, 3, FALSE)","v":""},{"$f":"VLOOKUP($B$74,VMWARE1, 5, FALSE)","v":""},null,{"$f":"VLOOKUP($B$74, VMWARE1, 6, FALSE)*C74","v":0}]
[]
[null,"Controller RAID"]
[null,"PERC H730P RAID Controller, 2Gb NV Cache, Minicard",{"$f":"VLOOKUP($B$77,PERC, 2, FALSE)","v":0},{"$f":"VLOOKUP($B$77,PERC, 3, FALSE)","v":""},{"$f":"VLOOKUP($B$77,PERC, 4, FALSE)","v":""},{"$f":"VLOOKUP($B$77,PERC, 7, FALSE)","v":0}]
[]
[null,"Dischi rigidi  (numero massimo totale 24)"]
[null,"600GB 10K RPM SAS 12Gbps 512n 2.5in Hot-plug Hard Drive",2,null,"[400-AJPK]"]
[]
[null,"600GB 10K RPM SAS 12Gbps 512n 2.5in Hot-plug Hard Drive",null,{"$f":"VLOOKUP($B$82, HDD_A,3, FALSE)","v":"CNV-TS1L1-HD600"},{"$f":"VLOOKUP($B$82, HDD_A,5, FALSE)","v":"[400-AUNQ]"},{"$f":"VLOOKUP($B$82, HDD_B,6, FALSE)*C82","v":0}]
[]
[null,"1.2TB 10K RPM SAS 12Gbps 512n 2.5in Hot-plug Hard Drive",null,{"$f":"VLOOKUP($B$84, HDD_A,3, FALSE)","v":"CNV-TS1L1-HD1200-U"},{"$f":"VLOOKUP($B$84, HDD_A,5, FALSE)","v":"[400-ATJL]"},{"$f":"VLOOKUP($B$84, HDD_B,6, FALSE)*C84","v":0}]
[]
[null,"1.8TB 10K RPM SAS 12Gbps 512e 2.5in Hot-plug Hard Drive",null,"CNV-TS1L1-HD1800","[400-AJQP]",{"$f":"VLOOKUP($B$86, HDD_B,6, FALSE)*C86","v":0}]
[]
[null,"960GB SSD SAS Mix Use 12Gbps 512n 2.5in Hot-plug Drive,\nPX05SV,3 DWPD,5256 TBW",null,"CNV-TS1L1-SSD800","[400-ANNX]",{"$f":"VLOOKUP($B$88, HDD_B,6, FALSE)*C88","v":0}]
[]
[null,"1.92TB SSD SAS Mix Use 12Gbps 512n 2.5in Hot-plug Drive,\nPX05SV,3 DWPD,10512 TBW",null,"CNV-TS1L1-SSD1920","[400-ANMN]",{"$f":"VLOOKUP($B$90, HDD_B,6, FALSE)*C90","v":0}]
[]
[null,"DISCHI TOTALI",{"$f":"SUM(C80:C91)","v":2},{"$f":"IF(C92<=24,\"      OK\",\"     ERRORE:   Totale n° di dischi superiore al consentito\")","v":"      OK"}]
[]
[null,"Configurazione RAID"]
[null,"C3 - RAID 1 for H330 (2 HDDs)",1,null,{"$f":"VLOOKUP($B$95,  RAID_B1, 2, FALSE)","v":"[780-BBJK]"}]
[null,"Hot Spare for 300GB HDD","No"]
[null,"SCRIVERE QUI' LA CONFIGURAZIONE RAID RICHIESTA.\nR740XD 2\n",null,null,null,null,null,{"$f":"IF(B97=\"SCRIVERE QUI' LA CONFIGURAZIONE RAID RICHIESTA.\nR740XD 2\n\",\"ATTENZIONE COMPILARE IL CAMPO DELLA SCELTA RAID\", \"\")","v":"ATTENZIONE COMPILARE IL CAMPO DELLA SCELTA RAID"}]
[null,"Configurazione RAID HDD 1TB"]
[null,"",1,null,{"$f":"VLOOKUP($B$99,  RAID_B2, 2, FALSE)","v":""}]
[null,"Hot Spare for 1TB HDD","No"]
[]
[null,"Impostazioni del BIOS per la gestione dell'alimentazione"]
[null,"Performance BIOS Setting",1,null,"[384-BBBL]"]
[]
[null,"Alimentatore"]
[null,"Dual, Hot-plug, Redundant Power Supply (1+1), 750W, Titanium, 200-240VAC",1,null,"[450-ADWT]"]
[]
[null,"Cavi di alimentazione"]
[null,"Rack Power Cord 2M (C13/C14 12A)",2,null,"[450-AADY]"]
[]
[null,"Fans"]
[null,{"$f":"VLOOKUP(B29, CPU_B, 9, FALSE)","v":"4 Standard Fans for R740/740XD"},{"$f":"VLOOKUP($B$29, CPU_B.1, 10, FALSE)","v":1},null,{"$f":"VLOOKUP($B$29, CPU_B.1, 11, FALSE)","v":"[384-BBQB]"}]
[]
[null,"PCIe Riser"]
[null,{"$f":"VLOOKUP(B29, CPU_B.1, 12, FALSE)","v":"Riser Config 1, 4 x8 slots"},{"$f":"VLOOKUP($B$29, CPU_B.1, 13, FALSE)","v":1},null,{"$f":"VLOOKUP($B$29, CPU_B.1, 14, FALSE)","v":"[330-BBGZ]"}]
[]
[null,"TPM Module"]
[null,"Trusted Platform Module 1.2",1,null,"[461-AAEL]"]
[]
[null,"Embedded Systems Management"]
[null,"iDRAC9,Enterprise",1,null,"[385-BBKT]"]
[]
[null,"Adattatore di rete"]
[null,"Broadcom 5720 QP 1Gb Network Daughter Card",1,null,"[540-BBBW]"]
[]
[null,"Modulo Doppia SD"]
[null,"None ",{"$f":"VLOOKUP($B$127,upsell_1, 2, FALSE)","v":0},{"$f":"VLOOKUP($B$127,upsell_1, 3, FALSE)","v":""},{"$f":"VLOOKUP($B$127,upsell_1, 4, FALSE)","v":""},{"$f":"VLOOKUP($B$127,upsell_1, 7, FALSE)","v":0}]
[]
[null,"Additional Card for PCIe Slot 1 (Full height) (CPU 1)"]
[null,"Broadcom 5719 QP 1Gb Network Interface Card",null,{"$f":"\"\"","v":""},"540-BBCW"]
[]
[null,"Additional Card for PCIe Slot 2 (Full height) (CPU 1)"]
[null,"None",{"$f":"VLOOKUP(B133,  PCI_B1.1, 2, FALSE)","v":""},{"$f":"VLOOKUP(B133,  PCI_B1.1, 3, FALSE)","v":""},{"$f":"VLOOKUP(B133,  PCI_B1.1, 5, FALSE)","v":""},{"$f":"VLOOKUP(B133,  PCI_B1.1, 6, FALSE)","v":""},{"$f":"VLOOKUP(B133,  PCI_B1.1, 7, FALSE)","v":0}]
[]
[null,"Additional Card for PCIe Slot 3 (Full height) (CPU 1)"]
[null,"None",{"$f":"VLOOKUP(B136,  PCI_B1.1, 2, FALSE)","v":""},{"$f":"VLOOKUP(B136,  PCI_B1.1, 3, FALSE)","v":""},{"$f":"VLOOKUP(B136,  PCI_B1.1, 5, FALSE)","v":""},{"$f":"VLOOKUP(B136,  PCI_B1.1, 6, FALSE)","v":""},{"$f":"VLOOKUP(B136,  PCI_B1.1, 7, FALSE)","v":0}]
[]
[null,"Additional Card for PCIe Slot 4 (Full height) (CPU 2)"]
[null,"None",{"$f":"VLOOKUP(B139,  PCI_B1.1, 2, FALSE)","v":""},{"$f":"VLOOKUP(B139,  PCI_B1.1, 3, FALSE)","v":""},{"$f":"VLOOKUP(B139,  PCI_B1.1, 5, FALSE)","v":""},{"$f":"VLOOKUP(B139,  PCI_B1.1, 6, FALSE)","v":""},{"$f":"VLOOKUP(B139,  PCI_B1.1, 7, FALSE)","v":0}]
[]
[null,"Additional Card for PCIe Slot 5 (Full height) (CPU 2)"]
[null,"None",{"$f":"VLOOKUP(B142,  PCI_B1.1, 2, FALSE)","v":""},{"$f":"VLOOKUP(B142,  PCI_B1.1, 3, FALSE)","v":""},{"$f":"VLOOKUP(B142,  PCI_B1.1, 5, FALSE)","v":""},{"$f":"VLOOKUP(B142,  PCI_B1.1, 6, FALSE)","v":""},{"$f":"VLOOKUP(B142,  PCI_B1.1, 7, FALSE)","v":0}]
[]
[null,"Additional Card for PCIe Slot 6 (Low Profile) (CPU 1)"]
[null,"None",{"$f":"VLOOKUP(B145,PCI_B5, 2, FALSE)","v":""},{"$f":"VLOOKUP(B145,  PCI_B5, 3, FALSE)","v":""},{"$f":"VLOOKUP($B$145,PCI_B5,5,FALSE)","v":""},{"$f":"VLOOKUP($B$145,PCI_B5,6,FALSE)","v":""},{"$f":"VLOOKUP($B$145,PCI_B5,7,FALSE)","v":0}]
[]
[null,"Additional Card for PCIe Slot 7 (Full height) (CPU 2)"]
[null,"None",{"$f":"VLOOKUP(B148,  PCI_B1.1, 2, FALSE)","v":""},{"$f":"VLOOKUP(B148,  PCI_B1.1, 3, FALSE)","v":""},{"$f":"VLOOKUP(B148,  PCI_B1.1, 5, FALSE)","v":""},{"$f":"VLOOKUP(B148,  PCI_B1.1, 6, FALSE)","v":""},{"$f":"VLOOKUP(B148,  PCI_B1.1, 7, FALSE)","v":0}]
[]
[null,"Additional Card for PCIe Slot 8 (Full height) (CPU 2)"]
[null,"None",{"$f":"VLOOKUP(B151,  PCI_B1.1, 2, FALSE)","v":""},{"$f":"VLOOKUP(B151,  PCI_B1.1, 3, FALSE)","v":""},{"$f":"VLOOKUP(B151,  PCI_B1.1, 5, FALSE)","v":""},{"$f":"VLOOKUP(B151,  PCI_B1.1, 6, FALSE)","v":""},{"$f":"VLOOKUP(B151,  PCI_B1.1, 7, FALSE)","v":0}]
[]
[null,"Pannello frontale"]
[null,"No Bezel Option",{"$f":"VLOOKUP(B154,upsell_1, 2, FALSE)","v":1},{"$f":"VLOOKUP(B154,upsell_1, 3, FALSE)","v":""},{"$f":"VLOOKUP(B154,upsell_1, 5, FALSE)","v":"[350-BBBW]"},{"$f":"VLOOKUP(B154,upsell_1, 6, FALSE)","v":0},{"$f":"VLOOKUP(B154,upsell_1, 7, FALSE)","v":0}]
[]
[null,"Guide per rack"]
[null,"ReadyRails™ Sliding Rails Without Cable Management Arm 2U",{"$f":"VLOOKUP(B157,upsell_1, 2, FALSE)","v":1},{"$f":"VLOOKUP(B157,upsell_1, 3, FALSE)","v":""},{"$f":"VLOOKUP(B157,upsell_1, 5, FALSE)","v":"[770-BBBQ]"},{"$f":"VLOOKUP(B157,upsell_1, 6, FALSE)","v":0},{"$f":"VLOOKUP(B157,upsell_1, 7, FALSE)","v":0}]
[]
[null,"Server Accessories"]
[null,"PowerEdge SFP+, 10GbE SR/SX, Optical Tranceiver, LC Connector, for Intel and Broadcom,CusKit",{"$f":"(VLOOKUP(B151,PCI_A2,8,FALSE))+((VLOOKUP(B130,PCI_A1,8,FALSE)))","v":{"$error":"#VALUE!"}},null,"[407-BBQE]"]
[]
[null,"System Documentation"]
[null,"Electronic System Documentation and OpenManage DVD Kit",1,null,"[631-AAJG]"]
[]
[null,"SHIPPING"]
[null,"PowerEdge R730xd Shipping EMEA1 (English/French/German/Spanish/Russian/Hebrew)",1,null,"[340-AMGS]"]
[]
[null,"Order Information"]
[null,"PowerEdge Order - EMEA",1,null,"[800-11671]"]
[]
[null,"Base warranty"]
[null,"3Yr Basic Warranty - Next Business Day - Minimum Warranty",1,null,"[709-12780][709-12781]"]
[]
[null,"Servizi di assitenza"]
[null,"Dell Channel Order - Service Info only",1,null,"[710-31085]"]
[]
[null,"Aggiornamenti della garanzia"]
[null,"None",{"$f":"VLOOKUP($B$178,  SO_B2,2, FALSE)","v":""},{"$f":"VLOOKUP($B$178,  SO_B2, 3, FALSE)","v":""},{"$f":"VLOOKUP($B$178,  SO_B2, 5, FALSE)","v":""},{"$f":"VLOOKUP($B$178,  SO_B2, 6, FALSE)","v":""}]
[]
[null,"Channel only - Support Extension"]
[null,"Channel 39M Basic Warranty - Next Business Day",1,null,"[723-28780]"]
[]
[null,"Warranty Upgrades - Non-Std/Local POS"]
[null,"CSTM CONSIP - 39M Onsite Labor Support for CRU for Servers with Basic Warranty",1,null,"[681-24467]"]

{"sheet":"CNV R740xd 3","index":13,"n_rows":181,"n_cols":8,"rows_kept":181,"cut":false,"hidden":false,"merged":[[27,2,27,4],[4,0,4,4],[5,0,5,4],[10,0,11,5],[12,0,12,5],[18,2,18,4],[20,1,20,4],[21,2,21,4],[23,1,23,4],[24,2,24,4],[26,1,26,4],[53,1,53,4],[29,1,29,4],[30,2,30,4],[33,1,33,4],[34,2,34,4],[36,1,36,4],[39,1,39,4],[40,2,40,4],[42,1,42,4],[43,2,43,4],[49,1,49,4],[50,2,50,4],[96,7,97,8],[92,1,92,4],[54,2,54,4],[57,1,57,4],[58,2,58,4],[60,1,60,4],[62,1,62,4],[75,2,75,4],[77,1,77,4],[78,2,78,4],[84,1,84,4],[86,1,86,4],[88,1,88,4],[65,1,65,4],[74,1,74,4],[109,1,109,4],[93,2,93,4],[97,2,97,4],[100,1,100,4],[101,2,101,4],[103,1,103,4],[104,2,104,4],[106,1,106,4],[107,2,107,4],[96,1,96,3],[131,2,131,4],[110,2,110,4],[112,1,112,4],[115,1,115,4],[118,1,118,4],[119,2,119,4],[121,1,121,4],[125,2,125,4],[127,1,127,4],[128,2,128,4],[130,1,130,4],[122,2,122,4],[124,1,124,4],[113,2,113,4],[149,2,149,4],[133,1,133,4],[134,2,134,4],[136,1,136,4],[137,2,137,4],[139,1,139,4],[140,2,140,4],[142,1,142,4],[143,2,143,4],[145,1,145,4],[146,2,146,4],[148,1,148,4],[167,2,167,4],[151,1,151,4],[152,2,152,4],[154,1,154,4],[155,2,155,4],[157,1,157,4],[158,2,158,4],[160,1,160,4],[161,2,161,4],[163,1,163,4],[164,2,164,4],[166,1,166,4],[178,1,178,4],[179,2,179,4],[181,1,181,4],[169,1,169,4],[170,2,170,4],[172,1,172,4],[173,2,173,4],[175,1,175,4],[176,2,176,4]]}
[null,null,null,"TOTALE MEPA",null,null,null,{"$f":"G10","v":0}]
[]
[]
[]
["POWEREDGE R740xd"]
[]
[null,null,null,null,null,"Totale Server e Opzioni",{"$f":"F17*SRV_BBB","v":0}]
[null,null,null,null,null,"Totale Ulteriori Opzioni "]
[]
[null,null,null,null,null,"TOTALE CONVENZIONE",{"$f":"G8+G7","v":0}]
["Components: \nServer DELL PowerEdge R740xd (1CPU Intel® Xeon® Gold 5120, 64GB RDIMM, 2xHDD 600GB 10K RPM SAS 12Gbps 2.5in)"]
[]
[]
[]
[null,"Category: Server",null,null,null,{"$f":"2371","v":2371}]
[null,"Quantity: ",null,null,null,{"$f":"SUM(F20:F182)","v":0},{"$f":"SUM(G20:G191)","v":0}]
[null,null,null,null,null,{"$f":"SUM(F15:F16)","v":2371}]
[]
[null,"Base"]
[null,"PowerEdge R740XD Server",1,null,"[210-AKZR]"]
[]
[null,"Configurazione dello chassis"]
[null,"Chassis with Up to 24 x 2.5” Hard Drives for 1CPU Configuration",1,null,"[321-BCPX]"]
[]
[null,"Processore"]
[null,"Intel® Xeon® Gold 5120 2.2G, 14C/28T, 10.4GT/s, 19M Cache, Turbo, HT (105W) DDR4-2400",1,null,"[338-BLUX]"]
[]
[null,"Processore aggiuntivo"]
[null,"No Additional Processor",{"$f":"VLOOKUP($B$29, CPU_B, 2, FALSE)","v":0},{"$f":"VLOOKUP($B$29, CPU_B, 3, FALSE)","v":""},{"$f":"VLOOKUP($B$29, CPU_B, 5, FALSE)","v":"[374-BBBX]"},{"$f":"VLOOKUP(B29, CPU_B, 15, FALSE)","v":0}]
[]
[null,"Processor Thermal Configuration"]
[null,"1 CPU Standard",1,null,"[370-ABWF][374-BBHM][750-AAEL]"]
[null,{"$f":"VLOOKUP($B$29, CPU_B, 6, FALSE)","v":""},{"$f":"VLOOKUP($B$29, CPU_B, 7, FALSE)","v":""},null,{"$f":"VLOOKUP($B$29, CPU_B, 8, FALSE)","v":""}]
[]
[null,"Tipo di configurazione memoria"]
[null,"Performance Optimized",1,null,"[370-AAIP]"]
[]
[null,"Memoria Totale in GB",null,{"$f":"IF(('CNV R740 1'!$D$12=0),\"\",'CNV R740 1'!#REF!)","v":""}]
[null,64]
[]
[null,"Tipo e velocità della memoria DIMM"]
[null,"2666MT/s RDIMMs",1,null,"[370-ADNU]"]
[]
[null,"Capacità di memoria"]
[null,{"$f":"IF($B$29=\"No Additional Processor\",VLOOKUP($B$39, MEM_B1, 8, FALSE),VLOOKUP($B$39, MEM_B2, 8, FALSE))","v":"Dell 32 GB Modulo di memoria - RDIMM 2666MHz"},{"$f":"IF($B$29=\"No Additional Processor\",VLOOKUP($B$39, MEM_B1, 9, FALSE),VLOOKUP($B$39, MEM_B2, 9, FALSE))","v":2},null,{"$f":"IF($B$29=\"No Additional Processor\",VLOOKUP($B$39, MEM_B1, 10, FALSE),VLOOKUP($B$39, MEM_B2, 10, FALSE))","v":"[370-ADNF]"}]
[]
[null,{"$f":"IF($B$29=\"No Additional Processor\",VLOOKUP($B$39, MEM_B1, 2, FALSE),VLOOKUP($B$39, MEM_B2, 2, FALSE))","v":""},{"$f":"IF($B$29=\"No Additional Processor\",VLOOKUP($B$39, MEM_B1, 3, FALSE),VLOOKUP($B$39, MEM_B2, 3, FALSE))","v":""},{"$f":"IF($B$29=\"No Additional Processor\",VLOOKUP($B$39, MEM_B1, 4, FALSE),VLOOKUP($B$39, MEM_B2, 4, FALSE))","v":""},{"$f":"IF($B$29=\"No Additional Processor\",VLOOKUP($B$39, MEM_B1, 6, FALSE),VLOOKUP($B$39, MEM_B2, 6, FALSE))","v":""},{"$f":"IF($B$29=\"No Additional Processor\",VLOOKUP($B$39, MEM_B1, 7, FALSE),VLOOKUP($B$39, MEM_B2, 7, FALSE))","v":""}]
[]
[null,{"$f":"IF($B$29=\"No Additional Processor\",VLOOKUP($B$39, MEM_B1, 11, FALSE),VLOOKUP($B$39, MEM_B2, 11, FALSE))","v":""},{"$f":"IF($B$29=\"No Additional Processor\",VLOOKUP($B$39, MEM_B1, 12, FALSE),VLOOKUP($B$39, MEM_B2, 12, FALSE))","v":""},{"$f":"IF($B$29=\"No Additional Processor\",VLOOKUP($B$39, MEM_B1, 13, FALSE),VLOOKUP($B$39, MEM_B2, 13, FALSE))","v":""},{"$f":"IF($B$29=\"No Additional Processor\",VLOOKUP($B$39, MEM_B1, 15, FALSE),VLOOKUP($B$39, MEM_B2, 15, FALSE))","v":""},{"$f":"IF($B$29=\"No Additional Processor\",VLOOKUP($B$39, MEM_B1, 16, FALSE),VLOOKUP($B$39, MEM_B2, 16, FALSE))","v":""}]
[]
[null,"Sistema operativo preinstallato"]
[null,"No Operating System",{"$f":"VLOOKUP($B$52, OS_B, 2, FALSE)","v":""},{"$f":"VLOOKUP($B$52, OS_B, 3, FALSE)","v":""},{"$f":"VLOOKUP($B$52, OS_B, 5, FALSE)","v":"[611-BBBF]"},{"$f":"VLOOKUP($B$52, OS_B, 6, FALSE)","v":""}]
[null,{"$f":"IF($B$29=\"No Additional Processor\",VLOOKUP($B$52, OS_B, 20, FALSE),VLOOKUP($B$52, OS_B2, 20, FALSE))","v":""},{"$f":"IF($B$29=\"No Additional Processor\",VLOOKUP($B$52, OS_B, 21, FALSE),VLOOKUP($B$52, OS_B2, 21, FALSE))","v":0},{"$f":"IF($B$29=\"No Additional Processor\",VLOOKUP($B$52, OS_A, 22, FALSE),VLOOKUP($B$52, OS_B2, 22, FALSE))","v":""},{"$f":"IF($B$29=\"No Additional Processor\",VLOOKUP($B$52, OS_B, 24, FALSE),VLOOKUP($B$52, OS_B2, 24, FALSE))","v":""},{"$f":"IF($B$29=\"No Additional Processor\",VLOOKUP($B$52, OS_B, 25, FALSE),VLOOKUP($B$52, OS_B2, 25, FALSE))","v":""}]
[]
[null,"OS Media Kits"]
[null,"No Media Required",1,null,"[605-BBFN]"]
[]
[]
[null,"Client Access Licenses"]
[null,{"$f":"VLOOKUP($B$52, OS_B, 8, FALSE)","v":"None"},null,{"$f":"VLOOKUP($B$52, OS_A, 10, FALSE)","v":""},{"$f":"VLOOKUP($B$52, OS_A, 12, FALSE)","v":""},{"$f":"VLOOKUP($B$52, OS_A, 13, FALSE)*C60","v":0}]
[]
[null,{"$f":"VLOOKUP($B$52, OS_A, 14, FALSE)","v":"None"},null,{"$f":"VLOOKUP($B$52, OS_A, 16, FALSE)","v":""},{"$f":"VLOOKUP($B$52, OS_A, 18, FALSE)","v":""},{"$f":"VLOOKUP($B$52, OS_A, 19, FALSE)*C62","v":0}]
[]
[null,"Sistema operativo SUSE Linux Enterprise Server"]
[null,"None\n",{"$f":"VLOOKUP($B$65,SUSE, 2, FALSE)","v":0},{"$f":"VLOOKUP($B$65,SUSE, 3, FALSE)","v":""},{"$f":"VLOOKUP($B$65,SUSE, 5, FALSE)","v":""},{"$f":"VLOOKUP($B$65, SUSE, 6, FALSE)*C65","v":0}]
[]
[null,"Sistema operativo VMware"]
[null,"None",{"$f":"VLOOKUP($B$68,VMWARE, 2, FALSE)+C29","v":0},{"$f":"VLOOKUP($B$68,VMWARE, 3, FALSE)","v":""},{"$f":"VLOOKUP($B$68,VMWARE, 5, FALSE)","v":""},{"$f":"VLOOKUP($B$68, VMWARE, 6, FALSE)*C68","v":0}]
[]
[null,"VMware vCenter Server Standard"]
[null,"None",{"$f":"VLOOKUP($B$71,VMWARE2, 2, FALSE)","v":0},{"$f":"VLOOKUP($B$71,VMWARE2, 3, FALSE)","v":""},{"$f":"VLOOKUP($B$71,VMWARE2, 5, FALSE)","v":""}]
[]
[null,"Essentials Plus Kit"]
[null,"None",{"$f":"IF(SRV_A<4,VLOOKUP($B$74,VMWARE1, 2, FALSE),0)","v":0},{"$f":"VLOOKUP($B$74,VMWARE1, 3, FALSE)","v":""},{"$f":"VLOOKUP($B$74,VMWARE1, 5, FALSE)","v":""}]
[]
[null,"Controller RAID"]
[null,"PERC H730P RAID Controller, 2Gb NV Cache, Minicard",{"$f":"VLOOKUP($B$77,PERC, 2, FALSE)","v":0},{"$f":"VLOOKUP($B$77,PERC, 3, FALSE)","v":""},{"$f":"VLOOKUP($B$77,PERC, 4, FALSE)","v":""},{"$f":"VLOOKUP($B$77,PERC, 7, FALSE)","v":0}]
[]
[null,"Dischi rigidi  (numero massimo totale 24)"]
[null,"600GB 10K RPM SAS 12Gbps 512n 2.5in Hot-plug Hard Drive",2,null,"[400-AJPK]"]
[]
[null,"600GB 10K RPM SAS 12Gbps 512n 2.5in Hot-plug Hard Drive",null,{"$f":"VLOOKUP($B$82, HDD_A,3, FALSE)","v":"CNV-TS1L1-HD600"},{"$f":"VLOOKUP($B$82, HDD_A,5, FALSE)","v":"[400-AUNQ]"},{"$f":"VLOOKUP($B$82, HDD_B,6, FALSE)*C82","v":0}]
[]
[null,"1.2TB 10K RPM SAS 12Gbps 512n 2.5in Hot-plug Hard Drive",null,{"$f":"VLOOKUP($B$84, HDD_A,3, FALSE)","v":"CNV-TS1L1-HD1200-U"},{"$f":"VLOOKUP($B$84, HDD_A,5, FALSE)","v":"[400-ATJL]"},{"$f":"VLOOKUP($B$84, HDD_B,6, FALSE)*C84","v":0}]
[]
[null,"1.8TB 10K RPM SAS 12Gbps 512e 2.5in Hot-plug Hard Drive",null,"CNV-TS1L1-HD1800","[400-AJQP]",{"$f":"VLOOKUP($B$86, HDD_B,6, FALSE)*C86","v":0}]
[]
[null,"960GB SSD SAS Mix Use 12Gbps 512n 2.5in Hot-plug Drive,\nPX05SV,3 DWPD,5256 TBW",null,"CNV-TS1L1-SSD800","[400-ANNX]",{"$f":"VLOOKUP($B$88, HDD_B,6, FALSE)*C88","v":0}]
[]
[null,"1.92TB SSD SAS Mix Use 12Gbps 512n 2.5in Hot-plug Drive,\nPX05SV,3 DWPD,10512 TBW",null,"CNV-TS1L1-SSD1920","[400-ANMN]",{"$f":"VLOOKUP($B$90, HDD_B,6, FALSE)*C90","v":0}]
[]
[null,"DISCHI TOTALI",{"$f":"SUM(C80:C91)","v":2},{"$f":"IF(C92<=24,\"      OK\",\"     ERRORE:   Totale n° di dischi superiore al consentito\")","v":"      OK"}]
[]
[null,"Configurazione RAID"]
[null,"C3 - RAID 1 for H330 (2 HDDs)",1,null,{"$f":"VLOOKUP($B$95,  RAID_B1, 2, FALSE)","v":"[780-BBJK]"}]
[null,"Hot Spare for 300GB HDD","No"]
[null,"SCRIVERE QUI' LA CONFIGURAZIONE RAID RICHIESTA.\nR740XD 3\n",null,null,null,null,null,{"$f":"IF(B97=\"SCRIVERE QUI' LA CONFIGURAZIONE RAID RICHIESTA.\nR740XD 3\n\",\"ATTENZIONE COMPILARE IL CAMPO DELLA SCELTA RAID\", \"\")","v":"ATTENZIONE COMPILARE IL CAMPO DELLA SCELTA RAID"}]
[null,"Configurazione RAID HDD 1TB"]
[null,"",1,null,{"$f":"VLOOKUP($B$99,  RAID_B2, 2, FALSE)","v":""}]
[null,"Hot Spare for 1TB HDD","No"]
[]
[null,"Impostazioni del BIOS per la gestione dell'alimentazione"]
[null,"Performance BIOS Setting",1,null,"[384-BBBL]"]
[]
[null,"Alimentatore"]
[null,"Dual, Hot-plug, Redundant Power Supply (1+1), 750W, Titanium, 200-240VAC",1,null,"[450-ADWT]"]
[]
[null,"Cavi di alimentazione"]
[null,"Rack Power Cord 2M (C13/C14 12A)",2,null,"[450-AADY]"]
[]
[null,"Fans"]
[null,{"$f":"VLOOKUP(B29, CPU_B, 9, FALSE)","v":"4 Standard Fans for R740/740XD"},{"$f":"VLOOKUP($B$29, CPU_B.1, 10, FALSE)","v":1},null,{"$f":"VLOOKUP($B$29, CPU_B.1, 11, FALSE)","v":"[384-BBQB]"}]
[]
[null,"PCIe Riser"]
[null,{"$f":"VLOOKUP(B29, CPU_B.1, 12, FALSE)","v":"Riser Config 1, 4 x8 slots"},{"$f":"VLOOKUP($B$29, CPU_B.1, 13, FALSE)","v":1},null,{"$f":"VLOOKUP($B$29, CPU_B.1, 14, FALSE)","v":"[330-BBGZ]"}]
[]
[null,"TPM Module"]
[null,"Trusted Platform Module 1.2",1,null,"[461-AAEL]"]
[]
[null,"Embedded Systems Management"]
[null,"iDRAC9,Enterprise",1,null,"[385-BBKT]"]
[]
[null,"Adattatore di rete"]
[null,"Broadcom 5720 QP 1Gb Network Daughter Card",1,null,"[540-BBBW]"]
[]
[null,"Modulo Doppia SD"]
[null,"None ",{"$f":"VLOOKUP($B$127,upsell_1, 2, FALSE)","v":0},{"$f":"VLOOKUP($B$127,upsell_1, 3, FALSE)","v":""},{"$f":"VLOOKUP($B$127,upsell_1, 4, FALSE)","v":""},{"$f":"VLOOKUP($B$127,upsell_1, 7, FALSE)","v":0}]
[]
[null,"Additional Card for PCIe Slot 1 (Full height) (CPU 1)"]
[null,"Broadcom 5719 QP 1Gb Network Interface Card",null,{"$f":"\"\"","v":""},"540-BBCW"]
[]
[null,"Additional Card for PCIe Slot 2 (Full height) (CPU 1)"]
[null,"None",{"$f":"VLOOKUP(B133,  PCI_B1.1, 2, FALSE)","v":""},{"$f":"VLOOKUP(B133,  PCI_B1.1, 3, FALSE)","v":""},{"$f":"VLOOKUP(B133,  PCI_B1.1, 5, FALSE)","v":""},{"$f":"VLOOKUP(B133,  PCI_B1.1, 6, FALSE)","v":""},{"$f":"VLOOKUP(B133,  PCI_B1.1, 7, FALSE)","v":0}]
[]
[null,"Additional Card for PCIe Slot 3 (Full height) (CPU 1)"]
[null,"None",{"$f":"VLOOKUP(B136,  PCI_B1.1, 2, FALSE)","v":""},{"$f":"VLOOKUP(B136,  PCI_B1.1, 3, FALSE)","v":""},{"$f":"VLOOKUP(B136,  PCI_B1.1, 5, FALSE)","v":""},{"$f":"VLOOKUP(B136,  PCI_B1.1, 6, FALSE)","v":""},{"$f":"VLOOKUP(B136,  PCI_B1.1, 7, FALSE)","v":0}]
[]
[null,"Additional Card for PCIe Slot 4 (Full height) (CPU 2)"]
[null,"None",{"$f":"VLOOKUP(B139,  PCI_B1.1, 2, FALSE)","v":""},{"$f":"VLOOKUP(B139,  PCI_B1.1, 3, FALSE)","v":""},{"$f":"VLOOKUP(B139,  PCI_B1.1, 5, FALSE)","v":""},{"$f":"VLOOKUP(B139,  PCI_B1.1, 6, FALSE)","v":""},{"$f":"VLOOKUP(B139,  PCI_B1.1, 7, FALSE)","v":0}]
[]
[null,"Additional Card for PCIe Slot 5 (Full height) (CPU 2)"]
[null,"None",{"$f":"VLOOKUP(B142,  PCI_B1.1, 2, FALSE)","v":""},{"$f":"VLOOKUP(B142,  PCI_B1.1, 3, FALSE)","v":""},{"$f":"VLOOKUP(B142,  PCI_B1.1, 5, FALSE)","v":""},{"$f":"VLOOKUP(B142,  PCI_B1.1, 6, FALSE)","v":""},{"$f":"VLOOKUP(B142,  PCI_B1.1, 7, FALSE)","v":0}]
[]
[null,"Additional Card for PCIe Slot 6 (Low Profile) (CPU 1)"]
[null,"None",{"$f":"VLOOKUP(B145,PCI_B5, 2, FALSE)","v":""},{"$f":"VLOOKUP(B145,  PCI_B5, 3, FALSE)","v":""},{"$f":"VLOOKUP($B$145,PCI_B5,5,FALSE)","v":""},{"$f":"VLOOKUP($B$145,PCI_B5,6,FALSE)","v":""},{"$f":"VLOOKUP($B$145,PCI_B5,7,FALSE)","v":0}]
[]
[null,"Additional Card for PCIe Slot 7 (Full height) (CPU 2)"]
[null,"None",{"$f":"VLOOKUP(B148,  PCI_B1.1, 2, FALSE)","v":""},{"$f":"VLOOKUP(B148,  PCI_B1.1, 3, FALSE)","v":""},{"$f":"VLOOKUP(B148,  PCI_B1.1, 5, FALSE)","v":""},{"$f":"VLOOKUP(B148,  PCI_B1.1, 6, FALSE)","v":""},{"$f":"VLOOKUP(B148,  PCI_B1.1, 7, FALSE)","v":0}]
[]
[null,"Additional Card for PCIe Slot 8 (Full height) (CPU 2)"]
[null,"None",{"$f":"VLOOKUP(B151,  PCI_B1.1, 2, FALSE)","v":""},{"$f":"VLOOKUP(B151,  PCI_B1.1, 3, FALSE)","v":""},{"$f":"VLOOKUP(B151,  PCI_B1.1, 5, FALSE)","v":""},{"$f":"VLOOKUP(B151,  PCI_B1.1, 6, FALSE)","v":""},{"$f":"VLOOKUP(B151,  PCI_B1.1, 7, FALSE)","v":0}]
[]
[null,"Pannello frontale"]
[null,"No Bezel Option",{"$f":"VLOOKUP(B154,upsell_1, 2, FALSE)","v":1},{"$f":"VLOOKUP(B154,upsell_1, 3, FALSE)","v":""},{"$f":"VLOOKUP(B154,upsell_1, 5, FALSE)","v":"[350-BBBW]"},{"$f":"VLOOKUP(B154,upsell_1, 6, FALSE)","v":0},{"$f":"VLOOKUP(B154,upsell_1, 7, FALSE)","v":0}]
[]
[null,"Guide per rack"]
[null,"ReadyRails™ Sliding Rails Without Cable Management Arm 2U",{"$f":"VLOOKUP(B157,upsell_1, 2, FALSE)","v":1},{"$f":"VLOOKUP(B157,upsell_1, 3, FALSE)","v":""},{"$f":"VLOOKUP(B157,upsell_1, 5, FALSE)","v":"[770-BBBQ]"},{"$f":"VLOOKUP(B157,upsell_1, 6, FALSE)","v":0},{"$f":"VLOOKUP(B157,upsell_1, 7, FALSE)","v":0}]
[]
[null,"Server Accessories"]
[null,"PowerEdge SFP+, 10GbE SR/SX, Optical Tranceiver, LC Connector, for Intel and Broadcom,CusKit",{"$f":"(VLOOKUP(B151,PCI_A2,8,FALSE))+((VLOOKUP(B130,PCI_A1,8,FALSE)))","v":{"$error":"#VALUE!"}},null,"[407-BBQE]"]
[]
[null,"System Documentation"]
[null,"Electronic System Documentation and OpenManage DVD Kit",1,null,"[631-AAJG]"]
[]
[null,"SHIPPING"]
[null,"PowerEdge R730xd Shipping EMEA1 (English/French/German/Spanish/Russian/Hebrew)",1,null,"[340-AMGS]"]
[]
[null,"Order Information"]
[null,"PowerEdge Order - EMEA",1,null,"[800-11671]"]
[]
[null,"Base warranty"]
[null,"3Yr Basic Warranty - Next Business Day - Minimum Warranty",1,null,"[709-12780][709-12781]"]
[]
[null,"Servizi di assitenza"]
[null,"Dell Channel Order - Service Info only",1,null,"[710-31085]"]
[]
[null,"Aggiornamenti della garanzia"]
[null,"None",{"$f":"VLOOKUP($B$178,  SO_B2,2, FALSE)","v":""},{"$f":"VLOOKUP($B$178,  SO_B2, 3, FALSE)","v":""},{"$f":"VLOOKUP($B$178,  SO_B2, 5, FALSE)","v":""},{"$f":"VLOOKUP($B$178,  SO_B2, 6, FALSE)","v":""}]
[]
[null,"Warranty Upgrades - Non-Std/Local POS"]
[null,"CSTM CONSIP - 39M Onsite Labor Support for CRU for Servers with Basic Warranty",1,null,"[681-24467]"]

{"sheet":"HDD","index":14,"n_rows":269,"n_cols":15,"rows_kept":269,"cut":false,"hidden":true,"merged":[]}
[null,"NO"]
[null,"STD"]
[null,"LCD"]
[]
[]
[]
["Hard Drives"]
["R630"]
["600GB 10K RPM SAS 12Gbps 512n 2.5in Hot-plug Hard Drive",null,"CNV-TS1L1-HD600","TS1L1-HD600","[400-AUNQ]",120]
["1.2TB 10K RPM SAS 12Gbps 512n 2.5in Hot-plug Hard Drive",null,"CNV-TS1L1-HD1200-U","TS1L1-HD1200-U","[400-ATJL]",212]
[null,"R630 ","R630 1","R630 2"]
["HDD max",8,8,8]
["HDD 300GB Base",2,2,2,"Hot Spare for 300GB HDD",{"$f":"'CNV R640 1'!$C$95","v":"No"},{"$f":"IF(F13=\"Yes\",1,0)","v":0},{"$f":"'CNV R640 2'!$C$95","v":"No"},{"$f":"IF(H13=\"Yes\",1,0)","v":0},{"$f":"'CNV R640 3'!$C$95","v":"No"},{"$f":"IF(J13=\"Yes\",1,0)","v":0}]
["HDD 300GB Selected",{"$f":"HD300_A","v":0},{"$f":"HD300_AA","v":0},{"$f":"HD300_AAA","v":0}]
["300GB 10K RPM SAS 12Gbps 2.5in Hot-plug Hard Drive,CusKit",0,0,0]
[null,1,1,1]
[null,2,2,2]
[null,3,3,3]
[null,4,4,4]
[null,5,5,5]
[null,6,6,6]
["HDD max",8,8,8]
["HDD 300GB",{"$f":"B13+B14","v":2},{"$f":"C13+C14","v":2},{"$f":"D13+D14","v":2}]
["HDD 1TB Selected",{"$f":"'CNV R640 1'!$C$83","v":0},{"$f":"HD1000_AA","v":0},{"$f":"HD1000_AAA","v":0},"Hot Spare for 1TB HDD",{"$f":"'CNV R640 1'!$C$99","v":"No"},{"$f":"IF(F24=\"Yes\",1,0)","v":0},{"$f":"'CNV R640 2'!$C$99","v":"No"},{"$f":"IF(H24=\"Yes\",1,0)","v":0},{"$f":"'CNV R640 3'!$C$99","v":"No"},{"$f":"IF(J24=\"Yes\",1,0)","v":0}]
["1TB 7.2K RPM NLSAS 6Gbps 2.5in Hot-plug Hard Drive,13G,CusKit",{"$f":"B$12-B$13-B$14","v":6},{"$f":"C$12-C$13-C$14","v":6},{"$f":"D$12-D$13-D$14","v":6}]
[null,{"$f":"IF(B25-1<1,0,B25-1)","v":5},5,5]
[null,4,4,4]
[null,3,3,3]
[null,2,2,2]
[null,1,1,1]
[null,0,0,0]
[null,0]
[null,0]
[]
["Hot Spare","Yes"]
[null,"No"]
[]
["RAID Configuration",null,null,"HDD 300GB R630",null,"HDD 1TB R630",null,"HDD 300GB R630 2",null,"HDD 1TB R630 2",null,"HDD 300GB R630 3",null,"HDD 1TB R630 3"]
["RAID Personalizzato",{"$f":"IF($B$146<=8,0,\"\")","v":0},"[780-BBJC]","RAID Personalizzato","[780-BBJC]","RAID Personalizzato","[780-BBJC]","RAID Personalizzato","[780-BBJC]","RAID Personalizzato","[780-BBJC]","RAID Personalizzato","[780-BBJC]","RAID Personalizzato","[780-BBJC]"]
["C10 - Unconfigured RAID for H330 (1-8 HDDs)",1,"[780-BBJD] ",{"$f":"IF($G$13=0,A40,\"\")","v":"C10 - Unconfigured RAID for H330 (1-8 HDDs)"},{"$f":"IF($G$13=0,C40,\"\")","v":"[780-BBJD] "},{"$f":"IF($G$24=0,A40,\"\")","v":"C10 - Unconfigured RAID for H330 (1-8 HDDs)"},{"$f":"IF($G$24=0,C40,\"\")","v":"[780-BBJD] "},{"$f":"IF(I13=0,$A$40,\"\")","v":"C10 - Unconfigured RAID for H330 (1-8 HDDs)"},{"$f":"IF(I13=0,$C$40,\"\")","v":"[780-BBJD] "},{"$f":"IF(I24=0,$A$40,\"\")","v":"C10 - Unconfigured RAID for H330 (1-8 HDDs)"},{"$f":"IF(I24=0,$C$40,\"\")","v":"[780-BBJD] "},{"$f":"IF(K13=0,$A$40,\"\")","v":"C10 - Unconfigured RAID for H330 (1-8 HDDs)"},{"$f":"IF(K13=0,$C$40,\"\")","v":"[780-BBJD] "},{"$f":"IF(K24=0,$A$40,\"\")","v":"C10 - Unconfigured RAID for H330 (1-8 HDDs)"},{"$f":"IF(K24=0,$C$40,\"\")","v":"[780-BBJD] "}]
["C2 - RAID 0 for H330 (1-8 HDDs)",1,"[780-BBJF]",{"$f":"IF($G$13=0,A41,\"\")","v":"C2 - RAID 0 for H330 (1-8 HDDs)"},{"$f":"IF($G$13=0,C41,\"\")","v":"[780-BBJF]"},{"$f":"IF($G$24=0,A41,\"\")","v":"C2 - RAID 0 for H330 (1-8 HDDs)"},{"$f":"IF($G$24=0,C41,\"\")","v":"[780-BBJF]"},{"$f":"IF(I13=0,$A$41,\"\")","v":"C2 - RAID 0 for H330 (1-8 HDDs)"},{"$f":"IF(I13=0,$C$41,\"\")","v":"[780-BBJF]"},{"$f":"IF(I24=0,$A$41,\"\")","v":"C2 - RAID 0 for H330 (1-8 HDDs)"},{"$f":"IF(I24=0,$C$41,\"\")","v":"[780-BBJF]"},{"$f":"IF(K13=0,$A$41,\"\")","v":"C2 - RAID 0 for H330 (1-8 HDDs)"},{"$f":"IF(K13=0,$C$41,\"\")","v":"[780-BBJF]"},{"$f":"IF(K24=0,$A$41,\"\")","v":"C2 - RAID 0 for H330 (1-8 HDDs)"},{"$f":"IF(K24=0,$C$41,\"\")","v":"[780-BBJF]"}]
["C3 - RAID 1 for H330 (2 HDDs)",1,"[780-BBJK]",{"$f":"IF($B$13+$B$14-$G$13=2,A42,\"\")","v":"C3 - RAID 1 for H330 (2 HDDs)"},{"$f":"IF($B$13+$B$14-$G$13=2,C42,\"\")","v":"[780-BBJK]"},{"$f":"IF($B$24-$G$24=2,A42,\"\")","v":""},{"$f":"IF($B$24-$G$24=2,C42,\"\")","v":""},{"$f":"IF($C$13+$C$14-I13=2,$A$42,\"\")","v":"C3 - RAID 1 for H330 (2 HDDs)"},{"$f":"IF($C$13+$C$14-I13=2,$C$42,\"\")","v":"[780-BBJK]"},{"$f":"IF($C$24-I24=2,A42,\"\")","v":""},{"$f":"IF($C$24-I24=2,$C$42,\"\")","v":""},{"$f":"IF($C$13+$C$14-K13=2,$A$42,\"\")","v":"C3 - RAID 1 for H330 (2 HDDs)"},{"$f":"IF($C$13+$C$14-K13=2,$C$42,\"\")","v":"[780-BBJK]"},{"$f":"IF($C$24-M24=2,E42,\"\")","v":""},{"$f":"IF($D$24-K24=2,$C$42,\"\")","v":""}]
["C4 - RAID 5 for H330 (3-8 HDDs)",1,"[780-BBJL]",{"$f":"IF($B$13+$B$14-$G$13>=3,A43,\"\")","v":""},{"$f":"IF($B$13+$B$14-$G$13>=3,C43,\"\")","v":""},{"$f":"IF($B$24-$G$24>=3,A43,\"\")","v":""},{"$f":"IF($B$24-$G$24>=3,C43,\"\")","v":""},{"$f":"IF($C$13+$C$14-I13>=3,$A$43,\"\")","v":""},{"$f":"IF($C$13+$C$14-I13>=3,$C$43,\"\")","v":""},{"$f":"IF($C$24-I24>=3,$A$43,\"\")","v":""},{"$f":"IF($C$24-I24>=3,$C$43,\"\")","v":""},{"$f":"IF($D$13+$D$14-K13>=3,$A$43,\"\")","v":""},{"$f":"IF($D$13+$D$14-K13>=3,$C$43,\"\")","v":""},{"$f":"IF($D$24-K24>=3,$A$43,\"\")","v":""},{"$f":"IF($D$24-K24>=3,$C$43,\"\")","v":""}]
["C6 - RAID 10 forH330 (4-8 HDDs in pairs) ",1,"[780-BBJN]",{"$f":"IF($B$13+$B$14-$G$13=4,A44,\"\")","v":""},{"$f":"IF($B$13+$B$14-$G$13=4,C44,\"\")","v":""},{"$f":"IF($B$24-$G$24=4,A44,\"\")","v":""},{"$f":"IF($B$24-$G$24=4,C44,\"\")","v":""},{"$f":"IF($C$13+$C$14-I13=4,$A$44,\"\")","v":""},{"$f":"IF($C$13+$C$14-I13=4,$C$44,\"\")","v":""},{"$f":"IF($C$24-I24=4,$A$44,\"\")","v":""},{"$f":"IF($C$24-I24=4,$C$44,\"\")","v":""},{"$f":"IF($D$13+$D$14-K13=4,$A$44,\"\")","v":""},{"$f":"IF($D$13+$D$14-K13=4,$C$44,\"\")","v":""},{"$f":"IF($D$24-K24=4,$A$44,\"\")","v":""},{"$f":"IF($D$24-K24=4,$C$44,\"\")","v":""}]
["C7 - RAID 1+RAID 1 for H330 (2 + 2 HDDs) ",1,"[780-BBJO]",{"$f":"IF($B$13+$B$14-$G$13=4,A45,\"\")","v":""},{"$f":"IF($B$13+$B$14-$G$13=4,C45,\"\")","v":""},{"$f":"IF($B$24-$G$24=4,A45,\"\")","v":""},{"$f":"IF($B$24-$G$24=4,C45,\"\")","v":""},{"$f":"IF($C$13+$C$14-I13=4,$A$45,\"\")","v":""},{"$f":"IF($C$13+$C$14-I13=4,$C$45,\"\")","v":""},{"$f":"IF($C$24-I24=4,A45,\"\")","v":""},{"$f":"IF($C$24-I24=4,$C$45,\"\")","v":""},{"$f":"IF($D$13+$D$14-K13=4,$A$45,\"\")","v":""},{"$f":"IF($D$13+$D$14-K13=4,$C$45,\"\")","v":""},{"$f":"IF($D$24-K24=4,A45,\"\")","v":""},{"$f":"IF($D$24-K24=4,$C$45,\"\")","v":""}]
["C8 - RAID 1+RAID 5 for H330 (2 + 3-8 HDDs)",1,"[780-BBJP]",{"$f":"IF($B$13+$B$14-$G$13>=5,A46,\"\")","v":""},{"$f":"IF($B$13+$B$14-$G$13>=5,C46,\"\")","v":""},{"$f":"IF($B$24-$G$24>=5,A46,\"\")","v":""},{"$f":"IF($B$24-$G$24>=5,C46,\"\")","v":""},{"$f":"IF($C$13+$C$14-I13>=5,$A$46,\"\")","v":""},{"$f":"IF($C$13+$C$14-I13>=5,$C$46,\"\")","v":""},{"$f":"IF($C$24-I24>=5,$A$46,\"\")","v":""},{"$f":"IF($C$24-I24>=5,$C$46,\"\")","v":""},{"$f":"IF($D$13+$D$14-K13>=5,$A$46,\"\")","v":""},{"$f":"IF($D$13+$D$14-K13>=5,$C$46,\"\")","v":""},{"$f":"IF($D$24-K24>=5,$A$46,\"\")","v":""},{"$f":"IF($D$24-K24>=5,$C$46,\"\")","v":""}]
["C9 - RAID 1+RAID 10 for H330 (2 + 4 HDDs in pairs) ",1,"[780-BBJQ] ",{"$f":"IF($B$13+$B$14-$G$13=6,A47,\"\")","v":""},{"$f":"IF($B$13+$B$14-$G$13=6,C47,\"\")","v":""},{"$f":"IF($B$24-$G$24=6,A47,\"\")","v":""},{"$f":"IF($B$24-$G$24=6,C47,\"\")","v":""},{"$f":"IF($C$13+$C$14-I13=6,$A$47,\"\")","v":""},{"$f":"IF($C$13+$C$14-I13=6,$C$47,\"\")","v":""},{"$f":"IF($C$24-I24=6,A47,\"\")","v":""},{"$f":"IF($C$24-I24=6,$C$47,\"\")","v":""},{"$f":"IF($D$13+$D$14-M13=6,$A$47,\"\")","v":""},{"$f":"IF($D$13+$D$14-M13=6,$C$47,\"\")","v":""},{"$f":"IF($D$24-K24=6,A47,\"\")","v":""},{"$f":"IF($D$24-K24=6,$C$47,\"\")","v":""}]
[]
["R730xd"]
["600GB 10K RPM SAS 12Gbps 512n 2.5in Hot-plug Hard Drive",null,"CNV-TS1L1-HD600","TS1L1-HD600","[400-ASGS]",120]
["1.2TB 10K RPM SAS 12Gbps 512n 2.5in Hot-plug Hard Drive",null,"CNV-TS1L1-HD1200-U","TS1L1-HD1200-U","[400-ATJL]",212]
["1.8TB 10K RPM SAS 12Gbps 512e 2.5in Hot-plug Hard Drive",null,"CNV-TS1L1-HD1800-U","TS1L1-HD1800-U","400-ATJR",236]
["960GB SSD SAS Mix Use 12Gbps 512n 2.5in Hot-plug Drive,\nPX05SV,3 DWPD,5256 TBW",null,"CNV-TS1L1-SSD800-U","TS1L1-SSD800-U","400-ATLR",748]
["1.92TB SSD SAS Mix Use 12Gbps 512n 2.5in Hot-plug Drive,\nPX05SV,3 DWPD,10512 TBW",null,"CNV-TS1L1-SSD1920-U","TS1L1-SSD1920-U","400-ATNG",1795]
[null,{"$f":"'CNV R740xd 1'!$C$96","v":"No"},{"$f":"'CNV R740xd 2'!$C$96","v":"No"},{"$f":"'CNV R740xd 3'!$C$96","v":"No"}]
["HDD max",24,24,24]
["HDD 300GB Base",2,2,2]
["Hot Spare for 300GB HDD",{"$f":"IF(B55=\"Yes\",1,0)","v":0},{"$f":"IF(C55=\"Yes\",1,0)","v":0},{"$f":"IF(D55=\"Yes\",1,0)","v":0}]
["HDD 300GB Selected",{"$f":"HD300_B","v":0},{"$f":"HD300_BB","v":0},{"$f":"HD300_BBB","v":0}]
["300GB 10K RPM SAS 12Gbps 2.5in Hot-plug Hard Drive,CusKit",0,0,0]
[null,1,1,1]
[null,2,2,2]
[null,3,3,3]
[null,4,4,4]
[null,5,5,5]
[null,6,6,6]
[null,7,7,7]
[null,8,8,8]
[null,9,9,9]
[null,10,10,10]
[null,11,11,11]
[null,12,12,12]
[null,13,13,13]
[null,14,14,14]
[null,15,15,15]
[null,16,16,16]
[null,17,17,17]
[null,18,18,18]
[null,19,19,19]
[null,20,20,20]
[null,21,21,21]
[null,22,22,22]
[]
[]
[]
[]
[]
[]
[null,{"$f":"'CNV R740xd 1'!$C$100","v":"No"},{"$f":"'CNV R740xd 2'!$C$100","v":"No"},{"$f":"'CNV R740xd 2'!$C$100","v":"No"}]
["HDD max",24,24,24]
["HDD 300GB",{"$f":"B57+B59","v":2},{"$f":"C57+C59","v":2},{"$f":"D57+D59","v":2}]
["Hot Spare for 1TB HDD",{"$f":"IF(B89=\"Yes\",1,0)","v":0},{"$f":"IF(C89=\"Yes\",1,0)","v":0},{"$f":"IF(D89=\"Yes\",1,0)","v":0}]
["HDD 1TB Selected",{"$f":"'CNV R740xd 1'!$C$84","v":0},{"$f":"'CNV R740xd 2'!$C$84","v":0},{"$f":"'CNV R740xd 3'!$C$84","v":0}]
["1TB 7.2K RPM NLSAS 6Gbps 2.5in Hot-plug Hard Drive,13G,CusKit",{"$f":"$B$90-$B$91-$B$93","v":22},{"$f":"$C$90-$C$91-$C$93","v":22},{"$f":"$D$90-$D$91-$D$93","v":22}]
[null,{"$f":"IF(B94-1<1,0,B94-1)","v":21},21,{"$f":"IF(D94-1<1,0,D94-1)","v":21}]
[null,20,20,20]
[null,19,19,19]
[null,18,18,18]
[null,17,17,17]
[null,16,16,16]
[null,15,15,15]
[null,14,14,14]
[null,{"$f":"IF(B102-1<1,0,B102-1)","v":13},13,13]
[null,12,12,12]
[null,11,11,11]
[null,10,10,10]
[null,9,9,9]
[null,8,8,8]
[null,7,7,7]
[null,6,6,6]
[null,5,5,5]
[null,4,4,4]
[null,3,3,3]
[null,2,2,2]
[null,1,1,1]
[null,0,0,0]
[]
[]
[]
[]
[]
[]
[]
[]
[]
["RAID Configuration",null,null,"HDD 300GB R730xd",null,"HDD 1TB R730xd",null,"HDD 300GB R730xd 2",null,"HDD 1TB R730xd 2",null,"HDD 300GB R730xd 3",null,"HDD 1TB R730xd 3"]
["RAID Personalizzato",{"$f":"IF($B$146<=8,0,\"\")","v":0},"[780-BBJC]","RAID Personalizzato","[780-BBJC]","RAID Personalizzato","[780-BBJC]","RAID Personalizzato","[780-BBJC]","RAID Personalizzato","[780-BBJC]","RAID Personalizzato","[780-BBJC]","RAID Personalizzato","[780-BBJC]"]
["C10 - Unconfigured RAID for H330 (1-8 HDDs)",1,"[780-BBJD] ",{"$f":"IF($B$58=0,A128,\"\")","v":"C10 - Unconfigured RAID for H330 (1-8 HDDs)"},{"$f":"IF($B$58=0,C128,\"\")","v":"[780-BBJD] "},{"$f":"IF($B$92=0,A128,\"\")","v":"C10 - Unconfigured RAID for H330 (1-8 HDDs)"},{"$f":"IF($B$92=0,C128,\"\")","v":"[780-BBJD] "},{"$f":"IF($C$58=0,A128,\"\")","v":"C10 - Unconfigured RAID for H330 (1-8 HDDs)"},{"$f":"IF($C$58=0,C128,\"\")","v":"[780-BBJD] "},{"$f":"IF($C$92=0,A128,\"\")","v":"C10 - Unconfigured RAID for H330 (1-8 HDDs)"},{"$f":"IF($C$92=0,C128,\"\")","v":"[780-BBJD] "},{"$f":"IF($D$58=0,A128,\"\")","v":"C10 - Unconfigured RAID for H330 (1-8 HDDs)"},{"$f":"IF($D$58=0,C128,\"\")","v":"[780-BBJD] "},{"$f":"IF($D$92=0,A128,\"\")","v":"C10 - Unconfigured RAID for H330 (1-8 HDDs)"},{"$f":"IF($D$92=0,C128,\"\")","v":"[780-BBJD] "}]
["C2 - RAID 0 for H330 (1-8 HDDs)",1,"[780-BBJF]",{"$f":"IF($B$58=0,A129,\"\")","v":"C2 - RAID 0 for H330 (1-8 HDDs)"},{"$f":"IF($B$58=0,C129,\"\")","v":"[780-BBJF]"},{"$f":"IF($B$92=0,A129,\"\")","v":"C2 - RAID 0 for H330 (1-8 HDDs)"},{"$f":"IF($B$92=0,C129,\"\")","v":"[780-BBJF]"},{"$f":"IF($C$58=0,A129,\"\")","v":"C2 - RAID 0 for H330 (1-8 HDDs)"},{"$f":"IF($C$58=0,C129,\"\")","v":"[780-BBJF]"},{"$f":"IF($C$92=0,A129,\"\")","v":"C2 - RAID 0 for H330 (1-8 HDDs)"},{"$f":"IF($C$92=0,C129,\"\")","v":"[780-BBJF]"},{"$f":"IF($D$58=0,A129,\"\")","v":"C2 - RAID 0 for H330 (1-8 HDDs)"},{"$f":"IF($D$58=0,C129,\"\")","v":"[780-BBJF]"},{"$f":"IF($D$92=0,A129,\"\")","v":"C2 - RAID 0 for H330 (1-8 HDDs)"},{"$f":"IF($D$92=0,C129,\"\")","v":"[780-BBJF]"}]
["C3 - RAID 1 for H330 (2 HDDs)",1,"[780-BBJK]",{"$f":"IF($B$57+$B$59-$B$58=2,A130,\"\")","v":"C3 - RAID 1 for H330 (2 HDDs)"},{"$f":"IF($B$57+$B$59-$B$58=2,C130,\"\")","v":"[780-BBJK]"},{"$f":"IF($B$93-$B$92=2,A130,\"\")","v":""},{"$f":"IF($B$93-$B$92=2,C130,\"\")","v":""},{"$f":"IF($C$57+$C$59-$C$58=2,A130,\"\")","v":"C3 - RAID 1 for H330 (2 HDDs)"},{"$f":"IF($C$57+$C$59-$C$58=2,C130,\"\")","v":"[780-BBJK]"},{"$f":"IF($C$93-$C$92=2,A130,\"\")","v":""},{"$f":"IF($C$93-$C$92=2,C130,\"\")","v":""},{"$f":"IF($D$57+$D$59-$D$58=2,A130,\"\")","v":"C3 - RAID 1 for H330 (2 HDDs)"},{"$f":"IF($D$57+$D$59-$D$58=2,C130,\"\")","v":"[780-BBJK]"},{"$f":"IF($D$93-$D$92=2,A130,\"\")","v":""},{"$f":"IF($D$93-$D$92=2,C130,\"\")","v":""}]
["C4 - RAID 5 for H330 (3-8 HDDs)",1,"[780-BBJL]",{"$f":"IF($B$57+$B$59-$B$58>=3,A131,\"\")","v":""},{"$f":"IF($B$57+$B$59-$B$58>=3,C131,\"\")","v":""},{"$f":"IF($B$93-$B$92>=3,A131,\"\")","v":""},{"$f":"IF($B$93-$B$92>=3,C131,\"\")","v":""},{"$f":"IF($C$57+$C$59-$C$58>=3,A131,\"\")","v":""},{"$f":"IF($C$57+$C$59-$C$58>=3,C131,\"\")","v":""},{"$f":"IF($C$93-$C$92>=3,A131,\"\")","v":""},{"$f":"IF($C$93-$C$92>=3,C131,\"\")","v":""},{"$f":"IF($D$57+$D$59-$D$58>=3,A131,\"\")","v":""},{"$f":"IF($D$57+$D$59-$D$58>=3,C131,\"\")","v":""},{"$f":"IF($D$93-$D$92>=3,A131,\"\")","v":""},{"$f":"IF($D$93-$D$92>=3,C131,\"\")","v":""}]
["C6 - RAID 10 forH330 (4-8 HDDs in pairs) ",1,"[780-BBJN]",{"$f":"IF($B$57+$B$59-$B$58=4,A132,\"\")","v":""},{"$f":"IF($B$57+$B$59-$B$58=4,C132,\"\")","v":""},{"$f":"IF($B$93-$B$92=4,A132,\"\")","v":""},{"$f":"IF($B$93-$B$92=4,C132,\"\")","v":""},{"$f":"IF($C$57+$C$59-$C$58=4,A132,\"\")","v":""},{"$f":"IF($C$57+$C$59-$C$58=4,C132,\"\")","v":""},{"$f":"IF($C$93-$C$92=4,A132,\"\")","v":""},{"$f":"IF($C$93-$C$92=4,C132,\"\")","v":""},{"$f":"IF($D$57+$D$59-$D$58=4,A132,\"\")","v":""},{"$f":"IF($D$57+$D$59-$D$58=4,C132,\"\")","v":""},{"$f":"IF($D$93-$D$92=4,A132,\"\")","v":""},{"$f":"IF($D$93-$D$92=4,C132,\"\")","v":""}]
["C7 - RAID 1+RAID 1 for H330 (2 + 2 HDDs) ",1,"[780-BBJO]",{"$f":"IF($B$57+$B$59-$B$58=4,A133,\"\")","v":""},{"$f":"IF($B$57+$B$59-$B$58=4,C133,\"\")","v":""},{"$f":"IF($B$93-$B$92=4,A133,\"\")","v":""},{"$f":"IF($B$93-$B$92=4,C133,\"\")","v":""},{"$f":"IF($C$57+$C$59-$C$58=4,A133,\"\")","v":""},{"$f":"IF($C$57+$C$59-$C$58=4,C133,\"\")","v":""},{"$f":"IF($C$93-$C$92=4,A133,\"\")","v":""},{"$f":"IF($C$93-$C$92=4,C133,\"\")","v":""},{"$f":"IF($D$57+$D$59-$D$58=4,A133,\"\")","v":""},{"$f":"IF($D$57+$D$59-$D$58=4,C133,\"\")","v":""},{"$f":"IF($D$93-$D$92=4,A133,\"\")","v":""},{"$f":"IF($D$93-$D$92=4,C133,\"\")","v":""}]
["C8 - RAID 1+RAID 5 for H330 (2 + 3-8 HDDs)",1,"[780-BBJP]",{"$f":"IF($B$57+$B$59-$B$58>=5,A134,\"\")","v":""},{"$f":"IF($B$57+$B$59-$B$58>=5,C134,\"\")","v":""},{"$f":"IF($B$93-$B$92>=5,A134,\"\")","v":""},{"$f":"IF($B$93-$B$92>=5,C134,\"\")","v":""},{"$f":"IF($C$57+$C$59-$C$58>=5,A134,\"\")","v":""},{"$f":"IF($C$57+$C$59-$C$58>=5,C134,\"\")","v":""},{"$f":"IF($C$93-$C$92>=5,A134,\"\")","v":""},{"$f":"IF($C$93-$C$92>=5,C134,\"\")","v":""},{"$f":"IF($D$57+$D$59-$D$58>=5,A134,\"\")","v":""},{"$f":"IF($D$57+$D$59-$D$58>=5,C134,\"\")","v":""},{"$f":"IF($D$93-$D$92>=5,A134,\"\")","v":""},{"$f":"IF($D$93-$D$92>=5,C134,\"\")","v":""}]
["C9 - RAID 1+RAID 10 for H330 (2 + 4 HDDs in pairs) ",1,"[780-BBJQ] ",{"$f":"IF($B$57+$B$59-$B$58=6,A135,\"\")","v":""},{"$f":"IF($B$57+$B$59-$B$58=6,C135,\"\")","v":""},{"$f":"IF($B$93-$B$92=6,A135,\"\")","v":""},{"$f":"IF($B$93-$B$92=6,C135,\"\")","v":""},{"$f":"IF($C$57+$C$59-$C$58=6,A135,\"\")","v":""},{"$f":"IF($C$57+$C$59-$C$58=6,C135,\"\")","v":""},{"$f":"IF($C$93-$C$92=6,A135,\"\")","v":""},{"$f":"IF($C$93-$C$92=6,C135,\"\")","v":""},{"$f":"IF($D$57+$D$59-$D$58=6,A135,\"\")","v":""},{"$f":"IF($D$57+$D$59-$D$58=6,C135,\"\")","v":""},{"$f":"IF($D$93-$D$92=6,A135,\"\")","v":""},{"$f":"IF($D$93-$D$92=6,C135,\"\")","v":""}]
[]
[]
[]
[]
[]
[]
["T630"]
["1.8TB 10K RPM SAS 12Gbps 512e 2.5in Hot-plug Hard Drive",null,"CNV-TS1L1-HD1800-U","TS1L1-HD1800-U","400-ATJR",236]
["960GB SSD SAS Mix Use 12Gbps 512n 2.5in Hot-plug Drive,\nPX05SV,3 DWPD,5256 TBW",null,"CNV-TS1L1-SSD800-U","TS1L1-SSD800-U","400-ATLR",748]
["1.92TB SSD SAS Mix Use 12Gbps 512n 2.5in Hot-plug Drive,\nPX05SV,3 DWPD,10512 TBW",null,"CNV-TS1L1-SSD1920-U","TS1L1-SSD1920-U","400-ATNG",1795]
["600GB 10K RPM SAS 12Gbps 512n 2.5in Hot-plug Hard Drive",null,"CNV-TS1L1-HD600R","TS1L1-HD600R","400-AUWU",120]
["1.2TB 10K RPM SAS 12Gbps 512n 2.5in Hot-plug Hard Drive",null,"CNV-TS1L1-HD1200R","TS1L1-HD1200R","400-AOWP",212]
[]
["HDD max",16]
["HDD 300GB Base",2]
["HDD 300GB Selected",{"$f":"HD300_C","v":0}]
["300GB 10K RPM SAS 12Gbps 2.5in Hot-plug Hard Drive,CusKit",0,null,"Hot Spare for 300GB HDD",{"$f":"'CNV T640 (Rack)'!C94","v":"No"},{"$f":"IF(E152=\"Yes\",1,0)","v":0}]
[null,1]
[null,2]
[null,3]
[null,4]
[null,5]
[null,6]
[null,7]
[null,8]
[null,9]
[null,10]
[null,11]
[null,12]
[null,13]
[null,14]
["HDD max",16]
["HDD 300GB",{"$f":"B150+B151","v":2}]
["HDD 1TB Selected",{"$f":"HD1000_c","v":0},null,"Hot Spare for 1TB HDD",{"$f":"'CNV T640 (Rack)'!C98","v":"No"},{"$f":"IF(E169=\"Yes\",1,0)","v":0}]
["1.2TB 10K RPM SAS 12Gbps 2.5in Hot-plug Hard Drive,CusKit",{"$f":"$B$167-$B$168-$B$169","v":14}]
[null,{"$f":"IF(B170-1<1,0,B170-1)","v":13}]
[null,12]
[null,11]
[null,10]
[null,9]
[null,8]
[null,7]
[null,6]
[null,{"$f":"IF(B178-1<1,0,B178-1)","v":5}]
[null,4]
[null,3]
[null,2]
[null,1]
[null,0,null,null,null,null,"[780-BBJC]"]
[null,null,null,null,null,null,{"$f":"IF($F$169=0,C188,\"\")","v":"[780-BBJD] "}]
["RAID Configuration",null,null,"HDD 300GB",null,"HDD 1TB",{"$f":"IF($F$169=0,C189,\"\")","v":"[780-BBJF]"}]
["RAID Personalizzato",{"$f":"IF($B$146<=8,0,\"\")","v":0},"[780-BBJC]","RAID Personalizzato","[780-BBJC]","RAID Personalizzato",{"$f":"IF($B$169-$F$169=2,C190,\"\")","v":""}]
["C10 - Unconfigured RAID for H330 (1-8 HDDs)",1,"[780-BBJD] ",{"$f":"IF($F$152=0,A188,\"\")","v":"C10 - Unconfigured RAID for H330 (1-8 HDDs)"},{"$f":"IF($F$152=0,C188,\"\")","v":"[780-BBJD] "},{"$f":"IF($F$169=0,A188,\"\")","v":"C10 - Unconfigured RAID for H330 (1-8 HDDs)"},{"$f":"IF($B$169-$F$169>=3,C191,\"\")","v":""}]
["C2 - RAID 0 for H330 (1-8 HDDs)",1,"[780-BBJF]",{"$f":"IF($F$152=0,A189,\"\")","v":"C2 - RAID 0 for H330 (1-8 HDDs)"},{"$f":"IF($F$152=0,C189,\"\")","v":"[780-BBJF]"},{"$f":"IF($F$169=0,A189,\"\")","v":"C2 - RAID 0 for H330 (1-8 HDDs)"},{"$f":"IF($B$169-$F$169=4,C192,\"\")","v":""}]
["C3 - RAID 1 for H330 (2 HDDs)",1,"[780-BBJK]",{"$f":"IF($B$150+$B$151-$F$152=2,A190,\"\")","v":"C3 - RAID 1 for H330 (2 HDDs)"},{"$f":"IF($B$150+$B$151-$F$152=2,C190,\"\")","v":"[780-BBJK]"},{"$f":"IF($B$169-$F$169=2,A190,\"\")","v":""},{"$f":"IF($B$169-$F$169=4,C193,\"\")","v":""}]
["C4 - RAID 5 for H330 (3-8 HDDs)",1,"[780-BBJL]",{"$f":"IF($B$150+$B$151-$F$152>=3,A191,\"\")","v":""},{"$f":"IF($B$150+$B$151-$F$152>=3,C191,\"\")","v":""},{"$f":"IF($B$169-$F$169>=3,A191,\"\")","v":""},{"$f":"IF($B$169-$F$169>=5,C194,\"\")","v":""}]
["C6 - RAID 10 forH330 (4-8 HDDs in pairs) ",1,"[780-BBJN]",{"$f":"IF($B$150+$B$151-$F$152=4,A192,\"\")","v":""},{"$f":"IF($B$150+$B$151-$F$152=4,C192,\"\")","v":""},{"$f":"IF($B$169-$F$169=4,A192,\"\")","v":""},{"$f":"IF($B$169-$F$169=6,C195,\"\")","v":""}]
["C7 - RAID 1+RAID 1 for H330 (2 + 2 HDDs) ",1,"[780-BBJO]",{"$f":"IF($B$150+$B$151-$F$152=4,A193,\"\")","v":""},{"$f":"IF($B$150+$B$151-$F$152=4,C193,\"\")","v":""},{"$f":"IF($B$169-$F$169=4,A193,\"\")","v":""}]
["C8 - RAID 1+RAID 5 for H330 (2 + 3-8 HDDs)",1,"[780-BBJP]",{"$f":"IF($B$150+$B$151-$F$152>=5,A194,\"\")","v":""},{"$f":"IF($B$150+$B$151-$F$152>=5,C194,\"\")","v":""},{"$f":"IF($B$169-$F$169>=5,A194,\"\")","v":""}]
["C9 - RAID 1+RAID 10 for H330 (2 + 4 HDDs in pairs) ",1,"[780-BBJQ] ",{"$f":"IF($B$150+$B$151-$F$152=6,A195,\"\")","v":""},{"$f":"IF($B$150+$B$151-$F$152=6,C195,\"\")","v":""},{"$f":"IF($B$169-$F$169=6,A195,\"\")","v":""}]
[]
[]
[]
["T630 Tower Base"]
["600GB 10K RPM SAS 12Gbps 512n 2.5in Hot-plug Hard Drive, 3.5in HYB CARR",1,"CNV-TS1L1-HD600T","TS1L1-HD600T","400-AOXC",111]
["1.2TB 10K RPM SAS 12Gbps 512n 2.5in Hot-plug Hard Drive, 3.5in HYB CARR",1,"CNV-TS1L1-HD1200T-U","TS1L1-HD1200T-U","400-AUUY",173]
[]
[]
["HDD max",18]
["HDD 300GB Base",2]
["HDD 300GB Selected",{"$f":"HD300_D","v":0}]
["300GB 10K RPM SAS 2.5in Hot-plug Hard Drive,3.5in HYB CARR,CusKit",0,null,"Hot Spare for 300GB HDD",{"$f":"'CNV T640 (Tower)'!C153","v":0},{"$f":"IF(E207=\"Yes\",1,0)","v":0}]
[null,1]
[null,2]
[null,3]
[null,4]
[null,5]
[null,6]
[null,7]
[null,8]
[null,9]
[null,10]
[null,11]
[null,12]
[null,13]
[null,14]
[null,15]
[null,16]
["HDD max",18]
["HDD 300GB",{"$f":"B205+B206","v":2}]
["HDD 1TB Selected",{"$f":"HD1000_D","v":0},null,"Hot Spare for 1TB HDD",{"$f":"'CNV T640 (Tower)'!C157","v":0},{"$f":"IF(E226=\"Yes\",1,0)","v":0}]
["1.2TB 10K RPM SAS 12Gbps 2.5in Hot-plug Hard Drive,3.5in HYB CARR,CusKit",{"$f":"$B$204-$B$205-$B$206","v":16}]
[null,{"$f":"IF(B227-1<1,0,B227-1)","v":15}]
[null,14]
[null,13]
[null,12]
[null,11]
[null,10]
[null,9]
[null,8]
[null,7]
[null,6]
[null,5]
[null,4]
[null,3]
[null,2]
[null,1]
[null,0]
[]
["T630 Tower Prest 2650"]
["300GB 10K RPM SAS 2.5in Hot-plug Hard Drive,3.5in HYB CARR,CusKit",1,"TS1L1-HD300T","TS1L1-HD300-T630","400-AJOU",111]
["1.2TB 10K RPM SAS 12Gbps 2.5in Hot-plug Hard Drive,3.5in HYB CARR,CusKit",1,"TS1L1-HD1200T","TS1L1-HD1200-T630","400-AJPC",173]
[]
[]
["HDD max",8]
["HDD 300GB Base",2]
["HDD 300GB Selected",{"$f":"HD300_E","v":0}]
["300GB 10K RPM SAS 2.5in Hot-plug Hard Drive,3.5in HYB CARR,CusKit",0,null,"Hot Spare for 300GB HDD",{"$f":"'CNV T640 1 (Tower) Prest'!C206","v":0},{"$f":"IF(E253=\"Yes\",1,0)","v":0}]
[null,1]
[null,2]
[null,3]
[null,4]
[null,5]
[null,6]
["HDD max",8]
["HDD 300GB",{"$f":"B251+B252","v":2}]
["HDD 1TB Selected",{"$f":"HD1000_E","v":0},null,"Hot Spare for 1TB HDD",{"$f":"'CNV T640 1 (Tower) Prest'!C210","v":0},{"$f":"IF(E262=\"Yes\",1,0)","v":0}]
["1.2TB 10K RPM SAS 12Gbps 2.5in Hot-plug Hard Drive,3.5in HYB CARR,CusKit",{"$f":"$B$260-$B$261-$B$262","v":6}]
[null,{"$f":"IF(B263-1<1,0,B263-1)","v":5}]
[null,4]
[null,3]
[null,2]
[null,1]
[null,0]

{"sheet":"Operating System","index":15,"n_rows":71,"n_cols":25,"rows_kept":71,"cut":false,"hidden":true,"merged":[[0,1,0,2]]}
["Operating System"]
["R630 1CPU"]
["No Operating System",{"$f":"\"\"","v":""},{"$f":"\"\"","v":""},{"$f":"\"\"","v":""},"[611-BBBF]",{"$f":"\"\"","v":""},null,"None",{"$f":"\"\"","v":""},{"$f":"\"\"","v":""},{"$f":"\"\"","v":""},{"$f":"\"\"","v":""},null,"None",{"$f":"\"\"","v":""},{"$f":"\"\"","v":""},{"$f":"\"\"","v":""},{"$f":"\"\"","v":""},null,{"$f":"\"\"","v":""},0,{"$f":"\"\"","v":""},{"$f":"\"\"","v":""},{"$f":"\"\"","v":""},{"$f":"\"\"","v":""}]
["Microsoft Windows Server 2016 Standard Edition ROK 16 Core",1,"CNV-TS1L1-WIN1","TS1L1-WIN1","[634-BIPU]",598,null,"1-pack of Windows Server 2016 User CALs (Standard or Datacenter)",1,"CNV-TS1L1-CALUSER","TS1L1-CALUSER","[618-10778]",25,"1-pack of Windows Server 2016 Device CALs (Standard or Datacenter)",1,"CNV-TS1L1-CALDEV","TS1L1-CALDEV","[618-10777]",22,{"$f":"\"\"","v":""},0,{"$f":"\"\"","v":""},{"$f":"\"\"","v":""},{"$f":"\"\"","v":""},{"$f":"\"\"","v":""}]
["CentOS 7.0",1,"CNV-TS1L1-LINUX","TS1L1-LINUX",{"$f":"\"\"","v":""},47,null,"None",{"$f":"\"\"","v":""},{"$f":"\"\"","v":""},{"$f":"\"\"","v":""},{"$f":"\"\"","v":""},null,"None",{"$f":"\"\"","v":""},{"$f":"\"\"","v":""},{"$f":"\"\"","v":""},{"$f":"\"\"","v":""},null,{"$f":"\"\"","v":""},0,{"$f":"\"\"","v":""},{"$f":"\"\"","v":""},{"$f":"\"\"","v":""},{"$f":"\"\"","v":""}]
["Microsoft Windows Server 2016 Standard Edition Additional License 2 Core",2,"CNV-TS1L1-WIN2CORE","TS1L1-WIN2CORE","871159-A21",108]
[]
["R630 2CPU"]
["No Operating System",{"$f":"\"\"","v":""},{"$f":"\"\"","v":""},{"$f":"\"\"","v":""},"[611-BBBF]",{"$f":"\"\"","v":""},null,"None",{"$f":"\"\"","v":""},{"$f":"\"\"","v":""},{"$f":"\"\"","v":""},{"$f":"\"\"","v":""},null,"None",{"$f":"\"\"","v":""},{"$f":"\"\"","v":""},{"$f":"\"\"","v":""},{"$f":"\"\"","v":""},null,{"$f":"\"\"","v":""},0,{"$f":"\"\"","v":""},{"$f":"\"\"","v":""},{"$f":"\"\"","v":""}]
["Microsoft Windows Server 2016 Standard Edition ROK 16 Core",1,"CNV-TS1L1-WIN1","TS1L1-WIN1","[634-BIPU]",598,null,"1-pack of Windows Server 2016 User CALs (Standard or Datacenter)",1,"CNV-TS1L1-CALUSER","TS1L1-CALUSER","[618-10778]",25,"1-pack of Windows Server 2016 Device CALs (Standard or Datacenter)",1,"CNV-TS1L1-CALDEV","TS1L1-CALDEV","[618-10777]",22,"Microsoft Windows Server 2016 Standard Edition Additional License 2 Core",2,"CNV-TS1L1-WIN2CORE","TS1L1-WIN2CORE","[634-BJQW]",150]
["CentOS 7.0",1,"CNV-TS1L1-LINUX","TS1L1-LINUX",{"$f":"\"\"","v":""},47,null,"None",{"$f":"\"\"","v":""},{"$f":"\"\"","v":""},{"$f":"\"\"","v":""},{"$f":"\"\"","v":""},null,"None",{"$f":"\"\"","v":""},{"$f":"\"\"","v":""},{"$f":"\"\"","v":""},{"$f":"\"\"","v":""},null,{"$f":"\"\"","v":""},0,{"$f":"\"\"","v":""},{"$f":"\"\"","v":""},{"$f":"\"\"","v":""}]
[]
[]
["Red Hat Enterprise Linux,2SKT,1 Physical OR 2Guest,1Yr PREMIUM SUB,No Media,CUS",1,"TS1L1-634-BIPV","TS1L1-634-BIPV","634-BIPV",null,990,"None",{"$f":"\"\"","v":""},{"$f":"\"\"","v":""},{"$f":"\"\"","v":""},{"$f":"\"\"","v":""},null,"None",{"$f":"\"\"","v":""},{"$f":"\"\"","v":""},{"$f":"\"\"","v":""},{"$f":"\"\"","v":""},null,{"$f":"\"\"","v":""},{"$f":"\"\"","v":""},{"$f":"\"\"","v":""},{"$f":"\"\"","v":""},{"$f":"\"\"","v":""},{"$f":"\"\"","v":""}]
["Red Hat Enterprise Linux,2SKT,1 Physical OR 2Guest,3Yr PREMIUM SUB,No Media,Cus Kit",1,"TS1L1-634-BIPX","TS1L1-634-BIPX","634-BIPX",null,2820,"None",{"$f":"\"\"","v":""},{"$f":"\"\"","v":""},{"$f":"\"\"","v":""},{"$f":"\"\"","v":""},null,"None",{"$f":"\"\"","v":""},{"$f":"\"\"","v":""},{"$f":"\"\"","v":""},{"$f":"\"\"","v":""},null,{"$f":"\"\"","v":""},{"$f":"\"\"","v":""},{"$f":"\"\"","v":""},{"$f":"\"\"","v":""},{"$f":"\"\"","v":""},{"$f":"\"\"","v":""}]
["Red Hat Enterprise Linux,2SKT,1 Physical OR 2Guest,5Yr PREMIUM SUB,No Media,CUS",1,"TS1L1-634-BIPW","TS1L1-634-BIPW","634-BIPW",null,4700,"None",{"$f":"\"\"","v":""},{"$f":"\"\"","v":""},{"$f":"\"\"","v":""},{"$f":"\"\"","v":""},null,"None",{"$f":"\"\"","v":""},{"$f":"\"\"","v":""},{"$f":"\"\"","v":""},{"$f":"\"\"","v":""},null,{"$f":"\"\"","v":""},{"$f":"\"\"","v":""},{"$f":"\"\"","v":""},{"$f":"\"\"","v":""},{"$f":"\"\"","v":""},{"$f":"\"\"","v":""}]
["VMware vSphere Essentials Plus",1,"TS1L1-210-AIKY","TS1L1-210-AIKY","210-AIKY",null,5730,"None",{"$f":"\"\"","v":""},{"$f":"\"\"","v":""},{"$f":"\"\"","v":""},{"$f":"\"\"","v":""},null,"None",{"$f":"\"\"","v":""},{"$f":"\"\"","v":""},{"$f":"\"\"","v":""},{"$f":"\"\"","v":""},null,{"$f":"\"\"","v":""},{"$f":"\"\"","v":""},{"$f":"\"\"","v":""},{"$f":"\"\"","v":""},{"$f":"\"\"","v":""},{"$f":"\"\"","v":""}]
["VMware vSphere EnterprisePlus",1,"TS1L1-210-AHRP","TS1L1-210-AHRP","210-AHRP",null,5230,"None",{"$f":"\"\"","v":""},{"$f":"\"\"","v":""},{"$f":"\"\"","v":""},{"$f":"\"\"","v":""},null,"None",{"$f":"\"\"","v":""},{"$f":"\"\"","v":""},{"$f":"\"\"","v":""},{"$f":"\"\"","v":""},null,{"$f":"\"\"","v":""},{"$f":"\"\"","v":""},{"$f":"\"\"","v":""},{"$f":"\"\"","v":""},{"$f":"\"\"","v":""},{"$f":"\"\"","v":""}]
["VMware vCenter Standard",1,"TS1L1-210-AHRF","TS1L1-210-AHRF","210-AHRF",null,8961,"None",{"$f":"\"\"","v":""},{"$f":"\"\"","v":""},{"$f":"\"\"","v":""},{"$f":"\"\"","v":""},null,"None",{"$f":"\"\"","v":""},{"$f":"\"\"","v":""},{"$f":"\"\"","v":""},{"$f":"\"\"","v":""},null,{"$f":"\"\"","v":""},{"$f":"\"\"","v":""},{"$f":"\"\"","v":""},{"$f":"\"\"","v":""},{"$f":"\"\"","v":""},{"$f":"\"\"","v":""}]
[]
["Red Hat Enterprise Linux,2SKT,1 Physical OR 2Guest,1Yr PREMIUM SUB,No Media,CUS",1,"TS1L1-634-BIPV","TS1L1-634-BIPV","634-BIPV",null,990,"None",{"$f":"\"\"","v":""},{"$f":"\"\"","v":""},{"$f":"\"\"","v":""},{"$f":"\"\"","v":""},null,"None",{"$f":"\"\"","v":""},{"$f":"\"\"","v":""},{"$f":"\"\"","v":""},{"$f":"\"\"","v":""},null,{"$f":"\"\"","v":""},{"$f":"\"\"","v":""},{"$f":"\"\"","v":""},{"$f":"\"\"","v":""},{"$f":"\"\"","v":""}]
["Red Hat Enterprise Linux,2SKT,1 Physical OR 2Guest,3Yr PREMIUM SUB,No Media,Cus Kit",1,"TS1L1-634-BIPX","TS1L1-634-BIPX","634-BIPX",null,2820,"None",{"$f":"\"\"","v":""},{"$f":"\"\"","v":""},{"$f":"\"\"","v":""},{"$f":"\"\"","v":""},null,"None",{"$f":"\"\"","v":""},{"$f":"\"\"","v":""},{"$f":"\"\"","v":""},{"$f":"\"\"","v":""},null,{"$f":"\"\"","v":""},{"$f":"\"\"","v":""},{"$f":"\"\"","v":""},{"$f":"\"\"","v":""},{"$f":"\"\"","v":""}]
["Red Hat Enterprise Linux,2SKT,1 Physical OR 2Guest,5Yr PREMIUM SUB,No Media,CUS",1,"TS1L1-634-BIPW","TS1L1-634-BIPW","634-BIPW",null,4700,"None",{"$f":"\"\"","v":""},{"$f":"\"\"","v":""},{"$f":"\"\"","v":""},{"$f":"\"\"","v":""},null,"None",{"$f":"\"\"","v":""},{"$f":"\"\"","v":""},{"$f":"\"\"","v":""},{"$f":"\"\"","v":""},null,{"$f":"\"\"","v":""},{"$f":"\"\"","v":""},{"$f":"\"\"","v":""},{"$f":"\"\"","v":""},{"$f":"\"\"","v":""}]
["VMware vSphere Essentials Plus",1,"TS1L1-210-AIKY","TS1L1-210-AIKY","210-AIKY",null,5730,"None",{"$f":"\"\"","v":""},{"$f":"\"\"","v":""},{"$f":"\"\"","v":""},{"$f":"\"\"","v":""},null,"None",{"$f":"\"\"","v":""},{"$f":"\"\"","v":""},{"$f":"\"\"","v":""},{"$f":"\"\"","v":""},null,{"$f":"\"\"","v":""},{"$f":"\"\"","v":""},{"$f":"\"\"","v":""},{"$f":"\"\"","v":""},{"$f":"\"\"","v":""}]
["VMware vSphere EnterprisePlus",1,"TS1L1-210-AHRP","TS1L1-210-AHRP","210-AHRP",null,5230,"None",{"$f":"\"\"","v":""},{"$f":"\"\"","v":""},{"$f":"\"\"","v":""},{"$f":"\"\"","v":""},null,"None",{"$f":"\"\"","v":""},{"$f":"\"\"","v":""},{"$f":"\"\"","v":""},{"$f":"\"\"","v":""},null,{"$f":"\"\"","v":""},{"$f":"\"\"","v":""},{"$f":"\"\"","v":""},{"$f":"\"\"","v":""},{"$f":"\"\"","v":""}]
["VMware vCenter Standard",1,"TS1L1-210-AHRF","TS1L1-210-AHRF","210-AHRF",null,8961,"None",{"$f":"\"\"","v":""},{"$f":"\"\"","v":""},{"$f":"\"\"","v":""},{"$f":"\"\"","v":""},null,"None",{"$f":"\"\"","v":""},{"$f":"\"\"","v":""},{"$f":"\"\"","v":""},{"$f":"\"\"","v":""},null,{"$f":"\"\"","v":""},{"$f":"\"\"","v":""},{"$f":"\"\"","v":""},{"$f":"\"\"","v":""},{"$f":"\"\"","v":""}]
[]
["R730xd 1CPU"]
["No Operating System",{"$f":"\"\"","v":""},{"$f":"\"\"","v":""},{"$f":"\"\"","v":""},"[611-BBBF]",{"$f":"\"\"","v":""},null,"None",{"$f":"\"\"","v":""},{"$f":"\"\"","v":""},{"$f":"\"\"","v":""},{"$f":"\"\"","v":""},null,"None",{"$f":"\"\"","v":""},{"$f":"\"\"","v":""},{"$f":"\"\"","v":""},{"$f":"\"\"","v":""},null,{"$f":"\"\"","v":""},0,{"$f":"\"\"","v":""},{"$f":"\"\"","v":""},{"$f":"\"\"","v":""},{"$f":"\"\"","v":""}]
["Microsoft Windows Server 2016 Standard Edition ROK 16 Core",1,"CNV-TS1L1-WIN1","TS1L1-WIN1","[634-BIPU]",598,null,"1-pack of Windows Server 2016 User CALs (Standard or Datacenter)",1,"CNV-TS1L1-CALUSER","TS1L1-CALUSER","[618-10778]",25,"1-pack of Windows Server 2016 Device CALs (Standard or Datacenter)",1,"CNV-TS1L1-CALDEV","TS1L1-CALDEV","[618-10777]",22,{"$f":"\"\"","v":""},0,{"$f":"\"\"","v":""},{"$f":"\"\"","v":""},{"$f":"\"\"","v":""},{"$f":"\"\"","v":""}]
["CentOS 7.0",1,"CNV-TS1L1-LINUX","TS1L1-LINUX",{"$f":"\"\"","v":""},47,null,"None",{"$f":"\"\"","v":""},{"$f":"\"\"","v":""},{"$f":"\"\"","v":""},{"$f":"\"\"","v":""},null,"None",{"$f":"\"\"","v":""},{"$f":"\"\"","v":""},{"$f":"\"\"","v":""},{"$f":"\"\"","v":""},null,{"$f":"\"\"","v":""},0,{"$f":"\"\"","v":""},{"$f":"\"\"","v":""},{"$f":"\"\"","v":""},{"$f":"\"\"","v":""}]
[]
["R730xd 2CPU"]
["No Operating System",{"$f":"\"\"","v":""},{"$f":"\"\"","v":""},{"$f":"\"\"","v":""},"[611-BBBF]",{"$f":"\"\"","v":""},null,"None",{"$f":"\"\"","v":""},{"$f":"\"\"","v":""},{"$f":"\"\"","v":""},{"$f":"\"\"","v":""},null,"None",{"$f":"\"\"","v":""},{"$f":"\"\"","v":""},{"$f":"\"\"","v":""},{"$f":"\"\"","v":""},null,{"$f":"\"\"","v":""},0,{"$f":"\"\"","v":""},{"$f":"\"\"","v":""},{"$f":"\"\"","v":""}]
["Microsoft Windows Server 2016 Standard Edition ROK 16 Core",1,"CNV-TS1L1-WIN1","TS1L1-WIN1","[634-BIPU]",598,null,"1-pack of Windows Server 2016 User CALs (Standard or Datacenter)",1,"CNV-TS1L1-CALUSER","TS1L1-CALUSER","[618-10778]",25,"1-pack of Windows Server 2016 Device CALs (Standard or Datacenter)",1,"CNV-TS1L1-CALDEV","TS1L1-CALDEV","[618-10777]",22,"Microsoft Windows Server 2016 Standard Edition Additional License 2 Core",6,"CNV-TS1L1-WIN2CORE","TS1L1-WIN2CORE","[634-BJQW]",300]
["CentOS 7.0",1,"CNV-TS1L1-LINUX","TS1L1-LINUX",{"$f":"\"\"","v":""},47,null,"None",{"$f":"\"\"","v":""},{"$f":"\"\"","v":""},{"$f":"\"\"","v":""},{"$f":"\"\"","v":""},null,"None",{"$f":"\"\"","v":""},{"$f":"\"\"","v":""},{"$f":"\"\"","v":""},{"$f":"\"\"","v":""},null,{"$f":"\"\"","v":""},0,{"$f":"\"\"","v":""},{"$f":"\"\"","v":""},{"$f":"\"\"","v":""}]
[]
["T630 2650"]
["No Operating System",{"$f":"\"\"","v":""},{"$f":"\"\"","v":""},{"$f":"\"\"","v":""},"[611-BBBF]",{"$f":"\"\"","v":""},null,"None",{"$f":"\"\"","v":""},{"$f":"\"\"","v":""},{"$f":"\"\"","v":""},{"$f":"\"\"","v":""},null,"None",{"$f":"\"\"","v":""},{"$f":"\"\"","v":""},{"$f":"\"\"","v":""},{"$f":"\"\"","v":""},null,{"$f":"\"\"","v":""},0,{"$f":"\"\"","v":""},{"$f":"\"\"","v":""},{"$f":"\"\"","v":""}]
["Microsoft Windows Server 2016 Standard Edition ROK 16 Core",1,"CNV-TS1L1-WIN1","TS1L1-WIN1","[634-BIPU]",598,null,"1-pack of Windows Server 2016 User CALs (Standard or Datacenter)",1,"CNV-TS1L1-CALUSER","TS1L1-CALUSER","[618-10778]",25,"1-pack of Windows Server 2012 Device CALs (Standard or Datacenter)",1,"CNV-TS1L1-CALDEV","TS1L1-CALDEV","[618-10777]",25,"Microsoft Windows Server 2016 Standard Edition Additional License 2 Core",0,"CNV-TS1L1-WIN2CORE","TS1L4-WIN2CORE","[634-BJQW]",300]
["CentOS 7.0",1,"CNV-TS1L1-LINUX","TS1L1-LINUX",{"$f":"\"\"","v":""},47,null,"None",{"$f":"\"\"","v":""},{"$f":"\"\"","v":""},{"$f":"\"\"","v":""},{"$f":"\"\"","v":""},null,"None",{"$f":"\"\"","v":""},{"$f":"\"\"","v":""},{"$f":"\"\"","v":""},{"$f":"\"\"","v":""},null,{"$f":"\"\"","v":""},0,{"$f":"\"\"","v":""},{"$f":"\"\"","v":""},{"$f":"\"\"","v":""}]
[]
["T630 2650 2CPU"]
["No Operating System",{"$f":"\"\"","v":""},{"$f":"\"\"","v":""},{"$f":"\"\"","v":""},"[611-BBBF]",{"$f":"\"\"","v":""},null,"None",{"$f":"\"\"","v":""},{"$f":"\"\"","v":""},{"$f":"\"\"","v":""},{"$f":"\"\"","v":""},null,"None",{"$f":"\"\"","v":""},{"$f":"\"\"","v":""},{"$f":"\"\"","v":""},{"$f":"\"\"","v":""},null,{"$f":"\"\"","v":""},0,{"$f":"\"\"","v":""},{"$f":"\"\"","v":""},{"$f":"\"\"","v":""}]
["Microsoft Windows Server 2016 Standard Edition ROK 16 Core",1,"CNV-TS1L1-WIN1","TS1L1-WIN1","[634-BIPU]",598,null,"1-pack of Windows Server 2016 User CALs (Standard or Datacenter)",1,"CNV-TS1L1-CALUSER","TS1L1-CALUSER","[618-10778]",25,"1-pack of Windows Server 2012 Device CALs (Standard or Datacenter)",1,"CNV-TS1L1-CALDEV","TS1L1-CALDEV","[618-10777]",25,"Microsoft Windows Server 2016 Standard Edition Additional License 2 Core",6,"CNV-TS1L1-WIN2CORE","TS1L4-WIN2CORE","[634-BJQW]",300]
["CentOS 7.0",1,"CNV-TS1L1-LINUX","TS1L1-LINUX",{"$f":"\"\"","v":""},47,null,"None",{"$f":"\"\"","v":""},{"$f":"\"\"","v":""},{"$f":"\"\"","v":""},{"$f":"\"\"","v":""},null,"None",{"$f":"\"\"","v":""},{"$f":"\"\"","v":""},{"$f":"\"\"","v":""},{"$f":"\"\"","v":""},null,{"$f":"\"\"","v":""},0,{"$f":"\"\"","v":""},{"$f":"\"\"","v":""},{"$f":"\"\"","v":""}]
[]
[]
[]
["None\n",0,"","","",0]
["SUSE Linux Enterprise Server, x86 & x86-64, 1-2 Sockets or 1-2 Virtual Machines, Standard Subscription, 3 Years",1,"CNV-874-006887","TS1-874-006887","874-006887",1350]
["SUSE Linux Enterprise Server, x86 & x86-64, 1-2 Sockets or 1-2 Virtual Machines, Standard Subscription, 5 Years",1,"CNV-874-006898","TS1-874-006898","874-006898",2242.5]
["SUSE Linux Enterprise Server, x86 & x86-64, 1-2 Sockets with Unlimited Virtual Machines, Standard Subscription, 3 Years",1,"CNV-874-006888","TS1-874-006888","874-006888",2692.5]
["SUSE Linux Enterprise Server, x86 & x86-64, 1-2 Sockets with Unlimited Virtual Machines, Standard Subscription, 5 Years",1,"CNV-874-006902","TS1-874-006902","874-006902",4500]
["SUSE Linux Enterprise Server, x86 & x86-64, 1-2 Sockets or 1-2 Virtual Machines, Priority Subscription, 3 Year",1,"CNV-874-006883","TS1-874-006883","874-006883",2520]
["SUSE Linux Enterprise Server, x86 & x86-64, 1-2 Sockets or 1-2 Virtual Machines, Priority Subscription, 5 Year",1,"CNV-874-006894","TS1-874-006894","874-006894",4200]
["SUSE Linux Enterprise Server, x86 & x86-64, 1-2 Sockets with Unlimited Virtual Machines, Priority Subscription, 3 Year",1,"CNV-874-006884","TS1-874-006884","874-006884",5100]
["SUSE Linux Enterprise Server, x86 & x86-64, 1-2 Sockets with Unlimited Virtual Machines, Priority Subscription, 5 Year",1,"CNV-874-006895","TS1-874-006895","874-006895",8400]
["VMWARE"]
["None",0,"","","",0]
["VMware vSphere Standard, 1CPU, 3YR License/Maintenance",1,"CNV-210-AHRT","TS1-210-AHRT","210-AHRT",1463]
["VMware vSphere Enterprise Plus, 1CPU, 3YR License/Maintenance",1,"CNV-210-AHRP","TS1-210-AHRP","210-AHRP",4400]
[]
[null,null,null,null,null,null,null,"R630","T630R","R730","R730xd","T630","T630P"]
["VMWARE1",null,null,null,null,null,1,{"$f":"SRV_A","v":0},{"$f":"SRV_C","v":0},{"$f":"SRV_B1.1","v":0},{"$f":"SRV_B","v":0},{"$f":"SRV_D","v":0},{"$f":"SRV_E","v":0}]
["None",0,"","","",0,2,{"$f":"SRV_AA","v":0},{"$f":"SRV_CC","v":0},{"$f":"SRV_B1.2","v":0},{"$f":"SRV_BB","v":0}]
["VMware vSphere Essentials Plus, 6CPU, 3YR",1,"CNV-210-AIKY","TS1-210-AIKY","210-AIKY",4100,3,{"$f":"SRV_AAA","v":0},{"$f":"SRV_CCC","v":0},{"$f":"SRV_B1.3","v":0},{"$f":"SRV_BB","v":0}]
[]
["VMWARE2"]
["None",0,"","","",0]
["VMware vCenter Standard, 3YR License/Maintenance",1,"CNV-210-AHRF","TS1-210-AHRF","210-AHRF",8338]

{"sheet":"Memory","index":16,"n_rows":85,"n_cols":16,"rows_kept":85,"cut":false,"hidden":true,"merged":[]}
[]
[null,"Dell 16 GB Modulo di memoria - RDIMM 2666MHz",1,"CNV-TS1L1-16GB-U","TS1L1-16GB-U","370-ADOR",122]
[null,"Dell 32 GB Modulo di memoria - RDIMM 2666MHz",1,"CNV-TS1L1-32GB-U","TS1L1-32GB-U","A9781929",313]
[null,"Dell 64 GB Modulo di memoria - LRDIMM 2666MHz",1,"CNV-TS1L1-64GB-U","TS1L1-64GB-U","A9781930",618]
[null,"Dell 64 GB Modulo di memoria - LRDIMM 2666MHz",1,"CNV-TS1L1-64GB-U-R74","TS1L1-64GB-U","A9781930",625]
[]
[null,"R640 - T640"]
["1CPU","MEMORY A"]
[32,{"$f":"\"\"","v":""},{"$f":"\"\"","v":""},{"$f":"\"\"","v":""},{"$f":"\"\"","v":""},{"$f":"\"\"","v":""},{"$f":"\"\"","v":""},"Dell 32 GB Modulo di memoria - RDIMM 2666MHz",1,"[370-ADNF]",{"$f":"\"\"","v":""},{"$f":"\"\"","v":""},{"$f":"\"\"","v":""},{"$f":"\"\"","v":""},{"$f":"\"\"","v":""},{"$f":"\"\"","v":""}]
[64,"Dell 32 GB Modulo di memoria - RDIMM 2666MHz",1,"CNV-TS1L1-32GB-U","TS1L1-32GB-U","A9781929",{"$f":"$G$3*C10","v":313},"Dell 32 GB Modulo di memoria - RDIMM 2666MHz",1,"[370-ADNF]",{"$f":"\"\"","v":""},{"$f":"\"\"","v":""},{"$f":"\"\"","v":""},{"$f":"\"\"","v":""},{"$f":"\"\"","v":""},{"$f":"\"\"","v":""}]
[96,"Dell 32 GB Modulo di memoria - RDIMM 2666MHz",2,"CNV-TS1L1-32GB-U","TS1L1-32GB-U","A9781929",626,"Dell 32 GB Modulo di memoria - RDIMM 2666MHz",1,"[370-ADNF]",{"$f":"\"\"","v":""},{"$f":"\"\"","v":""},{"$f":"\"\"","v":""},{"$f":"\"\"","v":""},{"$f":"\"\"","v":""},{"$f":"\"\"","v":""}]
[128,"Dell 32 GB Modulo di memoria - RDIMM 2666MHz",3,"CNV-TS1L1-32GB-U","TS1L1-32GB-U","A9781929",939,"Dell 32 GB Modulo di memoria - RDIMM 2666MHz",1,"[370-ADNF]",{"$f":"\"\"","v":""},{"$f":"\"\"","v":""},{"$f":"\"\"","v":""},{"$f":"\"\"","v":""},{"$f":"\"\"","v":""},{"$f":"\"\"","v":""}]
[160,"Dell 32 GB Modulo di memoria - RDIMM 2666MHz",4,"CNV-TS1L1-32GB-U","TS1L1-32GB-U","A9781929",1252,"Dell 32 GB Modulo di memoria - RDIMM 2666MHz",1,"[370-ADNF]",{"$f":"\"\"","v":""},{"$f":"\"\"","v":""},{"$f":"\"\"","v":""},{"$f":"\"\"","v":""},{"$f":"\"\"","v":""},{"$f":"\"\"","v":""}]
[192,"Dell 32 GB Modulo di memoria - RDIMM 2666MHz",5,"CNV-TS1L1-32GB-U","TS1L1-32GB-U","A9781929",1565,"Dell 32 GB Modulo di memoria - RDIMM 2666MHz",1,"[370-ADNF]",{"$f":"\"\"","v":""},{"$f":"\"\"","v":""},{"$f":"\"\"","v":""},{"$f":"\"\"","v":""},{"$f":"\"\"","v":""},{"$f":"\"\"","v":""}]
[256,"Dell 32 GB Modulo di memoria - RDIMM 2666MHz",7,"CNV-TS1L1-32GB-U","TS1L1-32GB-U","A9781929",2191,"Dell 32 GB Modulo di memoria - RDIMM 2666MHz",1,"[370-ADNF]",{"$f":"\"\"","v":""},{"$f":"\"\"","v":""},{"$f":"\"\"","v":""},{"$f":"\"\"","v":""},{"$f":"\"\"","v":""},{"$f":"\"\"","v":""}]
[320,"Dell 32 GB Modulo di memoria - RDIMM 2666MHz",9,"CNV-TS1L1-32GB-U","TS1L1-32GB-U","A9781929",2817,"Dell 32 GB Modulo di memoria - RDIMM 2666MHz",1,"[370-ADNF]",{"$f":"\"\"","v":""},{"$f":"\"\"","v":""},{"$f":"\"\"","v":""},{"$f":"\"\"","v":""},{"$f":"\"\"","v":""},{"$f":"\"\"","v":""}]
[384,"Dell 32 GB Modulo di memoria - RDIMM 2666MHz",11,"CNV-TS1L1-32GB-U","TS1L1-32GB-U","A9781929",3443,"Dell 32 GB Modulo di memoria - RDIMM 2666MHz",1,"[370-ADNF]",{"$f":"\"\"","v":""},{"$f":"\"\"","v":""},{"$f":"\"\"","v":""},{"$f":"\"\"","v":""},{"$f":"\"\"","v":""},{"$f":"\"\"","v":""}]
[512,{"$f":"\"\"","v":""},{"$f":"\"\"","v":""},{"$f":"\"\"","v":""},{"$f":"\"\"","v":""},{"$f":"\"\"","v":""},{"$f":"\"\"","v":""},{"$f":"\"\"","v":""},{"$f":"\"\"","v":""},{"$f":"\"\"","v":""},"Dell 64 GB Modulo di memoria - LRDIMM 2666MHz",8,"CNV-TS1L1-64GB-U","TS1L1-64GB-U","A9781930",{"$f":"$G$4*L18","v":4944}]
[640,{"$f":"\"\"","v":""},{"$f":"\"\"","v":""},{"$f":"\"\"","v":""},{"$f":"\"\"","v":""},{"$f":"\"\"","v":""},{"$f":"\"\"","v":""},{"$f":"\"\"","v":""},{"$f":"\"\"","v":""},{"$f":"\"\"","v":""},"Dell 64 GB Modulo di memoria - LRDIMM 2666MHz",10,"CNV-TS1L1-64GB-U","TS1L1-64GB-U","A9781930",{"$f":"$G$4*L19","v":6180}]
[768,{"$f":"\"\"","v":""},{"$f":"\"\"","v":""},{"$f":"\"\"","v":""},{"$f":"\"\"","v":""},{"$f":"\"\"","v":""},{"$f":"\"\"","v":""},{"$f":"\"\"","v":""},{"$f":"\"\"","v":""},{"$f":"\"\"","v":""},"Dell 64 GB Modulo di memoria - LRDIMM 2666MHz",12,"CNV-TS1L1-64GB-U","TS1L1-64GB-U","A9781930",{"$f":"$G$4*L20","v":7416}]
["2CPU"]
[64,"Dell 32 GB Modulo di memoria - RDIMM 2666MHz",1,"CNV-TS1L1-32GB-U","TS1L1-32GB-U","A9781929",{"$f":"$G$3*C22","v":313},"Dell 32 GB Modulo di memoria - RDIMM 2666MHz",1,"[370-ADNF]",{"$f":"\"\"","v":""},{"$f":"\"\"","v":""},{"$f":"\"\"","v":""},{"$f":"\"\"","v":""},{"$f":"\"\"","v":""},{"$f":"\"\"","v":""}]
[128,"Dell 32 GB Modulo di memoria - RDIMM 2666MHz",3,"CNV-TS1L1-32GB-U","TS1L1-32GB-U","A9781929",{"$f":"$G$3*C23","v":939},"Dell 32 GB Modulo di memoria - RDIMM 2666MHz",1,"[370-ADNF]",{"$f":"\"\"","v":""},{"$f":"\"\"","v":""},{"$f":"\"\"","v":""},{"$f":"\"\"","v":""},{"$f":"\"\"","v":""},{"$f":"\"\"","v":""}]
[192,"Dell 32 GB Modulo di memoria - RDIMM 2666MHz",5,"CNV-TS1L1-32GB-U","TS1L1-32GB-U","A9781929",1565,"Dell 32 GB Modulo di memoria - RDIMM 2666MHz",1,"[370-ADNF]",{"$f":"\"\"","v":""},{"$f":"\"\"","v":""},{"$f":"\"\"","v":""},{"$f":"\"\"","v":""},{"$f":"\"\"","v":""},{"$f":"\"\"","v":""}]
[256,"Dell 32 GB Modulo di memoria - RDIMM 2666MHz",7,"CNV-TS1L1-32GB-U","TS1L1-32GB-U","A9781929",2191,"Dell 32 GB Modulo di memoria - RDIMM 2666MHz",1,"[370-ADNF]",{"$f":"\"\"","v":""},{"$f":"\"\"","v":""},{"$f":"\"\"","v":""},{"$f":"\"\"","v":""},{"$f":"\"\"","v":""},{"$f":"\"\"","v":""}]
[320,"Dell 32 GB Modulo di memoria - RDIMM 2666MHz",9,"CNV-TS1L1-32GB-U","TS1L1-32GB-U","A9781929",2817,"Dell 32 GB Modulo di memoria - RDIMM 2666MHz",1,"[370-ADNF]",{"$f":"\"\"","v":""},{"$f":"\"\"","v":""},{"$f":"\"\"","v":""},{"$f":"\"\"","v":""},{"$f":"\"\"","v":""},{"$f":"\"\"","v":""}]
[384,"Dell 32 GB Modulo di memoria - RDIMM 2666MHz",11,"CNV-TS1L1-32GB-U","TS1L1-32GB-U","A9781929",3443,"Dell 32 GB Modulo di memoria - RDIMM 2666MHz",1,"[370-ADNF]",{"$f":"\"\"","v":""},{"$f":"\"\"","v":""},{"$f":"\"\"","v":""},{"$f":"\"\"","v":""},{"$f":"\"\"","v":""},{"$f":"\"\"","v":""}]
[512,"Dell 32 GB Modulo di memoria - RDIMM 2666MHz",15,"CNV-TS1L1-32GB-U","TS1L1-32GB-U","A9781929",4695,"Dell 32 GB Modulo di memoria - RDIMM 2666MHz",1,"[370-ADNF]",{"$f":"\"\"","v":""},{"$f":"\"\"","v":""},{"$f":"\"\"","v":""},{"$f":"\"\"","v":""},{"$f":"\"\"","v":""},{"$f":"\"\"","v":""}]
[640,"Dell 32 GB Modulo di memoria - RDIMM 2666MHz",19,"CNV-TS1L1-32GB-U","TS1L1-32GB-U","A9781929",5947,"Dell 32 GB Modulo di memoria - RDIMM 2666MHz",1,"[370-ADNF]",{"$f":"\"\"","v":""},{"$f":"\"\"","v":""},{"$f":"\"\"","v":""},{"$f":"\"\"","v":""},{"$f":"\"\"","v":""},{"$f":"\"\"","v":""}]
[768,"Dell 32 GB Modulo di memoria - RDIMM 2666MHz",23,"CNV-TS1L1-32GB-U","TS1L1-32GB-U","A9781929",7199,"Dell 32 GB Modulo di memoria - RDIMM 2666MHz",1,"[370-ADNF]",{"$f":"\"\"","v":""},{"$f":"\"\"","v":""},{"$f":"\"\"","v":""},{"$f":"\"\"","v":""},{"$f":"\"\"","v":""},{"$f":"\"\"","v":""}]
[1024,{"$f":"\"\"","v":""},{"$f":"\"\"","v":""},{"$f":"\"\"","v":""},{"$f":"\"\"","v":""},{"$f":"\"\"","v":""},{"$f":"\"\"","v":""},{"$f":"\"\"","v":""},{"$f":"\"\"","v":""},{"$f":"\"\"","v":""},"Dell 64 GB Modulo di memoria - LRDIMM 2666MHz",16,"CNV-TS1L1-64GB-U","TS1L1-64GB-U","A9781930",{"$f":"$G$4*L31","v":9888}]
[1280,{"$f":"\"\"","v":""},{"$f":"\"\"","v":""},{"$f":"\"\"","v":""},{"$f":"\"\"","v":""},{"$f":"\"\"","v":""},{"$f":"\"\"","v":""},{"$f":"\"\"","v":""},{"$f":"\"\"","v":""},{"$f":"\"\"","v":""},"Dell 64 GB Modulo di memoria - LRDIMM 2666MHz",20,"CNV-TS1L1-64GB-U","TS1L1-64GB-U","A9781930",{"$f":"$G$4*L32","v":12360}]
[1536,{"$f":"\"\"","v":""},{"$f":"\"\"","v":""},{"$f":"\"\"","v":""},{"$f":"\"\"","v":""},{"$f":"\"\"","v":""},{"$f":"\"\"","v":""},{"$f":"\"\"","v":""},{"$f":"\"\"","v":""},{"$f":"\"\"","v":""},"Dell 64 GB Modulo di memoria - LRDIMM 2666MHz",24,"CNV-TS1L1-64GB-U","TS1L1-64GB-U","A9781930",{"$f":"$G$4*L33","v":14832}]
[]
[]
["1CPU","MEMORY B"]
[64,{"$f":"\"\"","v":""},{"$f":"\"\"","v":""},{"$f":"\"\"","v":""},{"$f":"\"\"","v":""},{"$f":"\"\"","v":""},{"$f":"\"\"","v":""},"Dell 32 GB Modulo di memoria - RDIMM 2666MHz",2,"[370-ADNF]",{"$f":"\"\"","v":""},{"$f":"\"\"","v":""},{"$f":"\"\"","v":""},{"$f":"\"\"","v":""},{"$f":"\"\"","v":""},{"$f":"\"\"","v":""}]
[128,"Dell 32 GB Modulo di memoria - RDIMM 2666MHz",2,"CNV-TS1L1-32GB-U","TS1L1-32GB-U","A9781929",{"$f":"$G$3*C38","v":626},"Dell 32 GB Modulo di memoria - RDIMM 2666MHz",2,"[370-ADNF]",{"$f":"\"\"","v":""},{"$f":"\"\"","v":""},{"$f":"\"\"","v":""},{"$f":"\"\"","v":""},{"$f":"\"\"","v":""},{"$f":"\"\"","v":""}]
[160,"Dell 32 GB Modulo di memoria - RDIMM 2666MHz",4,"CNV-TS1L1-32GB-U","TS1L1-32GB-U","A9781929",{"$f":"$G$2*C39","v":488},"Dell 32 GB Modulo di memoria - RDIMM 2666MHz",1,"[370-ADNF]",{"$f":"\"\"","v":""},{"$f":"\"\"","v":""},{"$f":"\"\"","v":""},{"$f":"\"\"","v":""},{"$f":"\"\"","v":""},{"$f":"\"\"","v":""}]
[192,"Dell 32 GB Modulo di memoria - RDIMM 2666MHz",4,"CNV-TS1L1-32GB-U","TS1L1-32GB-U","A9781929",{"$f":"$G$3*C40","v":1252},"Dell 32 GB Modulo di memoria - RDIMM 2666MHz",2,"[370-ADNF]",{"$f":"\"\"","v":""},{"$f":"\"\"","v":""},{"$f":"\"\"","v":""},{"$f":"\"\"","v":""},{"$f":"\"\"","v":""},{"$f":"\"\"","v":""}]
[256,"Dell 32 GB Modulo di memoria - RDIMM 2666MHz",6,"CNV-TS1L1-32GB-U","TS1L1-32GB-U","A9781929",1878,"Dell 32 GB Modulo di memoria - RDIMM 2666MHz",2,"[370-ADNF]",{"$f":"\"\"","v":""},{"$f":"\"\"","v":""},{"$f":"\"\"","v":""},{"$f":"\"\"","v":""},{"$f":"\"\"","v":""},{"$f":"\"\"","v":""}]
[320,"Dell 32 GB Modulo di memoria - RDIMM 2666MHz",8,"CNV-TS1L1-32GB-U","TS1L1-32GB-U","A9781929",2504,"Dell 32 GB Modulo di memoria - RDIMM 2666MHz",2,"[370-ADNF]",{"$f":"\"\"","v":""},{"$f":"\"\"","v":""},{"$f":"\"\"","v":""},{"$f":"\"\"","v":""},{"$f":"\"\"","v":""},{"$f":"\"\"","v":""}]
[384,"Dell 32 GB Modulo di memoria - RDIMM 2666MHz",10,"CNV-TS1L1-32GB-U","TS1L1-32GB-U","A9781929",3130,"Dell 32 GB Modulo di memoria - RDIMM 2666MHz",2,"[370-ADNF]",{"$f":"\"\"","v":""},{"$f":"\"\"","v":""},{"$f":"\"\"","v":""},{"$f":"\"\"","v":""},{"$f":"\"\"","v":""},{"$f":"\"\"","v":""}]
[{"$f":"64*L44","v":512},{"$f":"\"\"","v":""},{"$f":"\"\"","v":""},{"$f":"\"\"","v":""},{"$f":"\"\"","v":""},{"$f":"\"\"","v":""},{"$f":"\"\"","v":""},{"$f":"\"\"","v":""},{"$f":"\"\"","v":""},{"$f":"\"\"","v":""},"Dell 64 GB Modulo di memoria - LRDIMM 2666MHz",8,"CNV-TS1L1-64GB-U-R74","TS1L1-64GB-U","A9781930",{"$f":"$G$5*L44","v":5000}]
[{"$f":"64*L45","v":640},{"$f":"\"\"","v":""},{"$f":"\"\"","v":""},{"$f":"\"\"","v":""},{"$f":"\"\"","v":""},{"$f":"\"\"","v":""},{"$f":"\"\"","v":""},{"$f":"\"\"","v":""},{"$f":"\"\"","v":""},{"$f":"\"\"","v":""},"Dell 64 GB Modulo di memoria - LRDIMM 2666MHz",10,"CNV-TS1L1-64GB-U-R74","TS1L1-64GB-U","A9781930",{"$f":"$G$3*L45","v":3130}]
[768,{"$f":"\"\"","v":""},{"$f":"\"\"","v":""},{"$f":"\"\"","v":""},{"$f":"\"\"","v":""},{"$f":"\"\"","v":""},{"$f":"\"\"","v":""},{"$f":"\"\"","v":""},{"$f":"\"\"","v":""},{"$f":"\"\"","v":""},"Dell 64 GB Modulo di memoria - LRDIMM 2666MHz",12,"CNV-TS1L1-64GB-U-R74","TS1L1-64GB-U","A9781930",{"$f":"$G$3*L46","v":3756}]
["2CPU"]
[64,{"$f":"\"\"","v":""},{"$f":"\"\"","v":""},{"$f":"\"\"","v":""},{"$f":"\"\"","v":""},{"$f":"\"\"","v":""},{"$f":"\"\"","v":""},"Dell 32 GB Modulo di memoria - RDIMM 2666MHz",2,"[370-ADNF]",{"$f":"\"\"","v":""},{"$f":"\"\"","v":""},{"$f":"\"\"","v":""},{"$f":"\"\"","v":""},{"$f":"\"\"","v":""},{"$f":"\"\"","v":""}]
[128,"Dell 32 GB Modulo di memoria - RDIMM 2666MHz",2,"CNV-TS1L1-32GB-U","TS1L1-32GB-U","A9781929",{"$f":"$G$3*C49","v":626},"Dell 32 GB Modulo di memoria - RDIMM 2666MHz",2,"[370-ADNF]",{"$f":"\"\"","v":""},{"$f":"\"\"","v":""},{"$f":"\"\"","v":""},{"$f":"\"\"","v":""},{"$f":"\"\"","v":""},{"$f":"\"\"","v":""}]
[192,"Dell 32 GB Modulo di memoria - RDIMM 2666MHz",4,"CNV-TS1L1-32GB-U","TS1L1-32GB-U","A9781929",{"$f":"$G$3*C50","v":1252},"Dell 32 GB Modulo di memoria - RDIMM 2666MHz",2,"[370-ADNF]",{"$f":"\"\"","v":""},{"$f":"\"\"","v":""},{"$f":"\"\"","v":""},{"$f":"\"\"","v":""},{"$f":"\"\"","v":""},{"$f":"\"\"","v":""}]
[256,"Dell 32 GB Modulo di memoria - RDIMM 2666MHz",6,"CNV-TS1L1-32GB-U","TS1L1-32GB-U","A9781929",1878,"Dell 32 GB Modulo di memoria - RDIMM 2666MHz",2,"[370-ADNF]",{"$f":"\"\"","v":""},{"$f":"\"\"","v":""},{"$f":"\"\"","v":""},{"$f":"\"\"","v":""},{"$f":"\"\"","v":""},{"$f":"\"\"","v":""}]
[320,"Dell 32 GB Modulo di memoria - RDIMM 2666MHz",8,"CNV-TS1L1-32GB-U","TS1L1-32GB-U","A9781929",2504,"Dell 32 GB Modulo di memoria - RDIMM 2666MHz",2,"[370-ADNF]",{"$f":"\"\"","v":""},{"$f":"\"\"","v":""},{"$f":"\"\"","v":""},{"$f":"\"\"","v":""},{"$f":"\"\"","v":""},{"$f":"\"\"","v":""}]
[384,"Dell 32 GB Modulo di memoria - RDIMM 2666MHz",10,"CNV-TS1L1-32GB-U","TS1L1-32GB-U","A9781929",3130,"Dell 32 GB Modulo di memoria - RDIMM 2666MHz",2,"[370-ADNF]",{"$f":"\"\"","v":""},{"$f":"\"\"","v":""},{"$f":"\"\"","v":""},{"$f":"\"\"","v":""},{"$f":"\"\"","v":""},{"$f":"\"\"","v":""}]
[{"$f":"32*(C54+I54)","v":512},"Dell 32 GB Modulo di memoria - RDIMM 2666MHz",14,"CNV-TS1L1-32GB-U","TS1L1-32GB-U","A9781929",{"$f":"$G$3*C54","v":4382},"Dell 32 GB Modulo di memoria - RDIMM 2666MHz",2,"[370-ADNF]",{"$f":"\"\"","v":""},{"$f":"\"\"","v":""},{"$f":"\"\"","v":""},{"$f":"\"\"","v":""},{"$f":"\"\"","v":""},{"$f":"\"\"","v":""}]
[{"$f":"32*(C55+I55)","v":640},"Dell 32 GB Modulo di memoria - RDIMM 2666MHz",18,"CNV-TS1L1-32GB-U","TS1L1-32GB-U","A9781929",{"$f":"$G$3*C55","v":5634},"Dell 32 GB Modulo di memoria - RDIMM 2666MHz",2,"[370-ADNF]",{"$f":"\"\"","v":""},{"$f":"\"\"","v":""},{"$f":"\"\"","v":""},{"$f":"\"\"","v":""},{"$f":"\"\"","v":""},{"$f":"\"\"","v":""}]
[{"$f":"32*(C56+I56)","v":768},"Dell 32 GB Modulo di memoria - RDIMM 2666MHz",22,"CNV-TS1L1-32GB-U","TS1L1-32GB-U","A9781929",{"$f":"$G$3*C56","v":6886},"Dell 32 GB Modulo di memoria - RDIMM 2666MHz",2,"[370-ADNF]",{"$f":"\"\"","v":""},{"$f":"\"\"","v":""},{"$f":"\"\"","v":""},{"$f":"\"\"","v":""},{"$f":"\"\"","v":""},{"$f":"\"\"","v":""}]
[{"$f":"64*L57","v":1024},{"$f":"\"\"","v":""},{"$f":"\"\"","v":""},{"$f":"\"\"","v":""},{"$f":"\"\"","v":""},{"$f":"\"\"","v":""},{"$f":"\"\"","v":""},{"$f":"\"\"","v":""},{"$f":"\"\"","v":""},{"$f":"\"\"","v":""},"Dell 64 GB Modulo di memoria - LRDIMM 2666MHz",16,"CNV-TS1L1-64GB-U-R74","TS1L1-64GB-U","A9781930",{"$f":"$G$5*L57","v":10000}]
[{"$f":"64*L58","v":1280},{"$f":"\"\"","v":""},{"$f":"\"\"","v":""},{"$f":"\"\"","v":""},{"$f":"\"\"","v":""},{"$f":"\"\"","v":""},{"$f":"\"\"","v":""},{"$f":"\"\"","v":""},{"$f":"\"\"","v":""},{"$f":"\"\"","v":""},"Dell 64 GB Modulo di memoria - LRDIMM 2666MHz",20,"CNV-TS1L1-64GB-U-R74","TS1L1-64GB-U","A9781930",{"$f":"$G$5*L58","v":12500}]
[1536,{"$f":"\"\"","v":""},{"$f":"\"\"","v":""},{"$f":"\"\"","v":""},{"$f":"\"\"","v":""},{"$f":"\"\"","v":""},{"$f":"\"\"","v":""},{"$f":"\"\"","v":""},{"$f":"\"\"","v":""},{"$f":"\"\"","v":""},"Dell 64 GB Modulo di memoria - LRDIMM 2666MHz",24,"CNV-TS1L1-64GB-U-R74","TS1L1-64GB-U","A9781930",{"$f":"$G$5*L59","v":15000}]
[]
[]
["1CPU","MEMORY C"]
[64,{"$f":"\"\"","v":""},{"$f":"\"\"","v":""},{"$f":"\"\"","v":""},{"$f":"\"\"","v":""},{"$f":"\"\"","v":""},{"$f":"\"\"","v":""},"Dell 32 GB Modulo di memoria - RDIMM 2666MHz",2,"[370-ADNF]",{"$f":"\"\"","v":""},{"$f":"\"\"","v":""},{"$f":"\"\"","v":""},{"$f":"\"\"","v":""},{"$f":"\"\"","v":""},{"$f":"\"\"","v":""}]
[128,"Dell 32 GB Modulo di memoria - RDIMM 2666MHz",2,"CNV-TS1L1-32GB-U","TS1L1-32GB-U","A9781929",{"$f":"$G$3*C64","v":626},"Dell 32 GB Modulo di memoria - RDIMM 2666MHz",2,"[370-ADNF]",{"$f":"\"\"","v":""},{"$f":"\"\"","v":""},{"$f":"\"\"","v":""},{"$f":"\"\"","v":""},{"$f":"\"\"","v":""},{"$f":"\"\"","v":""}]
[160,"Dell 32 GB Modulo di memoria - RDIMM 2666MHz",4,"CNV-TS1L1-32GB-U","TS1L1-32GB-U","A9781929",{"$f":"$G$2*C65","v":488},"Dell 32 GB Modulo di memoria - RDIMM 2666MHz",1,"[370-ADNF]",{"$f":"\"\"","v":""},{"$f":"\"\"","v":""},{"$f":"\"\"","v":""},{"$f":"\"\"","v":""},{"$f":"\"\"","v":""},{"$f":"\"\"","v":""}]
[192,"Dell 32 GB Modulo di memoria - RDIMM 2666MHz",4,"CNV-TS1L1-32GB-U","TS1L1-32GB-U","A9781929",{"$f":"$G$3*C66","v":1252},"Dell 32 GB Modulo di memoria - RDIMM 2666MHz",2,"[370-ADNF]",{"$f":"\"\"","v":""},{"$f":"\"\"","v":""},{"$f":"\"\"","v":""},{"$f":"\"\"","v":""},{"$f":"\"\"","v":""},{"$f":"\"\"","v":""}]
[256,"Dell 32 GB Modulo di memoria - RDIMM 2666MHz",6,"CNV-TS1L1-32GB-U","TS1L1-32GB-U","A9781929",1878,"Dell 32 GB Modulo di memoria - RDIMM 2666MHz",2,"[370-ADNF]",{"$f":"\"\"","v":""},{"$f":"\"\"","v":""},{"$f":"\"\"","v":""},{"$f":"\"\"","v":""},{"$f":"\"\"","v":""},{"$f":"\"\"","v":""}]
[320,"Dell 32 GB Modulo di memoria - RDIMM 2666MHz",8,"CNV-TS1L1-32GB-U","TS1L1-32GB-U","A9781929",2504,"Dell 32 GB Modulo di memoria - RDIMM 2666MHz",2,"[370-ADNF]",{"$f":"\"\"","v":""},{"$f":"\"\"","v":""},{"$f":"\"\"","v":""},{"$f":"\"\"","v":""},{"$f":"\"\"","v":""},{"$f":"\"\"","v":""}]
[384,"Dell 32 GB Modulo di memoria - RDIMM 2666MHz",10,"CNV-TS1L1-32GB-U","TS1L1-32GB-U","A9781929",3130,"Dell 32 GB Modulo di memoria - RDIMM 2666MHz",2,"[370-ADNF]",{"$f":"\"\"","v":""},{"$f":"\"\"","v":""},{"$f":"\"\"","v":""},{"$f":"\"\"","v":""},{"$f":"\"\"","v":""},{"$f":"\"\"","v":""}]
[{"$f":"64*L70","v":512},{"$f":"\"\"","v":""},{"$f":"\"\"","v":""},{"$f":"\"\"","v":""},{"$f":"\"\"","v":""},{"$f":"\"\"","v":""},{"$f":"\"\"","v":""},{"$f":"\"\"","v":""},{"$f":"\"\"","v":""},{"$f":"\"\"","v":""},"Dell 64 GB Modulo di memoria - LRDIMM 2666MHz",8,"CNV-TS1L1-64GB-U","TS1L1-64GB-U","A9781930",{"$f":"$G$5*L70","v":5000}]
[{"$f":"64*L71","v":640},{"$f":"\"\"","v":""},{"$f":"\"\"","v":""},{"$f":"\"\"","v":""},{"$f":"\"\"","v":""},{"$f":"\"\"","v":""},{"$f":"\"\"","v":""},{"$f":"\"\"","v":""},{"$f":"\"\"","v":""},{"$f":"\"\"","v":""},"Dell 64 GB Modulo di memoria - LRDIMM 2666MHz",10,"CNV-TS1L1-64GB-U","TS1L1-64GB-U","A9781930",{"$f":"$G$3*L71","v":3130}]
[768,{"$f":"\"\"","v":""},{"$f":"\"\"","v":""},{"$f":"\"\"","v":""},{"$f":"\"\"","v":""},{"$f":"\"\"","v":""},{"$f":"\"\"","v":""},{"$f":"\"\"","v":""},{"$f":"\"\"","v":""},{"$f":"\"\"","v":""},"Dell 64 GB Modulo di memoria - LRDIMM 2666MHz",12,"CNV-TS1L1-64GB-U","TS1L1-64GB-U","A9781930",{"$f":"$G$3*L72","v":3756}]
["2CPU"]
[64,{"$f":"\"\"","v":""},{"$f":"\"\"","v":""},{"$f":"\"\"","v":""},{"$f":"\"\"","v":""},{"$f":"\"\"","v":""},{"$f":"\"\"","v":""},"Dell 32 GB Modulo di memoria - RDIMM 2666MHz",2,"[370-ADNF]",{"$f":"\"\"","v":""},{"$f":"\"\"","v":""},{"$f":"\"\"","v":""},{"$f":"\"\"","v":""},{"$f":"\"\"","v":""},{"$f":"\"\"","v":""}]
[128,"Dell 32 GB Modulo di memoria - RDIMM 2666MHz",2,"CNV-TS1L1-32GB-U","TS1L1-32GB-U","A9781929",{"$f":"$G$3*C75","v":626},"Dell 32 GB Modulo di memoria - RDIMM 2666MHz",2,"[370-ADNF]",{"$f":"\"\"","v":""},{"$f":"\"\"","v":""},{"$f":"\"\"","v":""},{"$f":"\"\"","v":""},{"$f":"\"\"","v":""},{"$f":"\"\"","v":""}]
[192,"Dell 32 GB Modulo di memoria - RDIMM 2666MHz",4,"CNV-TS1L1-32GB-U","TS1L1-32GB-U","A9781929",{"$f":"$G$3*C76","v":1252},"Dell 32 GB Modulo di memoria - RDIMM 2666MHz",2,"[370-ADNF]",{"$f":"\"\"","v":""},{"$f":"\"\"","v":""},{"$f":"\"\"","v":""},{"$f":"\"\"","v":""},{"$f":"\"\"","v":""},{"$f":"\"\"","v":""}]
[256,"Dell 32 GB Modulo di memoria - RDIMM 2666MHz",6,"CNV-TS1L1-32GB-U","TS1L1-32GB-U","A9781929",1878,"Dell 32 GB Modulo di memoria - RDIMM 2666MHz",2,"[370-ADNF]",{"$f":"\"\"","v":""},{"$f":"\"\"","v":""},{"$f":"\"\"","v":""},{"$f":"\"\"","v":""},{"$f":"\"\"","v":""},{"$f":"\"\"","v":""}]
[320,"Dell 32 GB Modulo di memoria - RDIMM 2666MHz",8,"CNV-TS1L1-32GB-U","TS1L1-32GB-U","A9781929",2504,"Dell 32 GB Modulo di memoria - RDIMM 2666MHz",2,"[370-ADNF]",{"$f":"\"\"","v":""},{"$f":"\"\"","v":""},{"$f":"\"\"","v":""},{"$f":"\"\"","v":""},{"$f":"\"\"","v":""},{"$f":"\"\"","v":""}]
[384,"Dell 32 GB Modulo di memoria - RDIMM 2666MHz",10,"CNV-TS1L1-32GB-U","TS1L1-32GB-U","A9781929",3130,"Dell 32 GB Modulo di memoria - RDIMM 2666MHz",2,"[370-ADNF]",{"$f":"\"\"","v":""},{"$f":"\"\"","v":""},{"$f":"\"\"","v":""},{"$f":"\"\"","v":""},{"$f":"\"\"","v":""},{"$f":"\"\"","v":""}]
[{"$f":"32*(C80+I80)","v":512},"Dell 32 GB Modulo di memoria - RDIMM 2666MHz",14,"CNV-TS1L1-32GB-U","TS1L1-32GB-U","A9781929",4382,"Dell 32 GB Modulo di memoria - RDIMM 2666MHz",2,"[370-ADNF]",{"$f":"\"\"","v":""},{"$f":"\"\"","v":""},{"$f":"\"\"","v":""},{"$f":"\"\"","v":""},{"$f":"\"\"","v":""},{"$f":"\"\"","v":""}]
[{"$f":"32*(C81+I81)","v":640},"Dell 32 GB Modulo di memoria - RDIMM 2666MHz",18,"CNV-TS1L1-32GB-U","TS1L1-32GB-U","A9781929",5634,"Dell 32 GB Modulo di memoria - RDIMM 2666MHz",2,"[370-ADNF]",{"$f":"\"\"","v":""},{"$f":"\"\"","v":""},{"$f":"\"\"","v":""},{"$f":"\"\"","v":""},{"$f":"\"\"","v":""},{"$f":"\"\"","v":""}]
[{"$f":"32*(C82+I82)","v":768},"Dell 32 GB Modulo di memoria - RDIMM 2666MHz",22,"CNV-TS1L1-32GB-U","TS1L1-32GB-U","A9781929",6886,"Dell 32 GB Modulo di memoria - RDIMM 2666MHz",2,"[370-ADNF]",{"$f":"\"\"","v":""},{"$f":"\"\"","v":""},{"$f":"\"\"","v":""},{"$f":"\"\"","v":""},{"$f":"\"\"","v":""},{"$f":"\"\"","v":""}]
[{"$f":"64*L83","v":1024},{"$f":"\"\"","v":""},{"$f":"\"\"","v":""},{"$f":"\"\"","v":""},{"$f":"\"\"","v":""},{"$f":"\"\"","v":""},{"$f":"\"\"","v":""},{"$f":"\"\"","v":""},{"$f":"\"\"","v":""},{"$f":"\"\"","v":""},"Dell 64 GB Modulo di memoria - LRDIMM 2666MHz",16,"CNV-TS1L1-64GB-U","TS1L1-64GB-U","A9781930",{"$f":"$G$5*L83","v":10000}]
[{"$f":"64*L84","v":1280},{"$f":"\"\"","v":""},{"$f":"\"\"","v":""},{"$f":"\"\"","v":""},{"$f":"\"\"","v":""},{"$f":"\"\"","v":""},{"$f":"\"\"","v":""},{"$f":"\"\"","v":""},{"$f":"\"\"","v":""},{"$f":"\"\"","v":""},"Dell 64 GB Modulo di memoria - LRDIMM 2666MHz",20,"CNV-TS1L1-64GB-U","TS1L1-64GB-U","A9781930",{"$f":"$G$5*L84","v":12500}]
[1536,{"$f":"\"\"","v":""},{"$f":"\"\"","v":""},{"$f":"\"\"","v":""},{"$f":"\"\"","v":""},{"$f":"\"\"","v":""},{"$f":"\"\"","v":""},{"$f":"\"\"","v":""},{"$f":"\"\"","v":""},{"$f":"\"\"","v":""},"Dell 64 GB Modulo di memoria - LRDIMM 2666MHz",24,"CNV-TS1L1-64GB-U","TS1L1-64GB-U","A9781930",{"$f":"$G$5*L85","v":15000}]

{"sheet":"Processor","index":17,"n_rows":46,"n_cols":16,"rows_kept":46,"cut":false,"hidden":true,"merged":[[33,1,33,3]]}
[null,null,"CNV-TS1L1-CPU-R640","Intel Xeon Silver 4114",null,"Upgrade Processore per R640",null,null,null,null,null,"TS1L1-CPU-R640",null,null,728]
[null,null,"CNV-TS1L1-CPU-T640R","Intel Xeon Silver 4114",null,"Upgrade Processore per T640 rack",null,null,null,null,null,"TS1L1-CPU-T640R",null,null,728]
[null,null,"CNV-TS1L1-CPU-R740","Intel Gold 5120",null,"Upgrade Processore per R740",null,null,null,null,null,"TS1L1-CPU-R740",null,null,1307]
[null,null,"CNV-TS1L1-CPU-R740XD","Intel Gold 5120",null,"Upgrade Processore per R740xd",null,null,null,null,null,"TS1L1-CPU-R740X",null,null,1307]
[null,null,"CNV-TS1L1-CPU-T640","Intel Xeon Silver 4114",null,"Upgrade Processore per T640 base",null,null,null,null,null,"TS1L1-CPU-T640",null,null,650]
[null,null,"CNV-TS1L1-CPU-T640P","Intel Xeon Silver 4116",null,"Upgrade Processore per T640 prestazionale",null,null,null,null,null,"TS1L1-CPU-T640P",null,null,917]
[]
["Additional Processor"]
["Server R630",null,"CPU-A"]
["No Additional Processor",0,{"$f":"\"\"","v":""},null,"[374-BBBX]",{"$f":"\"\"","v":""},{"$f":"\"\"","v":""},{"$f":"\"\"","v":""},null,null,null,"5 Standard Fans for R640",1,"[384-BBPR]"]
["Intel Xeon Silver 4114 2.2G, 10C/20T, 9.6GT/s 2UPI, 14M Cache, Turbo, HT (85W)",1,"CNV-TS1L1-CPU-R640","TS1L1-CPU-R640","338-BLTV","Heat sink for PowerEdge R640 for CPUs up to 165W",1,"412-AAMF",null,null,null,"8 Standard Fans for R640",1,"[384-BBPR][384-BBQF]",728]
[]
["Server R740xd",null,"CPU-B"]
["No Additional Processor",0,{"$f":"\"\"","v":""},null,"[374-BBBX]",{"$f":"\"\"","v":""},{"$f":"\"\"","v":""},{"$f":"\"\"","v":""},"4 Standard Fans for R740/740XD",1,"[384-BBQB]","Riser Config 1, 4 x8 slots",1,"[330-BBGZ]",null,{"$f":"\"\"","v":""}]
["Intel Xeon Gold 5120 2.2G, 14C/28T, 10.4GT/s, 19M Cache, Turbo, HT (105W)",1,"CNV-TS1L1-CPU-R740XD","TS1L1-CPU-R740X","338-BLUB","Heat Sink for R740/R740XD,125W or lower CPU",1,"412-AAMC","6 Standard Fans for R740/740XD",1,"[384-BBQB] [384-BBSD]","Riser Config 5, 6 x8, 2 x16 slots",1,"[330-BBGZ][330-BBLT][330-BBLS]",1307]
[]
["Server R740",null,"CPU-B.1"]
["No Additional Processor",0,{"$f":"\"\"","v":""},null,"[374-BBBX]",{"$f":"\"\"","v":""},{"$f":"\"\"","v":""},{"$f":"\"\"","v":""},"4 Standard Fans for R740/740XD",1,"[384-BBQB]","Riser Config 1, 4 x8 slots",1,"[330-BBGZ]",null,{"$f":"\"\"","v":""}]
["Intel Xeon Gold 5120 2.2G, 14C/28T, 10.4GT/s, 19M Cache, Turbo, HT (105W)",1,"CNV-TS1L1-CPU-R740","TS1L1-CPU-R740","338-BLUB","Heat Sink for R740/R740XD,125W or lower CPU",1,"412-AAMC","6 Standard Fans for R740/740XD",1,"[384-BBQB] [384-BBSD]","Riser Config 5, 6 x8, 2 x16 slots",1,"[330-BBGZ][330-BBLT][330-BBLS]",1307]
[]
["Server T640 Rack",null,"CPU-C"]
["No Additional Processor",0,{"$f":"\"\"","v":""},null,"[374-BBBX]",{"$f":"\"\"","v":""},{"$f":"\"\"","v":""},{"$f":"\"\"","v":""},null,null,null,null,null,null,null,{"$f":"\"\"","v":""}]
["Intel Xeon Silver 4114 2.2G, 10C/20T, 9.6GT/s 2UPI, 14M Cache, Turbo, HT (85W)",1,"CNV-TS1L1-CPU-T640R","TS1L1-CPU-T640R","338-BLTV","Heat Sink, T640/440, EMEA",1,"412-AAMS",null,null,null,null,null,null,728]
[]
["Server T640 Tower Base",null,"CPU-D"]
["No Additional Processor",0,{"$f":"\"\"","v":""},null,"[374-BBBX]",{"$f":"\"\"","v":""},{"$f":"\"\"","v":""},{"$f":"\"\"","v":""},null,null,null,null,null,null,null,{"$f":"\"\"","v":""}]
["Intel Xeon Silver 4114 2.2G, 10C/20T, 9.6GT/s 2UPI, 14M Cache, Turbo, HT (85W)",1,"CNV-TS1L1-CPU-T640","TS1L1-CPU-T640","338-BLTV","Heat Sink, T640/440, EMEA",1,"412-AAMS",null,null,null,null,null,null,650]
[]
["Server T640 Tower Prestazionale",null,"CPU-E"]
["No Additional Processor",0,{"$f":"\"\"","v":""},null,"[374-BBBX]",{"$f":"\"\"","v":""},{"$f":"\"\"","v":""},{"$f":"\"\"","v":""},null,null,null,null,null,null,null,{"$f":"\"\"","v":""}]
["Intel Xeon Silver 4116 2.1G, 12C/24T, 9.6GT/s , 16.5M Cache, Turbo, HT (85W)",1,"CNV-TS1L1-CPU-T640P","TS1L1-CPU-T640P","338-BLTW","Heat Sink, T640/440, EMEA",1,"412-AAMS",null,null,null,null,null,null,917]
[]
[]
["Processore"]
["Intel Xeon E5-2640 v4 2.4GHz 25M Cache 8.0GT/s QPI Turbo HT 10C/20T (90W) Max Mem 2133MHz",1,{"$f":"\"\"","v":""},{"$f":"\"\"","v":""},"[338-BJDL]"]
[]
[]
["Intel Xeon E5-2643 v4 3.4GHz,20M Cache,9.60GT/s QPI,Turbo,HT,6C/12T (135W) Max Mem 2400MHz,processor only,Cust Kit",1,{"$f":"CONCATENATE(\"TS1-L1-\",E38)","v":"TS1-L1-338-BJFF"},"TS1-L1-338-BJFF","338-BJFF",2629.99]
["Intel Xeon E5-2697 v4 2.3GHz,45M Cache,9.60GT/s QPI,Turbo,HT,18C/36T (145W) Max Mem 2400MHz,processor only, Cust Kit",1,{"$f":"CONCATENATE(\"TS1-L1-\",E39)","v":"TS1-L1-338-BJES"},"TS1-L1-338-BJES","338-BJES",4574.99]
[]
[]
["Intel Xeon E5-2643 v4 3.4GHz,20M Cache,9.60GT/s QPI,Turbo,HT,6C/12T (135W) Max Mem 2400MHz,processor only,Cust Kit",1,{"$f":"CONCATENATE(\"TS1-L1-\",E42)","v":"TS1-L1-338-BJFF"},"TS1-L1-338-BJFF","338-BJFF","Kit - 120W Heatsink for PowerEdge R630",1,"[412-AAFB]",null,null,null,"R630 PCIe Riser for up to 2, x16 PCIe Slots for x8, 2 PCIe Chassis with 2 Processors,CusKit",1,"[330-BBCM]",null,2629.99]
["Intel Xeon E5-2697 v4 2.3GHz,45M Cache,9.60GT/s QPI,Turbo,HT,18C/36T (145W) Max Mem 2400MHz,processor only, Cust Kit",1,{"$f":"CONCATENATE(\"TS1-L1-\",E43)","v":"TS1-L1-338-BJES"},"TS1-L1-338-BJES","338-BJES","Kit - 120W Heatsink for PowerEdge R630",1,"[412-AAFB]",null,null,null,"R630 PCIe Riser for up to 2, x16 PCIe Slots for x8, 2 PCIe Chassis with 2 Processors,CusKit",1,"[330-BBCM]",null,4574.99]
[]
[]
["Aggiungere Secondo Processore"]

{"sheet":"Codici","index":18,"n_rows":242,"n_cols":21,"rows_kept":242,"cut":false,"hidden":true,"merged":[[19,0,20,0],[19,1,20,1],[19,2,20,2],[15,0,16,0],[15,1,16,1],[15,2,16,2],[17,0,18,0],[17,1,18,1],[17,2,18,2],[216,1,217,1],[216,0,217,0],[21,0,22,0],[21,1,22,1],[21,2,22,2],[150,1,153,1],[131,0,132,0],[131,1,132,1],[150,2,153,2],[66,1,69,1],[66,2,69,2],[236,1,239,1],[236,2,239,2],[228,0,230,0],[228,1,230,1],[228,2,230,2],[45,10,46,10],[45,11,46,11],[41,6,44,6],[33,6,35,6],[33,7,35,7],[33,8,35,8],[33,9,35,9],[33,10,35,10],[33,11,35,11],[41,7,42,7],[41,8,42,8],[41,9,42,9],[39,6,40,6],[45,6,48,6],[47,7,48,7],[47,8,48,8],[45,20,46,20],[45,7,46,7],[45,8,46,8],[45,9,46,9],[1,11,24,11],[1,12,24,12],[1,19,24,19],[1,20,24,20],[43,9,44,9],[33,12,35,12],[33,19,35,19],[33,20,35,20],[43,10,44,10],[43,11,44,11],[43,12,44,12],[43,19,44,19],[41,11,42,11],[1,6,24,6],[1,7,24,7],[1,8,24,8],[1,9,24,9],[1,10,24,10],[43,7,44,7],[43,8,44,8],[51,6,52,6],[43,20,44,20],[41,10,42,10],[41,12,42,12],[41,19,42,19],[41,20,42,20],[47,20,48,20],[47,9,48,9],[47,10,48,10],[47,11,48,11],[47,12,48,12],[47,19,48,19],[45,12,46,12],[45,19,46,19]]}
["Codici",null,null,null,null,null,null,"CODICE CONVERGE",null,"CODICE CONVENZIONE",null,"Nr. Offerta","Version",null,"Product Number","Description","Qty","Prezzo Listino","Offering","TOTAL Offering","Prezzo CONSIP"]
["TS1L1-R630","Rack Base",1720,1,"Server DELL EMC PowerEdge R630, 1U, 1 x Intel Xeon E5-2640 v4, RAM 32GB, 2 x HDD 300GB 10k 2.5\"",null,null,"TS1L1-R630",{"$f":"LEN(H2)","v":10},"TS1L1-R630",{"$f":"LEN(J2)","v":10},15900100,12,null,null,null,1,5608,null,{"$f":"SUMPRODUCT(Q2:Q25,S2:S25)","v":0},1720]
["CNV-TS1L1-R640","Rack Base",1720,1,"Server DELL EMC PowerEdge R640, 1U, 1 x Intel Xeon Silver 4114, RAM 32GB, 2 x HDD 600GB 10k 2.5\""]
[]
["CNV-TS1L1-CPU-R640","Opz1P",728,1,"Intel Xeon Processor Silver 4114\n[Intel Xeon Silver 4114 2.2G, 10C/20T, 9.6GT/s 2UPI, 14M Cache, Turbo, HT (85W)]"]
["CNV-TS1L1-WIN1","OpzWinServ1",598,1,"Windows Server 2016,Standard,ROK,16CORE (for Distributor sale only)"]
["CNV-TS1L1-CALDEV","OpzDeviceCal",22,1,"1-pack of Windows Server 2016,2012 Device CALs (Standard or Datacenter),CUS"]
["CNV-TS1L1-CALUSER","OpzUserCal",25,1,"1-pack of Windows Server 2016,2012 User CALs (Standard or Datacenter),CUS"]
["CNV-TS1L1-WIN2CORE","OpzWinServ 2 core",75,null,"Windows Server 2016 Standard Ed, Additional Lic,ROK,2CORE"]
["CNV-TS1L1-LINUX","OpzOpenSource",47,null,"DVD Linux Centos 7.x"]
["CNV-TS1L1-16GB-U","OpzRam16",122,1,"Kit Upgrade Ram 16GB"]
["CNV-TS1L1-32GB-U","OpzRam32",313,1,"Kit Upgrade Ram 32GB"]
["CNV-TS1L1-64GB-U","OpzRam64",618,1,"Kit Upgrade Ram 64GB"]
["CNV-TS1L1-1GB-L","OpzGigabit",35,1,"Scheda Lan Gigabit Low\n(Broadcom 5720 DP 1Gb Network Interface Card, Low Profile,CusKit)"]
["CNV-TS1L1-1GB","OpzGigabit",35,1,"Scheda Lan Gigabit Full\n(Broadcom 5720 DP 1Gb Network Interface Card,Full Height,CusKit)"]
["CNV-TS1L1-10GB-L","OpzGigabit 10GB",147,1,"QLogic 57810 Dual Port 10Gb Low\n(QLogic 57810 Dual Port 10Gb Direct Attach/SFP+ Low Profile Network Adapter,CusKit)"]
[null,null,null,2,"PowerEdge SFP+, 10GbE SR/SX, Optical Tranceiver, LC Connector, for Intel and Broadcom,CusKit"]
["CNV-TS1L1-10GB","OpzGigabit 10GB",147,1,"QLogic 57810 Dual Port 10Gb Full\n(QLogic 57810 Dual Port 10Gb Direct Attach/SFP+ Network Adapter,Full Height,CusKit)"]
[null,null,null,2,"PowerEdge SFP+, 10GbE SR/SX, Optical Tranceiver, LC Connector, for Intel and Broadcom,CusKit"]
["CNV-TS1L1-CNA-L","OpzGigabit 10GB CNA",147,1,"QLogic 57810 Dual Port 10Gb CNA Low\n(QLogic 57810 Dual Port 10Gb Direct Attach/SFP+ (CNA), Low Profile,CusKit)"]
[null,null,null,2,"PowerEdge SFP+, 10GbE SR/SX, Optical Tranceiver, LC Connector, for Intel and Broadcom,CusKit"]
["CNV-TS1L1-CNA","OpzGigabit 10GB CNA",147,1,"QLogic 57810 DualPort 10GbCNA Full\n(QLogic 57810 Dual Port 10Gb Direct Attach/SFP+ (CNA),Full Height,CusKit)"]
[null,null,null,2,"PowerEdge SFP+, 10GbE SR/SX, Optical Tranceiver, LC Connector, for Intel and Broadcom,CusKit"]
["CNV-S1-540-BBIU","Opz10Gb BaseT",248,1,"QLogic 57810 Dual Port 10Gb Base-T, Low Profile"]
["CNV-TS1L1-FC","OpzFibreChannel",311,1,"QLogic 2560 SP Full\n(QLogic 2560, Single Port 8Gb Optical Fibre Channel HBA,Full Height,CusKit)",null,null,null,null,null,null,null,null,null,null,"Cavi di rete"]
["CNV-TS1L1-FC-L","OpzFibreChannel",311,1,"QLogic 2560 SP Low\n(QLogic 2560, Single Port 8Gb Optical Fibre Channel HBA,Low Profile,CusKit)",null,"R630","CODICE CONVERGE",null,"CODICE CONVENZIONE",null,null,null,null,"Product Number","Description","Qty","Prezzo Listino","Offering","TOTAL Offering","Prezzo CONSIP"]
["CNV-TS1L1-4Y-R640","OpzEstensione12",42,1,"Estensione della manutenzione in garanzia per ulteriori 12 mesi",null,"OpzUserCal","TS1L1-CALUSER",{"$f":"LEN(H27)","v":13},"TS1L1-CALUSER-R630",{"$f":"LEN(J27)","v":18},15902257,11,null,"623-BBCC","1-pack of Windows Server 2016,2012 User CALs (Standard or Datacenter),CUS",1,57,null,{"$f":"S27*Q27","v":0},25]
["CNV-TS1L1-5Y-R640","OpzEstensione24",85,1,"Estensione della manutenzione in garanzia per ulteriori 24 mesi",null,null,null,null,null,null,15911903,5,null,"623-BBBY","5-pack of Windows Server 2016 USER CALs (Standard or Datacenter),CUS",null,125]
["CNV-TS1L1-HD600","OpzStorage300",120,1,"HDD 600GB SAS\n(600GB 10K RPM SAS 12Gbps 2.5in Hot-plug Hard Drive)",null,"OpzWinServ 2 core","TS1L1-WIN2CORE",{"$f":"LEN(H29)","v":14},"TS1L1-WIN2CORE-R630",19,15902257,11,null,"634-BJQW","Windows Server 2016 Standard Ed, Additional Lic,ROK,2CORE",1,83,null,0,75]
["CNV-TS1L1-HD1200-U","OpzStorage1Tb",212,1,"HDD 1.2TB SAS\n(1.2TB 10K RPM SAS 12Gbps 2.5in Hot-plug Hard Drive,CusKit)",null,"OpzOpenSource","TS1L1-LINUX",{"$f":"LEN(H30)","v":11},"TS1L1-LINUX-R630",16,null,null,null,null,null,null,null,null,0,47]
["CNV-TS1L1-HD1800-U","OpzStorage2Tb",236,1,"1.8TB 10K RPM SAS 12Gbps 512e 2.5in Hot-plug"]
["CNV-TS1L1-SSD800-U","OpzStorageSSD800",748,1,"960GB SSD SAS Mix Use  512n 2.5in Hot-plug"]
["CNV-TS1L1-SSD1920-U","OpzStorageSSD1,6TB",1795,1,"1.92TB SSD SAS Mix Use 12Gbps 512n 2.5in Hot-plug"]
["CNV-S1-IDSDMCCR","Opz IDSDMCCR",82,1,"ISDM and Combo Card Reader, with 2 16Gb microSDHC/SDXC Card",null,"Opz1P","TS1L1-CPU-R630",{"$f":"LEN(H34)","v":14},"TS1L1-CPU-R630",14,15902257,11,null,"338-BJET","Intel Xeon E5-2640 v4 2.4GHz,25M Cache,8.0GT/s QPI,Turbo,HT,10C/20T (90W) Max Mem 2133MHz,processor only,Cust Kit",1,1262.99,null,{"$f":"SUMPRODUCT(Q34:Q36,S34:S36)","v":0},728]
["CNV-S1-406-BBEL","OpzFibreChannelDP",810,1,"QLogic 2562 DP Low\n(QLogic 2560, Dual Port 8Gb Optical Fibre Channel HBA,Low Profile)",null,null,null,null,null,null,null,null,null,"412-AAFB","Kit - 120W Heatsink for PowerEdge R630",1,59.99]
["CNV-1UBezelSTD","Opz BezelStandard",25,1,"PowerEdge 1U Standard Bezel",null,null,null,{"$f":"LEN(H36)","v":0},null,0,null,null,null,"330-BBCM","R630 PCIe Riser for up to 2, x16 PCIe Slots for x8, 2 PCIe Chassis with 2 Processors,CusKit",1,29.99]
["CNV-1UBezelLCD","Opz BezelLCD",50,1,"PowerEdge 1U LCD Bezel",null,"OpzRam16","TS1L1-16GB",10,"TS1L1-16GB-R630",15,15902257,11,null,"A8711887","Dell 16 GB Modulo di memoria da determinati - 2RX8 RDIMM 2400MHz",1,333.74,null,{"$f":"S37*Q37","v":0},122]
["CNV-1UCMA","Opz CMA 1U",38,1,"Cable Management Arm 1U",null,"OpzRam32","TS1L1-32GB",10,"TS1L1-32GB-R630",15,15902257,11,null,"A8711888","Dell 32 GB Modulo di memoria da determinati - 2Rx4 DDR4 RDIMM 2400MHz",1,660.28,null,{"$f":"S38*Q38","v":0},313]
["CNV-S1-540-BBIU","Opz10Gb BaseT",248,1,"QLogic 57810 Dual Port 10Gb Base-T Low Profile Network Adapter,CusKit",null,"OpzRam64","TS1L1-64GB",10,"TS1L1-64GB-R630",15,15902257,11,null,"A8711890","Dell 64 GB Modulo di memoria da determinati - 4RX4 DDR4 LRDIMM 2400MHz",1,1464.62,null,{"$f":"S39*Q39","v":0},618]
["CNV-S1-405-AANN","Opz H840",479,1,"PERC H840 RAID Adapter for External MD14XX Only, 2GB NV Cache, Low Profile",null,"OpzGigabit","TS1L1-1GB",9,"TS1L1-1GB-R630",14,15902257,11,null,"540-BBGY","Broadcom 5720 DP 1Gb Network Interface Card,Full Height,CusKit",1,189.99,null,{"$f":"S40*Q40","v":0},35]
[null,null,null,null,null,null,null,"TS1L1-1GB-L",11,"TS1L1-1GB-L-R630",16,15902257,11,null,"540-BBGW","Broadcom 5720 DP 1Gb Network Interface Card, Low Profile,CusKit",1,175.99,null,{"$f":"S41*Q41","v":0},35]
[null,null,null,null,null,null,"OpzGigabit 10 GBs","TS1L1-10GB",10,"TS1L1-10GB-R630",{"$f":"LEN(J42)","v":15},15902257,11,null,"540-BBGS","QLogic 57810 Dual Port 10Gb Direct Attach/SFP+ Network Adapter,Full Height,CusKit",1,497.99,null,{"$f":"SUMPRODUCT(Q42:Q43,S42:S43)","v":0},147]
[null,null,null,null,null,null,null,null,null,null,null,15902257,11,null,"407-BBRM","SFP+, Short Range, Optical Transceiver, LC Connector, 10Gb compatible with QLogic 578xx Series, Cuskit",2,169.99]
[null,null,null,null,null,null,null,"TS1L1-10GB-L",{"$f":"LEN(H44)","v":12},"TS1L1-10GB-L-R630",{"$f":"LEN(J44)","v":17},15902257,11,null,"540-BBDX","QLogic 57810 Dual Port 10Gb Direct Attach/SFP+ Low Profile Network Adapter,CusKit",1,497.99,null,{"$f":"SUMPRODUCT(Q44:Q45,S44:S45)","v":0},147]
[null,null,null,null,null,null,null,null,null,null,null,15902257,11,null,"407-BBRM","SFP+, Short Range, Optical Transceiver, LC Connector, 10Gb compatible with QLogic 578xx Series, Cuskit",2,169.99]
[null,null,null,null,null,null,"OpzGigabit 10 GBs CNA","TS1L1-CNA",{"$f":"LEN(H46)","v":9},"TS1L1-CNA-R630",{"$f":"LEN(J46)","v":14},15902257,11,null,"540-BBGS","QLogic 57810 Dual Port 10Gb Direct Attach/SFP+ Network Adapter,Full Height,CusKit",1,497.99,null,{"$f":"SUMPRODUCT(Q46:Q47,S46:S47)","v":0},147]
[null,null,null,null,null,null,null,null,null,null,null,15902257,11,null,"407-BBRM","SFP+, Short Range, Optical Transceiver, LC Connector, 10Gb compatible with QLogic 578xx Series, Cuskit",2,169.99]
[null,null,null,null,null,null,null,"TS1L1-CNA-L",{"$f":"LEN(H48)","v":11},"TS1L1-CNA-L-R630",{"$f":"LEN(J48)","v":16},15902257,11,null,"540-BBDX","QLogic 57810 Dual Port 10Gb Direct Attach/SFP+ Low Profile Network Adapter,CusKit",1,497.99,null,{"$f":"SUMPRODUCT(Q48:Q49,S48:S49)","v":0},147]
[null,null,null,null,null,null,null,null,null,null,null,15902257,11,null,"407-BBRM","SFP+, Short Range, Optical Transceiver, LC Connector, 10Gb compatible with QLogic 578xx Series, Cuskit",2,169.99]
["TS1L1-FC","OpzFibreChannel",311,1,"QLogic 2560 SP Full\n(QLogic 2560, Single Port 8Gb Optical Fibre Channel HBA,Full Height,CusKit)",null,"OpzStorage300","TS1L1-HD300",{"$f":"LEN(H50)","v":11},"TS1L1-HD300-R630",{"$f":"LEN(J50)","v":16},15902257,11,null,"400-AJOQ","300GB 10K RPM SAS 12Gbps 2.5in Hot-plug Hard Drive,CusKit",1,208.99,null,{"$f":"S50*Q50","v":0},120]
[null,null,null,null,null,null,"OpzStorage1Tb","TS1L1-HD1200",{"$f":"LEN(H51)","v":12},"TS1L1-HD1200-R630",{"$f":"LEN(J51)","v":17},15902257,11,null,"400-AJPD","1.2TB 10K RPM SAS 12Gbps 2.5in Hot-plug Hard Drive,CusKit",1,579.99,null,0,212]
[null,null,null,null,null,null,"OpzFibreChannel","TS1L1-FC",{"$f":"LEN(H52)","v":8},"TS1L1-FC-R630",{"$f":"LEN(J52)","v":13},15902257,11,null,"406-BBEV","QLogic 2560, Single Port 8Gb Optical Fibre Channel HBA,Full Height,CusKit",1,1071.99,null,0,311]
[]
[null,null,null,null,null,null,"OpzEstensione12","TS1L1-4ANNI",{"$f":"LEN(H54)","v":11},"TS1L1-4ANNI-R630",{"$f":"LEN(J54)","v":16},15911903,5,null,"732-34071","1Yr Basic Warranty - Next Business Day Nr. serial number: R630_4Y",1,36,null,0,42]
["CNV-TS1L1-UPS","OpzUPS 3000VA",403,1,"UPS MSR 3000 VA",null,"OpzEstensione24","TS1L1-5ANNI",{"$f":"LEN(H55)","v":11},"TS1L1-5ANNI-R630",{"$f":"LEN(J55)","v":16},15911903,5,null,"732-34072","2Yr Basic Warranty - Next Business Day Nr. serial number: R630_5Y",1,72,null,0,85]
[]
["CNV-TS1L1-GUI","OpzGUIRack",452,1,"Console KVM per rack"]
["CNV-TS1L1-KVMIP","OpzSWGUIRack",577,1,"KVM Switch IP per GUI"]
[]
[]
[]
["CNV-TS1L1-RACK","OpzRack",487,null,"Armadio Rack 42U"]
[]
["10L1-SO-WIN","ServOpzSysManWindows",193,1,"System-Network Mng. svc Windows"]
["10L1-SO-LINUX","ServOpzSysManOS",193,1,"System-Network Mng. svc Linux"]
["10L1-SO-PREV","Manutenzione Preventiva",193,1,"Servizi di manutenzione Preventiva"]
["10L1-SO-HDD","Hard-Disk retention",150,1,"Servizio HDD Retention"]
[null,null,null,1,"Servizio HDD Retention 36 mesi"]
[null,null,null,1,"Servizio HDD Retention 48 mesi"]
[null,null,null,1,"Servizio HDD Retention 60 mesi"]
["10L1-SO-12M-P","OpzEstensione12",175,1,"Estensione garanzia 12 mesi Agg."]
["10L1-SO-24M-P","OpzEstensione24",350,1,"Estensione garanzia 24 mesi Agg."]
["COD_B"]
["CNV-TS1L1-R740XD","Rack Prestazionale Alternativo",2371,1,"Server DELL EMC PowerEdge R740xd, 2U, 1 x Intel Xeon Gold 5120, RAM 64GB, 2 x HDD 600GB 10k 2.5\""]
["CNV-TS1L1-R740","Rack Prestazionale",2371,1,"Server DELL EMC PowerEdge R740, 2U, 1 x Intel Xeon Gold 5120, RAM 64GB, 2 x HDD 600GB 10k 2.5\""]
["CNV-TS1L1-T640R","Rack Base Alternativo",1720,1,"Server DELL EMC PowerEdge T640, 5U, 1 x Intel Xeon Silver 4114, RAM 32GB, 2 x HDD 600GB 10k 2.5\""]
["CNV-TS1L1-WIN1","OpzWinServ1",598,1,"Windows Server 2016,Standard,ROK,16CORE (for Distributor sale only)"]
["CNV-TS1L1-CALDEV","OpzDeviceCal",22,1,"1-pack of Windows Server 2016,2012 Device CALs (Standard or Datacenter),CUS"]
["CNV-TS1L1-CALUSER","OpzUserCal",25,1,"1-pack of Windows Server 2016,2012 User CALs (Standard or Datacenter),CUS"]
["CNV-TS1L1-WIN2CORE","OpzWinServ 2 core",75,null,"Windows Server 2016 Standard Ed, Additional Lic,ROK,2CORE"]
["CNV-TS1L1-LINUX","OpzOpenSource",47,null,"DVD Linux Centos 7.x"]
["CNV-TS1L1-16GB-U","OpzRam16",122,1,"Kit Upgrade Ram 16GB"]
["CNV-TS1L1-32GB-U","OpzRam32",313,1,"Kit Upgrade Ram 32GB"]
["CNV-TS1L1-64GB-U-R74","OpzRam64",625,1,"Kit Upgrade Ram 64GB"]
["CNV-TS1L1-1GB-L","OpzGigabit",35,1,"Broadcom 5720 DP 1Gb Network Interface Card, Low Profile,CusKit"]
["CNV-TS1L1-10GB-L","OpzGigabit 10GB",147,1,"QLogic 57810 Dual Port 10Gb Direct Attach/SFP+ Low Profile Network Adapter,CusKit"]
["CNV-TS1L1-CNA-L","OpzGigabit 10GB CNA",147,1,"QLogic 57810 Dual Port 10Gb CNA Direct Attach/SFP+ Low Profile Network Adapter,CusKit"]
["CNV-S1-540-BBIU","Opz10Gb BaseT",248,1,"QLogic 57810 Dual Port 10Gb Base-T Low Profile Network Adapter,CusKit"]
["CNV-S1-405-AANN","Opz H840",479,1,"PERC H840 RAID Adapter for External MD14XX Only, 2GB NV Cache, Low Profile"]
["CNV-TS1L1-FC-L","OpzFibreChannel",311,null,"QLogic 2560, Single Port 8Gb Optical Fibre Channel HBA,Low Profile"]
["CNV-S1-406-BBEL","OpzFibreChannel2",810,null,"QLogic 2562, Dual Port 8Gb Optical Fibre Channel HBA, Low Profile"]
["CNV-TS1L1-1GB","OpzGigabit",35,1,"Broadcom 5720 DP 1Gb Network Interface Card,Full Height,CusKit"]
["CNV-TS1L1-10GB","OpzGigabit 10GB",147,1,"QLogic 57810 Dual Port 10Gb Direct Attach/SFP+ Network Adapter,Full Height,CusKit"]
["CNV-TS1L1-CNA","OpzGigabit 10GB CNA",147,1,"QLogic 57810 Dual Port 10Gb CNA Direct Attach/SFP+ Network Adapter,Full Height,CusKit"]
["CNV-S1-540-BBGU","Opz10Gb BaseT",248,1,"QLogic 57810 Dual Port 10Gb Base-T Network Adapter,Full Height"]
["CNV-TS1L1-540-BBIW","OpzX710quadPort",370,1,"Intel X710 Quad Port 10Gb Direct Attach, SFP+, Converged Network Adapter NO Transceiver"]
["CNV-TS1L1-540-BBIV","OpzX710",350,1,"Intel X710 Dual Port 10Gb Direct Attach, SFP+, Converged Network Adapter NO Transceiver"]
["CNV-S1-405-AAMZ","OpzH840",479,1,"PERC H840 RAID Adapter for External MD14XX Only, 2GB NV Cache"]
["CNV-TS1-BOSS","OpzBOSS",657,1,"BOSS controller card, full height, 2 x 240G M.2 Drive"]
["CNV-TS1-BOSS120","OpzBOSS120",425,1,"BOSS controller card, full height, 2 x 120G M.2 Drive"]
["CNV-TS1L1-403-BBTM","OpzNVMe2TB",2570,1,"Intel 2TB, NVMe, Mixed Use Express Flash, HHHL AIC, P4600"]
["CNV-TS1L1-FC","OpzFibreChannel",311,1,"QLogic 2560, Single Port 8Gb Optical Fibre Channel HBA,Full Height,CusKit"]
["CNV-S1-406-BBEK","OpzFibreChannel2",810,1,"QLogic 2562, Dual Port 8Gb Optical Fibre Channel HBA,Full Height,CusKit"]
["CNV-2UCMA","Opz CMA 2U",62,1,"Cable Management Arm 2U"]
["CNV-TS1L1-HD600","OpzStorage300",120,1,"HDD 600GB SAS\n(600GB 10K RPM SAS 12Gbps 2.5in Hot-plug Hard Drive)"]
["CNV-TS1L1-HD1200-U","OpzStorage1Tb",212,1,"HDD 1.2TB SAS\n(1.2TB 10K RPM SAS 12Gbps 2.5in Hot-plug Hard Drive,CusKit)"]
["CNV-TS1L1-HD1800-U","OpzStorage2Tb",236,1,"1.8TB 10K RPM SAS 12Gbps 512e 2.5in Hot-plug"]
["CNV-TS1L1-SSD800-U","OpzStorageSSD800",748,1,"960GB SSD SAS Mix Use  512n 2.5in Hot-plug"]
["CNV-TS1L1-SSD1920-U","OpzStorageSSD1,6TB",1795,1,"1.92TB SSD SAS Mix Use 12Gbps 512n 2.5in Hot-plug"]
["CNV-S1-IDSDMCCR","Opz IDSDMCCR",82,1,"ISDM and Combo Card Reader, with 2 16Gb microSDHC/SDXC Card"]
["CNV-2UBezelSTD","Opz BezelStandard 2U",30,1,"PowerEdge 2U Standard Bezel"]
["CNV-2UBezelLCD","Opz BezelLCD 2U",60,1,"PowerEdge 2U LCD Bezel"]
["CNV-874-006887","OpzSUSE1",1350,1,"SUSE Linux Enterprise Server, x86 & x86-64, 1-2 Sockets or 1-2 Virtual Machines, Standard Subscription, 3 Years"]
["CNV-874-006898","OpzSUSE2",2242.5,1,"SUSE Linux Enterprise Server, x86 & x86-64, 1-2 Sockets or 1-2 Virtual Machines, Standard Subscription, 5 Years"]
["CNV-874-006888","OpzSUSE3",2692.5,1,"SUSE Linux Enterprise Server, x86 & x86-64, 1-2 Sockets with Unlimited Virtual Machines, Standard Subscription, 3 Years"]
["CNV-874-006902","OpzSUSE4",4500,1,"SUSE Linux Enterprise Server, x86 & x86-64, 1-2 Sockets with Unlimited Virtual Machines, Standard Subscription, 5 Years"]
["CNV-874-006883","OpzSUSE5",2520,1,"SUSE Linux Enterprise Server, x86 & x86-64, 1-2 Sockets or 1-2 Virtual Machines, Priority Subscription, 3 Year"]
["CNV-874-006894","OpzSUSE6",4200,1,"SUSE Linux Enterprise Server, x86 & x86-64, 1-2 Sockets or 1-2 Virtual Machines, Priority Subscription, 5 Year"]
["CNV-874-006884","OpzSUSE7",5100,1,"SUSE Linux Enterprise Server, x86 & x86-64, 1-2 Sockets with Unlimited Virtual Machines, Priority Subscription, 3 Year"]
["CNV-874-006895","OpzSUSE8",8400,1,"SUSE Linux Enterprise Server, x86 & x86-64, 1-2 Sockets with Unlimited Virtual Machines, Priority Subscription, 5 Year"]
["CNV-210-AIKY","OpzVMwareKit3Y",4100,1,"VMware vSphere Essentials Plus, 6CPU, 3YR"]
["CNV-210-AHRT","OpzVMwareS3Y",1463,1,"VMware vSphere Standard, 1CPU, 3YR License/Maintenance"]
["CNV-210-AHRF","OpzVMwareVC3Y",8338,1,"VMware vCenter Standard, 3YR License/Maintenance"]
["CNV-210-AHRP","OpzVMwareEP3Y",4400,1,"VMware vSphere Enterprise Plus, 1CPU, 3YR License/Maintenance"]
["S1-IDSDM16GB","Opz IDSDM",82,null,"Internal Dual SD Module, with 2 16Gb SD Card, Cus Kit"]
["CNV-S1-405-AAJW","OpzHBA330",219,1,"HBA330 Internal 12Gbps SAS HBA,Minicard"]
["CNV-S1-RDXCC","OpzRDX",365,null,"Tandberg RDX External drive, black, USB3, con 3 Cartucce da 500 GB"]
["CNV-LG-646861","OpzPDU32A",289,null,"PDU Vertical 20+4 outlets C13  with MCB - IEC60309 input"]
["CNV-LG-646875","OpzPDU_TRIFASE",349,null,"PDU Vertical  18+6 outlets (C13+C19)  with MCB and ammeter - IEC60309 input - 3 phase"]
["CNV-TS1L1-CPU-R740","Opz1P",1307,1,"Intel Xeon Processor Gold 5120\n[Intel Xeon Gold 5120 2.2G, 14C/28T, 10.4GT/s 2UPI, 19M Cache, Turbo, HT (105W)]"]
["CNV-TS1L1-CPU-R740X","Opz1P",1307,1,"Intel Xeon Processor Gold 5120\n[Intel Xeon Gold 5120 2.2G, 14C/28T, 10.4GT/s 2UPI, 19M Cache, Turbo, HT (105W)]"]
["CNV-TS1L1-CPU-T640R","Opz1P",728,1,"Intel Xeon Processor Silver 4114\n[Intel Xeon Silver 4114 2.2G, 10C/20T, 9.6GT/s 2UPI, 14M Cache, Turbo, HT (85W)]"]
[null,null,null,1,"Heat Sink, T640/440, EMEA"]
["CNV-TS1L1-4Y-R740XD","OpzEstensione12",42,1,"Estensione della manutenzione in garanzia per ulteriori 12 mesi"]
["CNV-TS1L1-5Y-R740XD","OpzEstensione24",85,1,"Estensione della manutenzione in garanzia per ulteriori 24 mesi"]
["CNV-TS1L1-4Y-R740","OpzEstensione12",42,1,"Estensione della manutenzione in garanzia per ulteriori 12 mesi",null,null,"TS1L1-CPU-T630"]
["CNV-TS1L1-5Y-R740","OpzEstensione24",85,1,"Estensione della manutenzione in garanzia per ulteriori 24 mesi"]
[]
["10L1-UPS","OpzUPS 3000VA",422,1,"UPS MSR 3000 VA"]
[]
["10L1-GUI","OpzGUIRack",461,1,"Console KVM per rack"]
["10L1-KVMIP","OpzSWGUIRack",550,1,"KVM Switch IP per GUI con cavi"]
[]
[]
[]
["10L1-RACK","OpzRack",497,null,"Armadio Rack 42U"]
[]
["10L1-SO-WIN","ServOpzSysManWindows",193,1,"System-Network Mng. svc Windows"]
["10L1-SO-LINUX","ServOpzSysManOS",193,1,"System-Network Mng. svc Linux"]
["10L1-SO-PREV","Manutenzione Preventiva",193,1,"Servizi di manutenzione Preventiva"]
["10L1-SO-HDD","Hard-Disk retention",150,1,"Servizio HDD Retention"]
[null,null,null,1,"Servizio HDD Retention 36 mesi"]
[null,null,null,1,"Servizio HDD Retention 48 mesi"]
[null,null,null,1,"Servizio HDD Retention 60 mesi"]
["10L1-SO-12M-S","OpzEstensione12",175,1,"Estensione garanzia 12 mesi Agg."]
["10L1-SO-24M-S","OpzEstensione24",350,1,"Estensione garanzia 24 mesi Agg."]
["COD_C"]
["CNV-TS1L1-T640","Server Tower Base",2158,1,"DELL PowerEdge T640\n(1CPU Intel® Xeon® Silver 4114, 32GB RDIMM, 2xHDD 600GB 10K RPM SAS 12Gbps 3.5in)"]
["CNV-TS1L1-T640P","Server Tower Prestazionale",2214,{"$f":"\"\"","v":""},"DELL PowerEdge T640\n(1CPU Intel® Xeon® Silver 4116, 64GB RDIMM, 2xHDD 600GB 10K RPM SAS 12Gbps 3.5in)"]
["CNV-TS1L1-CPU-T640P","Opz1P",917,null,"Intel Xeon Processor Silver 4116\n[Intel Xeon Silver 4116 2.1G, 12C/24T, 9.6GT/s , 16.5M Cache, Turbo, HT (85W)]"]
[{"$f":"\"\"","v":""},{"$f":"\"\"","v":""},{"$f":"\"\"","v":""},{"$f":"\"\"","v":""},{"$f":"\"\"","v":""}]
["CNV-TS1L1-CPU-T640","Opz1P",650,1,"Intel Xeon Processor Silver 4114\n[Intel Xeon Silver 4114 2.2G, 10C/20T, 9.6GT/s 2UPI, 14M Cache, Turbo, HT (85W)]"]
["CNV-TS1L1-16GB-U","OpzRam16",122,1,"Kit Upgrade Ram 16GB"]
["CNV-TS1L1-32GB-U","OpzRam32",313,1,"Kit Upgrade Ram 32GB"]
["CNV-TS1L1-64GB-U","OpzRam64",625,1,"Kit Upgrade Ram 64GB"]
["CNV-TS1L1-1GB","OpzGigabit",35,1,"Scheda Lan Gigabit Full\n(Broadcom 5720 DP 1Gb Network Interface Card,Full Height,CusKit)"]
["CNV-TS1L1-10GB","OpzGigabit 10GB",147,1,"QLogic 57810 Dual Port 10Gb Full\n(QLogic 57810 Dual Port 10Gb Direct Attach/SFP+ Network Adapter,Full Height,CusKit)"]
["CNV-TS1L1-CNA","OpzGigabit 10GB CNA",147,1,"QLogic 57810 DualPort 10GbCNA Full\n(QLogic 57810 Dual Port 10Gb Direct Attach/SFP+ (CNA),Full Height,CusKit)"]
["CNV-S1-540-BBGU","Opz10Gb BaseT",248,null,"QLogic 57810 Dual Port 10Gb Base-T, Full Height"]
["CNV-TS1L1-540-BBIW","OpzX710quadPort",370,1,"Intel X710 Quad Port 10Gb Direct Attach, SFP+, Converged Network Adapter NO Tranceiver"]
["CNV-TS1L1-540-BBIV","OpzX710",350,1,"Intel X710 Dual Port 10Gb Direct Attach, SFP+, Converged Network Adapter NO Tranceiver"]
["CNV-S1-405-AAMZ","OpzH840",479,1,"PERC H840 RAID Adapter for External MD14XX Only, 2GB NV Cache"]
["CNV-TS1-BOSS","OpzBOSS",657,1,"BOSS controller card, full height, 2 x 240G M.2 Drive"]
["CNV-TS1-BOSS120","OpzBOSS120",425,1,"BOSS controller card, full height, 2 x 120G M.2 Drive"]
["CNV-TS1L1-403-BBTM","OpzNVMe2TB",2570,1,"Intel 2TB, NVMe, Mixed Use Express Flash, HHHL AIC, P4600"]
["CNV-TS1L1-FC","OpzFibreChannel",311,1,"QLogic 2560 SP Full\n(QLogic 2560, Single Port 8Gb Optical Fibre Channel HBA,Full Height,CusKit)"]
["CNV-S1-406-BBEK","OpzFibreChannel2",810,1,"QLogic 2562, Dual Port 8Gb Optical Fibre Channel HBA,Full Height,CusKit"]
[]
[]
["CNV-TS1L1-FC"]
["CNV-TS1L1-FC-L","OpzFibreChannel",311,1,"QLogic 2560 SP Low\n(QLogic 2560, Single Port 8Gb Optical Fibre Channel HBA,Low Profile,CusKit)"]
["CNV-2UCMA","Opz CMA 2U",62,1,"Cable Management Arm 2U"]
["CNV-TS1L1-HD600","OpzStorage300",120,1,"HDD 600GB SAS\n(600GB 10K RPM SAS 12Gbps 2.5in Hot-plug Hard Drive)"]
["CNV-TS1L1-HD1200-U","OpzStorage1Tb",212,1,"HDD 1.2TB SAS\n(1.2TB 10K RPM SAS 12Gbps 2.5in Hot-plug Hard Drive,CusKit)"]
["CNV-TS1L1-HD1800-U","OpzStorage2Tb",236,1,"1.8TB 10K RPM SAS 12Gbps 512e 2.5in Hot-plug"]
["CNV-TS1L1-SSD800-U","OpzStorageSSD800",748,1,"960GB SSD SAS Mix Use  512n 2.5in Hot-plug"]
["CNV-TS1L1-SSD1920-U","OpzStorageSSD1,6TB",1795,1,"1.92TB SSD SAS Mix Use 12Gbps 512n 2.5in Hot-plug"]
["CNV-S1-IDSDMCCR","Opz IDSDMCCR",82,1,"ISDM and Combo Card Reader, with 2 16Gb microSDHC/SDXC Card"]
["CNV-2UBezelSTD","Opz BezelStandard 2U",30,1,"PowerEdge 2U Standard Bezel"]
["CNV-2UBezelLCD","Opz BezelLCD 2U",60,1,"PowerEdge 2U LCD Bezel"]
["CNV-S1-406-BBEL","OpzFibreChannelDP",810,1,"QLogic 2562 DP Low\n(QLogic 2560, Dual Port 8Gb Optical Fibre Channel HBA,Low Profile)"]
["CNV-874-006887","OpzSUSE1",1350,1,"SUSE Linux Enterprise Server, x86 & x86-64, 1-2 Sockets or 1-2 Virtual Machines, Standard Subscription, 3 Years"]
["CNV-874-006898","OpzSUSE2",2242.5,1,"SUSE Linux Enterprise Server, x86 & x86-64, 1-2 Sockets or 1-2 Virtual Machines, Standard Subscription, 5 Years"]
["CNV-874-006888","OpzSUSE3",2692.5,1,"SUSE Linux Enterprise Server, x86 & x86-64, 1-2 Sockets with Unlimited Virtual Machines, Standard Subscription, 3 Years"]
["CNV-874-006902","OpzSUSE4",4500,1,"SUSE Linux Enterprise Server, x86 & x86-64, 1-2 Sockets with Unlimited Virtual Machines, Standard Subscription, 5 Years"]
["CNV-874-006883","OpzSUSE5",2520,1,"SUSE Linux Enterprise Server, x86 & x86-64, 1-2 Sockets or 1-2 Virtual Machines, Priority Subscription, 3 Year"]
["CNV-874-006894","OpzSUSE6",4200,1,"SUSE Linux Enterprise Server, x86 & x86-64, 1-2 Sockets or 1-2 Virtual Machines, Priority Subscription, 5 Year"]
["CNV-874-006884","OpzSUSE7",5100,1,"SUSE Linux Enterprise Server, x86 & x86-64, 1-2 Sockets with Unlimited Virtual Machines, Priority Subscription, 3 Year"]
["CNV-874-006895","OpzSUSE8",8400,1,"SUSE Linux Enterprise Server, x86 & x86-64, 1-2 Sockets with Unlimited Virtual Machines, Priority Subscription, 5 Year"]
["CNV-210-AIKY","OpzVMwareKit3Y",4100,1,"VMware vSphere Essentials Plus, 6CPU, 3YR"]
["CNV-210-AHRT","OpzVMwareS3Y",1463,1,"VMware vSphere Standard, 1CPU, 3YR License/Maintenance"]
["CNV-210-AHRF","OpzVMwareVC3Y",8338,1,"VMware vCenter Standard, 3YR License/Maintenance"]
["CNV-210-AHRP","OpzVMwareEP3Y",4400,1,"VMware vSphere Enterprise Plus, 1CPU, 3YR License/Maintenance"]
["S1-IDSDM16GB","Opz IDSDM",82,null,"Internal Dual SD Module, with 2 16Gb SD Card, Cus Kit"]
["CNV-S1-405-AAES","Opz SAS",160,null,"SAS 12Gbps HBA External Controller, Low Profile, CusKit"]
["CNV-S1-405-AAER","Opz H830",479,null,"PERC H830 RAID Adapter for External MD14XX Only, 2GB NV Cache, Low Profile,CusKit"]
["CNV-S1-540-BBIU","Opz10Gb BaseT",248,null,"QLogic 57810 Dual Port 10Gb Base-T Low Profile Network Adapter,CusKit"]
["CNV-S1-406-BBEK","OpzFibreChannel2",810,null,"QLogic 2562, Dual Port 8Gb Optical Fibre Channel HBA,Full Height,CusKit"]
["CNV-S1-405-AAJW","OpzHBA330",219,1,"HBA330 Internal 12Gbps SAS HBA,Minicard"]
["CNV-S1-RDXCC","OpzRDX",365,null,"Tandberg RDX External drive, black, USB3, con 3 Cartucce da 500 GB"]
["CNV-TS1L1-540-BBIW","OpzX710",370,1,"Intel X710 Quad Port 10Gb Direct Attach, SFP+, Converged Network Adapter"]
["TS1L1-16GB","OpzRam16",122,1,"Kit Upgrade Ram 16GB"]
["TS1L1-32GB","OpzRam32",313,1,"Kit Upgrade Ram 32GB"]
["TS1L1-1GB","OpzGigabit",35,1,"Scheda Lan Gigabit Full\n(Broadcom 5720 DP 1Gb Network Interface Card,Full Height,CusKit)"]
["CNV-TS1L1-HD600R","OpzStorage300",120,1,"HDD 600GB SAS\n(600GB 10K RPM SAS 12Gbps 2.5in Hot-plug Hard Drive)"]
["CNV-TS1L1-HD1200R","OpzStorage1Tb",212,1,"HDD 1.2TB SAS\n(1.2TB 10K RPM SAS 12Gbps 2.5in Hot-plug Hard Drive,CusKit)"]
["TS1L1-10GB","OpzGigabit 10 GBs",147,1,"QLogic 57810 Dual Port 10Gb Full\n(QLogic 57810 Dual Port 10Gb Direct Attach/SFP+ Network Adapter,Full Height,CusKit)"]
[null,null,null,2,"PowerEdge SFP+, 10GbE SR/SX, Optical Tranceiver, LC Connector, for Intel and Broadcom,CusKit"]
["CNV-TS1L1-HD600T","OpzStorage600",111,1,"HDD 600GB SAS\n(600GB 10K RPM SAS 12Gbps 2.5in Hot-plug Hard Drive,3.5in HYB CARR, CusKit)"]
["CNV-TS1L1-HD1200T-U","OpzStorage1Tb",173,1,"HDD 1.2TB SAS\n(1.2TB 10K RPM SAS 12Gbps 2.5in Hot-plug Hard Drive,3.5in HYB CARR, CusKit)"]
["TS1L1-FC","OpzFibreChannel",311,null,"QLogic 2560 SP Full\n(QLogic 2560, Single Port 8Gb Optical Fibre Channel HBA,Full Height,CusKit)"]
[]
["CNV-TS1L1-UPS-T","OpzUPS 3000VA",387,1,"UPS MSR 3000 VA"]
["CNV-TS1L1-4Y-T640P","OpzEstensione12",42,1,"Estensione della manutenzione in garanzia per ulteriori 12 mesi"]
["CNV-TS1L1-5Y-T640P","OpzEstensione24",85,1,"Estensione della manutenzione in garanzia per ulteriori 24 mesi"]
["CNV-TS1L1-4Y-T640","OpzEstensione12",42,1,"Estensione della manutenzione in garanzia per ulteriori 12 mesi"]
["CNV-TS1L1-5Y-T640","OpzEstensione24",85,1,"Estensione della manutenzione in garanzia per ulteriori 24 mesi"]
[]
["CNV-TS1L1-GUI-T","OpzGUIDesk",96,1,"KIT Monitor 19\" + Mouse + Keyboard"]
[null,null,null,1,"Mice : Dell USB Dual Tone Mouse - Grey - 2 button & Scrollwheel - kit"]
[null,null,null,1,"Dell 19 Monitor | E1916H - 47cm(18.5\") Black ITL"]
[]
[]
["10L1-SO-WIN","ServOpzSysManWindows",193,1,"System-Network Mng. svc Windows"]
["10L1-SO-LINUX","ServOpzSysManOS",193,1,"System-Network Mng. svc Linux"]
["10L1-SO-PREV","Manutenzione Preventiva",193,1,"Servizi di manutenzione Preventiva"]
["10L1-SO-HDD","Hard-Disk retention",150,1,"Servizio HDD Retention"]
[null,null,null,1,"Servizio HDD Retention 36 mesi"]
[null,null,null,1,"Servizio HDD Retention 48 mesi"]
[null,null,null,1,"Servizio HDD Retention 60 mesi"]
["10L1-SO-12M-T","OpzEstensione12",175,1,"Estensione garanzia 12 mesi Agg."]
["10L1-SO-24M-T","OpzEstensione24",350,1,"Estensione garanzia 24 mesi Agg."]

{"sheet":"PCI","index":19,"n_rows":358,"n_cols":11,"rows_kept":358,"cut":false,"hidden":true,"merged":[[71,1,71,3],[101,1,101,3],[104,0,104,3],[105,1,105,3],[66,1,66,3],[76,1,76,3],[79,0,79,3],[83,1,83,3],[97,1,97,3],[80,1,80,3]]}
["Additional Card for PCIe Slot 1 (Low Profile)"]
["R630"]
["None",{"$f":"\"\"","v":""},{"$f":"\"\"","v":""},{"$f":"\"\"","v":""},{"$f":"\"\"","v":""},{"$f":"\"\"","v":""},null,{"$f":"\"\"","v":""},0,{"$f":"\"\"","v":""}]
["Broadcom 5720 DP 1Gb Network Interface Card, Low Profile",1,"CNV-TS1L1-1GB-L","TS1L1-1GB-L","540-BBGW",35,null,"",0,""]
["QLogic 57810 Dual Port 10Gb Direct Attach/SFP+ Low Profile Network Adapter",1,"CNV-TS1L1-10GB-L","TS1L1-10GB-L","540-BBDX",147,null,"SFP+, Short Range, Optical Transceiver, LC Connector, 10Gb compatible with QLogic 578xx Series, Cuskit",2,"407-BBRM"]
["QLogic 57810 Dual Port 10Gb CNA Direct Attach/SFP+ Low Profile Network Adapter",1,"CNV-TS1L1-CNA-L","TS1L1-CNA-L","540-BBDX",147,null,"SFP+, Short Range, Optical Transceiver, LC Connector, 10Gb compatible with QLogic 578xx Series, Cuskit",2,"407-BBRM"]
["QLogic 57810 Dual Port 10Gb Base-T Low Profile Network Adapter,CusKit",1,"CNV-S1-540-BBIU","TS1-L1-540-BBIU","540-BBIU",248,null,null,0,""]
["PERC H840 RAID Adapter for External MD14XX Only, 2GB NV Cache, Low Profile",1,"CNV-S1-405-AANN","S1-405-AANN","405-AANN",479]
["QLogic 2560, Single Port 8Gb Optical Fibre Channel HBA,Low Profile",1,"CNV-TS1L1-FC-L","TS1L1-FC-L","406-BBHC",311,null,{"$f":"\"\"","v":""},0,{"$f":"\"\"","v":""}]
["QLogic 2562, Dual Port 8Gb Optical Fibre Channel HBA, Low Profile",1,"CNV-S1-406-BBEL","S1-406-BBEL","406-BBEL",810,null,{"$f":"\"\"","v":""},0,{"$f":"\"\"","v":""}]
[]
["Additional Card for PCIe Slot 2 (Full height)"]
["R630"]
["None",{"$f":"\"\"","v":""},{"$f":"\"\"","v":""},{"$f":"\"\"","v":""},{"$f":"\"\"","v":""},{"$f":"\"\"","v":""},null,{"$f":"\"\"","v":""},0,{"$f":"\"\"","v":""}]
["Broadcom 5720 DP 1Gb Network Interface Card,Full Height,CusKit",1,"TS1L1-1GB","TS1L1-1GB-R630","540-BBGY",35,null,"",0,""]
["QLogic 57810 Dual Port 10Gb Direct Attach/SFP+ Network Adapter,Full Height,CusKit",1,"TS1L1-10GB","TS1L1-10GB-R630","540-BBGS",147,null,"SFP+, Short Range, Optical Transceiver, LC Connector, 10Gb compatible with QLogic 578xx Series, Cuskit",2,"407-BBRM"]
["QLogic 57810 Dual Port 10Gb CNA Direct Attach/SFP+ Network Adapter,Full Height,CusKit",1,"TS1L1-CNA","TS1L1-CNA-R630","540-BBGS",147,null,"SFP+, Short Range, Optical Transceiver, LC Connector, 10Gb compatible with QLogic 578xx Series, Cuskit",2,"407-BBRM"]
["QLogic 57810 Dual Port 10Gb Base-T Low Profile Network Adapter,CusKit",1,"CNV-S1-540-BBIU","TS1-L1-540-BBIU","540-BBIU",248,null,null,0,""]
["QLogic 2560, Single Port 8Gb Optical Fibre Channel HBA,Full Height,CusKit",1,"TS1L1-FC","TS1L1-FC-R630","406-BBEV",311,null,"",0,""]
["Intel X710 Quad Port 10Gb Direct Attach, SFP+, Converged Network Adapter",1,"TS1L1-540-BBIW","TS1L1-540-BBIW","540-BBIW",null,370,null,0]
["QLogic 2562, Dual Port 8Gb Optical Fibre Channel HBA,Full Height,CusKit",1,"S1-406-BBEK","S1-406-BBEK","406-BBEK",null,810,"",0,""]
[]
["PERC H830 RAID Adapter for External MD14XX Only, 2GB NV Cache, Low Profile,CusKit",1,"CNV-S1-405-AAER","S1-405-AAER","405-AAER",479,null,{"$f":"\"\"","v":""},0,{"$f":"\"\"","v":""}]
["SAS 12Gbps HBA External Controller, Low Profile, CusKit",1,"CNV-S1-405-AAES","S1-405-AAES","405-AAES",160,null,{"$f":"\"\"","v":""},0,{"$f":"\"\"","v":""}]
["Qlogic 2692 Dual Port 16Gb Fibre Channel HBA, Low Profile, Customer Install",1,"TS1-L1-403-BBMT","TS1-L1-403-BBMT","403-BBMT",null,1858.99,null,0,""]
["QLogic 2742 Dual Port 32Gb Fibre Channel HBA, Low Profile, Customer Install",1,"TS1-L1-403-BBMR","TS1-L1-403-BBMR","403-BBMR",null,2785.99,null,0,""]
["QLogic 2740 Single Port 32Gb Fibre Channel HBA, Low Profile, Customer Install",1,"TS1-L1-403-BBMO","TS1-L1-403-BBMO","403-BBMO",null,1884.99,null,0,""]
["Intel Ethernet X540 DP 10GBASE-T Server Adapter, Low Profile,CusKit",1,"TS1-L1-540-BBDT","TS1-L1-540-BBDT","540-BBDT",null,821.99,null,0,""]
["Intel X520 DP 10Gb DA/SFP+ Server Adapter, Low Profile,CusKit",1,"TS1-L1-540-BBDW","TS1-L1-540-BBDW","540-BBDW",null,566.99,null,0,""]
["Broadcom 5719 QP 1Gb Network Interface Card, Low Profile,CusKit",1,"TS1-L1-540-BBHB","TS1-L1-540-BBHB","540-BBHB",null,207.99,null,0,""]
["QLogic 57810 Dual Port 10Gb Base-T Low Profile Network Adapter,CusKit",1,"TS1-L1-540-BBIU","TS1-L1-540-BBIU","540-BBIU",null,635.99,null,0,""]
["Intel X710 Dual Port 10Gb Direct Attach, SFP+, Converged Network Adapter, Low Profile, Cuskit",1,"TS1-L1-540-BBIX","TS1-L1-540-BBIX","540-BBIX",null,749.99,null,0,""]
["QLogic FastLinQ QL45212-DE Dual Port 25GbE SFP28 Adapter, Low Profile, Customer Install",1,"TS1-L1-540-BBQQ","TS1-L1-540-BBQQ","540-BBQQ",null,703.99,null,0,""]
["Intel Omni-Path Host Fabric Adapter 100 Series 1 Port PCIe x16, Low Profile, Customer Install",1,"TS1-L1-540-BBQT","TS1-L1-540-BBQT","540-BBQT",null,1526.99,null,0,""]
["Intel X550 Dual Port 10G Base-T Adapter, Low Profile, Customer Install",1,"TS1-L1-540-BBRG","TS1-L1-540-BBRG","540-BBRG",null,774.99,null,0,""]
["Intel XL710 Dual Port 40G, QSFP+, Low Profile, Customer Install",1,"TS1-L1-540-BBRN","TS1-L1-540-BBRN","540-BBRN",null,1133.99,null,0,""]
["PERC H830 RAID Adapter for External MD14XX Only, 2GB NV Cache, Low Profile,CusKit",1,"TS1-L1-405-AAER","TS1-L1-405-AAER","405-AAER",null,987.99,null,0,""]
["SAS 12Gbps HBA External Controller, Low Profile, CusKit",1,"TS1-L1-405-AAES","TS1-L1-405-AAES","405-AAES",null,318.99,null,0,""]
[]
["QLogic 2742 Dual Port 32Gb Fibre Channel HBA, Customer Install",1,"TS1-L1-403-BBMK","TS1-L1-403-BBMK","403-BBMK",null,2783.99,null,0,""]
["Qlogic 2692 Dual Port 16Gb Fibre Channel HBA, Customer Install",1,"TS1-L1-403-BBMU","TS1-L1-403-BBMU","403-BBMU",null,1858.99,null,0,""]
["Intel X520 DP 10Gb DA/SFP+ Server Adapter,Full Height,CusKit",1,"TS1-L1-540-BBDR","TS1-L1-540-BBDR","540-BBDR",null,667.99,null,0,""]
["Intel Ethernet X540 DP 10GBASE-T Server Adapter,Full Height,CusKit",1,"TS1-L1-540-BBDU","TS1-L1-540-BBDU","540-BBDU",null,737.99,null,0,""]
["Intel X710 Dual Port 10Gb Direct Aattach, SFP+, Converged Network Adapter, Customer Kit",1,"TS1-L1-540-BBIV","TS1-L1-540-BBIV","540-BBIV",null,655.99,null,0,""]
["Intel X710 Quad Port 10Gb Direct Aattach, SFP+, Converged Network Adapter",1,"TS1-L1-540-BBIW","TS1-L1-540-BBIW","540-BBIW",null,1040.99,null,0,""]
["QLogic FastLinQ QL45212-DE Dual Port 25GbE SFP28 Adapter, Customer Install",1,"TS1-L1-540-BBQR","TS1-L1-540-BBQR","540-BBQR",null,703.99,null,0,""]
["Intel Omni-Path Host Fabric Adapter 100 Series 1 Port PCIe x16, Customer Install",1,"TS1-L1-540-BBQU","TS1-L1-540-BBQU","540-BBQU",null,1526.99,null,0,""]
["Intel XL710 Dual Port 40G, QSFP+, Full Height, Customer Install",1,"TS1-L1-540-BBRH","TS1-L1-540-BBRH","540-BBRH",null,1133.99,null,0,""]
["Intel XL710 Dual Port 40G, QSFP+, rNDC, Customer Install",1,"TS1-L1-540-BBRJ","TS1-L1-540-BBRJ","540-BBRJ",null,1306.99,null,0,""]
["Intel X550 Dual Port 10G Base-T Adapter, Full Height, Customer Install",1,"TS1-L1-540-BBRK","TS1-L1-540-BBRK","540-BBRK",null,774.99,null,0,""]
["SAS 12Gbps HBA External Controller, Full Height,CusKit",1,"TS1-L1-405-AADZ","TS1-L1-405-AADZ","405-AADZ",null,324.99,null,0,""]
[]
[]
["PERC H730P RAID Controller, 2Gb NV Cache, Minicard",0,{"$f":"\"\"","v":""},{"$f":"\"\"","v":""},"[405-AAQU]",{"$f":"\"\"","v":""}]
["HBA330 Internal 12Gbps SAS HBA,Minicard",1,"CNV-S1-405-AAJW","405-AAJW","405-AAJW",null,219]
[]
[]
["Intel Ethernet i350 QP 1Gb Network Daughter Card",1,{"$f":"\"\"","v":""},{"$f":"\"\"","v":""},"[540-BBCB]",{"$f":"\"\"","v":""}]
["Broadcom 5720 QP 1Gb Network Daughter Card",1,{"$f":"\"\"","v":""},{"$f":"\"\"","v":""},"[540-BBBW]",{"$f":"\"\"","v":""}]
["Modulo Doppia SD"]
["None ",0,{"$f":"\"\"","v":""},{"$f":"\"\"","v":""},{"$f":"\"\"","v":""},{"$f":"\"\"","v":""}]
["ISDM and Combo Card Reader, with 2 16Gb microSDHC/SDXC Card",1,"CNV-S1-IDSDMCCR","S1-IDSDMCCR",{"$f":"\"\"","v":""},{"$f":"\"\"","v":""},82,"upsell_1",{"$f":"LEN(C62)","v":15}]
["Unità ottica interna"]
["No Internal Optical Drive for 8 HDD Chassis",1,{"$f":"\"\"","v":""},{"$f":"\"\"","v":""},"[429-AAQN]",{"$f":"\"\"","v":""}]
["No Internal Optical Drive for 8 HDD Chassis",1,{"$f":"\"\"","v":""},{"$f":"\"\"","v":""},"[429-AAQN]",{"$f":"\"\"","v":""}]
[]
["Pannello frontale"]
["No Bezel Option",1,{"$f":"\"\"","v":""},{"$f":"\"\"","v":""},"[350-BBBW]"]
["PowerEdge 1U Standard Bezel",1,"CNV-1UBezelSTD",{"$f":"\"\"","v":""},"[325-BCHJ]",25,null,null,null,{"$f":"I69/0.85","v":0}]
["PowerEdge 1U LCD Bezel",1,"CNV-1UBezelLCD",{"$f":"\"\"","v":""},"[325-BCHI]",50,null,null,null,{"$f":"I70/0.85","v":0}]
[]
["Pannello frontale"]
["No Bezel Option",1,{"$f":"\"\"","v":""},{"$f":"\"\"","v":""},"[350-BBBW]"]
["PowerEdge 2U Standard Bezel",1,"CNV-2UBezelSTD",{"$f":"\"\"","v":""},"[325-BCHX]",30,null,null,null,{"$f":"I74/0.85","v":0}]
["PowerEdge 2U LCD Bezel",1,"CNV-2UBezelLCD",{"$f":"\"\"","v":""},"[325-BCHW]",60,null,null,null,{"$f":"I75/0.85","v":0}]
[]
["Guide per rack"]
["ReadyRails™ Sliding Rails Without Cable Management Arm 1U",1,{"$f":"\"\"","v":""},{"$f":"\"\"","v":""},"[770-BBBC]"]
["ReadyRails™ Sliding Rails With Cable Management Arm 1U",1,"CNV-1UCMA",{"$f":"\"\"","v":""},"[770-BBBC][770-BBIE]",38]
[]
["Guide per rack"]
["ReadyRails™ Sliding Rails Without Cable Management Arm 2U",1,{"$f":"\"\"","v":""},{"$f":"\"\"","v":""},"[770-BBBQ]"]
["ReadyRails™ Sliding Rails With Cable Management Arm 2U",1,"CNV-2UCMA",{"$f":"\"\"","v":""},"[770-BBBQ][770-BBIP]",62]
["Alimentatore"]
["Dual, Hot-plug, Redundant Power Supply (1+1), 750W, Titanium, 200-240VAC",1,{"$f":"\"\"","v":""},{"$f":"\"\"","v":""},"[450-ADWT]"]
["Dual, Hot-plug, Redundant Power Supply (1+1), 750W, Titanium, 200-240VAC",1,{"$f":"\"\"","v":""},{"$f":"\"\"","v":""},"[450-ADWT]"]
[]
["Broadcom 5720 QP 1Gb Network Daughter Card",1,{"$f":"\"\"","v":""},{"$f":"\"\"","v":""},"[540-BBBW]",{"$f":"\"\"","v":""}]
["QLogic 57840S Quad Port 10Gb SFP+ Direct Attach Rack Network Daughter Card,CusKit",1,"TS1-L1-540-BBEV",{"$f":"\"\"","v":""},"540-BBEV",{"$f":"\"\"","v":""},740.99]
["Modulo Doppia SD"]
["None ",1,{"$f":"\"\"","v":""},{"$f":"\"\"","v":""},{"$f":"\"\"","v":""},{"$f":"\"\"","v":""}]
["Internal Dual SD Module,CusKit + (2 x 16GB SD Card For IDSDM, Cus Kit)",1,"TS1-L1-DSD-16GB",{"$f":"\"\"","v":""},"330-BBCN 385-BBLK 385-BBLK",{"$f":"\"\"","v":""},180]
["Internal Dual SD Module,CusKit + (2 x 32GB SD Card For IDSDM, Cus Kit)",1,"TS1-L1-DSD-32GB",{"$f":"\"\"","v":""},"330-BBCN 385-BBKB 385-BBKB",{"$f":"\"\"","v":""},210,"upsell_1 da sostituire (copia incolla)"]
["Unità ottica interna"]
["No Internal Optical Drive for 8 HDD Chassis",1,{"$f":"\"\"","v":""},{"$f":"\"\"","v":""},"[429-AAQN]",{"$f":"\"\"","v":""}]
["8X DVD+/-RW ROM Drive SATA - Kit",1,{"$f":"CONCATENATE(\"TS1-L1-\",E96)","v":"TS1-L1-429-AATE"},{"$f":"\"\"","v":""},"429-AATE",null,32.99]
[]
["Pannello frontale"]
["No Bezel Option",1,{"$f":"\"\"","v":""},{"$f":"\"\"","v":""},"[350-BBBW]"]
["Dell EMC 1U Standard Bezel,CK",1,{"$f":"CONCATENATE(\"TS1-L1-\",E100)","v":"TS1-L1-325-BCJX"},{"$f":"\"\"","v":""},"325-BCJX",null,85.99]
[]
["Guide per rack"]
["ReadyRails™ Sliding Rails Without Cable Management Arm",1,{"$f":"\"\"","v":""},{"$f":"\"\"","v":""},"[770-BBBC]"]
["ReadyRails™ Sliding Rails With Cable Management Arm",1,{"$f":"CONCATENATE(\"TS1-L1-\",E104)","v":"TS1-L1-770-BBIE"},{"$f":"\"\"","v":""},"770-BBIE",null,111.99]
[]
["Alimentatore"]
["Dual, Hot-plug, Redundant Power Supply (1+1), 750W, Titanium, 200-240VAC",1,{"$f":"\"\"","v":""},{"$f":"\"\"","v":""},"[450-ADWT]"]
["Dual, Hot-plug, Redundant Power Supply (1+1),  1100W, CusKit",2,{"$f":"CONCATENATE(\"TS1-L1-\",E108)","v":"TS1-L1-450-AEBL"},{"$f":"\"\"","v":""},"450-AEBL",null,{"$f":"349.99*B108","v":699.98}]
[]
["Additional Card for PCIe Slot 1 (Full height) (CPU 1)"]
["Broadcom 5720 DP 1Gb Network Interface Card",null,{"$f":"\"\"","v":""},"540-BBCX"]
[]
[]
["Additional Card for PCIe Slot 2 (Full height) (CPU 1)"]
["R740 /R740XD"]
[]
["None","","","","","",null,"",0,""]
["Broadcom 5720 DP 1Gb Network Interface Card,Full Height,CusKit",1,"CNV-TS1L1-1GB","TS1L1-1GB","540-BBGY",35,null,"",0,""]
["QLogic 57810 Dual Port 10Gb Direct Attach/SFP+ Network Adapter,Full Height,CusKit",1,"CNV-TS1L1-10GB","TS1L1-10GB","540-BBGS",147,null,"SFP+, Short Range, Optical Transceiver, LC Connector, 10Gb compatible with QLogic 578xx Series, Cuskit",2,"407-BBRM"]
["QLogic 57810 Dual Port 10Gb CNA Direct Attach/SFP+ Network Adapter,Full Height,CusKit",1,"CNV-TS1L1-CNA","TS1L1-CNA","540-BBGS",147,null,"SFP+, Short Range, Optical Transceiver, LC Connector, 10Gb compatible with QLogic 578xx Series, Cuskit",2,"407-BBRM"]
["QLogic 57810 Dual Port 10Gb Base-T Network Adapter,Full Height",1,"CNV-S1-540-BBGU","S1-540-BBGU","540-BBGU",248]
["Intel X710 Quad Port 10Gb Direct Attach, SFP+, Converged Network Adapter NO Transceiver",1,"CNV-TS1L1-540-BBIW","TS1L1-540-BBIW","540-BBIW",370,null,"",0,"",{"$f":"\"\"","v":""}]
["Intel X710 Dual Port 10Gb Direct Attach, SFP+, Converged Network Adapter NO Transceiver",1,"CNV-TS1L1-540-BBIV","TS1L1-540-BBIV","540-BBIV",350]
["PERC H840 RAID Adapter for External MD14XX Only, 2GB NV Cache",1,"CNV-S1-405-AAMZ","S1-405-AAMZ","405-AAMZ",479]
["BOSS controller card, full height, 2 x 240G M.2 Drive",1,"CNV-TS1-BOSS","TS1-BOSS","403-BBQB 400-ASDQ 400-ASDQ",657]
["BOSS controller card, full height, 2 x 120G M.2 Drive",1,"CNV-TS1-BOSS120","TS1-BOSS120","403-BBQB 385-BBLX  385-BBLX  ",425]
["Intel 2TB, NVMe, Mixed Use Express Flash, HHHL AIC, P4600",1,"CNV-TS1L1-403-BBTM","TS1L1-403-BBTM","403-BBTM",2570]
["QLogic 2560, Single Port 8Gb Optical Fibre Channel HBA,Full Height,CusKit",1,"CNV-TS1L1-FC","TS1L1-FC","406-BBEV",311,null,"",0,""]
["QLogic 2562, Dual Port 8Gb Optical Fibre Channel HBA,Full Height,CusKit",1,"CNV-S1-406-BBEK","S1-406-BBEK","406-BBEK",810,null,"",0,""]
[]
["Additional Card for PCIe Slot 3 (Full height) (CPU 1)"]
["R740 /R740XD"]
["None3","","","","","",null,"",0,""]
["Broadcom 5720 DP 1Gb Network Interface Card,Full Height,CusKit",1,"CNV-TS1L1-1GB","TS1L1-1GB","540-BBGY",35,null,"",0,""]
["QLogic 57810 Dual Port 10Gb Direct Attach/SFP+ Network Adapter,Full Height,CusKit",1,"CNV-TS1L1-10GB","TS1L1-10GB","540-BBGS",147,null,"SFP+, Short Range, Optical Transceiver, LC Connector, 10Gb compatible with QLogic 578xx Series, Cuskit",2,"407-BBRM"]
["QLogic 57810 Dual Port 10Gb CNA Direct Attach/SFP+ Network Adapter,Full Height,CusKit",1,"CNV-TS1L1-CNA","TS1L1-CNA","540-BBGS",147,null,"SFP+, Short Range, Optical Transceiver, LC Connector, 10Gb compatible with QLogic 578xx Series, Cuskit",2,"407-BBRM"]
["Intel X710 Quad Port 10Gb Direct Attach, SFP+, Converged Network Adapter",1,"CNV-TS1L1-540-BBIW","TS1L1-540-BBIW","540-BBIW",370,null,"",0,"",{"$f":"\"\"","v":""}]
["QLogic 2560, Single Port 8Gb Optical Fibre Channel HBA,Full Height,CusKit",1,"CNV-TS1L1-FC","TS1L1-FC","406-BBEV",311,null,"",0,""]
["QLogic 2562, Dual Port 8Gb Optical Fibre Channel HBA,Full Height,CusKit",1,"CNV-S1-406-BBEK","S1-406-BBEK","406-BBEK",810,null,"",0,""]
[]
["Additional Card for PCIe Slot 4 (Full height) (CPU 2)"]
["R740 /R740XD"]
["None4","","","","","",null,"",0,"",{"$f":"\"\"","v":""}]
["Broadcom 5720 DP 1Gb Network Interface Card,Full Height,CusKit",1,"CNV-TS1L1-1GB","TS1L1-1GB","540-BBGY",35,null,"",0,"",""]
["QLogic 57810 Dual Port 10Gb Direct Attach/SFP+ Network Adapter,Full Height,CusKit",1,"CNV-TS1L1-10GB","TS1L1-10GB","540-BBGS",147,null,"SFP+, Short Range, Optical Transceiver, LC Connector, 10Gb compatible with QLogic 578xx Series, Cuskit",2,"407-BBRM","[407-BBOK]"]
["QLogic 57810 Dual Port 10Gb CNA Direct Attach/SFP+ Network Adapter,Full Height,CusKit",1,"CNV-TS1L1-CNA","TS1L1-CNA","540-BBGS",147,null,"SFP+, Short Range, Optical Transceiver, LC Connector, 10Gb compatible with QLogic 578xx Series, Cuskit",2,"407-BBRM","[407-BBOK]"]
["Intel X710 Quad Port 10Gb Direct Attach, SFP+, Converged Network Adapter",1,"CNV-TS1L1-540-BBIW","TS1L1-540-BBIW","540-BBIW",370,null,"",0,"",{"$f":"\"\"","v":""}]
["QLogic 2560, Single Port 8Gb Optical Fibre Channel HBA,Full Height,CusKit",1,"CNV-TS1L1-FC","TS1L1-FC","406-BBEV",311,null,"",0,""]
["QLogic 2562, Dual Port 8Gb Optical Fibre Channel HBA,Full Height,CusKit",1,"CNV-S1-406-BBEK","S1-406-BBEK","406-BBEK",810,null,"",0,""]
[]
["Additional Card for PCIe Slot 5 (Full height) (CPU 2)"]
["R740 /R740XD"]
["None5","","","","","",null,"",0,"",{"$f":"\"\"","v":""}]
["Broadcom 5720 DP 1Gb Network Interface Card,Full Height,CusKit",1,"CNV-TS1L1-1GB","TS1L1-1GB","540-BBGY",35,null,"",0,"",""]
["QLogic 57810 Dual Port 10Gb Direct Attach/SFP+ Network Adapter,Full Height,CusKit",1,"CNV-TS1L1-10GB","TS1L1-10GB","540-BBGS",147,null,"SFP+, Short Range, Optical Transceiver, LC Connector, 10Gb compatible with QLogic 578xx Series, Cuskit",2,"407-BBRM","[407-BBOK]"]
["QLogic 57810 Dual Port 10Gb CNA Direct Attach/SFP+ Network Adapter,Full Height,CusKit",1,"CNV-TS1L1-CNA","TS1L1-CNA","540-BBGS",147,null,"SFP+, Short Range, Optical Transceiver, LC Connector, 10Gb compatible with QLogic 578xx Series, Cuskit",2,"407-BBRM"]
["Intel X710 Quad Port 10Gb Direct Attach, SFP+, Converged Network Adapter",1,"CNV-TS1L1-540-BBIW","TS1L1-540-BBIW","540-BBIW",370,null,"",0,""]
["QLogic 2560, Single Port 8Gb Optical Fibre Channel HBA,Full Height,CusKit",1,"CNV-TS1L1-FC","TS1L1-FC","406-BBEV",311,null,"",0,""]
["QLogic 2562, Dual Port 8Gb Optical Fibre Channel HBA,Full Height,CusKit",1,"CNV-S1-406-BBEK","S1-406-BBEK","406-BBEK",810,null,"",0,""]
[]
["Additional Card for PCIe Slot 6 (Low Profile) (CPU 1)"]
["R740 /R740XD"]
["None","","","","","",null,"",0,"",""]
["Broadcom 5720 DP 1Gb Network Interface Card, Low Profile,CusKit",1,"CNV-TS1L1-1GB-L","TS1L1-1GB-L","540-BBGW",35,null,"",0,"",""]
["QLogic 57810 Dual Port 10Gb Direct Attach/SFP+ Low Profile Network Adapter,CusKit",1,"CNV-TS1L1-10GB-L","TS1L1-10GB-L","540-BBDX",147,null,"SFP+, Short Range, Optical Transceiver, LC Connector, 10Gb compatible with QLogic 578xx Series, Cuskit",2,"407-BBRM","[407-BBOK]"]
["QLogic 57810 Dual Port 10Gb CNA Direct Attach/SFP+ Low Profile Network Adapter,CusKit",1,"CNV-TS1L1-CNA-L","TS1L1-CNA-L","540-BBDX",147,null,"SFP+, Short Range, Optical Transceiver, LC Connector, 10Gb compatible with QLogic 578xx Series, Cuskit",2,"407-BBRM"]
["QLogic 57810 Dual Port 10Gb Base-T Low Profile Network Adapter,CusKit",1,"CNV-S1-540-BBIU","TS1-L1-540-BBIU","540-BBIU",248,null,null,0,""]
["PERC H840 RAID Adapter for External MD14XX Only, 2GB NV Cache, Low Profile",1,"CNV-S1-405-AANN","S1-405-AANN","405-AANN",479]
["QLogic 2560, Single Port 8Gb Optical Fibre Channel HBA,Low Profile",1,"CNV-TS1L1-FC-L","TS1L1-FC-L","406-BBHC",311,null,{"$f":"\"\"","v":""},0,{"$f":"\"\"","v":""}]
["QLogic 2562, Dual Port 8Gb Optical Fibre Channel HBA, Low Profile",1,"CNV-S1-406-BBEL","S1-406-BBEL","406-BBEL",810,null,{"$f":"\"\"","v":""},0,{"$f":"\"\"","v":""}]
[]
["Additional Card for PCIe Slot 7 (Full height) (CPU 2)"]
["R740 /R740XD"]
["None5","","","","","",null,"",0,"",""]
["Broadcom 5720 DP 1Gb Network Interface Card,Full Height,CusKit",1,"CNV-TS1L1-1GB","TS1L1-1GB","540-BBGY",35,null,"",0,"",""]
["QLogic 57810 Dual Port 10Gb Direct Attach/SFP+ Network Adapter,Full Height,CusKit",1,"CNV-TS1L1-10GB","TS1L1-10GB","540-BBGS",147,null,"SFP+, Short Range, Optical Transceiver, LC Connector, 10Gb compatible with QLogic 578xx Series, Cuskit",2,"407-BBRM","[407-BBOK]"]
["QLogic 57810 Dual Port 10Gb CNA Direct Attach/SFP+ Network Adapter,Full Height,CusKit",1,"CNV-TS1L1-CNA","TS1L1-CNA","540-BBGS",147,null,"SFP+, Short Range, Optical Transceiver, LC Connector, 10Gb compatible with QLogic 578xx Series, Cuskit",2,"407-BBRM"]
["Intel X710 Quad Port 10Gb Direct Attach, SFP+, Converged Network Adapter",1,"CNV-TS1L1-540-BBIW","TS1L1-540-BBIW","540-BBIW",370,null,"",0,""]
["QLogic 2560, Single Port 8Gb Optical Fibre Channel HBA,Full Height,CusKit",1,"CNV-TS1L1-FC","TS1L1-FC","406-BBEV",311,null,"",0,""]
["QLogic 2562, Dual Port 8Gb Optical Fibre Channel HBA,Full Height,CusKit",1,"CNV-S1-406-BBEK","S1-406-BBEK","406-BBEK",810,null,"",0,""]
[]
["Additional Card for PCIe Slot 5 (Full height) (CPU 1)"]
["R730"]
["None XXXX","","","","","",null,"",0,""]
["Broadcom 5720 DP 1Gb Network Interface Card,Full Height,CusKit",1,"CNV-TS1L1-1GB","TS1L1-1GB","540-BBGY",35,null,"",0,""]
["QLogic 57810 Dual Port 10Gb Direct Attach/SFP+ Network Adapter,Full Height,CusKit",1,"CNV-TS1L1-10GB","TS1L1-10GB","540-BBGS",147,null,"SFP+, Short Range, Optical Transceiver, LC Connector, 10Gb compatible with QLogic 578xx Series, Cuskit",2,"407-BBRM"]
["QLogic 57810 Dual Port 10Gb CNA Direct Attach/SFP+ Network Adapter,Full Height,CusKit",1,"CNV-TS1L1-CNA","TS1L1-CNA","540-BBGS",147,null,"SFP+, Short Range, Optical Transceiver, LC Connector, 10Gb compatible with QLogic 578xx Series, Cuskit",2,"407-BBRM"]
["Intel X710 Quad Port 10Gb Direct Attach, SFP+, Converged Network Adapter",1,"CNV-TS1L1-540-BBIW","TS1L1-540-BBIW","540-BBIW",null,370,"",0,"",{"$f":"\"\"","v":""}]
["QLogic 2560, Single Port 8Gb Optical Fibre Channel HBA,Full Height,CusKit",1,"CNV-TS1L1-FC","TS1L1-FC","406-BBEV",311,null,"",0,""]
["QLogic 2562, Dual Port 8Gb Optical Fibre Channel HBA,Full Height,CusKit",1,"CNV-S1-406-BBEK","S1-406-BBEK","406-BBEK",null,810,"",0,""]
[]
["Additional Card for PCIe Slot 4 (Full height) (CPU 1)"]
["R730xd"]
["None","","","","","",null,"",0,"",{"$f":"\"\"","v":""}]
["Broadcom 5720 DP 1Gb Network Interface Card,Full Height,CusKit",1,"TS1L1-1GB","TS1L1-1GB-R630","540-BBGY",35,null,"",0,"",""]
["QLogic 57810 Dual Port 10Gb Direct Attach/SFP+ Network Adapter,Full Height,CusKit",1,"TS1L1-10GB","TS1L1-10GB-R630","540-BBGS",147,null,"SFP+, Short Range, Optical Transceiver, LC Connector, 10Gb compatible with QLogic 578xx Series, Cuskit",2,"407-BBRM","[407-BBOK]"]
["QLogic 57810 Dual Port 10Gb CNA Direct Attach/SFP+ Network Adapter,Full Height,CusKit",1,"TS1L1-CNA","TS1L1-CNA-R630","540-BBGS",147,null,"SFP+, Short Range, Optical Transceiver, LC Connector, 10Gb compatible with QLogic 578xx Series, Cuskit",2,"407-BBRM","[407-BBOK]"]
["Intel X710 Quad Port 10Gb Direct Attach, SFP+, Converged Network Adapter",1,"TS1L1-540-BBIW","TS1L1-540-BBIW","540-BBIW",null,370,"",0,"",{"$f":"\"\"","v":""}]
["QLogic 2560, Single Port 8Gb Optical Fibre Channel HBA,Full Height,CusKit",1,"TS1L1-FC","TS1L1-FC-R630","406-BBEV",311,null,"",0,""]
["QLogic 2562, Dual Port 8Gb Optical Fibre Channel HBA,Full Height,CusKit",1,"S1-406-BBEK","S1-406-BBEK","406-BBEK",null,810,"",0,""]
[]
["Additional Card for PCIe Slot 3 (Low Profile) (CPU 2)"]
["R730xd"]
["None","","","","","",null,"",0,"",{"$f":"\"\"","v":""}]
["Broadcom 5720 DP 1Gb Network Interface Card, Low Profile,CusKit",1,"TS1L1-1GB-L","TS1L1-1GB-L-R630","540-BBGW",35,null,"",0,"",""]
["QLogic 57810 Dual Port 10Gb Direct Attach/SFP+ Low Profile Network Adapter,CusKit",1,"TS1L1-10GB-L","TS1L1-10GB-L-R630","540-BBDX",147,null,"SFP+, Short Range, Optical Transceiver, LC Connector, 10Gb compatible with QLogic 578xx Series, Cuskit",2,"407-BBRM","[407-BBOK]"]
["QLogic 57810 Dual Port 10Gb CNA Direct Attach/SFP+ Low Profile Network Adapter,CusKit",1,"TS1L1-CNA-L","TS1L1-CNA-L-R630","540-BBDX",147,null,"SFP+, Short Range, Optical Transceiver, LC Connector, 10Gb compatible with QLogic 578xx Series, Cuskit",2,"407-BBRM"]
["QLogic 57810 Dual Port 10Gb Base-T Low Profile Network Adapter,CusKit",1,"S1-540-BBIU","S1-540-BBIU","540-BBIU",null,248]
["PERC H830 RAID Adapter for External MD14XX Only, 2GB NV Cache, Low Profile,CusKit",1,"S1-405-AAER","S1-405-AAER","405-AAER",null,479]
["SAS 12Gbps HBA External Controller, Low Profile, CusKit",1,"S1-405-AAES","S1-405-AAES","405-AAES",null,160]
[]
["Additional Card for PCIe Slot 2 (Low Profile) (CPU 2)"]
["R730xd"]
["None","","","","","",null,"",0,"",""]
["Broadcom 5720 DP 1Gb Network Interface Card, Low Profile,CusKit",1,"TS1L1-1GB-L","TS1L1-1GB-L-R630","540-BBGW",35,null,"",0,"",""]
["QLogic 57810 Dual Port 10Gb Direct Attach/SFP+ Low Profile Network Adapter,CusKit",1,"TS1L1-10GB-L","TS1L1-10GB-L-R630","540-BBDX",147,null,"SFP+, Short Range, Optical Transceiver, LC Connector, 10Gb compatible with QLogic 578xx Series, Cuskit",2,"407-BBRM","[407-BBOK]"]
["QLogic 57810 Dual Port 10Gb CNA Direct Attach/SFP+ Low Profile Network Adapter,CusKit",1,"TS1L1-CNA-L","TS1L1-CNA-L-R630","540-BBDX",147,null,"SFP+, Short Range, Optical Transceiver, LC Connector, 10Gb compatible with QLogic 578xx Series, Cuskit",2,"407-BBRM"]
["QLogic 57810 Dual Port 10Gb Base-T Low Profile Network Adapter,CusKit",1,"S1-540-BBIU","S1-540-BBIU","540-BBIU",null,248]
["PERC H830 RAID Adapter for External MD14XX Only, 2GB NV Cache, Low Profile,CusKit",1,"S1-405-AAER","S1-405-AAER","405-AAER",null,479]
["SAS 12Gbps HBA External Controller, Low Profile, CusKit",1,"S1-405-AAES","S1-405-AAES","405-AAES",null,160]
[]
["Additional Card for PCIe Slot 1 (Low Profile) (CPU 2)"]
["R730xd"]
["None","","","","","",null,"",0,"",""]
["Broadcom 5720 DP 1Gb Network Interface Card, Low Profile,CusKit",1,"TS1L1-1GB-L","TS1L1-1GB-L-R630","540-BBGW",35,null,"",0,"",""]
["QLogic 57810 Dual Port 10Gb Direct Attach/SFP+ Low Profile Network Adapter,CusKit",1,"TS1L1-10GB-L","TS1L1-10GB-L-R630","540-BBDX",147,null,"SFP+, Short Range, Optical Transceiver, LC Connector, 10Gb compatible with QLogic 578xx Series, Cuskit",2,"407-BBRM","[407-BBOK]"]
["QLogic 57810 Dual Port 10Gb CNA Direct Attach/SFP+ Low Profile Network Adapter,CusKit",1,"TS1L1-CNA-L","TS1L1-CNA-L-R630","540-BBDX",147,null,"SFP+, Short Range, Optical Transceiver, LC Connector, 10Gb compatible with QLogic 578xx Series, Cuskit",2,"407-BBRM"]
["QLogic 57810 Dual Port 10Gb Base-T Low Profile Network Adapter,CusKit",1,"S1-540-BBIU","S1-540-BBIU","540-BBIU",null,248]
["PERC H830 RAID Adapter for External MD14XX Only, 2GB NV Cache, Low Profile,CusKit",1,"S1-405-AAER","S1-405-AAER","405-AAER",null,479]
["SAS 12Gbps HBA External Controller, Low Profile, CusKit",1,"S1-405-AAES","S1-405-AAES","405-AAES",null,160]
[]
[]
[]
["Additional Card for PCIe Slot 6 (Full height) (CPU 1)"]
["R730xd"]
["Broadcom 5719 QP 1Gb Network Interface Card","","","","540-BBCW","",null,"",0,""]
["Broadcom 5720 DP 1Gb Network Interface Card,Full Height,CusKit",1,"TS1L1-1GB","TS1L1-1GB-R630","540-BBGY",35,null,"",0,""]
["QLogic 57810 Dual Port 10Gb Direct Attach/SFP+ Network Adapter,Full Height,CusKit",1,"TS1L1-10GB","TS1L1-10GB-R630","540-BBGS",147,null,"SFP+, Short Range, Optical Transceiver, LC Connector, 10Gb compatible with QLogic 578xx Series, Cuskit",2,"407-BBRM"]
["QLogic 57810 Dual Port 10Gb CNA Direct Attach/SFP+ Network Adapter,Full Height,CusKit",1,"TS1L1-CNA","TS1L1-CNA-R630","540-BBGS",147,null,"SFP+, Short Range, Optical Transceiver, LC Connector, 10Gb compatible with QLogic 578xx Series, Cuskit",2,"407-BBRM"]
["Intel X710 Quad Port 10Gb Direct Attach, SFP+, Converged Network Adapter",1,"TS1L1-540-BBIW","TS1L1-540-BBIW","540-BBIW",null,370,"",0,"",{"$f":"\"\"","v":""}]
["QLogic 2560, Single Port 8Gb Optical Fibre Channel HBA,Full Height,CusKit",1,"TS1L1-FC","TS1L1-FC-R630","406-BBEV",311,null,"",0,""]
["QLogic 2562, Dual Port 8Gb Optical Fibre Channel HBA,Full Height,CusKit",1,"S1-406-BBEK","S1-406-BBEK","406-BBEK",null,810,"",0,""]
[]
[]
["Additional Card for PCIe Slot 1 (Low Profile) (CPU 2)"]
["R730xd"]
["None","","","","","",null,"",0,"",""]
["Broadcom 5720 DP 1Gb Network Interface Card, Low Profile,CusKit",1,"TS1L1-1GB-L","TS1L1-1GB-L-R630","540-BBGW",35,null,"",0,"",""]
["QLogic 57810 Dual Port 10Gb Direct Attach/SFP+ Low Profile Network Adapter,CusKit",1,"TS1L1-10GB-L","TS1L1-10GB-L-R630","540-BBDX",147,null,"SFP+, Short Range, Optical Transceiver, LC Connector, 10Gb compatible with QLogic 578xx Series, Cuskit",2,"407-BBRM","[407-BBOK]"]
["QLogic 57810 Dual Port 10Gb CNA Direct Attach/SFP+ Low Profile Network Adapter,CusKit",1,"TS1L1-CNA-L","TS1L1-CNA-L-R630","540-BBDX",147,null,"SFP+, Short Range, Optical Transceiver, LC Connector, 10Gb compatible with QLogic 578xx Series, Cuskit",2,"407-BBRM"]
["QLogic 57810 Dual Port 10Gb Base-T Low Profile Network Adapter,CusKit",1,"S1-540-BBIU","S1-540-BBIU","540-BBIU",null,248]
["PERC H830 RAID Adapter for External MD14XX Only, 2GB NV Cache, Low Profile,CusKit",1,"S1-405-AAER","S1-405-AAER","405-AAER",null,479]
["SAS 12Gbps HBA External Controller, Low Profile, CusKit",1,"S1-405-AAES","S1-405-AAES","405-AAES",null,160]
[]
[]
["Additional Card for PCIe Slot 1 (Full height) (CPU1)"]
["T630"]
["None",{"$f":"\"\"","v":""},{"$f":"\"\"","v":""},{"$f":"\"\"","v":""},{"$f":"\"\"","v":""},{"$f":"\"\"","v":""},null,"Aggiungere Secondo Processore",{"$f":"\"\"","v":""},0,{"$f":"\"\"","v":""}]
["Broadcom 5720 DP 1Gb Network Interface Card,Full Height,CusKit",1,"TS1L1-1GB","TS1L1-1GB-T630R","[540-BBGY]",35,null,"Aggiungere Secondo Processore","",0,""]
["QLogic 2560, Single Port 8Gb Optical Fibre Channel HBA,Full Height,CusKit",1,"TS1L1-FC","TS1L1-FC-T630R","[406-BBEK]",311,null,"Aggiungere Secondo Processore",null,0,""]
["QLogic 57810 Dual Port 10Gb Direct Attach/SFP+ Network Adapter,Full Height,CusKit",1,"TS1L1-10GB","TS1L1-10GB-T630R","[540-BBGS]",147,null,"Aggiungere Secondo Processore","PowerEdge SFP+, 10GbE SR/SX, Optical Tranceiver, LC Connector, for Intel and Broadcom,CusKit",2,"[407-BBOK]"]
["Intel X710 Quad Port 10Gb Direct Attach, SFP+, Converged Network Adapter",1,"TS1L1-540-BBIW","TS1L1-540-BBIW","540-BBIW",null,370,"Aggiungere Secondo Processore",{"$f":"\"\"","v":""},0,{"$f":"\"\"","v":""}]
["QLogic 2562, Dual Port 8Gb Optical Fibre Channel HBA,Full Height,CusKit",1,"S1-406-BBEK","S1-406-BBEK","406-BBEK",null,810,"Aggiungere Secondo Processore",0,"",""]
[]
[]
["Additional Card for PCIe Slot 2 (Full height) (CPU1)"]
["T630"]
["None",{"$f":"\"\"","v":""},{"$f":"\"\"","v":""},{"$f":"\"\"","v":""},{"$f":"\"\"","v":""},{"$f":"\"\"","v":""},null,"Aggiungere Secondo Processore",{"$f":"\"\"","v":""},0,{"$f":"\"\"","v":""}]
["Broadcom 5720 DP 1Gb Network Interface Card,Full Height,CusKit",1,"TS1L1-1GB","TS1L1-1GB-T630R","[540-BBGY]",35,null,"Aggiungere Secondo Processore","",0,""]
["QLogic 2560, Single Port 8Gb Optical Fibre Channel HBA,Full Height,CusKit",1,"TS1L1-FC","TS1L1-FC-T630R","[406-BBEK]",311,null,"Aggiungere Secondo Processore",null,0,""]
["QLogic 57810 Dual Port 10Gb Direct Attach/SFP+ Network Adapter,Full Height,CusKit",1,"TS1L1-10GB","TS1L1-10GB-T630R","[540-BBGS]",147,null,"Aggiungere Secondo Processore","PowerEdge SFP+, 10GbE SR/SX, Optical Tranceiver, LC Connector, for Intel and Broadcom,CusKit",2,"[407-BBOK]"]
["Intel X710 Quad Port 10Gb Direct Attach, SFP+, Converged Network Adapter",1,"TS1L1-540-BBIW","TS1L1-540-BBIW","540-BBIW",null,370,"Aggiungere Secondo Processore",{"$f":"\"\"","v":""},0,{"$f":"\"\"","v":""}]
["QLogic 2562, Dual Port 8Gb Optical Fibre Channel HBA,Full Height,CusKit",1,"S1-406-BBEK","S1-406-BBEK","406-BBEK",null,810,"Aggiungere Secondo Processore",0,"",""]
[]
[]
["Additional Card for PCIe Slot 3 (Full height) (CPU2)"]
["T630"]
["None",{"$f":"\"\"","v":""},{"$f":"\"\"","v":""},{"$f":"\"\"","v":""},{"$f":"\"\"","v":""},{"$f":"\"\"","v":""},null,"Aggiungere Secondo Processore",{"$f":"\"\"","v":""},0,{"$f":"\"\"","v":""}]
["Broadcom 5720 DP 1Gb Network Interface Card,Full Height,CusKit",1,"TS1L1-1GB","TS1L1-1GB-T630R","[540-BBGY]",35,null,"Aggiungere Secondo Processore","",0,""]
["QLogic 2560, Single Port 8Gb Optical Fibre Channel HBA,Full Height,CusKit",1,"TS1L1-FC","TS1L1-FC-T630R","[406-BBEK]",311,null,"Aggiungere Secondo Processore",null,0,""]
["QLogic 57810 Dual Port 10Gb Direct Attach/SFP+ Network Adapter,Full Height,CusKit",1,"TS1L1-10GB","TS1L1-10GB-T630R","[540-BBGS]",147,null,"Aggiungere Secondo Processore","PowerEdge SFP+, 10GbE SR/SX, Optical Tranceiver, LC Connector, for Intel and Broadcom,CusKit",2,"[407-BBOK]"]
["Intel X710 Quad Port 10Gb Direct Attach, SFP+, Converged Network Adapter",1,"TS1L1-540-BBIW","TS1L1-540-BBIW","540-BBIW",null,370,"Aggiungere Secondo Processore",{"$f":"\"\"","v":""},0,{"$f":"\"\"","v":""}]
["QLogic 2562, Dual Port 8Gb Optical Fibre Channel HBA,Full Height,CusKit",1,"S1-406-BBEK","S1-406-BBEK","406-BBEK",null,810,"Aggiungere Secondo Processore",0,"",""]
[]
[]
["Additional Card for PCIe Slot 4 (Full height) (CPU2)"]
["T630",null,{"$f":"(PCI!#REF!+PCI!#REF!:J21CERCA.VERT(#REF!,PCI_A2,8,FALSE))+((VLOOKUP(B268,PCI_A1,8,FALSE)))","v":{"$error":"#REF!"}}]
["None",{"$f":"\"\"","v":""},{"$f":"\"\"","v":""},{"$f":"\"\"","v":""},{"$f":"\"\"","v":""},{"$f":"\"\"","v":""},null,"Aggiungere Secondo Processore",{"$f":"\"\"","v":""},0,{"$f":"\"\"","v":""}]
["Broadcom 5720 DP 1Gb Network Interface Card,Full Height,CusKit",1,"TS1L1-1GB","TS1L1-1GB-T630R","[540-BBGY]",35,null,"Aggiungere Secondo Processore","",0,""]
["QLogic 2560, Single Port 8Gb Optical Fibre Channel HBA,Full Height,CusKit",1,"TS1L1-FC","TS1L1-FC-T630R","[406-BBEK]",311,null,"Aggiungere Secondo Processore",null,0,""]
["QLogic 57810 Dual Port 10Gb Direct Attach/SFP+ Network Adapter,Full Height,CusKit",1,"TS1L1-10GB","TS1L1-10GB-T630R","[540-BBGS]",147,null,"Aggiungere Secondo Processore","PowerEdge SFP+, 10GbE SR/SX, Optical Tranceiver, LC Connector, for Intel and Broadcom,CusKit",2,"[407-BBOK]"]
["Intel X710 Quad Port 10Gb Direct Attach, SFP+, Converged Network Adapter",1,"TS1L1-540-BBIW","TS1L1-540-BBIW","540-BBIW",null,370,"Aggiungere Secondo Processore",{"$f":"\"\"","v":""},0,{"$f":"\"\"","v":""}]
["QLogic 2562, Dual Port 8Gb Optical Fibre Channel HBA,Full Height,CusKit",1,"S1-406-BBEK","S1-406-BBEK","406-BBEK",null,810,"Aggiungere Secondo Processore",0,"",""]
[]
[]
[]
["Additional Card for PCIe Slot 5 (Full height) (CPU2)"]
["T630"]
["None",{"$f":"\"\"","v":""},{"$f":"\"\"","v":""},{"$f":"\"\"","v":""},{"$f":"\"\"","v":""},{"$f":"\"\"","v":""},null,"Aggiungere Secondo Processore",{"$f":"\"\"","v":""},0,{"$f":"\"\"","v":""}]
["Broadcom 5720 DP 1Gb Network Interface Card,Full Height,CusKit",1,"TS1L1-1GB","TS1L1-1GB-T630R","[540-BBGY]",35,null,"Aggiungere Secondo Processore","",0,""]
["QLogic 2560, Single Port 8Gb Optical Fibre Channel HBA,Full Height,CusKit",1,"TS1L1-FC","TS1L1-FC-T630R","[406-BBEK]",311,null,"Aggiungere Secondo Processore",null,0,""]
["QLogic 57810 Dual Port 10Gb Direct Attach/SFP+ Network Adapter,Full Height,CusKit",1,"TS1L1-10GB","TS1L1-10GB-T630R","[540-BBGS]",147,null,"Aggiungere Secondo Processore","PowerEdge SFP+, 10GbE SR/SX, Optical Tranceiver, LC Connector, for Intel and Broadcom,CusKit",2,"[407-BBOK]"]
["Intel X710 Quad Port 10Gb Direct Attach, SFP+, Converged Network Adapter",1,"TS1L1-540-BBIW","TS1L1-540-BBIW","540-BBIW",null,370,"Aggiungere Secondo Processore",{"$f":"\"\"","v":""},0,{"$f":"\"\"","v":""}]
["QLogic 2562, Dual Port 8Gb Optical Fibre Channel HBA,Full Height,CusKit",1,"S1-406-BBEK","S1-406-BBEK","406-BBEK",null,810,"Aggiungere Secondo Processore",0,"",""]
[]
[]
["Additional Card for PCIe Slot 6 (Full height) (CPU2)"]
["T630"]
["None",{"$f":"\"\"","v":""},{"$f":"\"\"","v":""},{"$f":"\"\"","v":""},{"$f":"\"\"","v":""},{"$f":"\"\"","v":""},null,"Aggiungere Secondo Processore",{"$f":"\"\"","v":""},0,{"$f":"\"\"","v":""}]
["Broadcom 5720 DP 1Gb Network Interface Card,Full Height,CusKit",1,"TS1L1-1GB","TS1L1-1GB-T630R","[540-BBGY]",35,null,"Aggiungere Secondo Processore","",0,""]
["QLogic 2560, Single Port 8Gb Optical Fibre Channel HBA,Full Height,CusKit",1,"TS1L1-FC","TS1L1-FC-T630R","[406-BBEK]",311,null,"Aggiungere Secondo Processore",null,0,""]
["QLogic 57810 Dual Port 10Gb Direct Attach/SFP+ Network Adapter,Full Height,CusKit",1,"TS1L1-10GB","TS1L1-10GB-T630R","[540-BBGS]",147,null,"Aggiungere Secondo Processore","PowerEdge SFP+, 10GbE SR/SX, Optical Tranceiver, LC Connector, for Intel and Broadcom,CusKit",2,"[407-BBOK]"]
["Intel X710 Quad Port 10Gb Direct Attach, SFP+, Converged Network Adapter",1,"TS1L1-540-BBIW","TS1L1-540-BBIW","540-BBIW",null,370,"Aggiungere Secondo Processore",{"$f":"\"\"","v":""},0,{"$f":"\"\"","v":""}]
["QLogic 2562, Dual Port 8Gb Optical Fibre Channel HBA,Full Height,CusKit",1,"S1-406-BBEK","S1-406-BBEK","406-BBEK",null,810,"Aggiungere Secondo Processore",0,"",""]
[]
[]
["Aggiungere Secondo Processore"]
[]
["Qlogic 2692 Dual Port 16Gb Fibre Channel HBA, Low Profile, Customer Install",1,"TS1-L1-403-BBMT","TS1-L1-403-BBMT","403-BBMT",null,1858.99]
["QLogic 2742 Dual Port 32Gb Fibre Channel HBA, Low Profile, Customer Install",1,"TS1-L1-403-BBMR","TS1-L1-403-BBMR","403-BBMR",null,2785.99]
["QLogic 2740 Single Port 32Gb Fibre Channel HBA, Low Profile, Customer Install",1,"TS1-L1-403-BBMO","TS1-L1-403-BBMO","403-BBMO",null,1884.99]
["Intel Ethernet X540 DP 10GBASE-T Server Adapter, Low Profile,CusKit",1,"TS1-L1-540-BBDT","TS1-L1-540-BBDT","540-BBDT",null,821.99]
["Intel X520 DP 10Gb DA/SFP+ Server Adapter, Low Profile,CusKit",1,"TS1-L1-540-BBDW","TS1-L1-540-BBDW","540-BBDW",null,566.99]
["Broadcom 5719 QP 1Gb Network Interface Card, Low Profile,CusKit",1,"TS1-L1-540-BBHB","TS1-L1-540-BBHB","540-BBHB",null,207.99]
["QLogic 57810 Dual Port 10Gb Base-T Low Profile Network Adapter,CusKit",1,"TS1-L1-540-BBIU","TS1-L1-540-BBIU","540-BBIU",null,635.99]
["Intel X710 Dual Port 10Gb Direct Attach, SFP+, Converged Network Adapter, Low Profile, Cuskit",1,"TS1-L1-540-BBIX","TS1-L1-540-BBIX","540-BBIX",null,749.99]
["QLogic FastLinQ QL45212-DE Dual Port 25GbE SFP28 Adapter, Low Profile, Customer Install",1,"TS1-L1-540-BBQQ","TS1-L1-540-BBQQ","540-BBQQ",null,703.99]
["Intel Omni-Path Host Fabric Adapter 100 Series 1 Port PCIe x16, Low Profile, Customer Install",1,"TS1-L1-540-BBQT","TS1-L1-540-BBQT","540-BBQT",null,1526.99]
["Intel X550 Dual Port 10G Base-T Adapter, Low Profile, Customer Install",1,"TS1-L1-540-BBRG","TS1-L1-540-BBRG","540-BBRG",null,774.99]
["Intel XL710 Dual Port 40G, QSFP+, Low Profile, Customer Install",1,"TS1-L1-540-BBRN","TS1-L1-540-BBRN","540-BBRN",null,1133.99]
["PERC H830 RAID Adapter for External MD14XX Only, 2GB NV Cache, Low Profile,CusKit",1,"TS1-L1-405-AAER","TS1-L1-405-AAER","405-AAER",null,987.99]
["SAS 12Gbps HBA External Controller, Low Profile, CusKit",1,"TS1-L1-405-AAES","TS1-L1-405-AAES","405-AAES",null,318.99]
[]
["Intel X520 DP 10Gb DA/SFP+ Server Adapter,Full Height,CusKit",1,"TS1-L1-540-BBDR","TS1-L1-540-BBDR","540-BBDR",null,667.99]
["Intel Ethernet X540 DP 10GBASE-T Server Adapter,Full Height,CusKit",1,"TS1-L1-540-BBDU","TS1-L1-540-BBDU","540-BBDU",null,737.99]
["Intel X710 Dual Port 10Gb Direct Aattach, SFP+, Converged Network Adapter, Customer Kit",1,"TS1-L1-540-BBIV","TS1-L1-540-BBIV","540-BBIV",null,655.99]
["Intel X710 Quad Port 10Gb Direct Aattach, SFP+, Converged Network Adapter",1,"TS1-L1-540-BBIW","TS1-L1-540-BBIW","540-BBIW",null,1040.99]
["QLogic FastLinQ QL45212-DE Dual Port 25GbE SFP28 Adapter, Customer Install",1,"TS1-L1-540-BBQR","TS1-L1-540-BBQR","540-BBQR",null,703.99]
["Intel Omni-Path Host Fabric Adapter 100 Series 1 Port PCIe x16, Customer Install",1,"TS1-L1-540-BBQU","TS1-L1-540-BBQU","540-BBQU",null,1526.99]
["Intel XL710 Dual Port 40G, QSFP+, Full Height, Customer Install",1,"TS1-L1-540-BBRH","TS1-L1-540-BBRH","540-BBRH",null,1133.99]
["Intel XL710 Dual Port 40G, QSFP+, rNDC, Customer Install",1,"TS1-L1-540-BBRJ","TS1-L1-540-BBRJ","540-BBRJ",null,1306.99]
["Intel X550 Dual Port 10G Base-T Adapter, Full Height, Customer Install",1,"TS1-L1-540-BBRK","TS1-L1-540-BBRK","540-BBRK",null,774.99]
["SAS 12Gbps HBA External Controller, Full Height,CusKit",1,"TS1-L1-405-AADZ","TS1-L1-405-AADZ","405-AADZ",null,324.99]
["PERC H730P Integrated RAID Controller,2GB NV Cache,CusKit",1,"TS1-L1-405-AAEK","TS1-L1-405-AAEK","405-AAEK",null,774.99]
[]
[]
["RDX"]
["None",0,{"$f":"\"\"","v":""},{"$f":"\"\"","v":""},{"$f":"\"\"","v":""},{"$f":"\"\"","v":""}]
["Tandberg RDX External drive, black, USB3, con 3 Cartucce da 500 GB",1,"CNV-S1-RDXCC","S1-RDXCC",{"$f":"\"\"","v":""},{"$f":"\"\"","v":""},365]
[]
[]
[]
[]
[]
[]
[]
[]
["S1-RDXCC","OpzRDX",365,null,"Tandberg RDX External drive, black, USB3, con 3 Cartucce da 500 GB"]

{"sheet":"Lotto1 T630R 2","index":20,"n_rows":188,"n_cols":9,"rows_kept":188,"cut":false,"hidden":true,"merged":[[186,2,186,4],[188,1,188,4],[177,2,177,4],[179,1,179,4],[180,2,180,4],[182,1,182,4],[183,2,183,4],[185,1,185,4],[176,1,176,4],[159,2,159,4],[161,1,161,4],[162,2,162,4],[164,1,164,4],[165,2,165,4],[167,1,167,4],[168,2,168,4],[170,1,170,4],[171,2,171,4],[173,1,173,4],[174,2,174,4],[158,1,158,4],[139,2,139,4],[141,1,141,4],[142,2,142,4],[144,1,144,4],[145,2,145,4],[147,1,147,4],[148,2,148,4],[150,1,150,4],[151,2,151,4],[153,1,153,4],[154,2,154,4],[96,7,97,8],[138,1,138,4],[116,2,116,4],[118,1,118,4],[122,2,122,4],[126,1,126,4],[127,2,127,4],[129,1,129,4],[130,2,130,4],[132,1,132,4],[133,2,133,4],[135,1,135,4],[136,2,136,4],[119,2,119,4],[121,1,121,4],[115,1,115,4],[97,2,97,4],[100,1,100,4],[101,2,101,4],[103,1,103,4],[104,2,104,4],[106,1,106,4],[107,2,107,4],[109,1,109,4],[110,2,110,4],[112,1,112,4],[77,1,77,4],[78,2,78,4],[92,1,92,4],[93,2,93,4],[96,1,96,3],[75,2,75,4],[41,2,41,4],[43,1,43,4],[44,2,44,4],[50,1,50,4],[51,2,51,4],[54,1,54,4],[55,2,55,4],[57,1,57,4],[58,2,58,4],[60,1,60,4],[62,1,62,4],[65,1,65,4],[74,1,74,4],[40,1,40,4],[21,1,21,4],[22,2,22,4],[24,1,24,4],[25,2,25,4],[27,1,27,4],[28,2,28,4],[30,1,30,4],[31,2,31,4],[34,1,34,4],[35,2,35,4],[37,1,37,4],[19,2,19,4],[4,0,4,4],[10,0,10,4],[11,0,12,5],[13,0,13,5]]}
["IN ROSSO LE OPZIONI 20%"]
[]
[]
[]
["Tecnologie Server 1 Lotto 1"]
[]
[null,null,null,null,null,null,null,"Totale Server e Opzioni",{"$f":"F18*SRV_CC","v":{"$error":"#N/A"}}]
[null,null,null,null,null,null,null,"Totale Ulteriori Opzioni ",{"$f":"G17*SRV_CC-(G74*SRV_CC)+G74-(SRV_CC*G71)+G71","v":0}]
[]
[null,null,null,null,null,null,null,"TOTALE CONVENZIONE",{"$f":"I8+I7","v":{"$error":"#N/A"}}]
[null,null,null,null,null,{"$f":"F18*C17","v":{"$error":"#N/A"}}]
["Components: \nServer DELL PowerEdge T630 (1CPU Intel® Xeon® E5-2640 v4, 32GB RDIMM, 2xHDD 300GB 10K RPM SAS 12Gbps 2.5in)"]
[]
[]
[]
["PowerEdge T630","Category: Server",null,null,null,{"$f":"1720","v":1720}]
[null,"Quantity: ",null,null,null,{"$f":"SUM(F21:F189)","v":{"$error":"#N/A"}}]
[null,null,null,null,null,{"$f":"SUM(F16:F17)","v":{"$error":"#N/A"}}]
[]
[null,"Base"]
[null,"PowerEdge T630 for Intel v4 CPUs",1,null,"[210-ACWJ][329-BCZH]"]
[]
[null,"Configurazione dello chassis"]
[null,"Chassis with up to 16, 2.5\" Hard Drives, Rack Configuration",1,null,"[321-BBJW]"]
[]
[null,"Processore"]
[null,"Intel Xeon E5-2640 v4 2.4GHz 25M Cache 8.0GT/s QPI Turbo HT 10C/20T (90W) Max Mem 2133MHz",1,null,"[338-BJDL]"]
[]
[null,"Processore aggiuntivo"]
[null,"No Additional Processor",{"$f":"VLOOKUP($B$30, CPU_C, 2, FALSE)","v":0},{"$f":"VLOOKUP($B$30, CPU_C, 3, FALSE)","v":""},{"$f":"VLOOKUP($B$30, CPU_C, 5, FALSE)","v":"[374-BBBX]"},{"$f":"VLOOKUP(B30, CPU_C, 12, FALSE)","v":0}]
[]
[null,"Processor Thermal Configuration"]
[null,"1 CPU up to 105W",1,null,"[412-AADW]"]
[null,{"$f":"VLOOKUP($B$30, CPU_C, 6, FALSE)","v":""},{"$f":"VLOOKUP($B$30, CPU_C, 7, FALSE)","v":""},null,{"$f":"VLOOKUP($B$30, CPU_C, 8, FALSE)","v":""}]
[]
[null,"Tipo di configurazione memoria"]
[null,"Performance Optimized",1,null,"[370-AAIP]"]
[]
[null,"Total Memory in GB",{"$f":"IF(F30=728,IF(B40=32,\"ATTENZIONE: AUMENTARE LA RAM\",\"\"),\"\")","v":""}]
[null,32]
[]
[null,"Tipo e velocità della memoria DIMM"]
[null,"2400MT/s RDIMMs",1,null,"[370-ACPH]"]
[]
[null,"Capacità di memoria"]
[null,"32GB RDIMM, 2400MT/s, Dual Rank, x4 Data Width",1,null,"[370-ACNS]"]
[]
[null,{"$f":"IF($B$30=\"No Additional Processor\",VLOOKUP($B$40, MEM_A1, 2, FALSE),VLOOKUP($B$40, MEM_A2, 2, FALSE))","v":""},{"$f":"IF($B$30=\"No Additional Processor\",VLOOKUP($B$40, MEM_A1, 3, FALSE),VLOOKUP($B$40, MEM_A2, 3, FALSE))","v":""},{"$f":"IF($B$30=\"No Additional Processor\",VLOOKUP($B$40, MEM_A1, 4, FALSE),VLOOKUP($B$40, MEM_A2, 4, FALSE))","v":""},{"$f":"IF($B$30=\"No Additional Processor\",VLOOKUP($B$40, MEM_A1, 6, FALSE),VLOOKUP($B$40, MEM_A2, 6, FALSE))","v":""},{"$f":"IF($B$30=\"No Additional Processor\",VLOOKUP($B$40, MEM_A1, 7, FALSE),VLOOKUP($B$40, MEM_A2, 7, FALSE))","v":""}]
[]
[null,{"$f":"IF($B$30=\"No Additional Processor\",VLOOKUP($B$40, MEM_A1, 11, FALSE),VLOOKUP($B$40, MEM_A2, 11, FALSE))","v":""},{"$f":"IF($B$30=\"No Additional Processor\",VLOOKUP($B$40, MEM_A1, 12, FALSE),VLOOKUP($B$40, MEM_A2, 12, FALSE))","v":""},{"$f":"IF($B$30=\"No Additional Processor\",VLOOKUP($B$40, MEM_A1, 13, FALSE),VLOOKUP($B$40, MEM_A2, 13, FALSE))","v":""},{"$f":"IF($B$30=\"No Additional Processor\",VLOOKUP($B$40, MEM_A1, 15, FALSE),VLOOKUP($B$40, MEM_A2, 15, FALSE))","v":""},{"$f":"IF($B$30=\"No Additional Processor\",VLOOKUP($B$40, MEM_A1, 16, FALSE),VLOOKUP($B$40, MEM_A2, 16, FALSE))","v":""}]
[]
[null,"Sistema operativo preinstallato"]
[null,"No Operating System",{"$f":"VLOOKUP($B$53, OS_A, 2, FALSE)","v":""},{"$f":"VLOOKUP($B$53, OS_A, 3, FALSE)","v":""},{"$f":"VLOOKUP($B$53, OS_A, 5, FALSE)","v":"[611-BBBF]"},{"$f":"VLOOKUP($B$53, OS_A, 6, FALSE)","v":""}]
[null,{"$f":"IF($B$34=\"No Additional Processor\",VLOOKUP($B$53, OS_A, 20, FALSE),VLOOKUP($B$53, OS_A2, 20, FALSE))","v":""},{"$f":"IF($B$34=\"No Additional Processor\",VLOOKUP($B$53, OS_A, 21, FALSE),VLOOKUP($B$53, OS_A2, 21, FALSE))","v":0},{"$f":"IF($B$34=\"No Additional Processor\",VLOOKUP($B$53, OS_A, 22, FALSE),VLOOKUP($B$53, OS_A2, 22, FALSE))","v":""},{"$f":"IF($B$34=\"No Additional Processor\",VLOOKUP($B$53, OS_A, 24, FALSE),VLOOKUP($B$53, OS_A2, 24, FALSE))","v":""},{"$f":"IF($B$34=\"No Additional Processor\",VLOOKUP($B$53, OS_A, 25, FALSE),VLOOKUP($B$53, OS_A2, 25, FALSE))","v":0}]
[]
[null,"OS Media Kits"]
[null,"No Media Required",1,null,"[605-BBFN]"]
[]
[null,"Client Access Licenses"]
[null,{"$f":"VLOOKUP($B$53, OS_A, 8, FALSE)","v":"None"},null,{"$f":"VLOOKUP($B$53, OS_A, 10, FALSE)","v":""},{"$f":"VLOOKUP($B$53, OS_A, 12, FALSE)","v":""},{"$f":"VLOOKUP($B$53, OS_A, 13, FALSE)*C60","v":0}]
[]
[null,{"$f":"VLOOKUP($B$53, OS_A, 14, FALSE)","v":"None"},null,{"$f":"VLOOKUP($B$53, OS_A, 16, FALSE)","v":""},{"$f":"VLOOKUP($B$53, OS_A, 18, FALSE)","v":""},{"$f":"VLOOKUP($B$53, OS_A, 19, FALSE)*C62","v":0}]
[]
[null,"Sistema operativo SUSE Linux Enterprise Server"]
[null,"None\n",{"$f":"VLOOKUP($B$65,SUSE, 2, FALSE)","v":0},{"$f":"VLOOKUP($B$65,SUSE, 3, FALSE)","v":""},{"$f":"VLOOKUP($B$65,SUSE, 5, FALSE)","v":""},null,{"$f":"VLOOKUP($B$65, SUSE, 6, FALSE)*C65","v":0}]
[]
[null,"Sistema operativo VMware"]
[null,"None",{"$f":"VLOOKUP($B$68,VMWARE, 2, FALSE)+C30","v":0},{"$f":"VLOOKUP($B$68,VMWARE, 3, FALSE)","v":""},{"$f":"VLOOKUP($B$68,VMWARE, 5, FALSE)","v":""},null,{"$f":"VLOOKUP($B$68, VMWARE, 6, FALSE)*C68","v":0}]
[]
[null,"VMware vCenter Server Standard"]
[null,"None",{"$f":"VLOOKUP($B$71,VMWARE2, 2, FALSE)","v":0},{"$f":"VLOOKUP($B$71,VMWARE2, 3, FALSE)","v":""},{"$f":"VLOOKUP($B$71,VMWARE2, 5, FALSE)","v":""},null,{"$f":"VLOOKUP($B$71, VMWARE2, 6, FALSE)*C71","v":0}]
[]
[null,"Essentials Plus Kit"]
[null,"None",{"$f":"IF(SRV_A<4,VLOOKUP($B$74,VMWARE1, 2, FALSE),0)","v":0},{"$f":"VLOOKUP($B$74,VMWARE1, 3, FALSE)","v":""},{"$f":"VLOOKUP($B$74,VMWARE1, 5, FALSE)","v":""},null,{"$f":"VLOOKUP($B$74, VMWARE1, 6, FALSE)*C74","v":0}]
[]
[null,"Controller RAID"]
[null,"PERC H730P Adapter RAID Controller, 2GB NV Cache",1,null,"[405-AACU]"]
[]
[null,"Dischi rigidi"]
[null,"300GB 10K RPM SAS 12Gbps 2.5in Hot-plug Hard Drive",2,null,"[400-AJPK]"]
[]
[null,"300GB 10K RPM SAS 12Gbps 2.5in Hot-plug Hard Drive,CusKit",null,{"$f":"VLOOKUP($B$82, HDD_C,3, FALSE)","v":{"$error":"#N/A"}},{"$f":"VLOOKUP($B$82, HDD_C,5, FALSE)","v":{"$error":"#N/A"}},{"$f":"VLOOKUP($B$82, HDD_C,6, FALSE)*C82","v":{"$error":"#N/A"}}]
[]
[null,"1.2TB 10K RPM SAS 12Gbps 2.5in Hot-plug Hard Drive,CusKit",null,{"$f":"VLOOKUP($B$84, HDD_C,3, FALSE)","v":{"$error":"#N/A"}},{"$f":"VLOOKUP($B$84, HDD_C,5, FALSE)","v":{"$error":"#N/A"}},{"$f":"VLOOKUP($B$84, HDD_C,6, FALSE)*C84","v":{"$error":"#N/A"}}]
[]
[null,"1.8TB 10K RPM SAS 12Gbps 512e 2.5in Hot-plug Hard Drive,CusKit",null,"TS1L1-HD1800","[400-AJQP]",null,{"$f":"VLOOKUP($B$86, HDD_B,6, FALSE)*C86","v":{"$error":"#N/A"}}]
[]
[null,"960GB Solid State Drive SAS Mix Use MLC 2.5in Hot-plug Drive, PX04SV, Cus Kit",null,"TS1L1-SSD800","[400-ANNX]",null,{"$f":"VLOOKUP($B$88, HDD_B,6, FALSE)*C88","v":{"$error":"#N/A"}}]
[]
[null,"1.92TB Solid State Drive SAS Mix Use MLC 2.5in Hot-plug Drive, PX04SV, Cus Kit",null,"TS1L1-SSD1920","[400-ANMN]",null,{"$f":"VLOOKUP($B$90, HDD_B,6, FALSE)*C90","v":{"$error":"#N/A"}}]
[]
[null,"DISCHI TOTALI",{"$f":"SUM(C80:C91)","v":2},{"$f":"IF(C92<=16,\"      OK\",\"     ERRORE:   Totale n° di dischi superiore al consentito\")","v":"      OK"}]
[]
[null,"Configurazione RAID"]
[null,"C3 - RAID 1 for H330 (2 HDDs)",1,null,{"$f":"VLOOKUP($B$95,  RAID_C1, 2, FALSE)","v":"[780-BBJK]"}]
[null,"Hot Spare for 300GB HDD","No"]
[null,"SCRIVERE QUI' LA CONFIGURAZIONE RAID RICHIESTA.\nT630 2\n",null,null,null,null,null,{"$f":"IF(B97=\"SCRIVERE QUI' LA CONFIGURAZIONE RAID RICHIESTA.\nT630 2\n\",\"ATTENZIONE COMPILARE IL CAMPO DELLA SCELTA RAID\", \"\")","v":"ATTENZIONE COMPILARE IL CAMPO DELLA SCELTA RAID"}]
[null,"Configurazione RAID HDD 1TB"]
[null,"",1,null,{"$f":"VLOOKUP($B$99,  RAID_C2, 2, FALSE)","v":""}]
[null,"Hot Spare for 1TB HDD","No"]
[]
[null,"Impostazioni del BIOS per la gestione dell'alimentazione"]
[null,"Performance BIOS Setting",1,null,"[384-BBBL]"]
[]
[null,"Raffreddamento"]
[null,"Fresh Air Cooling",1,null,"[384-BBDW]"]
[]
[null,"Alimentatore"]
[null,"Dual, Hot-plug, Redundant Power Supply (1+1), 750W, Titanium, 200-240VAC",1,null,"[450-ADWT]"]
[]
[null,"Cavi di alimentazione"]
[null,"C13 to C14, PDU Style, 10 AMP, 6.5 Feet (2m), Power Cord",2,null,"[450-AADY]"]
[]
[null,"TPM Module"]
[null,"PowerEdge Server FIPS TPM 2.0",1,null,"[461-AADM]"]
[]
[null,"Embedded Systems Management"]
[null,"iDrac8, Enterprise",1,null,"[385-BBHO]"]
[]
[null,"Modulo Doppia SD"]
[null,"None ",{"$f":"VLOOKUP($B$121,upsell_1, 2, FALSE)","v":0},{"$f":"VLOOKUP($B$121,upsell_1, 3, FALSE)","v":""},{"$f":"VLOOKUP($B$121,upsell_1, 4, FALSE)","v":""},{"$f":"VLOOKUP($B$121,upsell_1, 6, FALSE)","v":""},{"$f":"VLOOKUP($B$121,upsell_1, 7, FALSE)","v":0}]
[]
[null,"Adattatore di rete aggiuntivo"]
[null,"On-Board LOM 1GBE (Dual Port for Towers, Quad Port for Racks and Blades)",1,null,"[542-BBBP]"]
[]
[null,"Broadcom 5720 DP 1Gb Network Interface Card",1,null,"[540-BBCX]"]
[]
[null,"Additional Card for PCIe Slot 2 (CPU 1)"]
[null,"None",{"$f":"VLOOKUP($B$129,  PCI_C1, 2, FALSE)","v":""},{"$f":"VLOOKUP($B$129,  PCI_C1, 3, FALSE)","v":""},{"$f":"VLOOKUP($B$129,  PCI_C1, 5, FALSE)","v":""},{"$f":"VLOOKUP($B$129,  PCI_C1, 6, FALSE)","v":""},{"$f":"VLOOKUP($B$129,  PCI_C1, 7, FALSE)","v":0}]
[]
[null,"Additional Card for PCIe Slot 3 (CPU 1)"]
[null,"None",{"$f":"VLOOKUP($B$132,  PCI_C2, 2, FALSE)","v":""},{"$f":"VLOOKUP($B$132,  PCI_C2, 3, FALSE)","v":""},{"$f":"VLOOKUP($B$132,  PCI_C2, 5, FALSE)","v":""},{"$f":"VLOOKUP($B$132,  PCI_C2, 6, FALSE)","v":""},{"$f":"VLOOKUP($B$132,  PCI_C2, 7, FALSE)","v":0}]
[]
[null,"Additional Card for PCIe Slot 4 (CPU 2)"]
[null,"None",{"$f":"IF(B135=\"Aggiungere Secondo Processore\",\"\",(VLOOKUP(B135,PCI_C3, 2, FALSE)))","v":""},{"$f":"IF(B135=\"Aggiungere Secondo Processore\",\"\",(VLOOKUP(B135,  PCI_C3, 3, FALSE)))","v":""},{"$f":"VLOOKUP($B$135,  PCI_C3, 5, FALSE)","v":""},{"$f":"VLOOKUP($B$135,  PCI_C3, 6, FALSE)","v":""},{"$f":"VLOOKUP($B$135,  PCI_C3, 7, FALSE)","v":0}]
[]
[null,"Additional Card for PCIe Slot 5 (CPU 2)"]
[null,"None",{"$f":"IF(B138=\"Aggiungere Secondo Processore\",\"\",(VLOOKUP(B138,PCI_C4, 2, FALSE)))","v":""},{"$f":"IF(B138=\"Aggiungere Secondo Processore\",\"\",(VLOOKUP(B138,  PCI_C4, 3, FALSE)))","v":""},{"$f":"VLOOKUP($B$138,  PCI_C4, 5, FALSE)","v":""},{"$f":"VLOOKUP($B$138,  PCI_C4, 6, FALSE)","v":""},{"$f":"VLOOKUP($B$138,  PCI_C4, 7, FALSE)","v":0}]
[]
[null,"Additional Card for PCIe Slot 6 (CPU 2)"]
[null,"None",{"$f":"IF(B141=\"Aggiungere Secondo Processore\",\"\",(VLOOKUP(B141,PCI_C4, 2, FALSE)))","v":""},{"$f":"IF(B141=\"Aggiungere Secondo Processore\",\"\",(VLOOKUP(B141,  PCI_C4, 3, FALSE)))","v":""},{"$f":"VLOOKUP($B$141,  PCI_C5, 5, FALSE)","v":""},{"$f":"VLOOKUP($B$141,  PCI_C5, 6, FALSE)","v":""},{"$f":"VLOOKUP($B$141,  PCI_C4, 7, FALSE)","v":0}]
[]
[null,"Additional Card for PCIe Slot 7 (CPU 2)"]
[null,"None",{"$f":"IF(B144=\"Aggiungere Secondo Processore\",\"\",(VLOOKUP(B144,PCI_C4, 2, FALSE)))","v":""},{"$f":"IF(B144=\"Aggiungere Secondo Processore\",\"\",(VLOOKUP(B144,  PCI_C4, 3, FALSE)))","v":""},{"$f":"VLOOKUP($B$144,  PCI_C6, 5, FALSE)","v":""},{"$f":"VLOOKUP($B$144,  PCI_C6, 6, FALSE)","v":""},{"$f":"VLOOKUP($B$144,  PCI_C6, 7, FALSE)","v":0}]
[]
[null,"Pannello frontale"]
[null,"No Bezel",1,null,"[350-BBBW]"]
[]
[null,"Guide per rack"]
[null,"Ready Rails Sliding Rails",1,null,"[770-BBJI]"]
[]
[null,"Unità ottica interna"]
[null,"No Internal Optical Drive, 2.5in Chassis",1,null,"[429-AAIQ][429-AAQS]"]
[]
[null,"Accessori per server"]
[null,"Redundant Fan Option",1,null,"[750-AAFF]"]
[]
[null,"PowerEdge SFP+, 10GbE SR/SX, Optical Tranceiver, LC Connector, for Intel and Broadcom,CusKit",{"$f":"(VLOOKUP(B132,PCI_C2,8,FALSE))+((VLOOKUP(B129,PCI_C1,8,FALSE)))+((VLOOKUP(B135,PCI_C3,8,FALSE)))+((VLOOKUP(B138,PCI_C4,8,FALSE)))+((VLOOKUP(B141,PCI_C5,8,FALSE)))+((VLOOKUP(B144,PCI_C6,8,FALSE)))","v":{"$error":"#VALUE!"}},null,"[407-BBQE]"]
[]
[null,"System Documentation"]
[null,"Electronic System Documentation and OpenManage DVD Kit, PowerEdge T630",1,null,"[343-BBDE]"]
[]
[null,"SHIPPING"]
[null,"PowerEdge T630 Shipping EMEA1 (English/French/German/Spanish/Russian/Hebrew)",1,null,"[340-AMBT]"]
[]
[null,"Order Information"]
[null,"Enterprise Order - EMEA",1,null,"[800-11671]"]
[]
[null,"Base warranty"]
[null,"3Yr Basic Warranty - Next Business Day - Minimum Warranty",1,null,"[709-12798][709-12799]"]
[]
[null,"Servizi di assitenza"]
[null,"Dell Channel Order - Service Info only",1,null,"[710-31085]"]
[]
[null,"Aggiornamenti della garanzia"]
[null,"None",{"$f":"VLOOKUP($B$176,  SO_C1, 2, FALSE)","v":""},{"$f":"VLOOKUP($B$176,  SO_C1, 3, FALSE)","v":""},{"$f":"VLOOKUP($B$176,  SO_C1, 5, FALSE)","v":""},{"$f":"VLOOKUP($B$176,  SO_C1, 6, FALSE)","v":""}]
[]
[null,"Protezione dei dati - Keep Your Hard Drive "]
[null,"None",{"$f":"VLOOKUP($B$179,  SO_C2, 2, FALSE)","v":""},{"$f":"VLOOKUP($B$179,  SO_C2, 3, FALSE)","v":""},{"$f":"VLOOKUP($B$179,  SO_C2,5, FALSE)","v":""},{"$f":"VLOOKUP($B$179,  SO_C2, 6, FALSE)","v":""}]
[]
[null,"Servizi di Installazione"]
[null,"No Installation Service Selected",1,null,"[683-11870]"]
[]
[null,"Channel only - Support Extension"]
[null,"Channel 39M Basic Warranty - Next Business Day",1,null,"[723-28783]"]
[]
[null,"Warranty Upgrades - Non-Std/Local POS"]
[null,"CSTM CONSIP - 39M Onsite Labor Support for CRU for Servers with Basic Warranty",1,null,"[681-24467]"]

{"sheet":"Lotto1 T630R 3","index":21,"n_rows":188,"n_cols":9,"rows_kept":188,"cut":false,"hidden":true,"merged":[[186,2,186,4],[188,1,188,4],[177,2,177,4],[179,1,179,4],[180,2,180,4],[182,1,182,4],[183,2,183,4],[185,1,185,4],[176,1,176,4],[159,2,159,4],[161,1,161,4],[162,2,162,4],[164,1,164,4],[165,2,165,4],[167,1,167,4],[168,2,168,4],[170,1,170,4],[171,2,171,4],[173,1,173,4],[174,2,174,4],[158,1,158,4],[139,2,139,4],[141,1,141,4],[142,2,142,4],[144,1,144,4],[145,2,145,4],[147,1,147,4],[148,2,148,4],[150,1,150,4],[151,2,151,4],[153,1,153,4],[154,2,154,4],[138,1,138,4],[116,2,116,4],[118,1,118,4],[122,2,122,4],[126,1,126,4],[127,2,127,4],[129,1,129,4],[130,2,130,4],[132,1,132,4],[133,2,133,4],[135,1,135,4],[136,2,136,4],[119,2,119,4],[121,1,121,4],[115,1,115,4],[97,2,97,4],[100,1,100,4],[101,2,101,4],[103,1,103,4],[104,2,104,4],[106,1,106,4],[107,2,107,4],[109,1,109,4],[110,2,110,4],[112,1,112,4],[77,1,77,4],[78,2,78,4],[92,1,92,4],[93,2,93,4],[96,1,96,3],[35,2,35,4],[37,1,37,4],[75,2,75,4],[41,2,41,4],[43,1,43,4],[44,2,44,4],[50,1,50,4],[51,2,51,4],[54,1,54,4],[55,2,55,4],[57,1,57,4],[58,2,58,4],[60,1,60,4],[62,1,62,4],[65,1,65,4],[74,1,74,4],[96,7,97,8],[19,2,19,4],[4,0,4,4],[10,0,10,4],[11,0,12,5],[13,0,13,5],[40,1,40,4],[21,1,21,4],[22,2,22,4],[24,1,24,4],[25,2,25,4],[27,1,27,4],[28,2,28,4],[30,1,30,4],[31,2,31,4],[34,1,34,4]]}
["IN ROSSO LE OPZIONI 20%"]
[]
[]
[]
["Tecnologie Server 1 Lotto 1"]
[]
[null,null,null,null,null,null,null,"Totale Server e Opzioni",{"$f":"F18*SRV_CCC","v":{"$error":"#N/A"}}]
[null,null,null,null,null,null,null,"Totale Ulteriori Opzioni ",{"$f":"G17*SRV_CCC-(G74*SRV_CCC)+G74-(SRV_CCC*G71)+G71","v":0}]
[]
[null,null,null,null,null,null,null,"TOTALE CONVENZIONE",{"$f":"I8+I7","v":{"$error":"#N/A"}}]
[null,null,null,null,null,{"$f":"F18*C17","v":{"$error":"#N/A"}}]
["Components: \nServer DELL PowerEdge T630 (1CPU Intel® Xeon® E5-2640 v4, 32GB RDIMM, 2xHDD 300GB 10K RPM SAS 12Gbps 2.5in)"]
[]
[]
[]
["PowerEdge T630","Category: Server",null,null,null,{"$f":"1720","v":1720}]
[null,"Quantity: ",null,null,null,{"$f":"SUM(F21:F189)","v":{"$error":"#N/A"}}]
[null,null,null,null,null,{"$f":"SUM(F16:F17)","v":{"$error":"#N/A"}}]
[]
[null,"Base"]
[null,"PowerEdge T630 for Intel v4 CPUs",1,null,"[210-ACWJ][329-BCZH]"]
[]
[null,"Configurazione dello chassis"]
[null,"Chassis with up to 16, 2.5\" Hard Drives, Rack Configuration",1,null,"[321-BBJW]"]
[]
[null,"Processore"]
[null,"Intel Xeon E5-2640 v4 2.4GHz 25M Cache 8.0GT/s QPI Turbo HT 10C/20T (90W) Max Mem 2133MHz",1,null,"[338-BJDL]"]
[]
[null,"Processore aggiuntivo"]
[null,"No Additional Processor",{"$f":"VLOOKUP($B$30, CPU_C, 2, FALSE)","v":0},{"$f":"VLOOKUP($B$30, CPU_C, 3, FALSE)","v":""},{"$f":"VLOOKUP($B$30, CPU_C, 5, FALSE)","v":"[374-BBBX]"},{"$f":"VLOOKUP(B30, CPU_C, 12, FALSE)","v":0}]
[]
[null,"Processor Thermal Configuration"]
[null,"1 CPU up to 105W",1,null,"[412-AADW]"]
[null,{"$f":"VLOOKUP($B$30, CPU_C, 6, FALSE)","v":""},{"$f":"VLOOKUP($B$30, CPU_C, 7, FALSE)","v":""},null,{"$f":"VLOOKUP($B$30, CPU_C, 8, FALSE)","v":""}]
[]
[null,"Tipo di configurazione memoria"]
[null,"Performance Optimized",1,null,"[370-AAIP]"]
[]
[null,"Total Memory in GB",{"$f":"IF(F30=728,IF(B40=32,\"ATTENZIONE: AUMENTARE LA RAM\",\"\"),\"\")","v":""}]
[null,32]
[]
[null,"Tipo e velocità della memoria DIMM"]
[null,"2400MT/s RDIMMs",1,null,"[370-ACPH]"]
[]
[null,"Capacità di memoria"]
[null,"32GB RDIMM, 2400MT/s, Dual Rank, x4 Data Width",1,null,"[370-ACNS]"]
[]
[null,{"$f":"IF($B$30=\"No Additional Processor\",VLOOKUP($B$40, MEM_A1, 2, FALSE),VLOOKUP($B$40, MEM_A2, 2, FALSE))","v":""},{"$f":"IF($B$30=\"No Additional Processor\",VLOOKUP($B$40, MEM_A1, 3, FALSE),VLOOKUP($B$40, MEM_A2, 3, FALSE))","v":""},{"$f":"IF($B$30=\"No Additional Processor\",VLOOKUP($B$40, MEM_A1, 4, FALSE),VLOOKUP($B$40, MEM_A2, 4, FALSE))","v":""},{"$f":"IF($B$30=\"No Additional Processor\",VLOOKUP($B$40, MEM_A1, 6, FALSE),VLOOKUP($B$40, MEM_A2, 6, FALSE))","v":""},{"$f":"IF($B$30=\"No Additional Processor\",VLOOKUP($B$40, MEM_A1, 7, FALSE),VLOOKUP($B$40, MEM_A2, 7, FALSE))","v":""}]
[]
[null,{"$f":"IF($B$30=\"No Additional Processor\",VLOOKUP($B$40, MEM_A1, 11, FALSE),VLOOKUP($B$40, MEM_A2, 11, FALSE))","v":""},{"$f":"IF($B$30=\"No Additional Processor\",VLOOKUP($B$40, MEM_A1, 12, FALSE),VLOOKUP($B$40, MEM_A2, 12, FALSE))","v":""},{"$f":"IF($B$30=\"No Additional Processor\",VLOOKUP($B$40, MEM_A1, 13, FALSE),VLOOKUP($B$40, MEM_A2, 13, FALSE))","v":""},{"$f":"IF($B$30=\"No Additional Processor\",VLOOKUP($B$40, MEM_A1, 15, FALSE),VLOOKUP($B$40, MEM_A2, 15, FALSE))","v":""},{"$f":"IF($B$30=\"No Additional Processor\",VLOOKUP($B$40, MEM_A1, 16, FALSE),VLOOKUP($B$40, MEM_A2, 16, FALSE))","v":""}]
[]
[null,"Sistema operativo preinstallato"]
[null,"No Operating System",{"$f":"VLOOKUP($B$53, OS_A, 2, FALSE)","v":""},{"$f":"VLOOKUP($B$53, OS_A, 3, FALSE)","v":""},{"$f":"VLOOKUP($B$53, OS_A, 5, FALSE)","v":"[611-BBBF]"},{"$f":"VLOOKUP($B$53, OS_A, 6, FALSE)","v":""}]
[null,{"$f":"IF($B$34=\"No Additional Processor\",VLOOKUP($B$53, OS_A, 20, FALSE),VLOOKUP($B$53, OS_A2, 20, FALSE))","v":""},{"$f":"IF($B$34=\"No Additional Processor\",VLOOKUP($B$53, OS_A, 21, FALSE),VLOOKUP($B$53, OS_A2, 21, FALSE))","v":0},{"$f":"IF($B$34=\"No Additional Processor\",VLOOKUP($B$53, OS_A, 22, FALSE),VLOOKUP($B$53, OS_A2, 22, FALSE))","v":""},{"$f":"IF($B$34=\"No Additional Processor\",VLOOKUP($B$53, OS_A, 24, FALSE),VLOOKUP($B$53, OS_A2, 24, FALSE))","v":""},{"$f":"IF($B$34=\"No Additional Processor\",VLOOKUP($B$53, OS_A, 25, FALSE),VLOOKUP($B$53, OS_A2, 25, FALSE))","v":0}]
[]
[null,"OS Media Kits"]
[null,"No Media Required",1,null,"[605-BBFN]"]
[]
[null,"Client Access Licenses"]
[null,{"$f":"VLOOKUP($B$53, OS_A, 8, FALSE)","v":"None"},null,{"$f":"VLOOKUP($B$53, OS_A, 10, FALSE)","v":""},{"$f":"VLOOKUP($B$53, OS_A, 12, FALSE)","v":""},{"$f":"VLOOKUP($B$53, OS_A, 13, FALSE)*C60","v":0}]
[]
[null,{"$f":"VLOOKUP($B$53, OS_A, 14, FALSE)","v":"None"},null,{"$f":"VLOOKUP($B$53, OS_A, 16, FALSE)","v":""},{"$f":"VLOOKUP($B$53, OS_A, 18, FALSE)","v":""},{"$f":"VLOOKUP($B$53, OS_A, 19, FALSE)*C62","v":0}]
[]
[null,"Sistema operativo SUSE Linux Enterprise Server"]
[null,"None\n",{"$f":"VLOOKUP($B$65,SUSE, 2, FALSE)","v":0},{"$f":"VLOOKUP($B$65,SUSE, 3, FALSE)","v":""},{"$f":"VLOOKUP($B$65,SUSE, 5, FALSE)","v":""},null,{"$f":"VLOOKUP($B$65, SUSE, 6, FALSE)*C65","v":0}]
[]
[null,"Sistema operativo VMware"]
[null,"None",{"$f":"VLOOKUP($B$68,VMWARE, 2, FALSE)+C30","v":0},{"$f":"VLOOKUP($B$68,VMWARE, 3, FALSE)","v":""},{"$f":"VLOOKUP($B$68,VMWARE, 5, FALSE)","v":""},null,{"$f":"VLOOKUP($B$68, VMWARE, 6, FALSE)*C68","v":0}]
[]
[null,"VMware vCenter Server Standard"]
[null,"None",{"$f":"VLOOKUP($B$71,VMWARE2, 2, FALSE)","v":0},{"$f":"VLOOKUP($B$71,VMWARE2, 3, FALSE)","v":""},{"$f":"VLOOKUP($B$71,VMWARE2, 5, FALSE)","v":""},null,{"$f":"VLOOKUP($B$71, VMWARE2, 6, FALSE)*C71","v":0}]
[]
[null,"Essentials Plus Kit"]
[null,"None",{"$f":"IF(SRV_A<4,VLOOKUP($B$74,VMWARE1, 2, FALSE),0)","v":0},{"$f":"VLOOKUP($B$74,VMWARE1, 3, FALSE)","v":""},{"$f":"VLOOKUP($B$74,VMWARE1, 5, FALSE)","v":""},null,{"$f":"VLOOKUP($B$74, VMWARE1, 6, FALSE)*C74","v":0}]
[]
[null,"Controller RAID"]
[null,"PERC H730P Adapter RAID Controller, 2GB NV Cache",1,null,"[405-AACU]"]
[]
[null,"Dischi rigidi"]
[null,"300GB 10K RPM SAS 12Gbps 2.5in Hot-plug Hard Drive",2,null,"[400-AJPK]"]
[]
[null,"300GB 10K RPM SAS 12Gbps 2.5in Hot-plug Hard Drive,CusKit",null,{"$f":"VLOOKUP($B$82, HDD_C,3, FALSE)","v":{"$error":"#N/A"}},{"$f":"VLOOKUP($B$82, HDD_C,5, FALSE)","v":{"$error":"#N/A"}},{"$f":"VLOOKUP($B$82, HDD_C,6, FALSE)*C82","v":{"$error":"#N/A"}}]
[]
[null,"1.2TB 10K RPM SAS 12Gbps 2.5in Hot-plug Hard Drive,CusKit",null,{"$f":"VLOOKUP($B$84, HDD_C,3, FALSE)","v":{"$error":"#N/A"}},{"$f":"VLOOKUP($B$84, HDD_C,5, FALSE)","v":{"$error":"#N/A"}},{"$f":"VLOOKUP($B$84, HDD_C,6, FALSE)*C84","v":{"$error":"#N/A"}}]
[]
[null,"1.8TB 10K RPM SAS 12Gbps 512e 2.5in Hot-plug Hard Drive,CusKit",null,"TS1L1-HD1800","[400-AJQP]",null,{"$f":"VLOOKUP($B$86, HDD_B,6, FALSE)*C86","v":{"$error":"#N/A"}}]
[]
[null,"960GB Solid State Drive SAS Mix Use MLC 2.5in Hot-plug Drive, PX04SV, Cus Kit",null,"TS1L1-SSD800","[400-ANNX]",null,{"$f":"VLOOKUP($B$88, HDD_B,6, FALSE)*C88","v":{"$error":"#N/A"}}]
[]
[null,"1.92TB Solid State Drive SAS Mix Use MLC 2.5in Hot-plug Drive, PX04SV, Cus Kit",null,"TS1L1-SSD1920","[400-ANMN]",null,{"$f":"VLOOKUP($B$90, HDD_B,6, FALSE)*C90","v":{"$error":"#N/A"}}]
[]
[null,"DISCHI TOTALI",{"$f":"SUM(C80:C91)","v":2},{"$f":"IF(C92<=16,\"      OK\",\"     ERRORE:   Totale n° di dischi superiore al consentito\")","v":"      OK"}]
[]
[null,"Configurazione RAID"]
[null,"C3 - RAID 1 for H330 (2 HDDs)",1,null,{"$f":"VLOOKUP($B$95,  RAID_C1, 2, FALSE)","v":"[780-BBJK]"}]
[null,"Hot Spare for 300GB HDD","No"]
[null,"SCRIVERE QUI' LA CONFIGURAZIONE RAID RICHIESTA.\nT630 3\n",null,null,null,null,null,{"$f":"IF(B97=\"SCRIVERE QUI' LA CONFIGURAZIONE RAID RICHIESTA.\nT630 3\n\",\"ATTENZIONE COMPILARE IL CAMPO DELLA SCELTA RAID\", \"\")","v":"ATTENZIONE COMPILARE IL CAMPO DELLA SCELTA RAID"}]
[null,"Configurazione RAID HDD 1TB"]
[null,"",1,null,{"$f":"VLOOKUP($B$99,  RAID_C2, 2, FALSE)","v":""}]
[null,"Hot Spare for 1TB HDD","No"]
[]
[null,"Impostazioni del BIOS per la gestione dell'alimentazione"]
[null,"Performance BIOS Setting",1,null,"[384-BBBL]"]
[]
[null,"Raffreddamento"]
[null,"Fresh Air Cooling",1,null,"[384-BBDW]"]
[]
[null,"Alimentatore"]
[null,"Dual, Hot-plug, Redundant Power Supply (1+1), 750W, Titanium, 200-240VAC",1,null,"[450-ADWT]"]
[]
[null,"Cavi di alimentazione"]
[null,"C13 to C14, PDU Style, 10 AMP, 6.5 Feet (2m), Power Cord",2,null,"[450-AADY]"]
[]
[null,"TPM Module"]
[null,"PowerEdge Server FIPS TPM 2.0",1,null,"[461-AADM]"]
[]
[null,"Embedded Systems Management"]
[null,"iDrac8, Enterprise",1,null,"[385-BBHO]"]
[]
[null,"Modulo Doppia SD"]
[null,"None ",{"$f":"VLOOKUP($B$121,upsell_1, 2, FALSE)","v":0},{"$f":"VLOOKUP($B$121,upsell_1, 3, FALSE)","v":""},{"$f":"VLOOKUP($B$121,upsell_1, 4, FALSE)","v":""},{"$f":"VLOOKUP($B$121,upsell_1, 6, FALSE)","v":""},{"$f":"VLOOKUP($B$121,upsell_1, 7, FALSE)","v":0}]
[]
[null,"Adattatore di rete aggiuntivo"]
[null,"On-Board LOM 1GBE (Dual Port for Towers, Quad Port for Racks and Blades)",1,null,"[542-BBBP]"]
[]
[null,"Broadcom 5720 DP 1Gb Network Interface Card",1,null,"[540-BBCX]"]
[]
[null,"Additional Card for PCIe Slot 2 (CPU 1)"]
[null,"None",{"$f":"VLOOKUP($B$129,  PCI_C1, 2, FALSE)","v":""},{"$f":"VLOOKUP($B$129,  PCI_C1, 3, FALSE)","v":""},{"$f":"VLOOKUP($B$129,  PCI_C1, 5, FALSE)","v":""},{"$f":"VLOOKUP($B$129,  PCI_C1, 6, FALSE)","v":""},{"$f":"VLOOKUP($B$129,  PCI_C1, 7, FALSE)","v":0}]
[]
[null,"Additional Card for PCIe Slot 3 (CPU 1)"]
[null,"None",{"$f":"VLOOKUP($B$132,  PCI_C2, 2, FALSE)","v":""},{"$f":"VLOOKUP($B$132,  PCI_C2, 3, FALSE)","v":""},{"$f":"VLOOKUP($B$132,  PCI_C2, 5, FALSE)","v":""},{"$f":"VLOOKUP($B$132,  PCI_C2, 6, FALSE)","v":""},{"$f":"VLOOKUP($B$132,  PCI_C2, 7, FALSE)","v":0}]
[]
[null,"Additional Card for PCIe Slot 4 (CPU 2)"]
[null,"None",{"$f":"IF(B135=\"Aggiungere Secondo Processore\",\"\",(VLOOKUP(B135,PCI_C3, 2, FALSE)))","v":""},{"$f":"IF(B135=\"Aggiungere Secondo Processore\",\"\",(VLOOKUP(B135,  PCI_C3, 3, FALSE)))","v":""},{"$f":"VLOOKUP($B$135,  PCI_C3, 5, FALSE)","v":""},{"$f":"VLOOKUP($B$135,  PCI_C3, 6, FALSE)","v":""},{"$f":"VLOOKUP($B$135,  PCI_C3, 7, FALSE)","v":0}]
[]
[null,"Additional Card for PCIe Slot 5 (CPU 2)"]
[null,"None",{"$f":"IF(B138=\"Aggiungere Secondo Processore\",\"\",(VLOOKUP(B138,PCI_C4, 2, FALSE)))","v":""},{"$f":"IF(B138=\"Aggiungere Secondo Processore\",\"\",(VLOOKUP(B138,  PCI_C4, 3, FALSE)))","v":""},{"$f":"VLOOKUP($B$138,  PCI_C4, 5, FALSE)","v":""},{"$f":"VLOOKUP($B$138,  PCI_C4, 6, FALSE)","v":""},{"$f":"VLOOKUP($B$138,  PCI_C4, 7, FALSE)","v":0}]
[]
[null,"Additional Card for PCIe Slot 6 (CPU 2)"]
[null,"None",{"$f":"IF(B141=\"Aggiungere Secondo Processore\",\"\",(VLOOKUP(B141,PCI_C4, 2, FALSE)))","v":""},{"$f":"IF(B141=\"Aggiungere Secondo Processore\",\"\",(VLOOKUP(B141,  PCI_C4, 3, FALSE)))","v":""},{"$f":"VLOOKUP($B$141,  PCI_C5, 5, FALSE)","v":""},{"$f":"VLOOKUP($B$141,  PCI_C5, 6, FALSE)","v":""},{"$f":"VLOOKUP($B$141,  PCI_C4, 7, FALSE)","v":0}]
[]
[null,"Additional Card for PCIe Slot 7 (CPU 2)"]
[null,"None",{"$f":"IF(B144=\"Aggiungere Secondo Processore\",\"\",(VLOOKUP(B144,PCI_C4, 2, FALSE)))","v":""},{"$f":"IF(B144=\"Aggiungere Secondo Processore\",\"\",(VLOOKUP(B144,  PCI_C4, 3, FALSE)))","v":""},{"$f":"VLOOKUP($B$144,  PCI_C6, 5, FALSE)","v":""},{"$f":"VLOOKUP($B$144,  PCI_C6, 6, FALSE)","v":""},{"$f":"VLOOKUP($B$144,  PCI_C6, 7, FALSE)","v":0}]
[]
[null,"Pannello frontale"]
[null,"No Bezel",1,null,"[350-BBBW]"]
[]
[null,"Guide per rack"]
[null,"Ready Rails Sliding Rails",1,null,"[770-BBJI]"]
[]
[null,"Unità ottica interna"]
[null,"No Internal Optical Drive, 2.5in Chassis",1,null,"[429-AAIQ][429-AAQS]"]
[]
[null,"Accessori per server"]
[null,"Redundant Fan Option",1,null,"[750-AAFF]"]
[]
[null,"PowerEdge SFP+, 10GbE SR/SX, Optical Tranceiver, LC Connector, for Intel and Broadcom,CusKit",{"$f":"(VLOOKUP(B132,PCI_C2,8,FALSE))+((VLOOKUP(B129,PCI_C1,8,FALSE)))+((VLOOKUP(B135,PCI_C3,8,FALSE)))+((VLOOKUP(B138,PCI_C4,8,FALSE)))+((VLOOKUP(B141,PCI_C5,8,FALSE)))+((VLOOKUP(B144,PCI_C6,8,FALSE)))","v":{"$error":"#VALUE!"}},null,"[407-BBQE]"]
[]
[null,"System Documentation"]
[null,"Electronic System Documentation and OpenManage DVD Kit, PowerEdge T630",1,null,"[343-BBDE]"]
[]
[null,"SHIPPING"]
[null,"PowerEdge T630 Shipping EMEA1 (English/French/German/Spanish/Russian/Hebrew)",1,null,"[340-AMBT]"]
[]
[null,"Order Information"]
[null,"Enterprise Order - EMEA",1,null,"[800-11671]"]
[]
[null,"Base warranty"]
[null,"3Yr Basic Warranty - Next Business Day - Minimum Warranty",1,null,"[709-12798][709-12799]"]
[]
[null,"Servizi di assitenza"]
[null,"Dell Channel Order - Service Info only",1,null,"[710-31085]"]
[]
[null,"Aggiornamenti della garanzia"]
[null,"None",{"$f":"VLOOKUP($B$176,  SO_C1, 2, FALSE)","v":""},{"$f":"VLOOKUP($B$176,  SO_C1, 3, FALSE)","v":""},{"$f":"VLOOKUP($B$176,  SO_C1, 5, FALSE)","v":""},{"$f":"VLOOKUP($B$176,  SO_C1, 6, FALSE)","v":""}]
[]
[null,"Protezione dei dati - Keep Your Hard Drive "]
[null,"None",{"$f":"VLOOKUP($B$179,  SO_C2, 2, FALSE)","v":""},{"$f":"VLOOKUP($B$179,  SO_C2, 3, FALSE)","v":""},{"$f":"VLOOKUP($B$179,  SO_C2,5, FALSE)","v":""},{"$f":"VLOOKUP($B$179,  SO_C2, 6, FALSE)","v":""}]
[]
[null,"Servizi di Installazione"]
[null,"No Installation Service Selected",1,null,"[683-11870]"]
[]
[null,"Channel only - Support Extension"]
[null,"Channel 39M Basic Warranty - Next Business Day",1,null,"[723-28783]"]
[]
[null,"Warranty Upgrades - Non-Std/Local POS"]
[null,"CSTM CONSIP - 39M Onsite Labor Support for CRU for Servers with Basic Warranty",1,null,"[681-24467]"]

{"sheet":"Servizi Opzionali","index":22,"n_rows":92,"n_cols":13,"rows_kept":92,"cut":false,"hidden":true,"merged":[]}
["Warranty Upgrades",null,null,null,null,null,"Protezione dei dati - Keep Your Hard Drive "]
["R630"]
["None",{"$f":"\"\"","v":""},{"$f":"\"\"","v":""},{"$f":"\"\"","v":""},{"$f":"\"\"","v":""},{"$f":"\"\"","v":""},null,null,{"$f":"IF(($A$22=$A$12),\"\",IF($A$8=$A$3,I13,IF($A$8=$A$4,I14,IF($A$8=$A$5,I15))))","v":""},{"$f":"IF(($A$22=$A$12),\"\",IF($A$8=$A$3,J13,IF($A$8=$A$4,J14,IF($A$8=$A$5,J15))))","v":""},{"$f":"IF(($A$22=$A$12),\"\",IF($A$8=$A$3,K13,IF($A$8=$A$4,K14,IF($A$8=$A$5,K15))))","v":""},{"$f":"IF(($A$22=$A$12),\"\",IF($A$8=$A$3,L13,IF($A$8=$A$4,L14,IF($A$8=$A$5,L15))))","v":""},{"$f":"IF(($A$22=$A$12),\"\",IF($A$8=$A$3,M13,IF($A$8=$A$4,M14,IF($A$8=$A$5,M15))))","v":""}]
["Estensione della manutenzione in garanzia per ulteriori 12 mesi",1,"CNV-TS1L1-4Y-R640","TS1L1-4Y-R640",{"$f":"\"\"","v":""},42]
["Estensione della manutenzione in garanzia per ulteriori 24 mesi",1,"CNV-TS1L1-5Y-R640","TS1L1-5Y-R640",{"$f":"\"\"","v":""},85]
[]
["Estensione Garanzia Selezionata"]
[{"$f":"'CNV R640 1'!$B$162","v":"None"},null,"R630"]
[{"$f":"#REF!","v":{"$error":"#REF!"}},null,"R630 2"]
[{"$f":"#REF!","v":{"$error":"#REF!"}},null,"R630 3"]
[]
["None",{"$f":"\"\"","v":""},{"$f":"\"\"","v":""},{"$f":"\"\"","v":""},{"$f":"\"\"","v":""},{"$f":"\"\"","v":""},null,"None"]
[{"$f":"IF($A$8=$A$3,H13,IF($A$8=$A$4,H14,IF($A$8=$A$5,H15)))","v":"3Yr Data Protection - Keep Your Hard Drive"},1,"10L1-SO-HDD","S10L1-R630-S-HDD",{"$f":"IF($A$8=$A$3,L13,IF($A$8=$A$4,L14,IF($A$8=$A$5,L15)))","v":"[733-10057]"},150,null,"3Yr Data Protection - Keep Your Hard Drive",1,"10L1-SO-HDD","S10L1-R630-S-HDD","[733-10057]",150]
["None",{"$f":"\"\"","v":""},{"$f":"\"\"","v":""},{"$f":"\"\"","v":""},{"$f":"\"\"","v":""},{"$f":"\"\"","v":""},null,"4Yr Data Protection - Keep Your Hard Drive",{"$f":"I13","v":1},{"$f":"J13","v":"10L1-SO-HDD"},{"$f":"K13","v":"S10L1-R630-S-HDD"},"[733-10058]",{"$f":"M13","v":150}]
[{"$f":"IF(A9=A3,H13,IF(A9=A4,H14,IF(A9=A5,H15)))","v":{"$error":"#REF!"}},1,"10L1-SO-HDD","S10L1-R730xd-S-HDD",{"$f":"IF(A9=A3,L13,IF(A9=A4,L14,IF(A9=A5,L15)))","v":{"$error":"#REF!"}},150,null,"5Yr Data Protection - Keep Your Hard Drive",{"$f":"I13","v":1},{"$f":"J13","v":"10L1-SO-HDD"},{"$f":"K13","v":"S10L1-R630-S-HDD"},"[733-10059]",{"$f":"M13","v":150}]
["None",{"$f":"\"\"","v":""},{"$f":"\"\"","v":""},{"$f":"\"\"","v":""},{"$f":"\"\"","v":""},{"$f":"\"\"","v":""}]
[{"$f":"IF(A10=A3,H13,IF(A10=A4,H14,IF(A10=A5,H15)))","v":{"$error":"#REF!"}},1,"10L1-SO-HDD","S10L1-R730xd-S-HDD",{"$f":"IF(A10=A3,L13,IF(A10=A4,L14,IF(A10=A5,L15)))","v":{"$error":"#REF!"}},150]
[]
[]
[]
["Protezione dei dati Selezionata"]
[{"$f":"'CNV R640 1'!B165","v":"None"}]
[]
["Servizio Specialistico di System and Network Management per sistema opertivo Windows, erogato on site.",1,"10L1-SO-WIN","S10L1-R630-S-WIN",null,193]
["Servizio Specialistico di System and Network Management per sistema opertivo Linux, erogato on site.",1,"10L1-SO-LINUX","S10L1-R630-S-LINUX",null,193]
[]
["None",{"$f":"\"\"","v":""},{"$f":"\"\"","v":""},{"$f":"\"\"","v":""},{"$f":"\"\"","v":""},{"$f":"\"\"","v":""}]
[{"$f":"IF('CNV R640 1'!$C$16>=5,H28,\"None\")","v":"None"},{"$f":"IF('CNV R640 1'!$C$16>=5,I28,\"\")","v":""},{"$f":"IF('CNV R640 1'!$C$16>=5,J28,\"\")","v":""},{"$f":"IF('CNV R640 1'!$C$16>=5,K28,\"\")","v":""},{"$f":"IF('CNV R640 1'!$C$16>=5,L28,\"\")","v":""},{"$f":"IF('CNV R640 1'!$C$16>=5,M28,\"\")","v":""},null,"Servizi di manutenzione preventiva",1,"10L1-SO-PREV","S10L1-T630-S-PREV",null,193]
[]
["Warranty Upgrades",null,null,null,null,null,"Protezione dei dati - Keep Your Hard Drive "]
["R730xd"]
["None",{"$f":"\"\"","v":""},{"$f":"\"\"","v":""},{"$f":"\"\"","v":""},{"$f":"\"\"","v":""},{"$f":"\"\"","v":""},null,null,{"$f":"IF(($A$22=$A$12),\"\",IF($A$8=$A$3,I48,IF($A$8=$A$4,I50,IF($A$8=$A$5,I51))))","v":""},{"$f":"IF(($A$22=$A$12),\"\",IF($A$8=$A$3,J48,IF($A$8=$A$4,J50,IF($A$8=$A$5,J51))))","v":""},{"$f":"IF(($A$22=$A$12),\"\",IF($A$8=$A$3,K48,IF($A$8=$A$4,K50,IF($A$8=$A$5,K51))))","v":""},{"$f":"IF(($A$22=$A$12),\"\",IF($A$8=$A$3,L48,IF($A$8=$A$4,L50,IF($A$8=$A$5,L51))))","v":""},{"$f":"IF(($A$22=$A$12),\"\",IF($A$8=$A$3,M48,IF($A$8=$A$4,M50,IF($A$8=$A$5,M51))))","v":""}]
["Estensione della manutenzione in garanzia per ulteriori 12 mesi",1,"CNV-TS1L1-4Y-R740","TS1L1-4Y-R740","",42]
["Estensione della manutenzione in garanzia per ulteriori 24 mesi",1,"CNV-TS1L1-5Y-R740","TS1L1-5Y-R740","",85]
[]
["R740xd"]
["None",{"$f":"\"\"","v":""},{"$f":"\"\"","v":""},{"$f":"\"\"","v":""},{"$f":"\"\"","v":""},{"$f":"\"\"","v":""}]
["Estensione della manutenzione in garanzia per ulteriori 12 mesi",1,"CNV-TS1L1-4Y-R740XD","TS1L1-4Y-R740XD","",42]
["Estensione della manutenzione in garanzia per ulteriori 24 mesi",1,"CNV-TS1L1-5Y-R740XD","TS1L1-5Y-R740XD","",85]
[]
["Estensione Garanzia Selezionata"]
[{"$f":"'CNV R740xd 1'!$B$178","v":"None"},null,"R730xd"]
[{"$f":"#REF!","v":{"$error":"#REF!"}},null,"R730xd 2"]
[{"$f":"#REF!","v":{"$error":"#REF!"}},null,"R730xd 3"]
[]
["None",{"$f":"\"\"","v":""},{"$f":"\"\"","v":""},{"$f":"\"\"","v":""},{"$f":"\"\"","v":""},{"$f":"\"\"","v":""},null,"None"]
["Estensione della manutenzione in garanzia per ulteriori 12 mesi",1,"CNV-TS1L1-4Y-R740XD","TS1L1-4Y-R740XD","",42]
["Estensione della manutenzione in garanzia per ulteriori 24 mesi",1,"CNV-TS1L1-5Y-R740XD","TS1L1-5Y-R740XD","",85,null,"3Yr Data Protection - Keep Your Hard Drive",1,"10L1-SO-HDD","S10L1-R730xd-S-HDD","[733-10057]",150]
[]
["None",{"$f":"\"\"","v":""},{"$f":"\"\"","v":""},{"$f":"\"\"","v":""},{"$f":"\"\"","v":""},{"$f":"\"\"","v":""},null,"4Yr Data Protection - Keep Your Hard Drive",{"$f":"I48","v":1},{"$f":"J48","v":"10L1-SO-HDD"},{"$f":"K48","v":"S10L1-R730xd-S-HDD"},"[733-10058]",{"$f":"M48","v":150}]
[{"$f":"IF(A43=A32,H48,IF(A43=A33,H50,IF(A43=A34,H51)))","v":{"$error":"#REF!"}},1,"10L1-SO-HDD","S10L1-R730xd-S-HDD",{"$f":"IF(A43=A32,L48,IF(A43=A33,L50,IF(A43=A34,L51)))","v":{"$error":"#REF!"}},150,null,"5Yr Data Protection - Keep Your Hard Drive",{"$f":"I48","v":1},{"$f":"J48","v":"10L1-SO-HDD"},{"$f":"K48","v":"S10L1-R730xd-S-HDD"},"[733-10059]",{"$f":"M48","v":150}]
["None",{"$f":"\"\"","v":""},{"$f":"\"\"","v":""},{"$f":"\"\"","v":""},{"$f":"\"\"","v":""},{"$f":"\"\"","v":""}]
[{"$f":"IF(A44=A32,H48,IF(A44=A33,H50,IF(A44=A34,H51)))","v":{"$error":"#REF!"}},1,"10L1-SO-HDD","S10L1-R730xd-S-HDD",{"$f":"IF(A44=A32,L48,IF(A44=A33,L50,IF(A44=A34,L51)))","v":{"$error":"#REF!"}},150]
[]
[]
[]
["Protezione dei dati Selezionata"]
[{"$f":"'CNV R740xd 1'!B181","v":"None"}]
[]
["Servizio Specialistico di System and Network Management per sistema opertivo Windows, erogato on site.",1,"10L1-SO-WIN","S10L1-R730xd-S-WIN",null,193]
["Servizio Specialistico di System and Network Management per sistema opertivo Linux, erogato on site.",1,"10L1-SO-LINUX","S10L1-R730xd-S-LINUX",null,193]
[]
["None",{"$f":"\"\"","v":""},{"$f":"\"\"","v":""},{"$f":"\"\"","v":""},{"$f":"\"\"","v":""},{"$f":"\"\"","v":""}]
[{"$f":"IF('CNV R740xd 1'!$C$16>=5,H64,\"None\")","v":"None"},{"$f":"IF('CNV R740xd 1'!$C$16>=5,I64,\"\")","v":""},{"$f":"IF('CNV R740xd 1'!$C$16>=5,J64,\"\")","v":""},{"$f":"IF('CNV R740xd 1'!$C$16>=5,K64,\"\")","v":""},{"$f":"IF('CNV R740xd 1'!$C$16>=5,L64,\"\")","v":""},{"$f":"IF('CNV R740xd 1'!$C$16>=5,M64,\"\")","v":""},null,"Servizi di manutenzione preventiva",1,"10L1-SO-PREV","S10L1-R730xd-S-PREV",null,193]
[]
[]
["Warranty Upgrades",null,null,null,null,null,"Protezione dei dati - Keep Your Hard Drive "]
["T640P"]
["None",{"$f":"\"\"","v":""},{"$f":"\"\"","v":""},{"$f":"\"\"","v":""},{"$f":"\"\"","v":""},{"$f":"\"\"","v":""},null,null,{"$f":"IF(($A$22=$A$12),\"\",IF($A$8=$A$3,I83,IF($A$8=$A$4,I84,IF($A$8=$A$5,I85))))","v":""},{"$f":"IF(($A$22=$A$12),\"\",IF($A$8=$A$3,J83,IF($A$8=$A$4,J84,IF($A$8=$A$5,J85))))","v":""},{"$f":"IF(($A$22=$A$12),\"\",IF($A$8=$A$3,K83,IF($A$8=$A$4,K84,IF($A$8=$A$5,K85))))","v":""},{"$f":"IF(($A$22=$A$12),\"\",IF($A$8=$A$3,L83,IF($A$8=$A$4,L84,IF($A$8=$A$5,L85))))","v":""},{"$f":"IF(($A$22=$A$12),\"\",IF($A$8=$A$3,M83,IF($A$8=$A$4,M84,IF($A$8=$A$5,M85))))","v":""}]
["Estensione della manutenzione in garanzia per ulteriori 12 mesi",1,"CNV-TS1L1-4Y-T640P","TS1L1-4Y-T640P","",42]
["Estensione della manutenzione in garanzia per ulteriori 24 mesi",1,"CNV-TS1L1-5Y-T640P","TS1L1-5Y-T640P","",85]
["T740"]
["None",{"$f":"\"\"","v":""},{"$f":"\"\"","v":""},{"$f":"\"\"","v":""},{"$f":"\"\"","v":""},{"$f":"\"\"","v":""}]
["Estensione della manutenzione in garanzia per ulteriori 12 mesi",1,"CNV-TS1L1-4Y-T640","TS1L1-4Y-T640","",42]
["Estensione della manutenzione in garanzia per ulteriori 24 mesi",1,"CNV-TS1L1-5Y-T640","TS1L1-5Y-T640","",85]
[]
["Estensione Garanzia Selezionata"]
[{"$f":"'CNV T640 (Rack)'!B175","v":"None"}]
[]
["None",{"$f":"\"\"","v":""},{"$f":"\"\"","v":""},{"$f":"\"\"","v":""},{"$f":"\"\"","v":""},{"$f":"\"\"","v":""},null,"None"]
[{"$f":"IF($A$78=$A$69,H81,IF($A$78=$A$70,H82,IF($A$78=$A$71,H83)))","v":"3Yr Data Protection - Keep Your Hard Drive"},1,"10L1-SO-HDD","S10L1-T630-S-HDD",{"$f":"IF($A$78=$A$69,L81,IF($A$78=$A$70,L82,IF($A$78=$A$71,L83)))","v":"[733-10057]"},150,null,"3Yr Data Protection - Keep Your Hard Drive",1,"10L1-SO-HDD","S10L1-T630-S-HDD","[733-10057]",150]
[null,null,null,null,null,null,null,"4Yr Data Protection - Keep Your Hard Drive",{"$f":"I81","v":1},{"$f":"J81","v":"10L1-SO-HDD"},{"$f":"K81","v":"S10L1-T630-S-HDD"},"[733-10058]",{"$f":"M81","v":150}]
[null,null,null,null,null,null,null,"5Yr Data Protection - Keep Your Hard Drive",{"$f":"I81","v":1},{"$f":"J81","v":"10L1-SO-HDD"},{"$f":"K81","v":"S10L1-T630-S-HDD"},"[733-10059]",{"$f":"M81","v":150}]
[]
["Protezione dei dati Selezionata"]
[{"$f":"'CNV T640 (Rack)'!B178","v":"None"}]
[]
["Servizio Specialistico di System and Network Management per sistema opertivo Windows, erogato on site.",1,"10L1-SO-WIN","S10L1-T630-S-WIN",null,193]
["Servizio Specialistico di System and Network Management per sistema opertivo Linux, erogato on site.",1,"10L1-SO-LINUX","S10L1-T630-S-LINUX",null,193]
[]
["None",{"$f":"\"\"","v":""},{"$f":"\"\"","v":""},{"$f":"\"\"","v":""},{"$f":"\"\"","v":""},{"$f":"\"\"","v":""}]
[{"$f":"IF('CNV T640 (Rack)'!$C$17>=5,H92,\"None\")","v":"None"},{"$f":"IF('CNV T640 (Rack)'!$C$17>=5,I92,\"\")","v":""},{"$f":"IF('CNV T640 (Rack)'!$C$17>=5,J92,\"\")","v":""},{"$f":"IF('CNV T640 (Rack)'!$C$17>=5,K92,\"\")","v":""},{"$f":"IF('CNV T640 (Rack)'!$C$17>=5,L92,\"\")","v":""},{"$f":"IF('CNV T640 (Rack)'!$C$17>=5,M92,\"\")","v":""},null,"Servizi di manutenzione preventiva",1,"10L1-SO-PREV","S10L1-T630-S-PREV",null,193]