{"text_format":"1","workbook":"xlsx","n_sheets":18,"sheets":["Lotto2 DL560 Gen10 1","Lotto2 DL580 1","Lotto2 DL580 Prest 1","RACK, Accessori e Servizi","Riepilogo","Lotto2 DL560 Gen10 2","Lotto2 DL560 Gen10 3","Lotto2 DL580 2","Lotto2 DL580 3","Lotto2 DL580 Prest 2","Lotto2 DL580 Prest 3","Codici","PCI","Operating System","Processor","Memory","HDD","Servizi Opzionali"],"not_rendered":{"charts":0,"images":20,"macros":1,"external_links":2,"defined_names":142,"comments":0,"pivot_tables":0},"unopened":[],"bounds":{"document_bytes":16777216,"sheet_cells":100000,"rows_first":2000,"rows_last":500,"rows_between":2000,"halvings":0,"cell_chars":16384,"cell_head_chars":4096},"cells_cut":0,"cells_raw":0,"read":"whole","date_system":"1900"}

{"sheet":"Lotto2 DL560 Gen10 1","index":0,"n_rows":154,"n_cols":11,"rows_kept":154,"cut":false,"hidden":false,"merged":[[107,7,109,8],[28,2,28,4],[4,0,4,4],[5,0,5,4],[10,0,11,5],[12,0,12,5],[18,2,18,4],[20,1,20,4],[24,2,24,4],[27,1,27,4],[48,1,48,4],[30,1,30,4],[31,2,31,4],[33,1,33,4],[36,1,36,4],[37,2,37,4],[43,1,43,4],[44,2,44,4],[34,2,34,3],[145,1,145,4],[134,2,134,4],[136,1,136,4],[137,2,137,4],[139,1,139,4],[143,2,143,4],[140,2,140,4],[142,1,142,4],[103,1,103,4],[104,2,104,4],[112,1,112,4],[133,1,133,4],[131,2,131,4],[152,2,152,4],[154,1,154,4],[149,2,149,4],[148,1,148,4],[146,2,146,4],[151,1,151,4],[97,8,100,10],[121,1,121,4],[124,1,124,4],[130,1,130,4],[122,2,122,4],[125,2,125,4],[128,2,128,4],[127,1,127,4],[97,2,97,4],[115,1,115,4],[116,2,116,4],[118,1,118,4],[119,2,119,4],[113,2,113,4],[100,1,100,4],[101,2,101,4],[92,7,92,8],[115,7,115,8],[115,10,115,12],[49,2,49,4],[53,1,53,4],[67,2,67,4],[73,1,73,4],[93,8,96,10],[74,2,74,4],[93,2,93,4],[96,1,96,4],[56,1,56,4],[59,1,59,4],[90,1,90,4],[91,2,91,4],[92,1,92,3]]}
["IN ROSSO LE OPZIONI 20%",null,null,null,null,null,null,"TOTALE CONVENZIONE",{"$f":"I13","v":0},"Totale Ulteriori Opzioni ",{"$f":"I11","v":0}]
[]
[]
[]
["Tecnologie Server1 Lotto2 Base DL560 Gen10"]
[]
[]
[]
[]
[null,null,null,null,null,null,null,"Totale Server e Opzioni",{"$f":"F17*SRV_A","v":0}]
["Components: \nServer HPE Proliant DL560 Gen10 (2CPU Intel® Xeon-Gold 5118, 64GB , 2xHDD 300GB 15K RPM SAS 12Gbps 2.5in)",null,null,null,null,null,null,"Totale Ulteriori Opzioni ",{"$f":"G17*SRV_A","v":0}]
[]
[null,null,null,null,null,null,null,"TOTALE CONVENZIONE",{"$f":"I11+I10","v":0}]
[]
["Proliant DL560 Gen10","Category: Server",null,null,null,3864]
[null,"Quantity: ",null,null,null,{"$f":"SUM(F20:F155)","v":0}]
[null,null,null,null,null,{"$f":"SUM(F15:F16)","v":3864},{"$f":"SUM(G20:G155)","v":0}]
[]
[null,"Base"]
[null,"HPE DL560 Gen10 8SFF CTO Server",1,null,"841730-B21"]
[]
[null,"Configurazione dello chassis"]
[null,"HP DL560 Gen9 2SFF Media Bay Kit",1,null,"795090-B21"]
[]
[null,"Processore"]
[null,"HPE DL560 Gen10 Intel® Xeon-Gold 5118 (2.3GHz/12-core/105W) Processor",1,null,"840399-L21"]
[null,"HPE DL560 Gen10 Intel® Xeon-Gold 5118 (2.3GHz/12-core/105W) Processor",1,null,"840399-B21"]
[]
[null,"Processore aggiuntivo"]
[null,"No Additional Processor",{"$f":"VLOOKUP($B$30, CPU_A, 2, FALSE)","v":0},{"$f":"VLOOKUP($B$30, CPU_A, 3, FALSE)","v":""},{"$f":"VLOOKUP($B$30, CPU_A, 5, FALSE)","v":""},{"$f":"VLOOKUP(B30, CPU_A, 12, FALSE)","v":0}]
[]
[null,"Mezz Board Option"]
[null,{"$f":"VLOOKUP($B$30, CPU_A, 6, FALSE)","v":""},{"$f":"VLOOKUP($B$30, CPU_A, 7, FALSE)","v":""},null,{"$f":"VLOOKUP($B$30, CPU_A, 8, FALSE)","v":""}]
[]
[null,"Memoria Totale in GB",{"$f":"IF(F30=2584,IF(B36=64,\"ATTENZIONE: AUMENTARE LA RAM\",\"\"),\"\")","v":""}]
[null,64]
[]
[null,"Capacità di memoria"]
[null,{"$f":"IF($B$30=\"No Additional Processor\",VLOOKUP($B$36, MEM_A1, 8, FALSE),VLOOKUP($B$36, MEM_A2, 8, FALSE))","v":"HPE 32GB (1x32GB) Dual Rank x4 DDR4-2666 CAS-19-19-19 Registered Smart Memory Kit"},{"$f":"IF($B$30=\"No Additional Processor\",VLOOKUP($B$36, MEM_A1, 9, FALSE),VLOOKUP($B$36, MEM_A2, 9, FALSE))","v":"2"},null,{"$f":"IF($B$30=\"No Additional Processor\",VLOOKUP($B$36, MEM_A1, 10, FALSE),VLOOKUP($B$36, MEM_A2, 10, FALSE))","v":"815100-B21"}]
[]
[null,{"$f":"IF($B$30=\"No Additional Processor\",VLOOKUP($B$36, MEM_A1, 2, FALSE),VLOOKUP($B$36, MEM_A2, 2, FALSE))","v":""},{"$f":"IF($B$30=\"No Additional Processor\",VLOOKUP($B$36, MEM_A1, 3, FALSE),VLOOKUP($B$36, MEM_A2, 3, FALSE))","v":""},{"$f":"IF($B$30=\"No Additional Processor\",VLOOKUP($B$36, MEM_A1, 4, FALSE),VLOOKUP($B$36, MEM_A2, 4, FALSE))","v":""},{"$f":"IF($B$30=\"No Additional Processor\",VLOOKUP($B$36, MEM_A1, 6, FALSE),VLOOKUP($B$36, MEM_A2, 6, FALSE))","v":""},{"$f":"IF($B$30=\"No Additional Processor\",VLOOKUP($B$36, MEM_A1, 7, FALSE),VLOOKUP($B$36, MEM_A2, 7, FALSE))","v":""}]
[]
[null,{"$f":"IF($B$30=\"No Additional Processor\",VLOOKUP($B$36, MEM_A1, 11, FALSE),VLOOKUP($B$36, MEM_A2, 11, FALSE))","v":""},{"$f":"IF($B$30=\"No Additional Processor\",VLOOKUP($B$36, MEM_A1, 12, FALSE),VLOOKUP($B$36, MEM_A2, 12, FALSE))","v":""},{"$f":"IF($B$30=\"No Additional Processor\",VLOOKUP($B$36, MEM_A1, 13, FALSE),VLOOKUP($B$36, MEM_A2, 13, FALSE))","v":""},{"$f":"IF($B$30=\"No Additional Processor\",VLOOKUP($B$36, MEM_A1, 15, FALSE),VLOOKUP($B$36, MEM_A2, 15, FALSE))","v":""},{"$f":"IF($B$30=\"No Additional Processor\",VLOOKUP($B$36, MEM_A1, 16, FALSE),VLOOKUP($B$36, MEM_A2, 16, FALSE))","v":""}]
[]
[null,"Sistema operativo preinstallato"]
[null,"No Operating System",{"$f":"VLOOKUP($B$46, OS_A, 2, FALSE)","v":""},{"$f":"VLOOKUP($B$46, OS_A, 3, FALSE)","v":""},{"$f":"VLOOKUP($B$46, OS_A, 5, FALSE)","v":""},{"$f":"VLOOKUP($B$46, OS_A, 6, FALSE)","v":""}]
[null,{"$f":"IF($B$30=\"No Additional Processor\",VLOOKUP($B$46, OS_A, 19, FALSE),VLOOKUP($B$46, OS_A2, 19, FALSE))","v":""},{"$f":"IF($B$30=\"No Additional Processor\",VLOOKUP($B$46, OS_A, 20, FALSE),VLOOKUP($B$46, OS_A2, 20, FALSE))","v":0},{"$f":"IF($B$30=\"No Additional Processor\",VLOOKUP($B$46, OS_A, 21, FALSE),VLOOKUP($B$46, OS_A2, 21, FALSE))","v":""},{"$f":"IF($B$30=\"No Additional Processor\",VLOOKUP($B$46, OS_A, 23, FALSE),VLOOKUP($B$46, OS_A2, 23, FALSE))","v":""},{"$f":"IF($B$30=\"No Additional Processor\",VLOOKUP($B$46, OS_A, 24, FALSE)*C47,VLOOKUP($B$46, OS_A2, 24, FALSE)*C47)","v":0},null,{"$f":"IF(D46=\"TS1L2-WIN1\",3,IF(D46=\"TS1L2-WINDC1\",4,0))","v":0}]
[null,{"$f":"IF($B$30=\"No Additional Processor\",VLOOKUP($B$46, OS_A, 25, FALSE),VLOOKUP($B$46, OS_A2, 25, FALSE))","v":""},{"$f":"IF($B$30=\"No Additional Processor\",VLOOKUP($B$46, OS_A, 26, FALSE),VLOOKUP($B$46, OS_A2, 26, FALSE))","v":0},{"$f":"IF($B$30=\"No Additional Processor\",VLOOKUP($B$46, OS_A, 27, FALSE),VLOOKUP($B$46, OS_A2, 27, FALSE))","v":""},{"$f":"IF($B$30=\"No Additional Processor\",VLOOKUP($B$46, OS_A, 29, FALSE),VLOOKUP($B$46, OS_A2, 29, FALSE))","v":""},{"$f":"IF($B$30=\"No Additional Processor\",VLOOKUP($B$46, OS_A, 30, FALSE)*C48,VLOOKUP($B$46, OS_A2, 30, FALSE)*C48)","v":0}]
[]
[null,"Client Access Licenses"]
[null,{"$f":"VLOOKUP($B$46, OS_A, 7, FALSE)","v":"None"},null,{"$f":"VLOOKUP($B$46, OS_A, 9, FALSE)","v":""},{"$f":"VLOOKUP($B$46, OS_A, 11, FALSE)","v":""},{"$f":"VLOOKUP($B$46, OS_A, 12, FALSE)*C51","v":0}]
[]
[null,{"$f":"VLOOKUP($B$46, OS_A, 13, FALSE)","v":"None"},null,{"$f":"VLOOKUP($B$46, OS_A, 15, FALSE)","v":""},{"$f":"VLOOKUP($B$46, OS_A, 17, FALSE)","v":""},{"$f":"VLOOKUP($B$46, OS_A, 18, FALSE)*C53","v":0}]
[]
[null,"Sistema opertivo SUSE Linux Enterprise Server"]
[null,"None\n",{"$f":"IF(D56=\"\",0,(C26+C27+C30)/2)","v":0},{"$f":"VLOOKUP($B$56, SUSE, 3, FALSE)","v":""},{"$f":"VLOOKUP($B$56, SUSE, 5, FALSE)","v":""},null,{"$f":"VLOOKUP($B$56, SUSE, 6, FALSE)*C56","v":0}]
[]
[null,"HPE OneView Advanced (with HPE iLO Advanced)"]
[null,"None",{"$f":"VLOOKUP($B$59, OpzOVAdv, 2, FALSE)","v":0},{"$f":"VLOOKUP($B$59, OpzOVAdv, 3, FALSE)","v":""},{"$f":"VLOOKUP($B$59, OpzOVAdv, 5, FALSE)","v":""},null,{"$f":"VLOOKUP($B$59, OpzOVAdv, 6, FALSE)","v":0}]
[]
[null,"Configurazione dello chassis"]
[null,"HPE DL560 Gen10 8SFF HDD Bay3 Kit",1,null,"872237-B21"]
[]
[null,"HPE DL560 Gen10 8SFF HDD Bay2 Kit",0,{"$f":"VLOOKUP($C$64, HDD_Bay2, 2, FALSE)","v":""},{"$f":"VLOOKUP($C$64, HDD_Bay2, 3, FALSE)","v":""},{"$f":"VLOOKUP($C$64, HDD_Bay2, 4, FALSE)","v":""},{"$f":"VLOOKUP($C$64, HDD_Bay2, 5, FALSE)","v":0}]
[]
[null,"HPE DL560 Gen10 8SFF HDD Bay1 Kit",0,{"$f":"VLOOKUP($C$66, HDD_BAY1, 2, FALSE)","v":""},{"$f":"VLOOKUP($C$66, HDD_BAY1, 3, FALSE)","v":""},{"$f":"VLOOKUP($C$66, HDD_BAY1, 4, FALSE)","v":""},{"$f":"VLOOKUP($C$66, HDD_BAY1, 5, FALSE)","v":0}]
[]
[null,"Controller RAID"]
[null,"HPE Smart Array P408i-a SR G10 LH Ctrlr",1,null,"869081-B21"]
[]
[null,"HPE 96W Smart Storage Battery with 145mm Cable Kit",1,null,"P01366-B21"]
[]
[null,{"$f":"IF(C64+C66=0,\"\",\"HPE DL5x0 Gen10 12Gb SAS Expander Card Kit with Cables\")","v":""},{"$f":"IF(C64+C66=0,\"\",1)","v":""},{"$f":"IF(C64+C66=0,\"\",\"S2-873444-B21\")","v":""},{"$f":"IF(C64+C66=0,\"\",\"873444-B21\")","v":""},null,{"$f":"IF(C64+C66=0,\"\",540)","v":""}]
[]
[null,{"$f":"IF(C62+C64+C66=1,\"Dischi rigidi  (numero massimo totale 8)\",(IF(C62+C64+C66=2,\"Dischi rigidi  (numero massimo totale 16)\",\"Dischi rigidi  (numero massimo totale 24)\")))","v":"Dischi rigidi  (numero massimo totale 8)"}]
[null,"HPE 300GB SAS 15K SFF SC DS HDD",2,null,"870753-B21"]
[]
[null,"HPE 300GB SAS 15K SFF SC DS HDD",null,"TS1L2-HD300","870753-B21",{"$f":"C78*156","v":0}]
[]
[null,"HPE 1.2TB SAS 10K SFF SC DS HDD",null,"TS1L2-HD1200","872479-B21",{"$f":"C80*292","v":0}]
[]
[null,"HPE 1.8TB SAS 10K SFF SC DS HDD",null,"TS1L2-HD1800-560","872481-B21",null,{"$f":"C82*467","v":0}]
[]
[null,"HPE 480GB SAS 12G Read Intensive SFF SC DS SSD",null,"S2-875311-B21","875311-B21",null,{"$f":"C84*749","v":0}]
[]
[null,"HPE 960GB SAS 12G Read Intensive SFF SC DS SSD",null,"TS1L2-SSD960-560","872390-B21",null,{"$f":"C86*1571","v":0}]
[]
[null,"HPE 1.92TB SAS 12G Read Intensive SFF SC DS SSD",null,"TS1L2-SSD1920-560","875326-B21",null,{"$f":"C88*2667","v":0}]
[]
[null,"DISCHI TOTALI",{"$f":"SUM(C76:C89)","v":2},{"$f":"IF(C90<=((C62+C64+C66)*8),\"      OK\",\"     ERRORE:   Totale n° di dischi superiore al consentito\")","v":"      OK"}]
[]
[null,"Configurazione RAID"]
[null,"SCRIVERE QUI' LA CONFIGURAZIONE RAID RICHIESTA.\nBASE DL560 Gen10 1\n",null,null,null,null,null,{"$f":"IF(B93=\"SCRIVERE QUI' LA CONFIGURAZIONE RAID RICHIESTA.\nBASE ALTERNATIVO DL560 Gen10 1\n\",\"!!!ATTENZIONE!!!     COMPILARE IL CAMPO DELLA SCELTA RAID\", \"\")","v":""}]
[null,"Configurazione RAID con HDD 300GB"]
[null,"RAID 1  (2 HDDs)",1,null,{"$f":"VLOOKUP($B$95,  RAID_A1, 2, FALSE)","v":{"$error":"#N/A"}}]
[null,"Hot Spare for 300GB HDD","No"]
[]
[null,"Configurazione RAID con HDD 1TB"]
[null,"",1,null,{"$f":"VLOOKUP($B$99,  RAID_A2, 2, FALSE)","v":{"$error":"#N/A"}}]
[null,"Hot Spare for 1TB HDD","No"]
[]
[null,"Alimentatore"]
[null,"HPE 1600W Flex Slot Platinum Hot Plug Low Halogen Power Supply Kit",2,null,"830272-B21"]
[]
[null,"PCIe Riser"]
[null,"Primary Riser",1]
[]
[null,"Secondary Riser",null,{"$f":"VLOOKUP($C$108, Riser2, 2, FALSE)","v":""},{"$f":"VLOOKUP($C$108, Riser2, 3, FALSE)","v":""},{"$f":"VLOOKUP($C$108, Riser2, 4, FALSE)","v":""},{"$f":"VLOOKUP($C$108, Riser2, 5, FALSE)","v":0},{"$f":"IF(C108+C110=2,\"ERRORE - SELEZIONARE SOLO UNA SECONDARY RISER\",\"\")","v":""}]
[]
[null,"Secondary Riser for GPU",0,{"$f":"VLOOKUP($C$110, Riser2GPU, 2, FALSE)","v":""},{"$f":"VLOOKUP($C$110, Riser2GPU, 3, FALSE)","v":""},{"$f":"VLOOKUP($C$110, Riser2GPU, 4, FALSE)","v":""},{"$f":"VLOOKUP($C$110, Riser2GPU, 5, FALSE)","v":0}]
[]
[null,"Tertiary riser",0,{"$f":"VLOOKUP($C$112, Riser3, 2, FALSE)","v":""},{"$f":"VLOOKUP($C$112, Riser3, 3, FALSE)","v":""},{"$f":"VLOOKUP($C$112, Riser3, 4, FALSE)","v":""},{"$f":"VLOOKUP($C$112, Riser3, 5, FALSE)","v":0}]
[]
[null,"Scheda FlexibleLOM"]
[null,"HPE FlexFabric 10Gb 2-port 534FLR-SFP+ Adapter",1,null,"700751-B21"]
[null,null,null,null,null,null,null,"PRIMARY RISER",null,"SECONDARY RISER","TERTIARY RISER"]
[null,"Additional Card for PCIe Slot 1"]
[null,"HPE Ethernet 1Gb 4-port 331T Adapter",1,"","647594-B21","",0]
[]
[null,"Additional Card for PCIe Slot 2"]
[null,"None",{"$f":"IF(B121=B73,\"\",VLOOKUP(B121,  PCI_A2, 2, FALSE))","v":""},{"$f":"IF(B121=B73,\"\",VLOOKUP(B121,  PCI_A2, 3, FALSE))","v":""},{"$f":"IF(B121=B73,\"\",VLOOKUP(B121,  PCI_A2, 5, FALSE))","v":""},{"$f":"IF(B121=B73,\"\",VLOOKUP(B121,  PCI_A2, 6, FALSE))","v":""},{"$f":"IF(B121=B73,\"\",VLOOKUP(B121,  PCI_A2, 9, FALSE))","v":0}]
[]
[null,"Additional Card for PCIe Slot 3"]
[null,"None",{"$f":"VLOOKUP(B124,  PCI_A2, 2, FALSE)","v":""},{"$f":"VLOOKUP(B124,  PCI_A2, 3, FALSE)","v":""},{"$f":"VLOOKUP(B124,  PCI_A2, 5, FALSE)","v":""},{"$f":"VLOOKUP(B124,  PCI_A2, 6, FALSE)","v":""},{"$f":"VLOOKUP(B124,  PCI_A2, 9, FALSE)","v":0}]
[]
[null,{"$f":"IF(C110=1,\"Additional Card for PCIe Slot 4 (GPU Slot)\",\"Additional Card for PCIe Slot 4\")","v":"Additional Card for PCIe Slot 4"}]
[null,"None",{"$f":"IF($B$127=\"Aggiungere Secondary Riser\",\"\",VLOOKUP($B$127,  PCI_A5, 2, FALSE))","v":""},{"$f":"IF($B$127=\"Aggiungere Secondary Riser\",\"\",VLOOKUP($B$127,  PCI_A5, 3, FALSE))","v":""},{"$f":"IF($B$127=\"Aggiungere Secondary Riser\",\"\",VLOOKUP($B$127,  PCI_A5, 5, FALSE))","v":""},{"$f":"IF($B$127=\"Aggiungere Secondary Riser\",\"\",VLOOKUP($B$127,  PCI_A5, 6, FALSE))","v":""},{"$f":"IF($B$127=\"Aggiungere Secondary Riser\",\"\",VLOOKUP($B$127,  PCI_A5, 9, FALSE))","v":0}]
[]
[null,"Additional Card for PCIe Slot 5"]
[null,"None",{"$f":"IF($B$130=\"Aggiungere Secondary Riser\",\"\",IF($B$130=\"Non Disponibile\",\"\",VLOOKUP($B$130,  PCI_A4, 2, FALSE)))","v":""},{"$f":"IF($B$130=\"Aggiungere Secondary Riser\",\"\",IF($B$130=\"Non Disponibile\",\"\",VLOOKUP($B$130,  PCI_A4, 3, FALSE)))","v":""},{"$f":"IF($B$130=\"Aggiungere Secondary Riser\",\"\",IF($B$130=\"Non Disponibile\",\"\",VLOOKUP($B$130,  PCI_A4, 5, FALSE)))","v":""},{"$f":"IF($B$130=\"Aggiungere Secondary Riser\",\"\",IF($B$130=\"Non Disponibile\",\"\",VLOOKUP($B$130,  PCI_A4, 9, FALSE)))","v":0},{"$f":"IF($B$130=\"Aggiungere Secondary Riser\",\"\",IF($B$130=\"Non Disponibile\",\"\",VLOOKUP($B$130,  PCI_A4, 6, FALSE)))","v":""}]
[]
[null,"Additional Card for PCIe Slot 6"]
[null,"None",{"$f":"IF($B$133=\"Aggiungere Secondary Riser\",\"\",VLOOKUP($B$133,  PCI_A4, 2, FALSE))","v":""},{"$f":"IF($B$133=\"Aggiungere Secondary Riser\",\"\",VLOOKUP($B$133,  PCI_A4, 3, FALSE))","v":""},{"$f":"IF($B$133=\"Aggiungere Secondary Riser\",\"\",VLOOKUP($B$133,  PCI_A4, 5, FALSE))","v":""},{"$f":"IF($B$133=\"Aggiungere Secondary Riser\",\"\",VLOOKUP($B$133,  PCI_A4, 6, FALSE))","v":""},{"$f":"IF($B$133=\"Aggiungere Secondary Riser\",\"\",VLOOKUP($B$133,  PCI_A4, 9, FALSE))","v":0}]
[]
[null,"Additional Card for PCIe Slot 7"]
[null,"None",{"$f":"IF($B$136=\"Aggiungere Tertiary Riser\",\"\",VLOOKUP($B$136,  PCI_A7, 2, FALSE))","v":""},{"$f":"IF($B$136=\"Aggiungere Tertiary Riser\",\"\",VLOOKUP($B$136,  PCI_A7, 3, FALSE))","v":""},{"$f":"IF($B$136=\"Aggiungere Tertiary Riser\",\"\",VLOOKUP($B$136,  PCI_A7, 5, FALSE))","v":""},{"$f":"IF($B$136=\"Aggiungere Tertiary Riser\",\"\",VLOOKUP($B$136,  PCI_A7, 6, FALSE))","v":""},{"$f":"IF($B$136=\"Aggiungere Tertiary Riser\",\"\",VLOOKUP($B$136,  PCI_A7, 9, FALSE))","v":0}]
[]
[null,"Additional Card for PCIe Slot 8"]
[null,"None",{"$f":"IF($B$139=\"Aggiungere Tertiary Riser\",\"\",VLOOKUP($B$139,  PCI_A7, 2, FALSE))","v":""},{"$f":"IF($B$139=\"Aggiungere Tertiary Riser\",\"\",VLOOKUP($B$139,  PCI_A7, 3, FALSE))","v":""},{"$f":"IF($B$139=\"Aggiungere Tertiary Riser\",\"\",VLOOKUP($B$139,  PCI_A7, 5, FALSE))","v":""},{"$f":"IF($B$139=\"Aggiungere Tertiary Riser\",\"\",VLOOKUP($B$139,  PCI_A7, 6, FALSE))","v":""},{"$f":"IF($B$139=\"Aggiungere Tertiary Riser\",\"\",VLOOKUP($B$139,  PCI_A7, 9, FALSE))","v":0}]
[]
[null,"Bezel"]
[null,"None",1]
[]
[null,"Unità ottica"]
[null,"HP Mobile USB DVDRW Drive",1,null,"701498-B21"]
[]
[null,"Accessori per Server"]
[null,"HP BLc 10G SFP+ SR Transceiver",{"$f":"(VLOOKUP(B118,PCI_A1,8,FALSE))+((VLOOKUP(B121,PCI_A2,8,FALSE)))+((VLOOKUP(B124,PCI_A2,8,FALSE)))+((VLOOKUP(B127,PCI_A4,8,FALSE)))+((VLOOKUP(B130,PCI_A4,8,FALSE)))+((VLOOKUP(B133,PCI_A4,8,FALSE)))+((VLOOKUP(B136,PCI_A7,8,FALSE))+((VLOOKUP(B139,PCI_A7,8,FALSE))))","v":0},null,"455883-B21"]
[]
[null,"Estensione di Garanzia"]
[null,"None",{"$f":"VLOOKUP($B$151,  SO_B1,2, FALSE)","v":""},{"$f":"VLOOKUP($B$151,  SO_B1, 3, FALSE)","v":""},{"$f":"VLOOKUP($B$151,  SO_B1, 5, FALSE)","v":""},{"$f":"VLOOKUP($B$151,  SO_B1, 6, FALSE)","v":""}]
[]
[null,"Protezione dei dati - Keep Your Hard Drive "]
[null,"None",{"$f":"VLOOKUP($B$154,  SO_A2, 2, FALSE)","v":""},{"$f":"VLOOKUP($B$154,  SO_A2, 3, FALSE)","v":""},{"$f":"VLOOKUP($B$154,  SO_A2,5, FALSE)","v":""},{"$f":"VLOOKUP($B$154,  SO_A2, 6, FALSE)","v":""}]

{"sheet":"Lotto2 DL580 1","index":1,"n_rows":168,"n_cols":13,"rows_kept":168,"cut":false,"hidden":false,"merged":[[83,1,83,4],[147,2,147,4],[153,1,153,4],[143,1,143,4],[144,2,144,4],[98,1,98,4],[135,2,135,4],[137,1,137,4],[138,2,138,4],[140,1,140,4],[141,2,141,4],[128,1,128,4],[129,2,129,4],[131,1,131,4],[132,2,132,4],[134,1,134,4],[4,0,4,4],[5,0,5,4],[10,0,11,5],[12,0,12,5],[34,2,34,4],[18,2,18,4],[33,1,33,4],[20,1,20,4],[21,2,21,4],[24,1,24,4],[25,2,25,4],[27,1,27,4],[31,2,31,3],[53,1,53,4],[56,1,56,4],[80,1,80,3],[40,1,40,4],[41,2,41,4],[45,1,45,4],[46,2,46,4],[48,1,48,4],[50,1,50,4],[61,2,61,4],[63,1,63,4],[64,2,64,4],[78,1,78,4],[79,2,79,4],[60,1,60,4],[93,1,93,4],[104,1,104,4],[117,2,117,4],[113,1,113,4],[84,2,84,4],[87,1,87,4],[88,2,88,4],[90,1,90,4],[116,1,116,4],[101,1,101,4],[114,2,114,4],[168,1,168,4],[163,2,163,4],[156,1,156,4],[157,2,157,4],[159,1,159,4],[160,2,160,4],[162,1,162,4],[165,1,165,4],[166,2,166,4],[80,7,80,8],[28,2,28,4],[30,1,30,4],[84,8,87,10],[154,2,154,4],[119,1,119,4],[120,2,120,4],[107,1,107,4],[110,1,110,4],[111,2,111,4],[122,1,122,4],[123,2,123,4],[125,1,125,4],[126,2,126,4],[146,1,146,4],[91,2,91,4]]}
["IN ROSSO LE OPZIONI 20%",null,null,null,null,null,null,null,null,"TOTALE CONVENZIONE",{"$f":"K10","v":0},"Totale Ulteriori Opzioni ",{"$f":"K8","v":0}]
[]
[]
[]
["Tecnologie Server1 Lotto2 Base Alternativo DL580"]
[]
[null,null,null,null,null,null,null,null,null,"Totale Server e Opzioni",{"$f":"F17*SRV_B","v":0}]
[null,null,null,null,null,null,null,null,null,"Totale Ulteriori Opzioni ",{"$f":"G16*SRV_B","v":0}]
[]
[null,null,null,null,null,null,null,null,null,"TOTALE CONVENZIONE",{"$f":"K8+K7","v":0}]
["Components: \nServer HP Proliant DL580 Gen10 (2CPU Intel® Xeon® Gold 5518, 64GB , 2xHDD 300GB 15K RPM SAS 12Gbps 2.5in)"]
[]
[]
[]
["Proliant DL580 Gen10","Category: Server",null,null,null,{"$f":"3864","v":3864}]
[null,"Quantity: ",null,null,null,{"$f":"SUM(F20:F207)","v":0},{"$f":"SUM(G20:G207)","v":0}]
[null,null,null,null,null,{"$f":"SUM(F15:F16)","v":3864}]
[]
[null,"Base"]
[null,"HPE DL580 Gen10 8SFF CTO Server",1,null,"869854-B21"]
[]
[null,"Processore"]
[null,"HPE DL580 Gen10 Intel® Xeon-Gold 5118 (2.3GHz/12-core/105W) Processor",1,null,"878126-L21"]
[null,"HPE DL580 Gen10 Intel® Xeon-Gold 5118 (2.3GHz/12-core/105W) Processor",1,null,"878126-B21"]
[]
[null,"Processore aggiuntivo"]
[null,"No Additional Processor",{"$f":"VLOOKUP($B$27, CPU_B, 2, FALSE)","v":0},{"$f":"VLOOKUP($B$27, CPU_B, 3, FALSE)","v":""},{"$f":"VLOOKUP($B$27, CPU_B, 5, FALSE)","v":""},{"$f":"VLOOKUP(B27, CPU_B, 12, FALSE)","v":""}]
[]
[null,"Mezz Board Option"]
[null,{"$f":"VLOOKUP($B$27, CPU_B, 6, FALSE)","v":""},{"$f":"VLOOKUP($B$27, CPU_B, 7, FALSE)","v":""},null,{"$f":"VLOOKUP($B$27, CPU_B, 8, FALSE)","v":""}]
[]
[null,"Memoria Totale in GB",{"$f":"IF(F27=2584,IF(B33=64,\"ATTENZIONE: AUMENTARE LA RAM\",\"\"),\"\")","v":""}]
[null,64]
[]
[null,"Capacità di memoria"]
[null,{"$f":"IF($B$27=\"No Additional Processor\",VLOOKUP($B$33, MEM_B1, 8, FALSE),VLOOKUP($B$33, MEM_B2, 8, FALSE))","v":"HPE 32GB (1x32GB) Dual Rank x4 DDR4-2666 CAS-19-19-19 Registered Smart Memory Kit"},{"$f":"IF($B$27=\"No Additional Processor\",VLOOKUP($B$33, MEM_B1, 9, FALSE),VLOOKUP($B$33, MEM_B2, 9, FALSE))","v":"2"},null,{"$f":"IF($B$27=\"No Additional Processor\",VLOOKUP($B$33, MEM_B1, 10, FALSE),VLOOKUP($B$33, MEM_B2, 10, FALSE))","v":"815100-B21"}]
[]
[null,{"$f":"IF($B$27=\"No Additional Processor\",VLOOKUP($B$33, MEM_B1, 2, FALSE),VLOOKUP($B$33, MEM_B2, 2, FALSE))","v":""},{"$f":"IF($B$27=\"No Additional Processor\",VLOOKUP($B$33, MEM_B1, 3, FALSE),VLOOKUP($B$33, MEM_B2, 3, FALSE))","v":""},{"$f":"IF($B$27=\"No Additional Processor\",VLOOKUP($B$33, MEM_B1, 4, FALSE),VLOOKUP($B$33, MEM_B2, 4, FALSE))","v":""},{"$f":"IF($B$27=\"No Additional Processor\",VLOOKUP($B$33, MEM_B1, 6, FALSE),VLOOKUP($B$33, MEM_B2, 6, FALSE))","v":""},{"$f":"IF($B$27=\"No Additional Processor\",VLOOKUP($B$33, MEM_B1, 7, FALSE),VLOOKUP($B$33, MEM_B2, 7, FALSE))","v":""}]
[]
[null,{"$f":"IF($B$27=\"No Additional Processor\",VLOOKUP($B$33, MEM_B1, 11, FALSE),VLOOKUP($B$33, MEM_B2, 11, FALSE))","v":""},{"$f":"IF($B$27=\"No Additional Processor\",VLOOKUP($B$33, MEM_B1, 12, FALSE),VLOOKUP($B$33, MEM_B2, 12, FALSE))","v":""},{"$f":"IF($B$27=\"No Additional Processor\",VLOOKUP($B$33, MEM_B1, 13, FALSE),VLOOKUP($B$33, MEM_B2, 13, FALSE))","v":""},{"$f":"IF($B$27=\"No Additional Processor\",VLOOKUP($B$33, MEM_B1, 15, FALSE),VLOOKUP($B$33, MEM_B2, 15, FALSE))","v":""},{"$f":"IF($B$27=\"No Additional Processor\",VLOOKUP($B$33, MEM_B1, 16, FALSE),VLOOKUP($B$33, MEM_B2, 16, FALSE))","v":""}]
[]
[null,"Sistema operativo preinstallato"]
[null,"No Operating System",{"$f":"VLOOKUP($B$43, OS_B, 2, FALSE)","v":""},{"$f":"VLOOKUP($B$43, OS_B, 3, FALSE)","v":""},{"$f":"VLOOKUP($B$43, OS_B, 5, FALSE)","v":""},{"$f":"VLOOKUP($B$43, OS_B, 6, FALSE)","v":""}]
[null,{"$f":"IF($B$27=\"No Additional Processor\",VLOOKUP($B$43, OS_B, 19, FALSE),VLOOKUP($B$43, OS_B2, 19, FALSE))","v":""},{"$f":"IF($B$27=\"No Additional Processor\",VLOOKUP($B$43, OS_B, 20, FALSE),VLOOKUP($B$43, OS_B2, 20, FALSE))","v":0},{"$f":"IF($B$27=\"No Additional Processor\",VLOOKUP($B$43, OS_B, 21, FALSE),VLOOKUP($B$43, OS_B2, 21, FALSE))","v":""},{"$f":"IF($B$27=\"No Additional Processor\",VLOOKUP($B$43, OS_B, 23, FALSE),VLOOKUP($B$43, OS_B2, 23, FALSE))","v":""},{"$f":"IF($B$27=\"No Additional Processor\",VLOOKUP($B$43, OS_B, 24, FALSE)*C44,VLOOKUP($B$43, OS_B2, 24, FALSE)*C44)","v":0},null,{"$f":"IF(D43=\"TS1L2-WIN1\",3,IF(D43=\"TS1L2-WINDC1\",4,0))","v":0}]
[null,{"$f":"IF($B$27=\"No Additional Processor\",VLOOKUP($B$43, OS_B, 25, FALSE),VLOOKUP($B$43, OS_B2, 25, FALSE))","v":""},{"$f":"IF($B$27=\"No Additional Processor\",VLOOKUP($B$43, OS_B, 26, FALSE),VLOOKUP($B$43, OS_B2, 26, FALSE))","v":0},{"$f":"IF($B$27=\"No Additional Processor\",VLOOKUP($B$43, OS_B, 27, FALSE),VLOOKUP($B$43, OS_B2, 27, FALSE))","v":""},{"$f":"IF($B$27=\"No Additional Processor\",VLOOKUP($B$43, OS_B, 29, FALSE),VLOOKUP($B$43, OS_B2, 29, FALSE))","v":""},{"$f":"IF($B$27=\"No Additional Processor\",VLOOKUP($B$43, OS_B, 30, FALSE)*C45,VLOOKUP($B$43, OS_B2, 30, FALSE)*C45)","v":0}]
[]
[null,"Client Access Licenses"]
[null,{"$f":"VLOOKUP($B$43, OS_B, 7, FALSE)","v":"None"},null,{"$f":"VLOOKUP($B$43, OS_B, 9, FALSE)","v":""},{"$f":"VLOOKUP($B$43, OS_B, 11, FALSE)","v":""},{"$f":"VLOOKUP($B$43, OS_B, 12, FALSE)*C48","v":0}]
[]
[null,{"$f":"VLOOKUP($B$43, OS_B, 13, FALSE)","v":"None"},null,{"$f":"VLOOKUP($B$43, OS_B, 15, FALSE)","v":""},{"$f":"VLOOKUP($B$43, OS_B, 17, FALSE)","v":""},{"$f":"VLOOKUP($B$43, OS_B, 18, FALSE)*C50","v":0}]
[]
[null,"Sistema opertivo SUSE Linux Enterprise Server"]
[null,"None\n",{"$f":"IF(D53=\"\",0,(C23+C24+C27)/2)","v":0},{"$f":"VLOOKUP($B$53, SUSE, 3, FALSE)","v":""},{"$f":"VLOOKUP($B$53, SUSE, 5, FALSE)","v":""},null,{"$f":"VLOOKUP($B$53, SUSE, 6, FALSE)*C53","v":0}]
[]
[null,"HPE OneView Advanced (with HPE iLO Advanced)"]
[null,"None",{"$f":"VLOOKUP($B$56, OpzOVAdv, 2, FALSE)","v":0},{"$f":"VLOOKUP($B$56, OpzOVAdv, 3, FALSE)","v":""},{"$f":"VLOOKUP($B$56, OpzOVAdv, 5, FALSE)","v":""},null,{"$f":"VLOOKUP($B$56, OpzOVAdv, 6, FALSE)","v":0}]
[]
[null,"Configurazione dello chassis"]
[null,"Chassis 16 slot HDD",{"$f":"IF(C60=0,1,0)","v":1},null,"830824-B21"]
[null,"Chassis 48 slot HDD",0,{"$f":"IF(C60=1,\"S2-48HDDbay\",\"\")","v":""},"830824-B21",null,{"$f":"IF(C60=1,1367,0)","v":0}]
[]
[null,"Controller RAID"]
[null,"HPE Smart Array P408i-p SR Gen10 (8 Internal Lanes/2GB Cache) 12G SAS PCIe Plug-in Controller",1,null,"830824-B21"]
[]
[null,{"$f":"IF(C59=1,\"Dischi rigidi (numero massimo totale 16)\",\"Dischi rigidi (numero massimo totale 48)\")","v":"Dischi rigidi (numero massimo totale 16)"}]
[null,"HPE 300GB SAS 15K SFF SC DS HDD",2,null,"870753-B21"]
[]
[null,"HPE 300GB SAS 15K SFF SC DS HDD",null,"TS1L2-HD300","870753-B21",{"$f":"HD300_B*156","v":0}]
[]
[null,"HPE 1.2TB SAS 10K SFF SC DS HDD",null,"TS1L2-HD1200","872479-B21",{"$f":"HD1000_B*292","v":0}]
[]
[null,"HPE 1.8TB SAS 10K SFF SC DS HDD",null,"TS1L2-HD1800","872481-B21",null,{"$f":"C72*467","v":0}]
[]
[null,"HPE 960GB SAS 12G Read Intensive SFF SC DS SSD",null,"TS1L2-SSD960","872390-B21",null,{"$f":"C74*1571","v":0}]
[]
[null,"HPE 1.92TB SAS 12G Read Intensive SFF SC DS SSD",null,"TS1L2-SSD1920","875326-B21",null,{"$f":"C76*2667","v":0}]
[]
[null,"DISCHI TOTALI",{"$f":"SUM(C66:C77)","v":2},{"$f":"IF(C59=1,IF(C78<=16,\"      OK\",\"     ERRORE:   Totale n° di dischi superiore al consentito\"),IF(C78<=48,\"      OK\",\"     ERRORE:   Totale n° di dischi superiore al consentito\"))","v":"      OK"}]
[]
[null,"Configurazione RAID"]
[null,"SCRIVERE QUI' LA CONFIGURAZIONE RAID RICHIESTA.\nBASE ALTERNATIVO DL580 1"]
[null,"RAID 1  (2 HDDs)",1,null,{"$f":"VLOOKUP($B$82,  RAID_B1, 2, FALSE)","v":"[780-BBJK]"}]
[null,"Hot Spare for 300GB HDD","No"]
[]
[null,"Configurazione RAID con HDD 1TB"]
[null,"",1,null,{"$f":"VLOOKUP($B$86,  RAID_B2, 2, FALSE)","v":""}]
[null,"Hot Spare for 1TB HDD","No"]
[]
[null,"Alimentatore"]
[null,"HPE 1600W FS Plat Ht Plg LH Pwr Sply Kit",{"$f":"IF(C98+C97>0,4,IF(G110+G104>5000,4,2))","v":2},null,"830272-B21"]
[]
[null,"Scheda FlexibleLOM"]
[null,"HPE FlexFbr 10Gb 534FLR-SFP+ FIO Adptr",1,null,"700751-B21"]
[]
[null,"PCIe Riser"]
[null,"7 slot Primary Riser",1]
[null,"9 slot Secondary Riser (48HDD)",{"$f":"IF(C60=1,1,0)","v":0},{"$f":"VLOOKUP($C$97, SlotRiser9, 2, FALSE)","v":""},{"$f":"VLOOKUP($C$97, SlotRiser9, 3, FALSE)","v":""},{"$f":"VLOOKUP($C$98, SlotRiser9, 4, FALSE)","v":""},{"$f":"VLOOKUP($C$97, SlotRiser9, 5, FALSE)","v":0}]
[null,"9 slot Secondary Riser",0,{"$f":"VLOOKUP($C$98, SlotRiser9, 2, FALSE)","v":""},{"$f":"VLOOKUP($C$98, SlotRiser9, 3, FALSE)","v":""},{"$f":"VLOOKUP($C$98, SlotRiser9, 4, FALSE)","v":""},{"$f":"IF(C60=1,0,VLOOKUP($C$98, SlotRiser9, 5, FALSE))","v":0}]
[]
[null,"Additional Card for PCIe Slot 1 (CPU3)"]
[null,"None",{"$f":"IF(B101=\"Aggiungere Coppia di Processori\",\"\",(VLOOKUP(B101,PCI_B5, 2, FALSE)))","v":""},{"$f":"IF(B101=\"Aggiungere Coppia di Processori\",\"\",(VLOOKUP(B101,PCI_B5, 3, FALSE)))","v":""},{"$f":"IF(B101=\"Aggiungere Coppia di Processori\",\"\",(VLOOKUP(B101,PCI_B5, 5, FALSE)))","v":""},{"$f":"IF(B101=\"Aggiungere Coppia di Processori\",\"\",(VLOOKUP(B101,PCI_B5, 6, FALSE)))","v":""},{"$f":"IF(B101=\"Aggiungere Coppia di Processori\",\"\",(VLOOKUP(B101,PCI_B5, 9, FALSE)))","v":0}]
[]
[null,"Additional Card for PCIe Slot 2 (CPU3) (GPU Slot)"]
[null,"None",{"$f":"IF(B104=\"Aggiungere Coppia di Processori\",\"\",(VLOOKUP(B104,PCI_B6, 2, FALSE)))","v":""},{"$f":"IF(B104=\"Aggiungere Coppia di Processori\",\"\",(VLOOKUP(B104,PCI_B6, 3, FALSE)))","v":""},{"$f":"IF(B104=\"Aggiungere Coppia di Processori\",\"\",(VLOOKUP(B104,PCI_B6, 5, FALSE)))","v":""},{"$f":"IF(B104=\"Aggiungere Coppia di Processori\",\"\",(VLOOKUP(B104,PCI_B6, 6, FALSE)))","v":""},{"$f":"IF(B104=\"Aggiungere Coppia di Processori\",\"\",(VLOOKUP(B104,PCI_B6, 9, FALSE)))","v":0}]
[]
[null,"Additional Card for PCIe Slot 3 (CPU3)"]
[null,"None",{"$f":"IF(B107=\"Aggiungere Coppia di Processori\",\"\",(VLOOKUP(B107,PCI_B5, 2, FALSE)))","v":""},{"$f":"IF(B107=\"Aggiungere Coppia di Processori\",\"\",(VLOOKUP(B107,PCI_B5, 3, FALSE)))","v":""},{"$f":"IF(B107=\"Aggiungere Coppia di Processori\",\"\",(VLOOKUP(B107,PCI_B5, 5, FALSE)))","v":""},{"$f":"IF(B107=\"Aggiungere Coppia di Processori\",\"\",(VLOOKUP(B107,PCI_B5, 6, FALSE)))","v":""},{"$f":"IF(B107=\"Aggiungere Coppia di Processori\",\"\",(VLOOKUP(B107,PCI_B5, 9, FALSE)))","v":0}]
[]
[null,"Additional Card for PCIe Slot 4 (CPU3) (GPU Slot)"]
[null,"None",{"$f":"IF(B110=\"Aggiungere Coppia di Processori\",\"\",(VLOOKUP(B110,PCI_B6, 2, FALSE)))","v":""},{"$f":"IF(B110=\"Aggiungere Coppia di Processori\",\"\",(VLOOKUP(B110,PCI_B6, 3, FALSE)))","v":""},{"$f":"IF(B110=\"Aggiungere Coppia di Processori\",\"\",(VLOOKUP(B110,PCI_B6, 5, FALSE)))","v":""},{"$f":"IF(B110=\"Aggiungere Coppia di Processori\",\"\",(VLOOKUP(B110,PCI_B6, 6, FALSE)))","v":""},{"$f":"IF(B110=\"Aggiungere Coppia di Processori\",\"\",(VLOOKUP(B110,PCI_B6, 9, FALSE)))","v":0}]
[]
[null,"Additional Card for PCIe Slot 5 (CPU1)"]
[null,"HPE Ethernet 1Gb 4-port 331T Adapter",1,null,"647594-B21"]
[]
[null,"Additional Card for PCIe Slot 6 (CPU1)"]
[null,"HPE Smart Array P408i-p SR Gen10 Ctrlr",1,null,"830824-B21"]
[]
[null,"Additional Card for PCIe Slot 7 (CPU1)"]
[null,"HPE DL580 Gen10 12G 24-port SAS Expander",1,null,"881101-B21"]
[]
[null,"Additional Card for PCIe Slot 8 (CPU4)"]
[null,"None",{"$f":"IF(B122=\"Aggiungere Coppia di Processori\",\"\",IF(B122=\"Aggiungere 9 slot Secondary Riser\",\"\",(VLOOKUP(B122,PCI_B5,2,FALSE))))","v":""},{"$f":"IF(B122=\"Aggiungere Coppia di Processori\",\"\",IF(B122=\"Aggiungere 9 slot Secondary Riser\",\"\",(VLOOKUP(B122,PCI_B5,3,FALSE))))","v":""},{"$f":"IF(B122=\"Aggiungere Coppia di Processori\",\"\",IF(B122=\"Aggiungere 9 slot Secondary Riser\",\"\",(VLOOKUP(B122,PCI_B5,5,FALSE))))","v":""},{"$f":"IF(B122=\"Aggiungere Coppia di Processori\",\"\",IF(B122=\"Aggiungere 9 slot Secondary Riser\",\"\",(VLOOKUP(B122,PCI_B5,6,FALSE))))","v":""},{"$f":"IF(B122=\"Aggiungere Coppia di Processori\",\"\",IF(B122=\"Aggiungere 9 slot Secondary Riser\",\"\",(VLOOKUP(B122,PCI_B5,9,FALSE))))","v":0}]
[]
[null,"Additional Card for PCIe Slot 9 (CPU4) (GPU Slot)"]
[null,"None",{"$f":"IF(B125=\"Aggiungere Coppia di Processori\",\"\",IF(B125=\"Aggiungere 9 slot Secondary Riser\",\"\",(VLOOKUP(B125,PCI_B6,2,FALSE))))","v":""},{"$f":"IF(B125=\"Aggiungere Coppia di Processori\",\"\",IF(B125=\"Aggiungere 9 slot Secondary Riser\",\"\",(VLOOKUP(B125,PCI_B6,3,FALSE))))","v":""},{"$f":"IF(B125=\"Aggiungere Coppia di Processori\",\"\",IF(B125=\"Aggiungere 9 slot Secondary Riser\",\"\",(VLOOKUP(B125,PCI_B6,5,FALSE))))","v":""},{"$f":"IF(B125=\"Aggiungere Coppia di Processori\",\"\",IF(B125=\"Aggiungere 9 slot Secondary Riser\",\"\",(VLOOKUP(B125,PCI_B6,6,FALSE))))","v":""},{"$f":"IF(B125=\"Aggiungere Coppia di Processori\",\"\",IF(B125=\"Aggiungere 9 slot Secondary Riser\",\"\",(VLOOKUP(B125,PCI_B6,9,FALSE))))","v":0}]
[]
[null,"Additional Card for PCIe Slot 10 (CPU4)"]
[null,"None",{"$f":"IF(B128=\"Aggiungere Coppia di Processori\",\"\",IF(B128=\"Aggiungere 9 slot Secondary Riser\",\"\",(VLOOKUP(B128,PCI_B5,2,FALSE))))","v":""},{"$f":"IF(B128=\"Aggiungere Coppia di Processori\",\"\",IF(B128=\"Aggiungere 9 slot Secondary Riser\",\"\",(VLOOKUP(B128,PCI_B5,3,FALSE))))","v":""},{"$f":"IF(B128=\"Aggiungere Coppia di Processori\",\"\",IF(B128=\"Aggiungere 9 slot Secondary Riser\",\"\",(VLOOKUP(B128,PCI_B5,5,FALSE))))","v":""},{"$f":"IF(B128=\"Aggiungere Coppia di Processori\",\"\",IF(B128=\"Aggiungere 9 slot Secondary Riser\",\"\",(VLOOKUP(B128,PCI_B5,6,FALSE))))","v":""},{"$f":"IF(B128=\"Aggiungere Coppia di Processori\",\"\",IF(B128=\"Aggiungere 9 slot Secondary Riser\",\"\",(VLOOKUP(B128,PCI_B5,9,FALSE))))","v":0}]
[]
[null,"Additional Card for PCIe Slot 11 (CPU4) (GPU Slot)"]
[null,"None",{"$f":"IF(B131=\"Aggiungere Coppia di Processori\",\"\",IF(B131=\"Aggiungere 9 slot Secondary Riser\",\"\",(VLOOKUP(B131,PCI_B6,2,FALSE))))","v":""},{"$f":"IF(B131=\"Aggiungere Coppia di Processori\",\"\",IF(B131=\"Aggiungere 9 slot Secondary Riser\",\"\",(VLOOKUP(B131,PCI_B6,3,FALSE))))","v":""},{"$f":"IF(B131=\"Aggiungere Coppia di Processori\",\"\",IF(B131=\"Aggiungere 9 slot Secondary Riser\",\"\",(VLOOKUP(B131,PCI_B6,5,FALSE))))","v":""},{"$f":"IF(B131=\"Aggiungere Coppia di Processori\",\"\",IF(B131=\"Aggiungere 9 slot Secondary Riser\",\"\",(VLOOKUP(B131,PCI_B6,6,FALSE))))","v":""},{"$f":"IF(B131=\"Aggiungere Coppia di Processori\",\"\",IF(B131=\"Aggiungere 9 slot Secondary Riser\",\"\",(VLOOKUP(B131,PCI_B6,9,FALSE))))","v":0}]
[]
[null,"Additional Card for PCIe Slot 12 (CPU2)"]
[null,"None",{"$f":"IF(B134=\"Aggiungere Coppia di Processori\",\"\",IF(B134=\"Aggiungere 9 slot Secondary Riser\",\"\",(VLOOKUP(B134,PCI_B5,2,FALSE))))","v":""},{"$f":"IF(B134=\"Aggiungere Coppia di Processori\",\"\",IF(B134=\"Aggiungere 9 slot Secondary Riser\",\"\",(VLOOKUP(B134,PCI_B5,3,FALSE))))","v":""},{"$f":"IF(B134=\"Aggiungere Coppia di Processori\",\"\",IF(B134=\"Aggiungere 9 slot Secondary Riser\",\"\",(VLOOKUP(B134,PCI_B5,5,FALSE))))","v":""},{"$f":"IF(B134=\"Aggiungere Coppia di Processori\",\"\",IF(B134=\"Aggiungere 9 slot Secondary Riser\",\"\",(VLOOKUP(B134,PCI_B5,6,FALSE))))","v":""},{"$f":"IF(B134=\"Aggiungere Coppia di Processori\",\"\",IF(B134=\"Aggiungere 9 slot Secondary Riser\",\"\",(VLOOKUP(B134,PCI_B5,9,FALSE))))","v":0}]
[]
[null,"Additional Card for PCIe Slot 13 (CPU2)"]
[null,"None",{"$f":"IF(B137=\"Aggiungere Coppia di Processori\",\"\",IF(B137=\"Aggiungere 9 slot Secondary Riser\",\"\",(VLOOKUP(B137,PCI_B5,2,FALSE))))","v":""},{"$f":"IF(B137=\"Aggiungere Coppia di Processori\",\"\",IF(B137=\"Aggiungere 9 slot Secondary Riser\",\"\",(VLOOKUP(B137,PCI_B5,3,FALSE))))","v":""},{"$f":"IF(B137=\"Aggiungere Coppia di Processori\",\"\",IF(B137=\"Aggiungere 9 slot Secondary Riser\",\"\",(VLOOKUP(B137,PCI_B5,5,FALSE))))","v":""},{"$f":"IF(B137=\"Aggiungere Coppia di Processori\",\"\",IF(B137=\"Aggiungere 9 slot Secondary Riser\",\"\",(VLOOKUP(B137,PCI_B5,6,FALSE))))","v":""},{"$f":"IF(B137=\"Aggiungere Coppia di Processori\",\"\",IF(B137=\"Aggiungere 9 slot Secondary Riser\",\"\",(VLOOKUP(B137,PCI_B5,9,FALSE))))","v":0}]
[]
[null,"Additional Card for PCIe Slot 14 (CPU2)"]
[null,"None",{"$f":"IF(B140=\"Aggiungere Coppia di Processori\",\"\",IF(B140=\"Aggiungere 9 slot Secondary Riser\",\"\",(VLOOKUP(B140,PCI_B5,2,FALSE))))","v":""},{"$f":"IF(B140=\"Aggiungere Coppia di Processori\",\"\",IF(B140=\"Aggiungere 9 slot Secondary Riser\",\"\",(VLOOKUP(B140,PCI_B5,3,FALSE))))","v":""},{"$f":"IF(B140=\"Aggiungere Coppia di Processori\",\"\",IF(B140=\"Aggiungere 9 slot Secondary Riser\",\"\",(VLOOKUP(B140,PCI_B5,5,FALSE))))","v":""},{"$f":"IF(B140=\"Aggiungere Coppia di Processori\",\"\",IF(B140=\"Aggiungere 9 slot Secondary Riser\",\"\",(VLOOKUP(B140,PCI_B5,6,FALSE))))","v":""},{"$f":"IF(B140=\"Aggiungere Coppia di Processori\",\"\",IF(B140=\"Aggiungere 9 slot Secondary Riser\",\"\",(VLOOKUP(B140,PCI_B5,9,FALSE))))","v":0}]
[]
[null,"Additional Card for PCIe Slot 15 (CPU2)"]
[null,"None",{"$f":"IF(B143=\"Aggiungere Coppia di Processori\",\"\",IF(B143=\"Aggiungere 9 slot Secondary Riser\",\"\",(VLOOKUP(B143,PCI_B4,2,FALSE))))","v":""},{"$f":"IF(B143=\"Aggiungere Coppia di Processori\",\"\",IF(B143=\"Aggiungere 9 slot Secondary Riser\",\"\",(VLOOKUP(B143,PCI_B4,3,FALSE))))","v":""},{"$f":"IF(B143=\"Aggiungere Coppia di Processori\",\"\",IF(B143=\"Aggiungere 9 slot Secondary Riser\",\"\",(VLOOKUP(B143,PCI_B4,5,FALSE))))","v":""},{"$f":"IF(B143=\"Aggiungere Coppia di Processori\",\"\",IF(B143=\"Aggiungere 9 slot Secondary Riser\",\"\",(VLOOKUP(B143,PCI_B4,6,FALSE))))","v":""},{"$f":"IF(B143=\"Aggiungere Coppia di Processori\",\"\",IF(B143=\"Aggiungere 9 slot Secondary Riser\",\"\",(VLOOKUP(B143,PCI_B4,9,FALSE))))","v":0}]
[]
[null,"Additional Card for PCIe Slot 16 (CPU2)"]
[null,"None",{"$f":"IF(B146=\"Aggiungere Coppia di Processori\",\"\",IF(B146=\"Aggiungere 9 slot Secondary Riser\",\"\",(VLOOKUP(B146,PCI_B4,2,FALSE))))","v":""},{"$f":"IF(B146=\"Aggiungere Coppia di Processori\",\"\",IF(B146=\"Aggiungere 9 slot Secondary Riser\",\"\",(VLOOKUP(B146,PCI_B4,3,FALSE))))","v":""},{"$f":"IF(B146=\"Aggiungere Coppia di Processori\",\"\",IF(B146=\"Aggiungere 9 slot Secondary Riser\",\"\",(VLOOKUP(B146,PCI_B4,5,FALSE))))","v":""},{"$f":"IF(B146=\"Aggiungere Coppia di Processori\",\"\",IF(B146=\"Aggiungere 9 slot Secondary Riser\",\"\",(VLOOKUP(B146,PCI_B4,6,FALSE))))","v":""},{"$f":"IF(B146=\"Aggiungere Coppia di Processori\",\"\",IF(B146=\"Aggiungere 9 slot Secondary Riser\",\"\",(VLOOKUP(B146,PCI_B4,9,FALSE))))","v":0}]
[]
[null,"Accessori per GPU"]
[null,"HPE DL38x Gen10 8-pin Cable Kit for P6000 GPU",{"$f":"IF(IF($E$104=\"Q0v76a\",1,0)+IF($E$110=\"Q0v76a\",1,0)+IF($E$125=\"Q0v76a\",1,0)++IF($E$131=\"Q0v76a\",1,0)=0,0,IF(IF($E$104=\"Q0v76a\",1,0)+IF($E$110=\"Q0v76a\",1,0)+IF($E$125=\"Q0v76a\",1,0)++IF($E$131=\"Q0v76a\",1,0)>3,2,1))","v":0},"TS1-871828","871828-B21",null,{"$f":"26*C149","v":0}]
[null,null,null,null,{"$f":"COUNTIF($E$104:$E$131,\"Q2N68A\")+COUNTIF($E$104:$E$131,\"Q0v80a\")","v":0}]
[null,"HPE DL38x Gen10 8-pin Keyed Cable Kit for P40 or V100 GPU",{"$f":"IF(E150=0,0,IF(E150>3,2,1))","v":0},"TS1-871829","871829-B21",null,{"$f":"31*C151","v":0}]
[]
[null,"HPE DL580 Gen10 GPU Bracket Kit for installation in slots 4 or 11",{"$f":"IF($E$110=\"Q2n68A\",1,0)+IF($E$131=\"Q2n68A\",1,0)+IF($E$110=\"Q0v80a\",1,0)+IF($E$131=\"Q0v80a\",1,0)+IF($E$110=\"Q0v76a\",1,0)+IF($E$131=\"Q0v76a\",1,0)","v":0},"TS1-P00268","P00268-B21",null,{"$f":"33*C153","v":0}]
[]
[null,"Bezel"]
[null,"None",1]
[]
[null,"Accessori per Server"]
[null,"HP BLc 10G SFP+ SR Transceiver",2,null,"455883-B21"]
[]
[null,"Unità ottica"]
[null,"HP Mobile USB DVDRW Drive",1,null,"701498-B21"]
[]
[null,"Estensione di Garanzia"]
[null,"None",{"$f":"VLOOKUP($B$165,  SO_B1,2, FALSE)","v":""},{"$f":"VLOOKUP($B$165,  SO_B1, 3, FALSE)","v":""},{"$f":"VLOOKUP($B$165,  SO_B1, 5, FALSE)","v":""},{"$f":"VLOOKUP($B$165,  SO_B1, 6, FALSE)","v":""}]
[]
[null,"Protezione dei dati - Keep Your Hard Drive "]
[null,"None",{"$f":"VLOOKUP($B$168,  SO_B2, 2, FALSE)","v":""},{"$f":"VLOOKUP($B$168,  SO_B2, 3, FALSE)","v":""},{"$f":"VLOOKUP($B$168,  SO_B2,5, FALSE)","v":""},{"$f":"VLOOKUP($B$168,  SO_B2, 6, FALSE)","v":""}]

{"sheet":"Lotto2 DL580 Prest 1","index":2,"n_rows":164,"n_cols":13,"rows_kept":164,"cut":false,"hidden":false,"merged":[[4,0,4,4],[5,0,5,4],[10,0,11,5],[12,0,12,5],[18,2,18,4],[20,1,20,4],[21,2,21,4],[24,1,24,4],[48,1,48,4],[50,1,50,4],[31,2,31,3],[27,1,27,4],[28,2,28,4],[30,1,30,4],[33,1,33,4],[25,2,25,4],[56,1,56,4],[61,2,61,4],[34,2,34,4],[40,1,40,4],[41,2,41,4],[45,1,45,4],[46,2,46,4],[53,1,53,4],[60,1,60,4],[63,1,63,4],[64,2,64,4],[78,1,78,4],[80,1,80,3],[83,1,83,4],[84,2,84,4],[84,8,87,10],[87,1,87,4],[79,2,79,4],[116,2,116,4],[88,2,88,4],[91,1,91,4],[92,2,92,4],[94,1,94,4],[100,1,100,4],[107,2,107,4],[109,1,109,4],[110,2,110,4],[112,1,112,4],[113,2,113,4],[115,1,115,4],[97,1,97,4],[103,1,103,4],[106,1,106,4],[150,2,150,4],[118,1,118,4],[119,2,119,4],[121,1,121,4],[122,2,122,4],[124,1,124,4],[125,2,125,4],[127,1,127,4],[128,2,128,4],[130,1,130,4],[140,2,140,4],[142,1,142,4],[131,2,131,4],[133,1,133,4],[134,2,134,4],[136,1,136,4],[161,1,161,4],[162,2,162,4],[137,2,137,4],[139,1,139,4],[143,2,143,4],[149,1,149,4],[164,1,164,4],[152,1,152,4],[153,2,153,4],[155,1,155,4],[156,2,156,4],[158,1,158,4],[159,2,159,4]]}
["IN ROSSO LE OPZIONI 20%",null,null,null,null,null,null,null,null,"TOTALE CONVENZIONE",{"$f":"K10","v":0},"Totale Ulteriori Opzioni ",{"$f":"K8","v":0}]
[]
[]
[]
["Tecnologie Server1 Lotto2 Prestazionale DL580"]
[]
[null,null,null,null,null,null,null,null,null,"Totale Server e Opzioni",{"$f":"F17*SRV_C","v":0}]
[null,null,null,null,null,null,null,null,null,"Totale Ulteriori Opzioni ",{"$f":"G16*SRV_C","v":0}]
[]
[null,null,null,null,null,null,null,null,null,"TOTALE CONVENZIONE",{"$f":"K8+K7","v":0}]
["Components: \nServer HP Proliant DL580 Gen10 (2CPU Intel® Xeon® Gold 6140M, 128GB , 2xHDD 300GB 15K RPM SAS 12Gbps 2.5in)"]
[]
[]
[]
["Proliant DL580 Gen10","Category: Server",null,null,null,6092]
[null,"Quantity: ",null,null,null,{"$f":"SUM(F20:F203)","v":0},{"$f":"SUM(G20:G203)","v":0}]
[null,null,null,null,null,{"$f":"SUM(F15:F16)","v":6092}]
[]
[null,"Base"]
[null,"HPE DL580 Gen10 8SFF CTO Server",1,null,"869854-B21"]
[]
[null,"Processore"]
[null,"HPE DL580 Gen10 Intel® Xeon-Gold 6140M (2.3GHz/18-core/140W) ",1,null,"878138-L21"]
[null,"HPE DL580 Gen10 Intel® Xeon-Gold 6140M (2.3GHz/18-core/140W) ",1,null,"878138-B21"]
[]
[null,"Processore aggiuntivo"]
[null,"No Additional Processor",{"$f":"VLOOKUP($B$27, CPU_C, 2, FALSE)","v":0},{"$f":"VLOOKUP($B$27, CPU_C, 3, FALSE)","v":""},{"$f":"VLOOKUP($B$27, CPU_C, 5, FALSE)","v":0},{"$f":"VLOOKUP(B27, CPU_C, 12, FALSE)","v":""}]
[]
[null,"Mezz Board Option"]
[null,{"$f":"VLOOKUP($B$27, CPU_C, 6, FALSE)","v":""},{"$f":"VLOOKUP($B$27, CPU_C, 7, FALSE)","v":""},null,{"$f":"VLOOKUP($B$27, CPU_C, 8, FALSE)","v":""}]
[]
[null,"Memoria Totale in GB",{"$f":"IF(F27=5056,IF(B33=128,\"ATTENZIONE: AUMENTARE LA RAM\",\"\"),\"\")","v":""}]
[null,128]
[]
[null,"Capacità di memoria"]
[null,{"$f":"IF($B$27=\"No Additional Processor\",VLOOKUP($B$33, MEM_C1, 8, FALSE),VLOOKUP($B$33, MEM_C2, 8, FALSE))","v":"HPE 32GB (1x32GB) Dual Rank x4 DDR4-2666 CAS-19-19-19 Registered Smart Memory Kit"},{"$f":"IF($B$27=\"No Additional Processor\",VLOOKUP($B$33, MEM_C1, 9, FALSE),VLOOKUP($B$33, MEM_C2, 9, FALSE))","v":4},null,{"$f":"IF($B$27=\"No Additional Processor\",VLOOKUP($B$33, MEM_C1, 10, FALSE),VLOOKUP($B$33, MEM_C2, 10, FALSE))","v":"815100-B21"}]
[]
[null,{"$f":"IF($B$27=\"No Additional Processor\",VLOOKUP($B$33, MEM_C1, 2, FALSE),VLOOKUP($B$33, MEM_C2, 2, FALSE))","v":""},{"$f":"IF($B$27=\"No Additional Processor\",VLOOKUP($B$33, MEM_C1, 3, FALSE),VLOOKUP($B$33, MEM_C2, 3, FALSE))","v":""},{"$f":"IF($B$27=\"No Additional Processor\",VLOOKUP($B$33, MEM_C1, 4, FALSE),VLOOKUP($B$33, MEM_C2, 4, FALSE))","v":""},{"$f":"IF($B$27=\"No Additional Processor\",VLOOKUP($B$33, MEM_C1, 6, FALSE),VLOOKUP($B$33, MEM_C2, 6, FALSE))","v":0},{"$f":"IF($B$27=\"No Additional Processor\",VLOOKUP($B$33, MEM_C1, 7, FALSE),VLOOKUP($B$33, MEM_C2, 7, FALSE))","v":""}]
[]
[null,{"$f":"IF($B$27=\"No Additional Processor\",VLOOKUP($B$33, MEM_C1, 11, FALSE),VLOOKUP($B$33, MEM_C2, 11, FALSE))","v":""},{"$f":"IF($B$27=\"No Additional Processor\",VLOOKUP($B$33, MEM_C1, 12, FALSE),VLOOKUP($B$33, MEM_C2, 12, FALSE))","v":""},{"$f":"IF($B$27=\"No Additional Processor\",VLOOKUP($B$33, MEM_C1, 13, FALSE),VLOOKUP($B$33, MEM_C2, 13, FALSE))","v":""},{"$f":"IF($B$27=\"No Additional Processor\",VLOOKUP($B$33, MEM_C1, 15, FALSE),VLOOKUP($B$33, MEM_C2, 15, FALSE))","v":""},{"$f":"IF($B$27=\"No Additional Processor\",VLOOKUP($B$33, MEM_C1, 16, FALSE),VLOOKUP($B$33, MEM_C2, 16, FALSE))","v":""}]
[]
[null,"Sistema operativo preinstallato"]
[null,"No Operating System",{"$f":"VLOOKUP($B$43, OS_C, 2, FALSE)","v":""},{"$f":"VLOOKUP($B$43, OS_C, 3, FALSE)","v":""},{"$f":"VLOOKUP($B$43, OS_C, 5, FALSE)","v":""},{"$f":"VLOOKUP($B$43, OS_C, 6, FALSE)","v":""}]
[null,{"$f":"IF($B$27=\"No Additional Processor\",VLOOKUP($B$43, OS_C, 19, FALSE),VLOOKUP($B$43, OS_C2, 19, FALSE))","v":""},{"$f":"IF($B$27=\"No Additional Processor\",VLOOKUP($B$43, OS_C, 20, FALSE),VLOOKUP($B$43, OS_C2, 20, FALSE))","v":0},{"$f":"IF($B$27=\"No Additional Processor\",VLOOKUP($B$43, OS_C, 21, FALSE),VLOOKUP($B$43, OS_C2, 21, FALSE))","v":""},{"$f":"IF($B$27=\"No Additional Processor\",VLOOKUP($B$43, OS_C, 23, FALSE),VLOOKUP($B$43, OS_C2, 23, FALSE))","v":""},{"$f":"IF($B$27=\"No Additional Processor\",VLOOKUP($B$43, OS_C, 24, FALSE)*C44,VLOOKUP($B$43, OS_C2, 24, FALSE)*C44)","v":0},null,{"$f":"IF(D43=\"TS1L2-WIN1\",3,IF(D43=\"TS1L2-WINDC1\",4,0))","v":0}]
[null,{"$f":"IF($B$27=\"No Additional Processor\",VLOOKUP($B$43, OS_C, 25, FALSE),VLOOKUP($B$43, OS_C2, 25, FALSE))","v":""},{"$f":"IF($B$27=\"No Additional Processor\",VLOOKUP($B$43, OS_C, 26, FALSE),VLOOKUP($B$43, OS_C2, 26, FALSE))","v":0},{"$f":"IF($B$27=\"No Additional Processor\",VLOOKUP($B$43, OS_C, 27, FALSE),VLOOKUP($B$43, OS_C2, 27, FALSE))","v":""},{"$f":"IF($B$27=\"No Additional Processor\",VLOOKUP($B$43, OS_C, 29, FALSE),VLOOKUP($B$43, OS_C2, 29, FALSE))","v":""},{"$f":"IF($B$27=\"No Additional Processor\",VLOOKUP($B$43, OS_C, 30, FALSE)*C45,VLOOKUP($B$43, OS_C2, 30, FALSE)*C45)","v":0}]
[]
[null,"Client Access Licenses"]
[null,{"$f":"VLOOKUP($B$43, OS_C, 7, FALSE)","v":"None"},null,{"$f":"VLOOKUP($B$43, OS_C, 9, FALSE)","v":""},{"$f":"VLOOKUP($B$43, OS_C, 11, FALSE)","v":""},{"$f":"VLOOKUP($B$43, OS_C, 12, FALSE)*C48","v":0}]
[]
[null,{"$f":"VLOOKUP($B$43, OS_C, 13, FALSE)","v":"None"},null,{"$f":"VLOOKUP($B$43, OS_C, 15, FALSE)","v":""},{"$f":"VLOOKUP($B$43, OS_C, 17, FALSE)","v":""},{"$f":"VLOOKUP($B$43, OS_C, 18, FALSE)*C50","v":0}]
[]
[null,"Sistema opertivo SUSE Linux Enterprise Server"]
[null,"None\n",{"$f":"IF(D53=\"\",0,(C23+C24+C27)/2)","v":0},{"$f":"VLOOKUP($B$53, SUSE, 3, FALSE)","v":""},{"$f":"VLOOKUP($B$53, SUSE, 5, FALSE)","v":""},null,{"$f":"VLOOKUP($B$53, SUSE, 6, FALSE)*C53","v":0}]
[]
[null,"HPE OneView Advanced (with HPE iLO Advanced)"]
[null,"None",{"$f":"VLOOKUP($B$56, OpzOVAdv, 2, FALSE)","v":0},{"$f":"VLOOKUP($B$56, OpzOVAdv, 3, FALSE)","v":""},{"$f":"VLOOKUP($B$56, OpzOVAdv, 5, FALSE)","v":""},null,{"$f":"VLOOKUP($B$56, OpzOVAdv, 6, FALSE)","v":0}]
[]
[null,"Configurazione dello chassis"]
[null,"Chassis 16 slot HDD",{"$f":"IF(C60=0,1,0)","v":1},null,"830824-B21"]
[null,"Chassis 48 slot HDD",0,{"$f":"IF(C60=1,\"S2-48HDDbay\",\"\")","v":""},"830824-B21",null,{"$f":"IF(C60=1,1367,0)","v":0}]
[]
[null,"Controller RAID (PCIe Slot 16)"]
[null,"HPE Smart Array P408i-p SR Gen10 (8 Internal Lanes/2GB Cache) 12G SAS PCIe Plug-in Controller",1,null,"830824-B21"]
[]
[null,{"$f":"IF(C59=1,\"Dischi rigidi (numero massimo totale 16)\",\"Dischi rigidi (numero massimo totale 48)\")","v":"Dischi rigidi (numero massimo totale 16)"}]
[null,"HPE 300GB SAS 15K SFF SC DS HDD",2,null,"870753-B21"]
[]
[null,"HPE 300GB SAS 15K SFF SC DS HDD",null,"TS1L2-HD300","870753-B21",{"$f":"HD300_C*156","v":0}]
[]
[null,"HPE 1.2TB SAS 10K SFF SC DS HDD",null,"TS1L2-HD1200","872479-B21",{"$f":"HD1000_c*292","v":0}]
[]
[null,"HPE 1.8TB SAS 10K SFF SC DS HDD",null,"TS1L2-HD1800","872481-B21",{"$f":"C72*467","v":0}]
[]
[null,"HPE 960GB SAS 12G Read Intensive SFF SC DS SSD",null,"TS1L2-SSD960","872390-B21",{"$f":"C74*1571","v":0}]
[]
[null,"HPE 1.92TB SAS 12G Read Intensive SFF SC DS SSD",null,"TS1L2-SSD1920","875326-B21",{"$f":"C76*2667","v":0}]
[]
[null,"DISCHI TOTALI",{"$f":"SUM(C66:C77)","v":2},{"$f":"IF(C59=1,IF(C78<=16,\"      OK\",\"     ERRORE:   Totale n° di dischi superiore al consentito\"),IF(C78<=48,\"      OK\",\"     ERRORE:   Totale n° di dischi superiore al consentito\"))","v":"      OK"}]
[]
[null,"Configurazione RAID"]
[null,"SCRIVERE QUI' LA CONFIGURAZIONE RAID RICHIESTA.\nDL580 Prestazionale 1"]
[null,"RAID 1  (2 HDDs)",1,null,{"$f":"VLOOKUP($B$82,  RAID_B1, 2, FALSE)","v":"[780-BBJK]"}]
[null,"Hot Spare for 300GB HDD","No"]
[]
[null,"Configurazione RAID con HDD 1TB"]
[null,"",1,null,{"$f":"VLOOKUP($B$86,  RAID_B2, 2, FALSE)","v":""}]
[null,"Hot Spare for 1TB HDD","No"]
[]
[null,"Alimentatore"]
[null,"HPE 1600W FS Plat Ht Plg LH Pwr Sply Kit",{"$f":"IF(C27=0,2,4)","v":2},null,"830272-B21"]
[null,"HPE 1600W FS Plat Ht Plg LH Pwr Sply Kit",{"$f":"IF(C27+C60>=2,0,IF(C27+C60=0,0,2))","v":0},"S2-PwrSply2","830272-B21",null,{"$f":"IF(C91=0,0,306)","v":0}]
[]
[null,"Scheda FlexibleLOM"]
[null,"HPE FlexFabric 10Gb 2P 534FLR-SFP+ Adptr",1,null,"700751-B21"]
[]
[null,"Additional Card for PCIe Slot 1 (CPU3)"]
[null,"None",{"$f":"IF(B97=\"Aggiungere Coppia di Processori\",\"\",(VLOOKUP(B97,PCI_B5, 2, FALSE)))","v":""},{"$f":"IF(B97=\"Aggiungere Coppia di Processori\",\"\",(VLOOKUP(B97,PCI_B5, 3, FALSE)))","v":""},{"$f":"IF(B97=\"Aggiungere Coppia di Processori\",\"\",(VLOOKUP(B97,PCI_B5, 5, FALSE)))","v":""},{"$f":"IF(B97=\"Aggiungere Coppia di Processori\",\"\",(VLOOKUP(B97,PCI_B5, 6, FALSE)))","v":""},{"$f":"IF(B97=\"Aggiungere Coppia di Processori\",\"\",(VLOOKUP(B97,PCI_B5, 9, FALSE)))","v":0}]
[]
[null,"Additional Card for PCIe Slot 2 (CPU3) (GPU Slot)"]
[null,"None",{"$f":"IF(B100=\"Aggiungere Coppia di Processori\",\"\",(VLOOKUP(B100,PCI_B6, 2, FALSE)))","v":""},{"$f":"IF(B100=\"Aggiungere Coppia di Processori\",\"\",(VLOOKUP(B100,PCI_B6, 3, FALSE)))","v":""},{"$f":"IF(B100=\"Aggiungere Coppia di Processori\",\"\",(VLOOKUP(B100,PCI_B6, 5, FALSE)))","v":""},{"$f":"IF(B100=\"Aggiungere Coppia di Processori\",\"\",(VLOOKUP(B100,PCI_B6, 6, FALSE)))","v":""},{"$f":"IF(B100=\"Aggiungere Coppia di Processori\",\"\",(VLOOKUP(B100,PCI_B6, 9, FALSE)))","v":0}]
[]
[null,"Additional Card for PCIe Slot 3 (CPU3)"]
[null,"None",{"$f":"IF(B103=\"Aggiungere Coppia di Processori\",\"\",(VLOOKUP(B103,PCI_B5, 2, FALSE)))","v":""},{"$f":"IF(B103=\"Aggiungere Coppia di Processori\",\"\",(VLOOKUP(B103,PCI_B5, 3, FALSE)))","v":""},{"$f":"IF(B103=\"Aggiungere Coppia di Processori\",\"\",(VLOOKUP(B103,PCI_B5, 5, FALSE)))","v":""},{"$f":"IF(B103=\"Aggiungere Coppia di Processori\",\"\",(VLOOKUP(B103,PCI_B5, 6, FALSE)))","v":""},{"$f":"IF(B103=\"Aggiungere Coppia di Processori\",\"\",(VLOOKUP(B103,PCI_B5, 9, FALSE)))","v":0}]
[]
[null,"Additional Card for PCIe Slot 4 (CPU3) (GPU Slot)"]
[null,"None",{"$f":"IF(B106=\"Aggiungere Coppia di Processori\",\"\",(VLOOKUP(B106,PCI_B6, 2, FALSE)))","v":""},{"$f":"IF(B106=\"Aggiungere Coppia di Processori\",\"\",(VLOOKUP(B106,PCI_B6, 3, FALSE)))","v":""},{"$f":"IF(B106=\"Aggiungere Coppia di Processori\",\"\",(VLOOKUP(B106,PCI_B6, 5, FALSE)))","v":""},{"$f":"IF(B106=\"Aggiungere Coppia di Processori\",\"\",(VLOOKUP(B106,PCI_B6, 6, FALSE)))","v":""},{"$f":"IF(B106=\"Aggiungere Coppia di Processori\",\"\",(VLOOKUP(B106,PCI_B6, 9, FALSE)))","v":0}]
[]
[null,"Additional Card for PCIe Slot 5 (CPU1)"]
[null,"HPE Ethernet 1Gb 4-port 331T Adapter",1,null,"647594-B21"]
[]
[null,"Additional Card for PCIe Slot 6 (CPU1)"]
[null,"HPE Ethernet 1Gb 2-port 332T Adapter",1,null,"647594-B21"]
[]
[null,"Additional Card for PCIe Slot 7 (CPU1)"]
[null,"HPE DL580 Gen10 12G 24-port SAS Expander",1,null,"881101-B21"]
[]
[null,"Additional Card for PCIe Slot 8 (CPU4)"]
[null,"None",{"$f":"IF(B118=\"Aggiungere Coppia di Processori\",\"\",(VLOOKUP(B118,PCI_B5, 2, FALSE)))","v":""},{"$f":"IF(B118=\"Aggiungere Coppia di Processori\",\"\",(VLOOKUP(B118,PCI_B5, 3, FALSE)))","v":""},{"$f":"IF(B118=\"Aggiungere Coppia di Processori\",\"\",(VLOOKUP(B118,PCI_B5, 5, FALSE)))","v":""},{"$f":"IF(B118=\"Aggiungere Coppia di Processori\",\"\",(VLOOKUP(B118,PCI_B5, 6, FALSE)))","v":""},{"$f":"IF(B118=\"Aggiungere Coppia di Processori\",\"\",(VLOOKUP(B118,PCI_B5, 9, FALSE)))","v":0}]
[]
[null,"Additional Card for PCIe Slot 9 (CPU4) (GPU Slot)"]
[null,"None",{"$f":"IF(B121=\"Aggiungere Coppia di Processori\",\"\",IF(B121=\"Aggiungere 9 slot Secondary Riser\",\"\",(VLOOKUP(B121,PCI_B6,2,FALSE))))","v":""},{"$f":"IF(B121=\"Aggiungere Coppia di Processori\",\"\",IF(B121=\"Aggiungere 9 slot Secondary Riser\",\"\",(VLOOKUP(B121,PCI_B6,3,FALSE))))","v":""},{"$f":"IF(B121=\"Aggiungere Coppia di Processori\",\"\",IF(B121=\"Aggiungere 9 slot Secondary Riser\",\"\",(VLOOKUP(B121,PCI_B6,5,FALSE))))","v":""},{"$f":"IF(B121=\"Aggiungere Coppia di Processori\",\"\",IF(B121=\"Aggiungere 9 slot Secondary Riser\",\"\",(VLOOKUP(B121,PCI_B6,6,FALSE))))","v":""},{"$f":"IF(B121=\"Aggiungere Coppia di Processori\",\"\",IF(B121=\"Aggiungere 9 slot Secondary Riser\",\"\",(VLOOKUP(B121,PCI_B6,9,FALSE))))","v":0}]
[]
[null,"Additional Card for PCIe Slot 10 (CPU4)"]
[null,"None",{"$f":"IF(B124=\"Aggiungere Coppia di Processori\",\"\",(VLOOKUP(B124,PCI_B5, 2, FALSE)))","v":""},{"$f":"IF(B124=\"Aggiungere Coppia di Processori\",\"\",(VLOOKUP(B124,PCI_B5, 3, FALSE)))","v":""},{"$f":"IF(B124=\"Aggiungere Coppia di Processori\",\"\",(VLOOKUP(B124,PCI_B5, 5, FALSE)))","v":""},{"$f":"IF(B124=\"Aggiungere Coppia di Processori\",\"\",(VLOOKUP(B124,PCI_B5, 6, FALSE)))","v":""},{"$f":"IF(B124=\"Aggiungere Coppia di Processori\",\"\",(VLOOKUP(B124,PCI_B5, 9, FALSE)))","v":0}]
[]
[null,"Additional Card for PCIe Slot 11 (CPU4) (GPU Slot)"]
[null,"None",{"$f":"IF(B127=\"Aggiungere Coppia di Processori\",\"\",IF(B127=\"Aggiungere 9 slot Secondary Riser\",\"\",(VLOOKUP(B127,PCI_B6,2,FALSE))))","v":""},{"$f":"IF(B127=\"Aggiungere Coppia di Processori\",\"\",IF(B127=\"Aggiungere 9 slot Secondary Riser\",\"\",(VLOOKUP(B127,PCI_B6,3,FALSE))))","v":""},{"$f":"IF(B127=\"Aggiungere Coppia di Processori\",\"\",IF(B127=\"Aggiungere 9 slot Secondary Riser\",\"\",(VLOOKUP(B127,PCI_B6,5,FALSE))))","v":""},{"$f":"IF(B127=\"Aggiungere Coppia di Processori\",\"\",IF(B127=\"Aggiungere 9 slot Secondary Riser\",\"\",(VLOOKUP(B127,PCI_B6,6,FALSE))))","v":""},{"$f":"IF(B127=\"Aggiungere Coppia di Processori\",\"\",IF(B127=\"Aggiungere 9 slot Secondary Riser\",\"\",(VLOOKUP(B127,PCI_B6,9,FALSE))))","v":0}]
[]
[null,"Additional Card for PCIe Slot 12 (CPU2)"]
[null,"None",{"$f":"VLOOKUP(B130,  PCI_B2, 2, FALSE)","v":""},{"$f":"VLOOKUP(B130,  PCI_B2, 3, FALSE)","v":""},{"$f":"VLOOKUP(B130,  PCI_B2, 5, FALSE)","v":""},{"$f":"VLOOKUP(B130,  PCI_B2, 6, FALSE)","v":""},{"$f":"VLOOKUP(B130,  PCI_B2, 9, FALSE)","v":0}]
[]
[null,"Additional Card for PCIe Slot 13 (CPU2)"]
[null,"None",{"$f":"VLOOKUP(B133,  PCI_B2, 2, FALSE)","v":""},{"$f":"VLOOKUP(B133,  PCI_B2, 3, FALSE)","v":""},{"$f":"VLOOKUP(B133,  PCI_B2, 5, FALSE)","v":""},{"$f":"VLOOKUP(B133,  PCI_B2, 6, FALSE)","v":""},{"$f":"VLOOKUP(B133,  PCI_B2, 9, FALSE)","v":0}]
[]
[null,"Additional Card for PCIe Slot 14 (CPU2)"]
[null,"None",{"$f":"IF(B136=\"Aggiungere Coppia di Processori\",\"\",(VLOOKUP(B136,PCI_B4,2,FALSE)))","v":""},{"$f":"IF(B136=\"Aggiungere Coppia di Processori\",\"\",(VLOOKUP(B136,PCI_B4,3,FALSE)))","v":""},{"$f":"IF($B$136=\"Aggiungere Coppia di Processori\",\"\",(VLOOKUP($B$136,PCI_B4,5,FALSE)))","v":""},{"$f":"IF($B$136=\"Aggiungere Coppia di Processori\",\"\",(VLOOKUP($B$136,PCI_B4,6,FALSE)))","v":""},{"$f":"IF($B$136=\"Aggiungere Coppia di Processori\",\"\",(VLOOKUP($B$136,PCI_B4,9,FALSE)))","v":0}]
[]
[null,"Additional Card for PCIe Slot 15 (CPU2)"]
[null,"None",{"$f":"IF(B139=\"Aggiungere Coppia di Processori\",\"\",(VLOOKUP(B139,PCI_B4,2,FALSE)))","v":""},{"$f":"IF(B139=\"Aggiungere Coppia di Processori\",\"\",(VLOOKUP(B139,PCI_B4,3,FALSE)))","v":""},{"$f":"IF($B$139=\"Aggiungere Coppia di Processori\",\"\",(VLOOKUP($B$139,PCI_B4,5,FALSE)))","v":""},{"$f":"IF($B$139=\"Aggiungere Coppia di Processori\",\"\",(VLOOKUP($B$139,PCI_B4,6,FALSE)))","v":""},{"$f":"IF($B$139=\"Aggiungere Coppia di Processori\",\"\",(VLOOKUP($B$139,PCI_B4,9,FALSE)))","v":0}]
[]
[null,"Additional Card for PCIe Slot 16 (CPU2)"]
[null,"HPE Smart Array P408i-p SR Gen10 Ctrlr",1,null,"830824-B21"]
[]
[null,"Accessori per GPU"]
[null,"HPE DL38x Gen10 8-pin Cable Kit for P6000 GPU",{"$f":"IF(IF($E$100=\"Q0v76a\",1,0)+IF($E$106=\"Q0v76a\",1,0)+IF($E$121=\"Q0v76a\",1,0)++IF($E$127=\"Q0v76a\",1,0)=0,0,IF(IF($E$100=\"Q0v76a\",1,0)+IF($E$106=\"Q0v76a\",1,0)+IF($E$121=\"Q0v76a\",1,0)++IF($E$127=\"Q0v76a\",1,0)>3,2,1))","v":0},"TS1-871828","871828-B21",null,{"$f":"26*C145","v":0}]
[null,null,null,null,{"$f":"COUNTIF($E$100:$E$127,\"Q2N68A\")+COUNTIF($E$100:$E$127,\"Q0v80a\")","v":0}]
[null,"HPE DL38x Gen10 8-pin Keyed Cable Kit for P40 or V100 GPU",{"$f":"IF(E146=0,0,IF(E146>3,2,1))","v":0},"TS1-871829","871829-B21",null,{"$f":"31*C147","v":0}]
[]
[null,"HPE DL580 Gen10 GPU Bracket Kit for installation in slots 4 or 11",{"$f":"IF($E$106=\"Q2n68A\",1,0)+IF($E$127=\"Q2n68A\",1,0)+IF($E$106=\"Q0v80a\",1,0)+IF($E$127=\"Q0v80a\",1,0)+IF($E$106=\"Q0v76a\",1,0)+IF($E$127=\"Q0v76a\",1,0)","v":0},"TS1-P00268","P00268-B21",null,{"$f":"33*C149","v":0}]
[]
[null,"Bezel"]
[null,"None",1]
[]
[null,"Accessori per Server"]
[null,"HP BLc 10G SFP+ SR Transceiver",2,null,"455883-B21"]
[]
[null,"Unità ottica"]
[null,"HP Mobile USB DVDRW Drive",1,null,"701498-B21"]
[]
[null,"Estensione di Garanzia"]
[null,"None",{"$f":"VLOOKUP($B$161,  SO_B1,2, FALSE)","v":""},{"$f":"VLOOKUP($B$161,  SO_B1, 3, FALSE)","v":""},{"$f":"VLOOKUP($B$161,  SO_B1, 5, FALSE)","v":""},{"$f":"VLOOKUP($B$161,  SO_B1, 6, FALSE)","v":""}]
[]
[null,"Protezione dei dati - Keep Your Hard Drive "]
[null,"None",{"$f":"VLOOKUP($B$164,  SO_B2, 2, FALSE)","v":""},{"$f":"VLOOKUP($B$164,  SO_B2, 3, FALSE)","v":""},{"$f":"VLOOKUP($B$164,  SO_B2,5, FALSE)","v":""},{"$f":"VLOOKUP($B$164,  SO_B2, 6, FALSE)","v":""}]

{"sheet":"RACK, Accessori e Servizi","index":3,"n_rows":70,"n_cols":17,"rows_kept":70,"cut":false,"hidden":false,"merged":[[0,0,0,22],[1,3,1,8],[3,12,10,12],[12,12,30,12],[30,4,30,7],[20,2,20,7],[54,2,54,6],[5,2,5,7],[7,2,7,7],[9,2,9,7],[12,13,30,17],[14,2,14,7],[23,2,23,7],[26,2,26,7],[29,2,29,7],[17,2,17,7]]}
["IN ROSSO LE OPZIONI 20%"]
[null,null,null,"Indicare il numero delle Opzioni"]
[]
[null,null,null,null,null,null,null,null,null,null,null,null,"SERVIZI"]
[null,null,{"$f":"IF(SRV_A+SRV_B>=1,\"Servizi Specialistici\",\"\")","v":""}]
[null,null,{"$f":"IF(SRV_A+SRV_B>=1,\"Servizio Specialistico di System and Network Management per sistema opertivo Windows, erogato on site. (GG/Uomo)\",\"\")","v":""},null,null,null,null,null,null,null,{"$f":"IF(J6>=1,\"10L2-SO-WIN\",\"\")","v":""}]
[]
[null,null,{"$f":"IF(SRV_A+SRV_B>=1,\"Servizio Specialistico di System and Network Management per sistema opertivo Linux, erogato on site. (GG/Uomo)\",\"\")","v":""},null,null,null,null,null,null,null,{"$f":"IF(J8>=1,\"10L2-SO-LINUX\",\"\")","v":""}]
[]
[null,null,{"$f":"IF((SRV_A+SRV_AA+SRV_AAA+SRV_B+SRV_BB+SRV_BBB)>=5,\"Servizi specialistici sistemistici per aggiornare e prevenire malfunzionamenti. \n(Minimo 5 Server)\",\"\")","v":""},null,null,null,null,null,null,null,{"$f":"IF(J10>=1,\"10L2-SO-PREV\",\"\")","v":""}]
[]
[]
[null,null,null,null,null,null,null,null,null,null,null,null,"SERVER RACK","\n\n\nIn questo foglio deve essere indicata la quantità delle opzioni Hardware  da acquistare.\n\n"]
[null,null,"Rack (OpzRack)"]
[null,null,{"$f":"IF((SRV_A+SRV_AA+SRV_AAA+SRV_B+SRV_BB+SRV_BBB+SRV_C+SRV_CC+SRV_CCC)>=1,\"Tecnosteel: armadio Rack 19'' 42U\",\"\")","v":""},null,null,null,null,null,null,null,{"$f":"IF(J15>=1,\"TS1L2-RACK\",\"\")","v":""}]
[]
[null,null,"PDU (OpzPDU32A)"]
[null,null,{"$f":"IF((SRV_A+SRV_AA+SRV_AAA+SRV_B+SRV_BB+SRV_BBB+SRV_C+SRV_CC+SRV_CCC)>=1,\"PDU Vertical 20+4 outlets C13 with MCB - IEC60309 input\",\"\")","v":""},null,null,null,null,null,null,null,{"$f":"IF(J18>=1,\"TS1-646861\",\"\")","v":""}]
[]
[null,null,"OpzPDU_TRIFASE"]
[null,null,{"$f":"IF((SRV_A+SRV_AA+SRV_AAA+SRV_B+SRV_BB+SRV_BBB+SRV_C+SRV_CC+SRV_CCC)>=1,\"PDU Vertical  18+6 outlets (C13+C19)  with MCB and ammeter - IEC60309 input - 3 phase\",\"\")","v":""},null,null,null,null,null,null,null,{"$f":"IF(J21>=1,\"TS1-646875\",\"\")","v":""}]
[]
[null,null,"KVM (OpzGUIRack)"]
[null,null,{"$f":"IF((SRV_A+SRV_AA+SRV_AAA+SRV_B+SRV_BB+SRV_BBB+SRV_C+SRV_CC+SRV_CCC)>=1,\"Orca: 1U Rackmount Console 17'' with Italian Keyboard\",\"\")","v":""},null,null,null,null,null,null,null,{"$f":"IF(J24>=1,\"TS1L2-GUI\",\"\")","v":""}]
[]
[null,null,"KVM Option (OpzSWGUIRack)"]
[null,null,{"$f":"IF((SRV_A+SRV_AA+SRV_AAA+SRV_B+SRV_BB+SRV_BBB+SRV_C+SRV_CC+SRV_CCC)>=1,\"Raritan: 16-port remote KVM switch with one remote user\",\"\")","v":""},null,null,null,null,null,null,null,{"$f":"IF(J27>=1,\"TS1L2-KVMIP\",\"\")","v":""}]
[]
[null,null,"Uninterrupted Power Supply (OpzUPS 3000VA)"]
[null,null,{"$f":"IF((SRV_A+SRV_AA+SRV_AAA+SRV_B+SRV_BB+SRV_BBB+SRV_C+SRV_CC+SRV_CCC)>=1,\"Riello - UPS MSR3000EVO 3000VA 2U Rackmount (SNMP+USB+RS232)\",\"\")","v":""},null,null,null,null,null,null,null,{"$f":"IF(J30>=1,\"TS1L2-UPS\",\"\")","v":""}]
[]
[]
[null,null,null,"Totale-"]
[null,null,null,"RACK A","RACK B","RACK C","RACK D","RACK E","RACK F","RACK G","RACK H","RACK I","RACK J"]
[null,null,{"$f":"J15","v":0},{"$f":"IF(H55>0,IF(C35-H55=0,0,C35-H55),0)","v":0},{"$f":"IF(I55>0,IF(D35-I55=0,0,D35-I55),0)","v":0},0,0,0,0,0,0,0,0]
[]
[]
[null,null,null,"Server Modello 1",null,null,{"$f":"SRV_A","v":0}]
[null,null,null,"Server Modello 2",null,null,{"$f":"SRV_AA","v":0}]
[null,null,null,"Server Modello 3",null,null,{"$f":"SRV_AAA","v":0}]
[null,null,null,"Server Modello 4",null,null,{"$f":"SRV_B","v":0}]
[null,null,null,"Server Modello 5",null,null,{"$f":"SRV_BB","v":0}]
[null,null,null,"Server Modello 6",null,null,{"$f":"SRV_BBB","v":0}]
[]
[null,null,null,null,null,null,null,{"$f":"SUM(H5:H10)+H12+H87*2+H89*2","v":0},0,0,0,0,0,0,0,0,0]
[]
[]
[]
[]
[]
[]
[]
[null,null,"Rack ancora da configurare",null,null,{"$f":"J15-H55-I55-J55-K55-L55-M55-N55-O55-P55-Q55","v":0}]
[]
[null,null,"Indicare il numero di rack per questa configurazione"]
[]
[null,null,null,null,"Totali","da inserire",null,{"$f":"IF(C35>0,\"RACK A\",\"\")","v":""},{"$f":"IF(D35>0,\"RACK B\",\"\")","v":""},{"$f":"IF(E35>0,\"RACK C\",\"\")","v":""},{"$f":"IF(F35>0,\"RACK D\",\"\")","v":""},{"$f":"IF(G35>0,\"RACK E\",\"\")","v":""},{"$f":"IF(H35>0,\"RACK F\",\"\")","v":""},{"$f":"IF(I35>0,\"RACK G\",\"\")","v":""},{"$f":"IF(J35>0,\"RACK H\",\"\")","v":""},{"$f":"IF(K35>0,\"RACK I\",\"\")","v":""},{"$f":"IF(L35>0,\"RACK J\",\"\")","v":""}]
[]
[null,null,{"$f":"IF(G38*$J$15>0,\"Server Lotto2 DL560 Conf.1\",\"\")","v":""},null,{"$f":"G38","v":0},{"$f":"(E59-(H59*$H$55)-(I59*$I$55)-(J59*$J$55)-(K59*$K$55)-(L59*$L$55)-(M59*$M$55)-(N59*$N$55)-(O59*$O$55)-(P59*$P$55)-(Q59*$Q$55))","v":0}]
[null,null,{"$f":"IF(G39*$J$15>0,\"Server Lotto2 DL560 Conf.2\",\"\")","v":""},null,0,0]
[null,null,{"$f":"IF(G40*$J$15>0,\"Server Lotto2 DL560 Conf.3\",\"\")","v":""},null,0,0]
[null,null,{"$f":"IF(G41*$J$15>0,\"Server Lotto2 DL580 Conf.1\",\"\")","v":""},null,0,0]
[null,null,{"$f":"IF(G42*$J$15>0,\"Server Lotto2 DL580 Conf.2\",\"\")","v":""},null,0,0]
[null,null,{"$f":"IF(G43*$J$15>0,\"Server Lotto2 DL580 Conf.3\",\"\")","v":""},null,0,0]
[]
[null,null,{"$f":"IF(J24>0,\"OpzGUIRack Disponibili\",\" \")","v":" "},null,{"$f":"J24","v":0},{"$f":"J24-H66*H55-I66*I55-J66*J55-K66*K55-L66*L55-M66*M55-N66*N55-O66*O55-P66*P55-Q66*Q55","v":0}]
[]
[null,null,{"$f":"IF(J27>0,\"OpzSWGUIRack Disponibili\",\" \")","v":" "},null,{"$f":"J27","v":0},{"$f":"J27-H68*H55-I68*I55-J68*J55-K68*K55-L68*L55-M68*M55-N68*N55-O68*O55-P68*P55-Q68*Q55","v":0}]
[]
[null,null,{"$f":"IF(J30>0,\"OpzUPS 3000VA Disponibili\",\" \")","v":" "},null,{"$f":"J30","v":0},{"$f":"J30-H70*H55-I70*I55-J70*J55-K70*K55-L70*L55-M70*M55-N70*N55-O70*O55-P70*P55-Q70*Q55","v":0}]

{"sheet":"Riepilogo","index":4,"n_rows":368,"n_cols":46,"rows_kept":368,"cut":false,"hidden":false,"merged":[[166,2,166,5],[167,2,167,5],[166,9,166,12],[167,9,167,12],[166,16,166,19],[167,16,167,19],[316,2,316,5],[317,2,317,5],[316,9,316,12],[317,9,317,12],[316,16,316,19],[317,16,317,19],[238,2,238,5],[239,2,239,5],[238,9,238,12],[239,9,239,12],[238,16,238,19],[239,16,239,19],[252,16,252,19],[255,2,255,5],[256,2,256,5],[257,2,257,5],[258,2,258,5],[284,2,284,5],[284,9,284,12],[286,9,286,12],[286,16,286,19],[287,2,287,5],[287,9,287,12],[255,9,255,12],[256,9,256,12],[257,9,257,12],[119,2,119,5],[119,6,119,8],[119,9,119,16],[119,17,119,18],[119,19,119,20],[116,2,116,5],[116,6,116,8],[116,9,116,16],[116,17,116,18],[116,19,116,20],[117,2,117,5],[117,6,117,8],[117,9,117,16],[117,17,117,18],[117,19,117,20],[125,1,125,16],[125,17,125,20],[129,3,130,18],[133,1,133,3],[133,8,133,10],[146,9,146,12],[251,2,251,5],[251,9,251,12],[251,16,251,19],[252,2,252,5],[252,9,252,12],[333,16,333,19],[253,16,253,19],[254,16,254,19],[255,16,255,19],[256,16,256,19],[257,16,257,19],[258,16,258,19],[330,2,330,5],[330,9,330,12],[253,2,253,5],[253,9,253,12],[254,9,254,12],[263,1,279,5],[263,8,279,12],[263,15,279,19],[261,1,261,3],[261,8,261,10],[261,15,261,17],[284,16,284,19],[285,2,285,5],[285,9,285,12],[285,16,285,19],[286,2,286,5],[258,9,258,12],[43,2,43,5],[43,6,43,8],[43,9,43,16],[43,17,43,18],[43,19,43,20],[40,2,40,5],[40,6,40,8],[40,9,40,16],[40,17,40,18],[40,19,40,20],[38,2,38,5],[38,6,38,8],[39,19,39,20],[44,2,44,5],[45,2,45,5],[118,2,118,5],[118,6,118,8],[118,9,118,16],[118,17,118,18],[118,19,118,20],[91,2,91,5],[91,6,91,8],[91,9,91,16],[91,17,91,18],[91,19,91,20],[92,2,92,5],[92,6,92,8],[92,9,92,16],[92,17,92,18],[92,19,92,20],[97,2,97,5],[97,6,97,8],[97,9,97,16],[97,17,97,18],[97,19,97,20],[100,2,100,5],[115,2,115,5],[115,6,115,8],[115,9,115,16],[115,17,115,18],[115,19,115,20],[159,2,159,5],[159,9,159,12],[159,16,159,19],[63,19,63,20],[44,9,44,16],[44,17,44,18],[81,19,81,20],[88,2,88,5],[88,6,88,8],[88,9,88,16],[88,17,88,18],[88,19,88,20],[96,19,96,20],[85,9,85,16],[85,17,85,18],[94,2,94,5],[94,6,94,8],[94,9,94,16],[114,2,114,5],[114,6,114,8],[114,9,114,16],[114,17,114,18],[114,19,114,20],[95,19,95,20],[87,6,87,8],[87,9,87,16],[87,17,87,18],[87,19,87,20],[89,2,89,5],[89,6,89,8],[89,9,89,16],[89,17,89,18],[89,19,89,20],[93,2,93,5],[93,6,93,8],[93,9,93,16],[93,17,93,18],[93,19,93,20],[149,2,149,5],[148,16,148,19],[140,9,140,12],[140,16,140,19],[142,2,142,5],[143,2,143,5],[142,9,142,12],[143,9,143,12],[144,9,144,12],[145,9,145,12],[142,16,142,19],[138,9,138,12],[124,1,124,16],[103,2,103,5],[103,6,103,8],[103,9,103,16],[150,2,150,5],[143,16,143,19],[144,16,144,19],[145,16,145,19],[146,16,146,19],[147,16,147,19],[150,16,150,19],[72,17,72,18],[80,17,80,18],[78,2,78,5],[78,9,78,16],[78,17,78,18],[94,17,94,18],[94,19,94,20],[95,2,95,5],[95,6,95,8],[95,9,95,16],[95,17,95,18],[78,19,78,20],[80,19,80,20],[79,2,79,5],[79,6,79,8],[79,9,79,16],[79,17,79,18],[96,2,96,5],[96,6,96,8],[81,2,81,5],[81,6,81,8],[81,9,81,16],[81,17,81,18],[84,1,84,20],[85,2,85,5],[153,9,153,12],[154,9,154,12],[155,9,155,12],[152,2,152,5],[64,6,64,8],[64,9,64,16],[64,17,64,18],[64,19,64,20],[65,2,65,5],[65,6,65,8],[206,1,206,3],[72,19,72,20],[71,17,71,18],[71,19,71,20],[72,2,72,5],[72,6,72,8],[73,2,73,5],[73,6,73,8],[73,9,73,16],[73,17,73,18],[74,6,74,8],[74,9,74,16],[74,17,74,18],[78,6,78,8],[73,19,73,20],[80,2,80,5],[80,6,80,8],[80,9,80,16],[96,9,96,16],[96,17,96,18],[150,9,150,12],[148,2,148,5],[85,6,85,8],[360,3,361,18],[363,2,363,7],[363,14,363,19],[185,8,185,10],[185,1,185,3],[185,15,185,17],[210,9,210,12],[18,6,18,8],[18,9,18,16],[18,17,18,18],[18,19,18,20],[22,17,22,18],[22,19,22,20],[156,16,156,19],[152,9,152,12],[156,9,156,12],[158,9,158,12],[158,16,158,19],[157,2,157,5],[158,2,158,5],[157,16,157,19],[153,16,153,19],[154,16,154,19],[155,16,155,19],[156,2,156,5],[153,2,153,5],[157,9,157,12],[154,2,154,5],[155,2,155,5],[230,16,230,19],[231,16,231,19],[223,16,223,19],[224,16,224,19],[226,2,226,5],[224,2,224,5],[222,9,222,12],[215,9,215,12],[215,16,215,19],[254,2,254,5],[206,8,206,10],[364,2,367,7],[364,14,367,19],[71,2,71,5],[71,6,71,8],[71,9,71,16],[74,19,74,20],[79,19,79,20],[76,19,76,20],[77,2,77,5],[77,6,77,8],[77,9,77,16],[77,17,77,18],[77,19,77,20],[232,9,232,12],[141,2,141,5],[141,9,141,12],[141,16,141,19],[82,19,82,20],[83,17,83,18],[83,19,83,20],[123,17,123,20],[85,19,85,20],[87,2,87,5],[83,2,83,5],[83,6,83,8],[83,9,83,16],[220,2,220,5],[140,2,140,5],[124,17,124,20],[123,1,123,16],[213,16,213,19],[357,14,357,15],[357,16,357,17],[217,16,217,19],[218,2,218,5],[218,9,218,12],[218,16,218,19],[226,9,226,12],[226,16,226,19],[227,2,227,5],[227,9,227,12],[221,2,221,5],[357,18,357,19],[212,2,212,5],[212,9,212,12],[212,16,212,19],[357,2,357,3],[357,4,357,5],[357,6,357,7],[357,8,357,9],[357,10,357,11],[357,12,357,13],[229,16,229,19],[138,2,138,5],[139,2,139,5],[65,9,65,16],[335,16,335,19],[232,2,232,5],[222,16,222,19],[222,2,222,5],[220,9,220,12],[220,16,220,19],[133,15,133,17],[135,2,135,5],[135,9,135,12],[135,16,135,19],[136,2,136,5],[136,9,136,12],[136,16,136,19],[137,2,137,5],[82,2,82,5],[82,6,82,8],[82,9,82,16],[82,17,82,18],[70,19,70,20],[75,2,75,5],[75,6,75,8],[75,9,75,16],[75,17,75,18],[75,19,75,20],[76,17,76,18],[70,2,70,5],[70,6,70,8],[70,9,70,16],[70,17,70,18],[76,2,76,5],[76,6,76,8],[76,9,76,16],[72,9,72,16],[45,17,45,18],[45,19,45,20],[65,17,65,18],[65,19,65,20],[47,2,47,5],[47,6,47,8],[47,9,47,16],[47,17,47,18],[69,1,69,20],[74,2,74,5],[56,2,56,5],[56,6,56,8],[56,9,56,16],[56,17,56,18],[56,19,56,20],[59,6,59,8],[59,9,59,16],[52,2,52,5],[52,6,52,8],[52,9,52,16],[52,17,52,18],[55,17,55,18],[55,19,55,20],[50,2,50,5],[50,6,50,8],[50,9,50,16],[50,17,50,18],[50,19,50,20],[51,2,51,5],[51,6,51,8],[39,17,39,18],[35,2,35,5],[35,9,35,16],[35,17,35,18],[31,19,31,20],[32,2,32,5],[37,2,37,5],[37,6,37,8],[37,9,37,16],[37,17,37,18],[36,2,36,5],[36,6,36,8],[36,9,36,16],[36,17,36,18],[33,2,33,5],[36,19,36,20],[35,19,35,20],[35,6,35,8],[34,19,34,20],[34,2,34,5],[34,6,34,8],[33,19,33,20],[33,6,33,8],[33,9,33,16],[38,17,38,18],[38,19,38,20],[39,2,39,5],[39,6,39,8],[39,9,39,16],[33,17,33,18],[38,9,38,16],[37,19,37,20],[41,19,41,20],[53,2,53,5],[53,6,53,8],[53,9,53,16],[53,17,53,18],[19,2,19,5],[19,6,19,8],[19,9,19,16],[19,17,19,18],[20,2,20,5],[16,2,16,5],[16,6,16,8],[31,2,31,5],[31,6,31,8],[31,9,31,16],[31,17,31,18],[16,9,16,16],[21,17,21,18],[23,2,23,5],[23,6,23,8],[23,9,23,16],[27,2,27,5],[27,6,27,8],[27,9,27,16],[27,17,27,18],[25,6,25,8],[25,9,25,16],[25,17,25,18],[25,2,25,5],[29,9,29,16],[26,2,26,5],[26,6,26,8],[32,6,32,8],[32,9,32,16],[32,17,32,18],[32,19,32,20],[13,19,13,20],[30,1,30,20],[34,17,34,18],[34,9,34,16],[14,2,14,5],[14,6,14,8],[14,9,14,16],[14,17,14,18],[16,19,16,20],[19,19,19,20],[20,6,20,8],[20,9,20,16],[20,17,20,18],[20,19,20,20],[23,17,23,18],[21,9,21,16],[28,2,28,5],[28,6,28,8],[28,9,28,16],[29,2,29,5],[29,6,29,8],[28,17,28,18],[27,19,27,20],[25,19,25,20],[28,19,28,20],[29,19,29,20],[26,19,26,20],[29,17,29,18],[9,4,9,8],[9,9,9,10],[9,11,9,14],[26,9,26,16],[26,17,26,18],[22,2,22,5],[22,6,22,8],[22,9,22,16],[13,6,13,8],[13,9,13,16],[9,15,9,16],[9,17,9,20],[21,6,21,8],[17,2,17,5],[17,6,17,8],[17,9,17,16],[17,17,17,18],[17,19,17,20],[18,2,18,5],[23,19,23,20],[21,19,21,20],[24,2,24,5],[24,6,24,8],[24,9,24,16],[24,17,24,18],[24,19,24,20],[13,2,13,5],[21,2,21,5],[15,17,15,18],[16,17,16,18],[15,19,15,20],[0,17,1,20],[0,1,0,5],[0,6,0,14],[1,1,1,5],[1,6,1,7],[1,8,5,16],[2,1,2,5],[2,6,2,7],[3,1,3,5],[3,6,3,7],[4,1,4,7],[5,1,5,5],[5,6,5,7],[7,1,7,3],[7,4,7,8],[7,9,7,10],[7,11,7,14],[7,15,7,16],[13,17,13,18],[15,2,15,5],[15,6,15,8],[15,9,15,16],[9,1,9,3],[41,6,41,8],[41,9,41,16],[41,17,41,18],[52,19,52,20],[51,17,51,18],[51,19,51,20],[7,17,7,20],[11,2,11,5],[11,6,11,8],[11,9,11,16],[11,17,11,18],[12,1,12,20],[41,2,41,5],[11,19,11,20],[14,19,14,20],[42,2,42,5],[42,6,42,8],[42,9,42,16],[42,17,42,18],[42,19,42,20],[44,19,44,20],[45,6,45,8],[45,9,45,16],[47,19,47,20],[46,2,46,5],[46,6,46,8],[48,1,48,20],[49,2,49,5],[49,6,49,8],[49,9,49,16],[49,17,49,18],[49,19,49,20],[62,9,62,16],[62,17,62,18],[62,19,62,20],[51,9,51,16],[44,6,44,8],[53,19,53,20],[46,9,46,16],[46,17,46,18],[46,19,46,20],[59,17,59,18],[59,19,59,20],[59,2,59,5],[60,2,60,5],[60,6,60,8],[60,9,60,16],[60,17,60,18],[60,19,60,20],[61,2,61,5],[61,6,61,8],[61,9,61,16],[61,17,61,18],[61,19,61,20],[99,19,99,20],[68,19,68,20],[66,2,66,5],[66,6,66,8],[66,9,66,16],[66,17,66,18],[66,19,66,20],[67,2,67,5],[67,6,67,8],[67,9,67,16],[67,17,67,18],[67,19,67,20],[62,2,62,5],[54,2,54,5],[54,6,54,8],[57,2,57,5],[57,6,57,8],[57,9,57,16],[57,17,57,18],[57,19,57,20],[54,9,54,16],[54,17,54,18],[54,19,54,20],[55,2,55,5],[55,6,55,8],[55,9,55,16],[58,2,58,5],[58,6,58,8],[58,9,58,16],[58,17,58,18],[58,19,58,20],[62,6,62,8],[63,2,63,5],[63,6,63,8],[63,9,63,16],[100,6,100,8],[100,9,100,16],[100,17,100,18],[100,19,100,20],[101,2,101,5],[101,6,101,8],[101,9,101,16],[101,17,101,18],[101,19,101,20],[102,2,102,5],[102,6,102,8],[102,9,102,16],[102,17,102,18],[102,19,102,20],[63,17,63,18],[64,2,64,5],[68,2,68,5],[68,6,68,8],[68,9,68,16],[68,17,68,18],[98,2,98,5],[98,6,98,8],[98,9,98,16],[98,17,98,18],[98,19,98,20],[99,2,99,5],[99,6,99,8],[99,9,99,16],[99,17,99,18],[104,6,104,8],[104,9,104,16],[104,17,104,18],[104,19,104,20],[105,2,105,5],[105,6,105,8],[105,9,105,16],[105,17,105,18],[105,19,105,20],[106,2,106,5],[106,6,106,8],[106,9,106,16],[106,17,106,18],[106,19,106,20],[107,2,107,5],[107,6,107,8],[107,9,107,16],[107,17,107,18],[107,19,107,20],[206,15,206,17],[208,2,208,5],[208,9,208,12],[109,2,109,5],[109,6,109,8],[109,9,109,16],[109,17,109,18],[109,19,109,20],[120,2,120,5],[120,6,120,8],[120,9,120,16],[120,17,120,18],[120,19,120,20],[110,2,110,5],[110,6,110,8],[110,9,110,16],[110,17,110,18],[110,19,110,20],[111,2,111,5],[111,6,111,8],[111,9,111,16],[111,17,111,18],[111,19,111,20],[112,2,112,5],[112,6,112,8],[112,9,112,16],[112,17,112,18],[139,9,139,12],[139,16,139,19],[144,2,144,5],[145,2,145,5],[138,16,138,19],[216,16,216,19],[217,2,217,5],[217,9,217,12],[214,2,214,5],[223,9,223,12],[210,16,210,19],[122,1,122,16],[122,17,122,20],[152,16,152,19],[137,9,137,12],[137,16,137,19],[208,16,208,19],[209,2,209,5],[209,9,209,12],[209,16,209,19],[171,16,171,19],[172,2,172,5],[172,9,172,12],[172,16,172,19],[187,1,203,5],[187,8,203,12],[187,15,203,19],[179,9,179,12],[170,2,170,5],[170,9,170,12],[170,16,170,19],[171,2,171,5],[171,9,171,12],[146,2,146,5],[147,2,147,5],[147,9,147,12],[148,9,148,12],[246,16,246,19],[219,2,219,5],[219,9,219,12],[219,16,219,19],[213,2,213,5],[215,2,215,5],[236,2,236,5],[236,9,236,12],[236,16,236,19],[240,2,240,5],[240,9,240,12],[240,16,240,19],[234,2,234,5],[234,9,234,12],[234,16,234,19],[235,2,235,5],[235,9,235,12],[235,16,235,19],[230,9,230,12],[231,9,231,12],[223,2,223,5],[232,16,232,19],[225,9,225,12],[225,16,225,19],[233,2,233,5],[233,9,233,12],[233,16,233,19],[229,2,229,5],[230,2,230,5],[231,2,231,5],[228,9,228,12],[229,9,229,12],[250,2,250,5],[250,9,250,12],[250,16,250,19],[259,2,259,5],[241,2,241,5],[241,9,241,12],[241,16,241,19],[242,2,242,5],[242,9,242,12],[242,16,242,19],[243,2,243,5],[243,9,243,12],[243,16,243,19],[259,9,259,12],[259,16,259,19],[247,2,247,5],[247,9,247,12],[247,16,247,19],[248,2,248,5],[248,9,248,12],[248,16,248,19],[249,2,249,5],[249,9,249,12],[245,2,245,5],[245,9,245,12],[245,16,245,19],[246,2,246,5],[246,9,246,12],[249,16,249,19],[244,2,244,5],[244,9,244,12],[244,16,244,19],[282,1,282,3],[282,8,282,10],[282,15,282,17],[86,2,86,5],[86,6,86,8],[86,9,86,16],[86,17,86,18],[86,19,86,20],[160,2,160,5],[160,9,160,12],[160,16,160,19],[169,9,169,12],[169,16,169,19],[176,9,176,12],[177,9,177,12],[175,16,175,19],[180,16,180,19],[181,16,181,19],[178,2,178,5],[179,2,179,5],[180,2,180,5],[121,9,121,16],[121,17,121,18],[121,19,121,20],[182,2,182,5],[183,2,183,5],[182,9,182,12],[183,9,183,12],[182,16,182,19],[183,16,183,19],[237,2,237,5],[237,9,237,12],[287,16,287,19],[288,2,288,5],[288,9,288,12],[288,16,288,19],[289,2,289,5],[289,9,289,12],[289,16,289,19],[290,2,290,5],[290,9,290,12],[290,16,290,19],[291,2,291,5],[291,9,291,12],[291,16,291,19],[292,2,292,5],[292,9,292,12],[292,16,292,19],[293,2,293,5],[293,9,293,12],[293,16,293,19],[294,2,294,5],[294,9,294,12],[294,16,294,19],[295,2,295,5],[295,9,295,12],[295,16,295,19],[296,2,296,5],[296,9,296,12],[296,16,296,19],[297,2,297,5],[297,9,297,12],[297,16,297,19],[298,2,298,5],[298,9,298,12],[298,16,298,19],[299,2,299,5],[299,9,299,12],[299,16,299,19],[300,2,300,5],[300,9,300,12],[300,16,300,19],[301,2,301,5],[301,9,301,12],[301,16,301,19],[302,2,302,5],[302,9,302,12],[302,16,302,19],[303,2,303,5],[303,9,303,12],[303,16,303,19],[304,2,304,5],[304,9,304,12],[304,16,304,19],[305,2,305,5],[305,9,305,12],[305,16,305,19],[306,2,306,5],[306,9,306,12],[306,16,306,19],[307,2,307,5],[307,9,307,12],[307,16,307,19],[308,2,308,5],[308,9,308,12],[308,16,308,19],[309,2,309,5],[309,9,309,12],[309,16,309,19],[310,2,310,5],[310,9,310,12],[310,16,310,19],[311,2,311,5],[311,9,311,12],[311,16,311,19],[312,2,312,5],[312,9,312,12],[312,16,312,19],[320,9,320,12],[320,16,320,19],[321,2,321,5],[321,9,321,12],[321,16,321,19],[313,2,313,5],[313,9,313,12],[313,16,313,19],[314,2,314,5],[314,9,314,12],[314,16,314,19],[318,2,318,5],[318,9,318,12],[318,16,318,19],[315,2,315,5],[315,9,315,12],[315,16,315,19],[337,1,337,3],[337,8,337,10],[337,15,337,17],[339,1,355,5],[339,8,355,12],[339,15,355,19],[326,2,326,5],[326,9,326,12],[326,16,326,19],[328,2,328,5],[328,9,328,12],[328,16,328,19],[329,2,329,5],[329,9,329,12],[329,16,329,19],[327,2,327,5],[327,9,327,12],[327,16,327,19],[331,2,331,5],[332,2,332,5],[333,2,333,5],[334,2,334,5],[335,2,335,5],[331,9,331,12],[334,9,334,12],[335,9,335,12],[334,16,334,19],[332,9,332,12],[333,9,333,12],[330,16,330,19],[331,16,331,19],[332,16,332,19],[325,2,325,5],[325,9,325,12],[325,16,325,19],[322,2,322,5],[322,9,322,12],[322,16,322,19],[323,2,323,5],[323,9,323,12],[323,16,323,19],[324,2,324,5],[324,9,324,12],[324,16,324,19],[319,2,319,5],[319,9,319,12],[319,16,319,19],[320,2,320,5],[161,2,161,5],[161,9,161,12],[161,16,161,19],[162,2,162,5],[162,9,162,12],[162,16,162,19],[163,2,163,5],[163,9,163,12],[163,16,163,19],[164,2,164,5],[164,9,164,12]],"merged_total":1069,"flags":["merged_cut"]}
[null,"Amministrazione ",null,null,null,null,null,null,null,null,null,null,null,null,null,null,null,"CONFIGURATORE ELETTRONICO CONVENZIONE CONSIP \nTECNOLOGIE SERVER 1 LOTTO 2",null,null,null,1]
[null,"N° Identificativo Ordine ",null,null,null,null,null,null,{"$f":"IF(G4=R126,\"Configurazione OK\",U4)","v":"Configurazione OK"},null,null,null,null,null,null,null,null,null,null,null,null,1]
[null,"Data Ordine",null,null,null,null,null,null,null,null,null,null,null,null,null,null,null,null,null,null,null,1]
[null,"Tot Ordine Portale CONSIP IVA incl.",null,null,null,null,{"$f":"R126","v":0},null,null,null,null,null,null,null,null,null,null,null,null,null,"Nel \"Tot Ordine Portale CONSIP\" deve essere inserito l'importo totale risultante dall'ordinativo del portale CONSIP.\nQualora l'importo inserito corrisponde al valore ricalcolato dal configuratore viene attivato il pulsante \"Salva in formato PDF\" che permette di generare il file pdf da allegare all'ordinativo.",1]
[null,"LE CELLE IN GIALLO DEVO ESSERE COMPILATE OBBLIGATORIAMENTE",null,null,null,null,null,null,null,null,null,null,null,null,null,null,null,null,null,null,null,1]
[null,"Quantità Server Ordinati",null,null,null,null,{"$f":"IF(B32=\"\",0,B32)+IF(B14=\"\",0,B14)+IF(B50=\"\",0,B50)","v":0},null,null,null,null,null,null,null,null,null,null,null,null,"ver. 4.1",null,1]
[null,null,null,null,null,null,null,null,null,null,null,null,null,null,null,null,null,null,null,null,null,1]
[null,"Referente per la Consegna",null,null,null,null,null,null,null,"Telefono",null,null,null,null,null,"email",null,null,null,null,null,1]
[null,null,null,null,null,null,null,null,null,null,null,null,null,null,null,null,null,null,null,null,null,1]
[null,"Referente per l'installazione",null,null,null,null,null,null,null,"Telefono",null,null,null,null,null,"email",null,null,null,null,null,1]
[null,null,null,null,null,null,null,null,null,null,null,null,null,null,null,null,null,null,null,null,null,1]
[null,"Qtà Totale Ordinata","Oggetto di fornitura",null,null,null,"Codice Prodotto",null,null,"Descrizione Sintetica (si faccia riferimento alla guida alla convenzione per la descrizione estesa e per le regole di acquisto delle opzioni)",null,null,null,null,null,null,null,"Costo Unitario",null,"Costo Complessivo",null,1]
[null,"SERVER BASE (HPE PROLIANT DL560 Gen10)",null,null,null,null,null,null,null,null,null,null,null,null,null,null,null,null,null,null,null,{"$f":"IF(B14>=\"\",0,1)","v":0},"DL560","Server1","Server2","Server3"]
[null,{"$f":"IF(AE14>=1,AE14,\"\")","v":""},{"$f":"IF(AE14>0,(VLOOKUP(G14,COD_A,2,FALSE)),\"\")","v":""},null,null,null,{"$f":"IF(AE14>=1,W14,\"\")","v":""},null,null,{"$f":"IF(AE14>0,(VLOOKUP(G14,COD_A,5,FALSE)),\"\")","v":""},null,null,null,null,null,null,null,{"$f":"IF(AE14>0,(VLOOKUP(G14,COD_A,3,FALSE)),\"\")","v":""},null,{"$f":"IF(B14=\"\",\"\",R14*B14)","v":""},null,{"$f":"IF(B14>=\"\",0,1)","v":0},"TS1L2-560",{"$f":"SRV_A","v":0},{"$f":"SRV_AA","v":0},{"$f":"SRV_AAA","v":0},null,null,null,null,{"$f":"SUM(X14:AD14)","v":0}]
[null,{"$f":"IF(AE15>=1,AE15,\"\")","v":""},"",null,null,null,{"$f":"IF(AE15>=1,W15,\"\")","v":""},null,null,"",null,null,null,null,null,null,null,"",null,{"$f":"IF(B15=\"\",\"\",R15*B15)","v":""},null,{"$f":"IF(B15>=\"\",0,1)","v":0},"TS1L2-CPU-560",{"$f":"'Lotto2 DL560 Gen10 1'!$C$30/2","v":0},{"$f":"'Lotto2 DL560 Gen10 2'!$C$30/2","v":0},{"$f":"'Lotto2 DL560 Gen10 3'!$C$30/2","v":0},null,{"$f":"X15*$X$14","v":0},{"$f":"Y15*$Y$14","v":0},{"$f":"Z15*$Z$14","v":0},{"$f":"SUM(AB15:AD15)","v":0}]
[null,{"$f":"IF(AE16>=1,AE16,\"\")","v":""},"",null,null,null,{"$f":"IF(AE16>=1,W16,\"\")","v":""},null,null,"",null,null,null,null,null,null,null,"",null,{"$f":"IF(B16=\"\",\"\",R16*B16)","v":""},null,0,"TS1L2-32GB",{"$f":"IF(MEM_A=\"\",0,MEM_A)","v":0},{"$f":"IF(MEM_AA=\"\",0,MEM_AA)","v":0},{"$f":"IF(MEM_AAA=\"\",0,MEM_AAA)","v":0},null,{"$f":"X16*$X$14","v":0},{"$f":"Y16*$Y$14","v":0},{"$f":"Z16*$Z$14","v":0},{"$f":"SUM(AB16:AD16)","v":0}]
[null,"","",null,null,null,"",null,null,"",null,null,null,null,null,null,null,"",null,"",null,0,"TS1L2-64GB",{"$f":"IF(MEM_A32=\"\",0,MEM_A32)","v":0},{"$f":"IF(MEM_AA32=\"\",0,MEM_AA32)","v":0},{"$f":"IF(MEM_AAA32=\"\",0,MEM_AAA32)","v":0},null,{"$f":"X17*$X$14","v":0},{"$f":"Y17*$Y$14","v":0},{"$f":"Z17*$Z$14","v":0},{"$f":"SUM(AB17:AD17)","v":0}]
[null,"","",null,null,null,"",null,null,"",null,null,null,null,null,null,null,"",null,"",null,0,null,null,null,null,null,null,null,null,null,null,null,"slot1",{"$f":"'Lotto2 DL560 Gen10 1'!$D$118","v":""},{"$f":"'Lotto2 DL560 Gen10 2'!$D$116","v":""},{"$f":"'Lotto2 DL560 Gen10 3'!$D$116","v":""}]
[null,"","",null,null,null,"",null,null,"",null,null,null,null,null,null,null,"",null,"",null,0,"TS1L2-1GB",{"$f":"COUNTIF($AI$18:$AI$25,W19)","v":0},{"$f":"COUNTIF($AJ$18:$AJ$25,W19)","v":0},{"$f":"COUNTIF($AK$18:$AK$25,W19)","v":0},null,{"$f":"X19*$X$14","v":0},{"$f":"Y19*$Y$14","v":0},{"$f":"Z19*$Z$14","v":0},{"$f":"SUM(AB19:AD19)","v":0},null,null,"slot2",{"$f":"'Lotto2 DL560 Gen10 1'!$D$121","v":""},{"$f":"'Lotto2 DL560 Gen10 2'!$D$119","v":""},{"$f":"'Lotto2 DL560 Gen10 3'!$D$119","v":""}]
[null,"","",null,null,null,"",null,null,"",null,null,null,null,null,null,null,"",null,"",null,0,null,{"$f":"COUNTIF($AI$18:$AI$25,W20)","v":0},{"$f":"COUNTIF($AJ$18:$AJ$25,W20)","v":0},{"$f":"COUNTIF($AK$18:$AK$25,W20)","v":0},null,null,null,null,null,null,null,"slot3",{"$f":"'Lotto2 DL560 Gen10 1'!$D$124","v":""},{"$f":"'Lotto2 DL560 Gen10 2'!$D$122","v":""},{"$f":"'Lotto2 DL560 Gen10 3'!$D$122","v":""}]
[null,"","",null,null,null,"",null,null,"",null,null,null,null,null,null,null,"",null,"",null,0,"TS1L2-10GB",0,0,0,null,{"$f":"X21*$X$14","v":0},{"$f":"Y21*$Y$14","v":0},{"$f":"Z21*$Z$14","v":0},{"$f":"SUM(AB21:AD21)","v":0},null,null,"slot4",{"$f":"'Lotto2 DL560 Gen10 1'!$D$127","v":""},{"$f":"'Lotto2 DL560 Gen10 2'!$D$125","v":""},{"$f":"'Lotto2 DL560 Gen10 3'!$D$125","v":""}]
[null,"","",null,null,null,"",null,null,"",null,null,null,null,null,null,null,"",null,"",null,0,null,0,0,0,null,{"$f":"X22*$X$14","v":0},{"$f":"Y22*$Y$14","v":0},{"$f":"Z22*$Z$14","v":0},{"$f":"SUM(AB22:AD22)","v":0},null,null,"slot5",{"$f":"'Lotto2 DL560 Gen10 1'!$D$130","v":""},{"$f":"'Lotto2 DL560 Gen10 2'!$D$128","v":""},{"$f":"'Lotto2 DL560 Gen10 3'!$D$128","v":""}]
[null,"","",null,null,null,"",null,null,"",null,null,null,null,null,null,null,"",null,"",null,0,"TS1L2-CNA",0,0,0,null,{"$f":"X23*$X$14","v":0},{"$f":"Y23*$Y$14","v":0},{"$f":"Z23*$Z$14","v":0},{"$f":"SUM(AB23:AD23)","v":0},null,null,"slot6",{"$f":"'Lotto2 DL560 Gen10 1'!$D$133","v":""},{"$f":"'Lotto2 DL560 Gen10 2'!$D$131","v":""},{"$f":"'Lotto2 DL560 Gen10 3'!$D$131","v":""}]
[null,"","",null,null,null,"",null,null,"",null,null,null,null,null,null,null,"",null,"",null,0,null,0,0,0,null,null,null,null,null,null,null,"slot7",{"$f":"'Lotto2 DL560 Gen10 1'!$D$136","v":""},{"$f":"'Lotto2 DL560 Gen10 2'!$D$134","v":""},{"$f":"'Lotto2 DL560 Gen10 3'!$D$134","v":""}]
[null,{"$f":"IF(AE25>=1,AE25,\"\")","v":""},"",null,null,null,{"$f":"IF(AE25>=1,W25,\"\")","v":""},null,null,"",null,null,null,null,null,null,null,"",null,"",null,0,"TS1L2-FC",0,0,0,null,{"$f":"X25*$X$14","v":0},{"$f":"Y25*$Y$14","v":0},{"$f":"Z25*$Z$14","v":0},{"$f":"SUM(AB25:AD25)","v":0},null,null,"slot8",{"$f":"'Lotto2 DL560 Gen10 1'!$D$139","v":""},{"$f":"'Lotto2 DL560 Gen10 2'!$D$137","v":""},{"$f":"'Lotto2 DL560 Gen10 3'!$D$137","v":""}]
[null,"","",null,null,null,"",null,null,"",null,null,null,null,null,null,null,"",null,"",null,0,"TS1L2-HD300",{"$f":"'Lotto2 DL560 Gen10 1'!$C$78","v":0},{"$f":"'Lotto2 DL560 Gen10 2'!$C$78","v":0},{"$f":"'Lotto2 DL560 Gen10 3'!$C$78","v":0},null,0,0,0,0]
[null,"","",null,null,null,"",null,null,"",null,null,null,null,null,null,null,"",null,"",null,0,"TS1L2-HD1200",{"$f":"'Lotto2 DL560 Gen10 1'!$C$80","v":0},{"$f":"'Lotto2 DL560 Gen10 2'!$C$80","v":0},{"$f":"'Lotto2 DL560 Gen10 3'!$C$80","v":0},null,0,0,0,0]
[null,"","",null,null,null,"",null,null,"",null,null,null,null,null,null,null,"",null,"",null,0,"TS1L2-4ANNI",{"$f":"IF('Lotto2 DL560 Gen10 1'!$D$151=W28,'Lotto2 DL560 Gen10 1'!$C$151,0)","v":0},{"$f":"IF('Lotto2 DL560 Gen10 2'!$D$149=W28,'Lotto2 DL560 Gen10 2'!$C$149,0)","v":0},{"$f":"IF('Lotto2 DL560 Gen10 3'!$D$149=W28,'Lotto2 DL560 Gen10 3'!$C$149,0)","v":0},null,0,0,0,0]
[null,"","",null,null,null,"",null,null,"",null,null,null,null,null,null,null,"",null,"",null,0,"TS1L2-5ANNI",{"$f":"IF('Lotto2 DL560 Gen10 1'!$D$151=W29,'Lotto2 DL560 Gen10 1'!$C$151,0)","v":0},{"$f":"IF('Lotto2 DL560 Gen10 2'!$D$149=W29,'Lotto2 DL560 Gen10 2'!$C$149,0)","v":0},{"$f":"IF('Lotto2 DL560 Gen10 3'!$D$149=W29,'Lotto2 DL560 Gen10 3'!$C$149,0)","v":0},null,0,{"$f":"Y29*$Y$14","v":0},0,0]
[null,"","",null,null,null,"",null,null,"",null,null,null,null,null,null,null,"",null,"",null,0,"10L2-SO-HDD",{"$f":"IF('Lotto2 DL560 Gen10 1'!$D$154=W30,'Lotto2 DL560 Gen10 1'!$C$154,0)","v":0},{"$f":"IF('Lotto2 DL560 Gen10 2'!$D$152=W30,'Lotto2 DL560 Gen10 2'!$C$152,0)","v":0},{"$f":"IF('Lotto2 DL560 Gen10 3'!$D$152=W30,'Lotto2 DL560 Gen10 3'!$C$152,0)","v":0},null,0,0,0,0]
[null,"SERVER BASE ALTERNATIVO (HP PROLIANT DL580 Gen10)",null,null,null,null,null,null,null,null,null,null,null,null,null,null,null,null,null,null,null,{"$f":"IF(B32>=\"\",0,1)","v":0},"DL580 Alt","Server1","Server2","Server3"]
[null,{"$f":"IF(AE32>=1,AE32,\"\")","v":""},{"$f":"IF(AE32>0,(VLOOKUP(G32,COD_B,2,FALSE)),\"\")","v":""},null,null,null,{"$f":"IF(AE32>=1,W32,\"\")","v":""},null,null,{"$f":"IF(AE32>0,(VLOOKUP(G32,COD_B,5,FALSE)),\"\")","v":""},null,null,null,null,null,null,null,{"$f":"IF(AE32>0,(VLOOKUP(G32,COD_B,3,FALSE)),\"\")","v":""},null,{"$f":"IF(B32=\"\",\"\",R32*B32)","v":""},null,0,"TS1L2-ALT-U",{"$f":"SRV_B","v":0},{"$f":"SRV_BB","v":0},{"$f":"SRV_BBB","v":0},null,null,null,null,{"$f":"SUM(X32:AD32)","v":0}]
[null,{"$f":"IF(AE33>=1,AE33,\"\")","v":""},{"$f":"IF(AE33>0,(VLOOKUP(G33,COD_B,2,FALSE)),\"\")","v":""},null,null,null,{"$f":"IF(AE33>=1,W33,\"\")","v":""},null,null,{"$f":"IF(AE33>0,(VLOOKUP(G33,COD_B,5,FALSE)),\"\")","v":""},null,null,null,null,null,null,null,{"$f":"IF(AE33>0,(VLOOKUP(G33,COD_B,3,FALSE)),\"\")","v":""},null,{"$f":"IF(B33=\"\",\"\",R33*B33)","v":""},null,{"$f":"IF(B33>=\"\",0,1)","v":0},"TS1L2-CPU-ALT-U",{"$f":"'Lotto2 DL580 1'!$C$27/2","v":0},{"$f":"'Lotto2 DL580 2'!$C$27/2","v":0},{"$f":"'Lotto2 DL580 3'!$C$27/2","v":0},null,{"$f":"X33*$X$32","v":0},{"$f":"Y33*$Y$32","v":0},{"$f":"Z33*$Z$32","v":0},{"$f":"SUM(AB33:AD33)","v":0}]
[null,"","",null,null,null,"",null,null,"",null,null,null,null,null,null,null,"",null,"",null,0,"TS1L2-32GB",{"$f":"IF(MEM_B=\"\",0,MEM_B)","v":0},{"$f":"IF(MEM_BB=\"\",0,MEM_BB)","v":0},{"$f":"IF(MEM_BBB=\"\",0,MEM_BBB)","v":0},null,{"$f":"X34*$X$32","v":0},{"$f":"Y34*$Y$32","v":0},{"$f":"Z34*$Z$32","v":0},{"$f":"SUM(AB34:AD34)","v":0}]
[null,"","",null,null,null,"",null,null,"",null,null,null,null,null,null,null,"",null,"",null,0,"TS1L2-64GB",{"$f":"IF(MEM_B32=\"\",0,MEM_B32)","v":0},{"$f":"IF(MEM_BB32=\"\",0,MEM_BB32)","v":0},{"$f":"IF(MEM_BBB32=\"\",0,MEM_BBB32)","v":0},null,{"$f":"X35*$X$32","v":0},{"$f":"Y35*$Y$32","v":0},{"$f":"Z35*$Z$32","v":0},{"$f":"SUM(AB35:AD35)","v":0},null,null,null,"Dl580-alt 1","Dl580-alt 2","Dl580-alt 3"]
[null,"","",null,null,null,"",null,null,"",null,null,null,null,null,null,null,"",null,"",null,0,"TS1L2-64GB",{"$f":"COUNTIF($AI$36:$AI$44,W36)","v":0},{"$f":"COUNTIF($AJ$36:$AJ$44,W36)","v":0},{"$f":"COUNTIF($AK$36:$AK$44,W36)","v":0},null,{"$f":"X36*$X$32","v":0},{"$f":"Y36*$Y$32","v":0},{"$f":"Z36*$Z$32","v":0},{"$f":"SUM(AB36:AD36)","v":0},null,null,"Slot1",{"$f":"'Lotto2 DL580 1'!$D$101","v":""},{"$f":"'Lotto2 DL580 2'!$D$101","v":""},{"$f":"'Lotto2 DL580 3'!$D$101","v":""}]
[null,"","",null,null,null,"",null,null,"",null,null,null,null,null,null,null,"",null,"",null,0,"TS1L2-1GB",{"$f":"COUNTIF($AI$36:$AI$48,W37)","v":0},{"$f":"COUNTIF($AJ$36:$AJ$48,W37)","v":0},{"$f":"COUNTIF($AK$36:$AK$48,W37)","v":0},null,{"$f":"X37*$X$32","v":0},{"$f":"Y37*$Y$32","v":0},{"$f":"Z37*$Z$32","v":0},{"$f":"SUM(AB37:AD37)","v":0},null,null,"Slot2",{"$f":"'Lotto2 DL580 1'!$D$104","v":""},{"$f":"'Lotto2 DL580 2'!$D$104","v":""},{"$f":"'Lotto2 DL580 3'!$D$104","v":""}]
[null,"","",null,null,null,"",null,null,"",null,null,null,null,null,null,null,"",null,"",null,0,null,{"$f":"COUNTIF($AI$36:$AI$48,W38)","v":0},{"$f":"COUNTIF($AJ$36:$AJ$48,W38)","v":0},{"$f":"COUNTIF($AK$36:$AK$48,W38)","v":0},null,0,0,0,0,null,null,"Slot3",{"$f":"'Lotto2 DL580 1'!$D$107","v":""},{"$f":"'Lotto2 DL580 2'!$D$107","v":""},{"$f":"'Lotto2 DL580 3'!$D$107","v":""}]
[null,"","",null,null,null,"",null,null,"",null,null,null,null,null,null,null,"",null,"",null,0,"TS1L2-10GB",0,0,0,null,0,0,0,0,null,null,"Slot4",{"$f":"'Lotto2 DL580 1'!$D$110","v":""},{"$f":"'Lotto2 DL580 2'!$D$110","v":""},{"$f":"'Lotto2 DL580 3'!$D$110","v":""}]
[null,"","",null,null,null,"",null,null,"",null,null,null,null,null,null,null,"",null,"",null,0,null,0,0,0,null,0,0,0,0,null,null,"Slot8",{"$f":"'Lotto2 DL580 1'!$D$122","v":""},{"$f":"'Lotto2 DL580 2'!$D$122","v":""},{"$f":"'Lotto2 DL580 3'!$D$122","v":""}]
[null,"","",null,null,null,"",null,null,"",null,null,null,null,null,null,null,"",null,"",null,0,"TS1L2-CNA",0,0,0,null,0,0,0,0,null,null,"Slot9",{"$f":"'Lotto2 DL580 1'!$D$125","v":""},{"$f":"'Lotto2 DL580 2'!$D$125","v":""},{"$f":"'Lotto2 DL580 3'!$D$125","v":""}]
[null,"","",null,null,null,"",null,null,"",null,null,null,null,null,null,null,"",null,"",null,0,null,0,0,0,null,0,0,0,0,null,null,"Slot10",{"$f":"'Lotto2 DL580 1'!$D$128","v":""},{"$f":"'Lotto2 DL580 2'!$D$128","v":""},{"$f":"'Lotto2 DL580 3'!$D$128","v":""}]
[null,"","",null,null,null,"",null,null,"",null,null,null,null,null,null,null,"",null,"",null,0,"TS1L2-FC",0,0,0,null,0,0,0,0,null,null,"Slot11",{"$f":"'Lotto2 DL580 1'!$D$131","v":""},{"$f":"'Lotto2 DL580 2'!$D$131","v":""},{"$f":"'Lotto2 DL580 3'!$D$131","v":""}]
[null,"","",null,null,null,"",null,null,"",null,null,null,null,null,null,null,"",null,"",null,0,"TS1L2-HD300",{"$f":"HD300_B","v":0},{"$f":"HD300_BB","v":0},{"$f":"HD300_BBB","v":0},null,{"$f":"X44*$X$32","v":0},{"$f":"Y44*$Y$32","v":0},{"$f":"Z44*$Z$32","v":0},{"$f":"SUM(AB44:AD44)","v":0},null,null,"Slot12",{"$f":"'Lotto2 DL580 1'!$D$134","v":""},{"$f":"'Lotto2 DL580 2'!$D$134","v":""},{"$f":"'Lotto2 DL580 3'!$D$134","v":""}]
[null,"","",null,null,null,"",null,null,"",null,null,null,null,null,null,null,"",null,"",null,0,"TS1L2-HD1200",{"$f":"HD1000_B","v":0},{"$f":"HD1000_BB","v":0},{"$f":"HD1000_BBB","v":0},null,{"$f":"X45*$X$32","v":0},{"$f":"Y45*$Y$32","v":0},{"$f":"Z45*$Z$32","v":0},{"$f":"SUM(AB45:AD45)","v":0},null,null,"Slot13",{"$f":"'Lotto2 DL580 1'!$D$137","v":""},{"$f":"'Lotto2 DL580 2'!$D$137","v":""},{"$f":"'Lotto2 DL580 3'!$D$137","v":""}]
[null,"","",null,null,null,"",null,null,"",null,null,null,null,null,null,null,"",null,"",null,0,"TS1L2-4ANNI",{"$f":"IF('Lotto2 DL580 1'!$D$165=W46,'Lotto2 DL580 1'!$C$165,0)","v":0},{"$f":"IF('Lotto2 DL580 2'!$D$165=W46,'Lotto2 DL580 2'!$C$165,0)","v":0},{"$f":"IF('Lotto2 DL580 3'!$D$165=W46,'Lotto2 DL580 3'!$C$165,0)","v":0},null,{"$f":"X46*$X$32","v":0},{"$f":"Y46*$Y$32","v":0},{"$f":"Z46*$Z$32","v":0},{"$f":"SUM(AB46:AD46)","v":0},null,null,"Slot14",{"$f":"'Lotto2 DL580 1'!$D$140","v":""},{"$f":"'Lotto2 DL580 2'!$D$140","v":""},{"$f":"'Lotto2 DL580 3'!$D$140","v":""}]
[null,"","",null,null,null,"",null,null,"",null,null,null,null,null,null,null,"",null,"",null,0,"TS1L2-5ANNI",{"$f":"IF('Lotto2 DL580 1'!$D$165=W47,'Lotto2 DL580 1'!$C$165,0)","v":0},{"$f":"IF('Lotto2 DL580 2'!$D$165=W47,'Lotto2 DL580 2'!$C$165,0)","v":0},{"$f":"IF('Lotto2 DL580 3'!$D$165=W47,'Lotto2 DL580 3'!$C$165,0)","v":0},null,{"$f":"X47*$X$32","v":0},{"$f":"Y47*$Y$32","v":0},{"$f":"Z47*$Z$32","v":0},{"$f":"SUM(AB47:AD47)","v":0},null,null,"Slot15",{"$f":"'Lotto2 DL580 1'!$D$143","v":""},{"$f":"'Lotto2 DL580 2'!$D$143","v":""},{"$f":"'Lotto2 DL580 3'!$D$143","v":""}]
[null,"","",null,null,null,"",null,null,"",null,null,null,null,null,null,null,"",null,"",null,0,"10L2-SO-HDD",{"$f":"IF('Lotto2 DL580 1'!$D$168=W48,'Lotto2 DL580 1'!$C$168,0)","v":0},{"$f":"IF('Lotto2 DL580 2'!$D$168=W48,'Lotto2 DL580 2'!$C$168,0)","v":0},{"$f":"IF('Lotto2 DL580 3'!$D$168=W48,'Lotto2 DL580 3'!$C$168,0)","v":0},null,{"$f":"X48*$X$32","v":0},{"$f":"Y48*$Y$32","v":0},{"$f":"Z48*$Z$32","v":0},{"$f":"SUM(AB48:AD48)","v":0},null,null,"Slot16",{"$f":"'Lotto2 DL580 1'!$D$146","v":""},{"$f":"'Lotto2 DL580 2'!$D$146","v":""},{"$f":"'Lotto2 DL580 3'!$D$146","v":""}]
[null,"SERVER PRESTAZIONALE (HP PROLIANT DL580 Gen10)",null,null,null,null,null,null,null,null,null,null,null,null,null,null,null,null,null,null,null,{"$f":"IF(B50>=\"\",0,1)","v":0},"DL580 Prest","Server1","Server2","Server3"]
[null,{"$f":"IF(AE50>=1,AE50,\"\")","v":""},{"$f":"IF(AE50>0,(VLOOKUP(G50,COD_B,2,FALSE)),\"\")","v":""},null,null,null,{"$f":"IF(AE50>=1,W50,\"\")","v":""},null,null,{"$f":"IF(AE50>0,(VLOOKUP(G50,COD_B,5,FALSE)),\"\")","v":""},null,null,null,null,null,null,null,{"$f":"IF(AE50>0,(VLOOKUP(G50,COD_B,3,FALSE)),\"\")","v":""},null,{"$f":"IF(B50=\"\",\"\",R50*B50)","v":""},null,{"$f":"IF(B50>=\"\",0,1)","v":0},"TS1L2-580-U",{"$f":"SRV_C","v":0},{"$f":"SRV_CC","v":0},{"$f":"SRV_CCC","v":0},null,null,null,null,{"$f":"SUM(X50:AD50)","v":0}]
[null,{"$f":"IF(AE51>=1,AE51,\"\")","v":""},"",null,null,null,{"$f":"IF(AE51>=1,W51,\"\")","v":""},null,null,"",null,null,null,null,null,null,null,"",null,"",null,0,"TS1L2-CPU-580-U",{"$f":"'Lotto2 DL580 Prest 1'!$C$27/2","v":0},{"$f":"'Lotto2 DL580 Prest 2'!$C$27/2","v":0},{"$f":"'Lotto2 DL580 Prest 3'!$C$27/2","v":0},null,{"$f":"X51*$X$50","v":0},{"$f":"Y51*$Y$50","v":0},{"$f":"Z51*$Z$50","v":0},{"$f":"SUM(AB51:AD51)","v":0}]
[null,"","",null,null,null,"",null,null,"",null,null,null,null,null,null,null,"",null,"",null,0,"TS1L2-32GB",{"$f":"IF(MEM_C=\"\",0,MEM_C)","v":0},{"$f":"IF(MEM_CC=\"\",0,MEM_CC)","v":0},{"$f":"IF(MEM_CCC=\"\",0,MEM_CCC)","v":0},null,{"$f":"X52*$X$50","v":0},{"$f":"Y52*$Y$50","v":0},{"$f":"Z52*$Z$50","v":0},{"$f":"SUM(AB52:AD52)","v":0}]
[null,"","",null,null,null,"",null,null,"",null,null,null,null,null,null,null,"",null,"",null,0,"TS1L2-64GB",{"$f":"IF(MEM_C32=\"\",0,MEM_C32)","v":0},{"$f":"IF(MEM_CC32=\"\",0,MEM_CC32)","v":0},{"$f":"IF(MEM_CCC32=\"\",0,MEM_CCC32)","v":0},null,0,0,0,0,null,null,null,"Dl580-prest 1","Dl580-prest 2","Dl580-prest 3"]
[null,"","",null,null,null,"",null,null,"",null,null,null,null,null,null,null,"",null,"",null,0,"TS1L2-64GB",{"$f":"COUNTIF($AI$54:$AI$65,W54)","v":0},{"$f":"COUNTIF($AJ$54:$AJ$62,W54)","v":0},{"$f":"COUNTIF($AK$54:$AK$62,W54)","v":0},null,0,0,0,0,null,null,"slot1",{"$f":"'Lotto2 DL580 Prest 1'!$D$97","v":""},{"$f":"'Lotto2 DL580 Prest 2'!$D$97","v":""},{"$f":"'Lotto2 DL580 Prest 3'!$D$97","v":""}]
[null,"","",null,null,null,"",null,null,"",null,null,null,null,null,null,null,"",null,"",null,0,"TS1L2-1GB",0,{"$f":"COUNTIF($AJ$54:$AJ$65,W55)","v":0},{"$f":"COUNTIF($AK$54:$AK$65,W55)","v":0},null,0,0,0,0,null,null,"slot2",{"$f":"'Lotto2 DL580 Prest 1'!$D$100","v":""},{"$f":"'Lotto2 DL580 Prest 2'!$D$100","v":""},{"$f":"'Lotto2 DL580 Prest 3'!$D$100","v":""}]
[null,"","",null,null,null,"",null,null,"",null,null,null,null,null,null,null,"",null,"",null,0,null,0,{"$f":"COUNTIF($AJ$54:$AJ$65,W56)","v":0},{"$f":"COUNTIF($AK$54:$AK$65,W56)","v":0},null,0,0,0,0,null,null,"slot3",{"$f":"'Lotto2 DL580 Prest 1'!$D$103","v":""},{"$f":"'Lotto2 DL580 Prest 2'!$D$103","v":""},{"$f":"'Lotto2 DL580 Prest 3'!$D$103","v":""}]
[null,"","",null,null,null,"",null,null,"",null,null,null,null,null,null,null,"",null,"",null,0,"TS1L2-10GB",0,0,0,null,0,0,0,0,null,null,"slot4",{"$f":"'Lotto2 DL580 Prest 1'!$D$106","v":""},{"$f":"'Lotto2 DL580 Prest 2'!$D$106","v":""},{"$f":"'Lotto2 DL580 Prest 3'!$D$106","v":""}]
[null,"","",null,null,null,"",null,null,"",null,null,null,null,null,null,null,"",null,"",null,0,null,0,0,0,null,0,0,0,0,null,null,"slot8",{"$f":"'Lotto2 DL580 Prest 1'!$D$118","v":""},{"$f":"'Lotto2 DL580 Prest 2'!$D$118","v":""},{"$f":"'Lotto2 DL580 Prest 3'!$D$118","v":""}]
[null,"","",null,null,null,"",null,null,"",null,null,null,null,null,null,null,"",null,"",null,0,"TS1L2-CNA",0,0,0,null,0,0,0,0,null,null,"slot9",{"$f":"'Lotto2 DL580 Prest 1'!$D$121","v":""},{"$f":"'Lotto2 DL580 Prest 2'!$D$121","v":""},{"$f":"'Lotto2 DL580 Prest 3'!$D$121","v":""}]
[null,"","",null,null,null,"",null,null,"",null,null,null,null,null,null,null,"",null,"",null,0,null,0,0,0,null,0,0,0,0,null,null,"slot10",{"$f":"'Lotto2 DL580 Prest 1'!$D$124","v":""},{"$f":"'Lotto2 DL580 Prest 2'!$D$124","v":""},{"$f":"'Lotto2 DL580 Prest 3'!$D$124","v":""}]
[null,"","",null,null,null,"",null,null,"",null,null,null,null,null,null,null,"",null,"",null,0,"TS1L2-FC",0,0,0,null,0,0,0,0,null,null,"slot11",{"$f":"'Lotto2 DL580 Prest 1'!$D$127","v":""},{"$f":"'Lotto2 DL580 Prest 2'!$D$127","v":""},{"$f":"'Lotto2 DL580 Prest 3'!$D$127","v":""}]
[null,"","",null,null,null,"",null,null,"",null,null,null,null,null,null,null,"",null,"",null,0,"TS1L2-HD300",{"$f":"HD300_C","v":0},{"$f":"HD300_CC","v":0},{"$f":"HD300_CCC","v":0},null,0,0,0,0,null,null,"slot12",{"$f":"'Lotto2 DL580 Prest 1'!$D$130","v":""},{"$f":"'Lotto2 DL580 Prest 2'!$D$130","v":""},{"$f":"'Lotto2 DL580 Prest 3'!$D$130","v":""}]
[null,"","",null,null,null,"",null,null,"",null,null,null,null,null,null,null,"",null,"",null,0,"TS1L2-HD1200",{"$f":"HD1000_c","v":0},{"$f":"HD1000_CC","v":0},{"$f":"HD1000_CCC","v":0},null,0,0,0,0,null,null,"slot13",{"$f":"'Lotto2 DL580 Prest 1'!$D$133","v":""},{"$f":"'Lotto2 DL580 Prest 2'!$D$133","v":""},{"$f":"'Lotto2 DL580 Prest 3'!$D$133","v":""}]
[null,"",{"$f":"IF(AE64>0,(VLOOKUP(G64,COD_B,2,FALSE)),\"\")","v":""},null,null,null,{"$f":"IF(AE64>=1,W64,\"\")","v":""},null,null,{"$f":"IF(AE64>0,(VLOOKUP(G64,COD_B,5,FALSE)),\"\")","v":""},null,null,null,null,null,null,null,{"$f":"IF(AE64>0,(VLOOKUP(G64,COD_B,3,FALSE)),\"\")","v":""},null,{"$f":"IF(B64=\"\",\"\",R64*B64)","v":""},null,0,"TS1L2-HD1800",{"$f":"'Lotto2 DL580 Prest 1'!C72","v":0},{"$f":"'Lotto2 DL580 Prest 2'!C72","v":0},{"$f":"'Lotto2 DL580 Prest 3'!C72","v":0},null,0,0,0,0,null,null,"slot14",{"$f":"'Lotto2 DL580 Prest 1'!$D$136","v":""},{"$f":"'Lotto2 DL580 Prest 2'!$D$136","v":""},{"$f":"'Lotto2 DL580 Prest 3'!$D$136","v":""}]
[null,"",{"$f":"IF(AE65>0,(VLOOKUP(G65,COD_B,2,FALSE)),\"\")","v":""},null,null,null,{"$f":"IF(AE65>=1,W65,\"\")","v":""},null,null,{"$f":"IF(AE65>0,(VLOOKUP(G65,COD_B,5,FALSE)),\"\")","v":""},null,null,null,null,null,null,null,{"$f":"IF(AE65>0,(VLOOKUP(G65,COD_B,3,FALSE)),\"\")","v":""},null,{"$f":"IF(B65=\"\",\"\",R65*B65)","v":""},null,0,"TS1L2-SSD960",{"$f":"'Lotto2 DL580 Prest 1'!C74","v":0},{"$f":"'Lotto2 DL580 Prest 2'!C74","v":0},{"$f":"'Lotto2 DL580 Prest 3'!C74","v":0},null,0,0,0,0,null,null,"slot15",{"$f":"'Lotto2 DL580 Prest 1'!$D$139","v":""},{"$f":"'Lotto2 DL580 Prest 2'!$D$139","v":""},{"$f":"'Lotto2 DL580 Prest 3'!$D$139","v":""}]
[null,"",{"$f":"IF(AE66>0,(VLOOKUP(G66,COD_B,2,FALSE)),\"\")","v":""},null,null,null,{"$f":"IF(AE66>=1,W66,\"\")","v":""},null,null,{"$f":"IF(AE66>0,(VLOOKUP(G66,COD_B,5,FALSE)),\"\")","v":""},null,null,null,null,null,null,null,{"$f":"IF(AE66>0,(VLOOKUP(G66,COD_B,3,FALSE)),\"\")","v":""},null,{"$f":"IF(B66=\"\",\"\",R66*B66)","v":""},null,0,"TS1L2-SSD1920",{"$f":"'Lotto2 DL580 Prest 1'!C76","v":0},{"$f":"'Lotto2 DL580 Prest 2'!C76","v":0},{"$f":"'Lotto2 DL580 Prest 3'!C76","v":0},null,0,0,0,0]
[null,"","",null,null,null,"",null,null,"",null,null,null,null,null,null,null,"",null,"",null,0,"TS1L2-4ANNI",{"$f":"IF('Lotto2 DL580 Prest 1'!$D$161=W67,'Lotto2 DL580 Prest 1'!$C$161,0)","v":0},{"$f":"IF('Lotto2 DL580 Prest 2'!$D$161=W67,'Lotto2 DL580 Prest 2'!$C$161,0)","v":0},{"$f":"IF('Lotto2 DL580 Prest 3'!$D$161=W67,'Lotto2 DL580 Prest 3'!$C$161,0)","v":0},null,0,0,0,0]
[null,"","",null,null,null,"",null,null,"",null,null,null,null,null,null,null,"",null,"",null,0,"TS1L2-5ANNI",{"$f":"IF('Lotto2 DL580 Prest 1'!$D$161=W68,'Lotto2 DL580 Prest 1'!$C$161,0)","v":0},{"$f":"IF('Lotto2 DL580 Prest 2'!$D$161=W68,'Lotto2 DL580 Prest 2'!$C$161,0)","v":0},{"$f":"IF('Lotto2 DL580 Prest 3'!$D$161=W68,'Lotto2 DL580 Prest 3'!$C$161,0)","v":0},null,0,0,0,0]
[null,"","",null,null,null,"",null,null,"",null,null,null,null,null,null,null,"",null,"",null,0,"10L2-SO-HDD",null,null,null,null,0,0,0,0]
[null,"OPZIONI COMUNI",null,null,null,null,null,null,null,null,null,null,null,null,null,null,null,null,null,null,null,{"$f":"IF(SUM(V71:V84)=0,0,1)","v":0},"Comuni","DL560","DL560 2","DL560 3","DL580","DL580 2","DL580 3","DL580 Prest 1","DL580 Prest 2","DL580 Prest 3","tot DL560","tot DL580","tot 580 Prest"]
[null,{"$f":"IF(AT71=0,\"\",AT71)","v":""},{"$f":"IF(AT71=0,\"\",(VLOOKUP(G71,COD_A,2,FALSE)))","v":""},null,null,null,{"$f":"IF(AT71>0,W71,\"\")","v":""},null,null,{"$f":"IF(AT71>0,(VLOOKUP(G71,COD_A,5,FALSE)),\"\")","v":""},null,null,null,null,null,null,null,{"$f":"IF(AT71>0,(VLOOKUP(G71,COD_A,3,FALSE)),\"\")","v":""},null,{"$f":"IF(B71=\"\",\"\",R71*B71)","v":""},null,0,"TS1L2-WIN1",{"$f":"IF('Lotto2 DL560 Gen10 1'!$D$46=W71,1,0)","v":0},{"$f":"IF('Lotto2 DL560 Gen10 2'!$D$46=W71,1,0)","v":0},{"$f":"IF('Lotto2 DL560 Gen10 3'!$D$46=W71,1,0)","v":0},{"$f":"IF('Lotto2 DL580 1'!$D$43=W71,1,0)","v":0},{"$f":"IF('Lotto2 DL580 2'!$D$43=W71,1,0)","v":0},{"$f":"IF('Lotto2 DL580 3'!$D$43=W71,1,0)","v":0},{"$f":"IF('Lotto2 DL580 Prest 1'!$D$43=W71,1,0)","v":0},{"$f":"IF('Lotto2 DL580 Prest 2'!$D$43=W71,1,0)","v":0},{"$f":"IF('Lotto2 DL580 Prest 3'!$D$43=W71,1,0)","v":0},{"$f":"SUM(X71:Z71)","v":0},{"$f":"SUM(AA71:AC71)","v":0},{"$f":"SUM(AD71:AF71)","v":0},{"$f":"X71*$X$14","v":0},{"$f":"Y71*$Y$14","v":0},{"$f":"Z71*$Z$14","v":0},{"$f":"AA71*$X$32","v":0},{"$f":"AB71*$Y$32","v":0},{"$f":"AC71*$Z$32","v":0},{"$f":"AD71*$X$50","v":0},{"$f":"AE71*$Y$50","v":0},{"$f":"AF71*$Z$50","v":0},null,{"$f":"SUM(AJ71:AR71)","v":0}]
[null,"","",null,null,null,"",null,null,"",null,null,null,null,null,null,null,"",null,"",null,0,"TS1L2-WIN2",{"$f":"IF('Lotto2 DL560 Gen10 1'!$D$47=$W$72,'Lotto2 DL560 Gen10 1'!$C$47,0)","v":0},{"$f":"IF('Lotto2 DL560 Gen10 2'!$D$47=$W$72,'Lotto2 DL560 Gen10 2'!$C$47,0)","v":0},{"$f":"IF('Lotto2 DL560 Gen10 3'!$D$47=$W$72,'Lotto2 DL560 Gen10 3'!$C$47,0)","v":0},{"$f":"IF('Lotto2 DL580 1'!$D$44=W72,'Lotto2 DL580 1'!$C$44,0)","v":0},{"$f":"IF('Lotto2 DL580 2'!$D$44=W72,'Lotto2 DL580 2'!$C$44,0)","v":0},{"$f":"IF('Lotto2 DL580 3'!$D$44=W72,'Lotto2 DL580 3'!$C$44,0)","v":0},{"$f":"IF('Lotto2 DL580 Prest 1'!$D$44=W72,'Lotto2 DL580 Prest 1'!$C$44,0)","v":0},{"$f":"IF('Lotto2 DL580 Prest 2'!$D$44=W72,'Lotto2 DL580 Prest 2'!$C$44,0)","v":0},{"$f":"IF('Lotto2 DL580 Prest 3'!$D$44=W72,'Lotto2 DL580 Prest 3'!$C$44,0)","v":0},0,0,{"$f":"SUM(AD72:AF72)","v":0},0,0,0,0,0,0,{"$f":"AD72*$X$50","v":0},{"$f":"AE72*$Y$50","v":0},{"$f":"AF72*$Z$50","v":0},null,{"$f":"SUM(AJ72:AR72)","v":0}]
[null,"","",null,null,null,"",null,null,"",null,null,null,null,null,null,null,"",null,"",null,0,"TS1L2-WINDC1",{"$f":"IF('Lotto2 DL560 Gen10 1'!$D$46=$W$73,1,0)","v":0},{"$f":"IF('Lotto2 DL560 Gen10 2'!$D$46=$W$73,1,0)","v":0},{"$f":"IF('Lotto2 DL560 Gen10 3'!$D$46=$W$73,1,0)","v":0},{"$f":"IF('Lotto2 DL580 1'!$D$43=W73,1,0)","v":0},{"$f":"IF('Lotto2 DL580 2'!$D$43=W73,1,0)","v":0},{"$f":"IF('Lotto2 DL580 3'!$D$43=W73,1,0)","v":0},{"$f":"IF('Lotto2 DL580 Prest 1'!$D$43=W73,1,0)","v":0},{"$f":"IF('Lotto2 DL580 Prest 2'!$D$43=W73,1,0)","v":0},{"$f":"IF('Lotto2 DL580 Prest 3'!$D$43=W73,1,0)","v":0},0,0,0,0,0,0,0,0,0,0,0,0,null,0]
[null,"","",null,null,null,"",null,null,"",null,null,null,null,null,null,null,"",null,"",null,0,"TS1L2-WINDC2",{"$f":"IF('Lotto2 DL560 Gen10 1'!$D$47=$W$74,'Lotto2 DL560 Gen10 1'!$C$47,0)","v":0},{"$f":"IF('Lotto2 DL560 Gen10 2'!$D$47=$W$74,'Lotto2 DL560 Gen10 2'!$C$47,0)","v":0},{"$f":"IF('Lotto2 DL560 Gen10 3'!$D$47=$W$74,'Lotto2 DL560 Gen10 3'!$C$47,0)","v":0},{"$f":"IF('Lotto2 DL580 1'!$D$44=W74,'Lotto2 DL580 1'!$C$44,0)","v":0},{"$f":"IF('Lotto2 DL580 2'!$D$44=W74,'Lotto2 DL580 2'!$C$44,0)","v":0},{"$f":"IF('Lotto2 DL580 3'!$D$44=W74,'Lotto2 DL580 3'!$C$44,0)","v":0},{"$f":"IF('Lotto2 DL580 Prest 1'!$D$44=W74,'Lotto2 DL580 Prest 1'!$C$44,0)","v":0},{"$f":"IF('Lotto2 DL580 Prest 2'!$D$44=W74,'Lotto2 DL580 Prest 2'!$C$44,0)","v":0},{"$f":"IF('Lotto2 DL580 Prest 3'!$D$44=W74,'Lotto2 DL580 Prest 3'!$C$44,0)","v":0},0,0,0,0,0,0,0,0,0,0,0,0,null,0]
[null,"","",null,null,null,"",null,null,"",null,null,null,null,null,null,null,"",null,"",null,0,"TS1L2-LINUX",{"$f":"IF('Lotto2 DL560 Gen10 1'!$D$46=$W$75,1,0)","v":0},{"$f":"IF('Lotto2 DL560 Gen10 2'!$D$46=$W$75,1,0)","v":0},{"$f":"IF('Lotto2 DL560 Gen10 3'!$D$46=$W$75,1,0)","v":0},{"$f":"IF('Lotto2 DL580 1'!$D$43=W75,1,0)","v":0},{"$f":"IF('Lotto2 DL580 2'!$D$43=W75,1,0)","v":0},{"$f":"IF('Lotto2 DL580 3'!$D$43=W75,1,0)","v":0},{"$f":"IF('Lotto2 DL580 Prest 1'!$D$43=W75,1,0)","v":0},{"$f":"IF('Lotto2 DL580 Prest 2'!$D$43=W75,1,0)","v":0},{"$f":"IF('Lotto2 DL580 Prest 3'!$D$43=W75,1,0)","v":0},0,0,0,0,0,0,0,0,0,0,0,0,null,0]
[null,"","",null,null,null,"",null,null,"",null,null,null,null,null,null,null,"",null,"",null,0,"TS1L2-CALUSER",{"$f":"IF(($X$71+$X$73)>0,'Lotto2 DL560 Gen10 1'!$C$51,0)","v":0},{"$f":"IF(($Y$71+$Y$73)>0,'Lotto2 DL560 Gen10 2'!$C$51,0)","v":0},{"$f":"IF(($Z$71+$Z$73)>0,'Lotto2 DL560 Gen10 3'!$C$51,0)","v":0},{"$f":"IF(($AA$71+$AA$73)>0,'Lotto2 DL580 1'!$C$48,0)","v":0},{"$f":"IF(($AB$71+$AB$73)>0,'Lotto2 DL580 2'!$C$48,0)","v":0},{"$f":"IF(($AC$71+$AC$73)>0,'Lotto2 DL580 3'!$C$48,0)","v":0},{"$f":"IF(($AD$71+$AD$73)>0,'Lotto2 DL580 Prest 1'!$C$48,0)","v":0},{"$f":"IF(($AE$71+$AE$73)>0,'Lotto2 DL580 Prest 2'!$C$48,0)","v":0},{"$f":"IF(($AF$71+$AF$73)>0,'Lotto2 DL580 Prest 3'!$C$48,0)","v":0},0,0,0,0,0,0,0,0,0,0,0,0,null,0]
[null,"","",null,null,null,"",null,null,"",null,null,null,null,null,null,null,"",null,"",null,0,"TS1L2-CALDEV",{"$f":"IF(($X$71+$X$73)>0,'Lotto2 DL560 Gen10 2'!$C$53,0)","v":0},{"$f":"IF(($Y$71+$Y$73)>0,'Lotto2 DL560 Gen10 1'!$C$53,0)","v":0},{"$f":"IF(($Z$71+$Z$73)>0,'Lotto2 DL560 Gen10 3'!$C$53,0)","v":0},{"$f":"IF(($AA$71+$AA$73)>0,'Lotto2 DL580 1'!$C$50,0)","v":0},{"$f":"IF(($AB$71+$AB$73)>0,'Lotto2 DL580 2'!$C$50,0)","v":0},{"$f":"IF(($AC$71+$AC$73)>0,'Lotto2 DL580 3'!$C$50,0)","v":0},{"$f":"IF(($AD$71+$AD$73)>0,'Lotto2 DL580 Prest 1'!$C$50,0)","v":0},{"$f":"IF(($AE$71+$AE$73)>0,'Lotto2 DL580 Prest 2'!$C$50,0)","v":0},{"$f":"IF(($AF$71+$AF$73)>0,'Lotto2 DL580 Prest 3'!$C$50,0)","v":0},0,0,0,0,0,0,0,0,0,0,0,0,null,0]
[null,"","",null,null,null,"",null,null,{"$f":"IF(AT78>0,(VLOOKUP(G78,COD_A,5,FALSE)),\"\")","v":""},null,null,null,null,null,null,null,{"$f":"IF(AT78>0,(VLOOKUP(G78,COD_A,3,FALSE)),\"\")","v":""},null,"",null,0,"TS1L2-WIN2CORE",{"$f":"IF('Lotto2 DL560 Gen10 1'!$D$47=Riepilogo!$W$78,'Lotto2 DL560 Gen10 1'!$C$47,0)","v":0},{"$f":"IF('Lotto2 DL560 Gen10 2'!$D$47=Riepilogo!$W$78,'Lotto2 DL560 Gen10 2'!$C$47,0)","v":0},{"$f":"IF('Lotto2 DL560 Gen10 3'!$D$47=Riepilogo!$W$78,'Lotto2 DL560 Gen10 3'!$C$47,0)","v":0},{"$f":"IF('Lotto2 DL580 1'!$D$44=Riepilogo!$W$78,'Lotto2 DL580 1'!$C$44,0)","v":0},{"$f":"IF('Lotto2 DL580 2'!$D$44=Riepilogo!$W$78,'Lotto2 DL580 2'!$C$44,0)","v":0},{"$f":"IF('Lotto2 DL580 3'!$D$44=Riepilogo!$W$78,'Lotto2 DL580 3'!$C$44,0)","v":0},{"$f":"IF('Lotto2 DL580 Prest 1'!D45=Riepilogo!$W$78,'Lotto2 DL580 Prest 1'!$C$45,0)","v":0},{"$f":"IF('Lotto2 DL580 Prest 2'!D45=Riepilogo!$W$78,'Lotto2 DL580 Prest 2'!$C$45,0)","v":0},{"$f":"IF('Lotto2 DL580 Prest 3'!D45=Riepilogo!$W$78,'Lotto2 DL580 Prest 3'!$C$45,0)","v":0},0,0,0,0,0,0,0,0,0,0,0,0,null,0]
[null,{"$f":"IF('RACK, Accessori e Servizi'!J30=0,\"\",'RACK, Accessori e Servizi'!J30)","v":""},{"$f":"IF(B79=\"\",\"\",(VLOOKUP(G79,COD_A,2,FALSE)))","v":""},null,null,null,{"$f":"IF('RACK, Accessori e Servizi'!J30>0,'RACK, Accessori e Servizi'!K30,\"\")","v":""},null,null,{"$f":"IF(B79=\"\",\"\",(VLOOKUP(G79,COD_A,5,FALSE)))","v":""},null,null,null,null,null,null,null,{"$f":"IF(B79=\"\",\"\",(VLOOKUP(G79,COD_A,3,FALSE)))","v":""},null,{"$f":"IF(B79=\"\",\"\",R79*B79)","v":""},null,0]
[null,{"$f":"IF('RACK, Accessori e Servizi'!J24=0,\"\",'RACK, Accessori e Servizi'!J24)","v":""},{"$f":"IF(B80=\"\",\"\",(VLOOKUP(G80,COD_A,2,FALSE)))","v":""},null,null,null,{"$f":"IF('RACK, Accessori e Servizi'!J24>0,'RACK, Accessori e Servizi'!K24,\"\")","v":""},null,null,{"$f":"IF(B80=\"\",\"\",(VLOOKUP(G80,COD_A,5,FALSE)))","v":""},null,null,null,null,null,null,null,{"$f":"IF(B80=\"\",\"\",(VLOOKUP(G80,COD_A,3,FALSE)))","v":""},null,"",null,0]
[null,{"$f":"IF('RACK, Accessori e Servizi'!J27=0,\"\",'RACK, Accessori e Servizi'!J27)","v":""},{"$f":"IF(B81=\"\",\"\",(VLOOKUP(G81,COD_A,2,FALSE)))","v":""},null,null,null,{"$f":"IF('RACK, Accessori e Servizi'!J27>0,'RACK, Accessori e Servizi'!K27,\"\")","v":""},null,null,{"$f":"IF(B81=\"\",\"\",(VLOOKUP(G81,COD_A,5,FALSE)))","v":""},null,null,null,null,null,null,null,{"$f":"IF(B81=\"\",\"\",(VLOOKUP(G81,COD_A,3,FALSE)))","v":""},null,"",null,0]
[null,{"$f":"IF('RACK, Accessori e Servizi'!J15=0,\"\",'RACK, Accessori e Servizi'!J15)","v":""},{"$f":"IF(B82=\"\",\"\",(VLOOKUP(G82,COD_A,2,FALSE)))","v":""},null,null,null,{"$f":"IF('RACK, Accessori e Servizi'!J15>0,'RACK, Accessori e Servizi'!K15,\"\")","v":""},null,null,{"$f":"IF(B82=\"\",\"\",(VLOOKUP(G82,COD_A,5,FALSE)))","v":""},null,null,null,null,null,null,null,{"$f":"IF(B82=\"\",\"\",(VLOOKUP(G82,COD_A,3,FALSE)))","v":""},null,"",null,0]
[null,{"$f":"IF('RACK, Accessori e Servizi'!J8=0,\"\",'RACK, Accessori e Servizi'!J8)","v":""},{"$f":"IF(B83>0,(VLOOKUP(G83,COD_B,2,FALSE)),\"\")","v":""},null,null,null,{"$f":"IF('RACK, Accessori e Servizi'!J8>0,'RACK, Accessori e Servizi'!K8,\"\")","v":""},null,null,{"$f":"IF(B83>0,(VLOOKUP(G83,COD_B,5,FALSE)),\"\")","v":""},null,null,null,null,null,null,null,{"$f":"IF(B83>0,(VLOOKUP(G83,COD_B,3,FALSE)),\"\")","v":""},null,"",null,0]
[null,{"$f":"IF('RACK, Accessori e Servizi'!J10=0,\"\",'RACK, Accessori e Servizi'!J10)","v":""},{"$f":"IF(B84>0,(VLOOKUP(G84,COD_B,2,FALSE)),\"\")","v":""},null,null,null,{"$f":"IF('RACK, Accessori e Servizi'!J10>0,'RACK, Accessori e Servizi'!K10,\"\")","v":""},null,null,{"$f":"IF(B84>0,(VLOOKUP(G84,COD_B,5,FALSE)),\"\")","v":""},null,null,null,null,null,null,null,{"$f":"IF(B84>0,(VLOOKUP(G84,COD_B,3,FALSE)),\"\")","v":""},null,"",null,0]
[null,"ULTERIORI OPZIONI",null,null,null,null,null,null,null,null,null,null,null,null,null,null,null,null,null,null,null,{"$f":"IF(SUM(V86:V122)=0,0,1)","v":0},null,"DL560","DL560 2","DL560 3","DL580","DL580 2","DL580 3","DL580","DL580 2","DL580 3","tot DL560","tot DL580"]
[null,{"$f":"IF(AT86=0,\"\",AT86)","v":""},{"$f":"IF(AT86=0,\"\",(VLOOKUP(G86,COD_A,2,FALSE)))","v":""},null,null,null,{"$f":"IF(AT86>0,W86,\"\")","v":""},null,null,{"$f":"IF(AT86>0,(VLOOKUP(G86,COD_A,5,FALSE)),\"\")","v":""},null,null,null,null,null,null,null,{"$f":"IF(AT86>0,(VLOOKUP(G86,COD_A,3,FALSE)),\"\")","v":""},null,{"$f":"IF(B86=\"\",\"\",R86*B86)","v":""},null,0,"TS1L2-HD1800-580-AS",{"$f":"'Lotto2 DL560 Gen10 1'!$C$82","v":0},{"$f":"'Lotto2 DL560 Gen10 2'!$C$82","v":0},{"$f":"'Lotto2 DL560 Gen10 3'!$C$82","v":0},{"$f":"'Lotto2 DL580 1'!$C$72","v":0},{"$f":"'Lotto2 DL580 2'!$C$72","v":0},{"$f":"'Lotto2 DL580 3'!$C$72","v":0},null,null,null,{"$f":"SUM(X86:Z86)","v":0},{"$f":"SUM(AA86:AC86)","v":0},{"$f":"SUM(AD86:AF86)","v":0},{"$f":"X86*$X$14","v":0},{"$f":"Y86*$Y$14","v":0},{"$f":"Z86*$Z$14","v":0},{"$f":"AA86*$X$32","v":0},{"$f":"AB86*$Y$32","v":0},{"$f":"AC86*$Z$32","v":0},{"$f":"AD86*$X$50","v":0},{"$f":"AE86*$Y$50","v":0},{"$f":"AF86*$Z$50","v":0},null,{"$f":"SUM(AJ86:AS86)","v":0}]
[null,"",{"$f":"IF(AT87=0,\"\",(VLOOKUP(G87,COD_A,2,FALSE)))","v":""},null,null,null,{"$f":"IF(AT87>0,W87,\"\")","v":""},null,null,{"$f":"IF(AT87>0,(VLOOKUP(G87,COD_A,5,FALSE)),\"\")","v":""},null,null,null,null,null,null,null,{"$f":"IF(AT87>0,(VLOOKUP(G87,COD_A,3,FALSE)),\"\")","v":""},null,{"$f":"IF(B87=\"\",\"\",R87*B87)","v":""},null,0,"S2-875311-B21",{"$f":"'Lotto2 DL560 Gen10 1'!$C$84","v":0},{"$f":"'Lotto2 DL560 Gen10 2'!$C$84","v":0},{"$f":"'Lotto2 DL560 Gen10 3'!$C$84","v":0},null,null,null,null,null,null,{"$f":"SUM(X87:Z87)","v":0},{"$f":"SUM(AA87:AC87)","v":0},{"$f":"SUM(AD87:AF87)","v":0},{"$f":"X87*$X$14","v":0},{"$f":"Y87*$Y$14","v":0},{"$f":"Z87*$Z$14","v":0},{"$f":"AA87*$X$32","v":0},{"$f":"AB87*$Y$32","v":0},{"$f":"AC87*$Z$32","v":0},{"$f":"AD87*$X$50","v":0},{"$f":"AE87*$Y$50","v":0},{"$f":"AF87*$Z$50","v":0},null,{"$f":"SUM(AJ87:AS87)","v":0}]
[null,"",{"$f":"IF(AT88=0,\"\",(VLOOKUP(G88,COD_A,2,FALSE)))","v":""},null,null,null,"",null,null,"",null,null,null,null,null,null,null,"",null,{"$f":"IF(B88=\"\",\"\",R88*B88)","v":""},null,0,"TS1L2-SSD960-AS",{"$f":"'Lotto2 DL560 Gen10 1'!$C$86","v":0},{"$f":"'Lotto2 DL560 Gen10 2'!$C$86","v":0},{"$f":"'Lotto2 DL560 Gen10 3'!$C$86","v":0},{"$f":"'Lotto2 DL580 1'!$C$74","v":0},{"$f":"'Lotto2 DL580 2'!$C$74","v":0},{"$f":"'Lotto2 DL580 3'!$C$74","v":0},null,null,null,0,0,{"$f":"SUM(AD88:AF88)","v":0},0,0,0,0,0,0,{"$f":"AD88*$X$50","v":0},{"$f":"AE88*$Y$50","v":0},{"$f":"AF88*$Z$50","v":0},null,{"$f":"SUM(AJ88:AS88)","v":0}]
[null,"","",null,null,null,"",null,null,"",null,null,null,null,null,null,null,"",null,"",null,0,"TS1L2-SSD1920",{"$f":"'Lotto2 DL560 Gen10 1'!$C$88","v":0},{"$f":"'Lotto2 DL560 Gen10 2'!$C$88","v":0},{"$f":"'Lotto2 DL560 Gen10 3'!$C$88","v":0},{"$f":"'Lotto2 DL580 1'!$C$76","v":0},{"$f":"'Lotto2 DL580 2'!$C$76","v":0},{"$f":"'Lotto2 DL580 3'!$C$76","v":0},null,null,null,0,0,0,0,0,0,0,0,0,0,0,0,null,0]
[null,"","",null,null,null,"",null,null,"",null,null,null,null,null,null,null,"",null,"",null,0,"S2-P9D94A",{"$f":"COUNTIF($AI$18:$AI$25,W90)","v":0},{"$f":"COUNTIF($AJ$18:$AJ$25,W90)","v":0},{"$f":"COUNTIF($AK$18:$AK$25,W90)","v":0},{"$f":"COUNTIF($AI$36:$AI$48,W90)","v":0},{"$f":"COUNTIF($AJ$36:$AJ$48,W90)","v":0},{"$f":"COUNTIF($AK$36:$AK$48,W90)","v":0},{"$f":"COUNTIF($AI$54:$AI$65,W90)","v":0},{"$f":"COUNTIF($AJ$54:$AJ$65,W90)","v":0},{"$f":"COUNTIF($AK$54:$AK$65,W90)","v":0},0,0,0,0,0,0,0,0,0,0,0,0,null,0]
[null,"",{"$f":"IF(AT91=0,\"\",(VLOOKUP(G91,COD_A,2,FALSE)))","v":""},null,null,null,{"$f":"IF(AT91>0,W91,\"\")","v":""},null,null,{"$f":"IF(AT91>0,(VLOOKUP(G91,COD_A,5,FALSE)),\"\")","v":""},null,null,null,null,null,null,null,{"$f":"IF(AT91>0,(VLOOKUP(G91,COD_A,3,FALSE)),\"\")","v":""},null,{"$f":"IF(B91=\"\",\"\",R91*B91)","v":""},null,0,"TS1-764302",{"$f":"COUNTIF($AI$18:$AI$25,W91)","v":0},{"$f":"COUNTIF($AJ$18:$AJ$25,W91)","v":0},{"$f":"COUNTIF($AK$18:$AK$25,W91)","v":0},{"$f":"COUNTIF($AI$36:$AI$48,W91)","v":0},{"$f":"COUNTIF($AJ$36:$AJ$48,W91)","v":0},{"$f":"COUNTIF($AK$36:$AK$48,W91)","v":0},{"$f":"COUNTIF($AI$54:$AI$65,W91)","v":0},{"$f":"COUNTIF($AJ$54:$AJ$65,W91)","v":0},{"$f":"COUNTIF($AK$54:$AK$65,W91)","v":0},{"$f":"SUM(X91:Z91)","v":0},{"$f":"SUM(AA91:AC91)","v":0},{"$f":"SUM(AD91:AF91)","v":0},{"$f":"X91*$X$14","v":0},{"$f":"Y91*$Y$14","v":0},{"$f":"Z91*$Z$14","v":0},{"$f":"AA91*$X$32","v":0},{"$f":"AB91*$Y$32","v":0},{"$f":"AC91*$Z$32","v":0},{"$f":"AD91*$X$50","v":0},{"$f":"AE91*$Y$50","v":0},{"$f":"AF91*$Z$50","v":0},null,{"$f":"SUM(AJ91:AS91)","v":0}]
[null,"",{"$f":"IF(AT92=0,\"\",(VLOOKUP(G92,COD_A,2,FALSE)))","v":""},null,null,null,{"$f":"IF(AT92>0,W92,\"\")","v":""},null,null,{"$f":"IF(AT92>0,(VLOOKUP(G92,COD_A,5,FALSE)),\"\")","v":""},null,null,null,null,null,null,null,{"$f":"IF(AT92>0,(VLOOKUP(G92,COD_A,3,FALSE)),\"\")","v":""},null,{"$f":"IF(B92=\"\",\"\",R92*B92)","v":""},null,0,"TS1-656596",{"$f":"COUNTIF($AI$18:$AI$25,W92)","v":0},{"$f":"COUNTIF($AJ$18:$AJ$25,W92)","v":0},{"$f":"COUNTIF($AK$18:$AK$25,W92)","v":0},{"$f":"COUNTIF($AI$36:$AI$48,W92)","v":0},{"$f":"COUNTIF($AJ$36:$AJ$48,W92)","v":0},{"$f":"COUNTIF($AK$36:$AK$48,W92)","v":0},{"$f":"COUNTIF($AI$54:$AI$65,W92)","v":0},{"$f":"COUNTIF($AJ$54:$AJ$65,W92)","v":0},{"$f":"COUNTIF($AK$54:$AK$65,W92)","v":0},{"$f":"SUM(X92:Z92)","v":0},{"$f":"SUM(AA92:AC92)","v":0},{"$f":"SUM(AD92:AF92)","v":0},{"$f":"X92*$X$14","v":0},{"$f":"Y92*$Y$14","v":0},{"$f":"Z92*$Z$14","v":0},{"$f":"AA92*$X$32","v":0},{"$f":"AB92*$Y$32","v":0},{"$f":"AC92*$Z$32","v":0},{"$f":"AD92*$X$50","v":0},{"$f":"AE92*$Y$50","v":0},{"$f":"AF92*$Z$50","v":0},null,{"$f":"SUM(AJ92:AS92)","v":0}]
[null,"","",null,null,null,"",null,null,"",null,null,null,null,null,null,null,"",null,"",null,0,"TS1-867707",0,0,0,0,0,0,0,0,0,0,0,0,0,0,0,0,0,0,0,0,0,null,0]
[null,"","",null,null,null,"",null,null,"",null,null,null,null,null,null,null,"",null,"",null,0,"S2-E5Y34A",{"$f":"'Lotto2 DL560 Gen10 1'!$C$59","v":0},{"$f":"'Lotto2 DL560 Gen10 2'!$C$59","v":0},{"$f":"'Lotto2 DL560 Gen10 3'!$C$59","v":0},{"$f":"'Lotto2 DL580 1'!$C$56","v":0},{"$f":"'Lotto2 DL580 2'!$C$56","v":0},{"$f":"'Lotto2 DL580 3'!$C$56","v":0},{"$f":"'Lotto2 DL580 Prest 1'!$C$56","v":0},{"$f":"'Lotto2 DL580 Prest 2'!$C$56","v":0},{"$f":"'Lotto2 DL580 Prest 3'!$C$56","v":0},0,0,0,0,0,0,0,0,0,0,0,0,null,0]
[null,"","",null,null,null,"",null,null,"",null,null,null,null,null,null,null,"",null,"",null,0,"TS1-874-006887",{"$f":"IF('Lotto2 DL560 Gen10 1'!$D$56=Riepilogo!W95,'Lotto2 DL560 Gen10 1'!$C$56,0)","v":0},{"$f":"IF('Lotto2 DL560 Gen10 2'!$D$56=Riepilogo!W95,'Lotto2 DL560 Gen10 2'!$C$56,0)","v":0},{"$f":"IF('Lotto2 DL560 Gen10 3'!$D$56=Riepilogo!W95,'Lotto2 DL560 Gen10 3'!$C$56,0)","v":0},{"$f":"IF('Lotto2 DL580 1'!$D$53=Riepilogo!$W$95,'Lotto2 DL580 1'!$C$53,0)","v":0},{"$f":"IF('Lotto2 DL580 2'!$D$53=Riepilogo!W95,'Lotto2 DL580 2'!$C$53,0)","v":0},{"$f":"IF('Lotto2 DL580 3'!$D$53=Riepilogo!W95,'Lotto2 DL580 3'!$C$53,0)","v":0},{"$f":"IF('Lotto2 DL580 Prest 1'!$D$53=Riepilogo!W95,'Lotto2 DL580 Prest 1'!$C$53,0)","v":0},{"$f":"IF('Lotto2 DL580 Prest 2'!$D$53=Riepilogo!W95,'Lotto2 DL580 Prest 2'!$C$53,0)","v":0},{"$f":"IF('Lotto2 DL580 Prest 3'!$D$53=Riepilogo!W95,'Lotto2 DL580 Prest 3'!$C$53,0)","v":0},0,0,0,0,0,0,0,0,0,0,0,0,null,0]
[null,"","",null,null,null,"",null,null,"",null,null,null,null,null,null,null,"",null,"",null,0,"TS1-874-006898",{"$f":"IF('Lotto2 DL560 Gen10 1'!$D$56=Riepilogo!W96,'Lotto2 DL560 Gen10 1'!$C$56,0)","v":0},{"$f":"IF('Lotto2 DL560 Gen10 2'!$D$56=Riepilogo!W96,'Lotto2 DL560 Gen10 2'!$C$56,0)","v":0},{"$f":"IF('Lotto2 DL560 Gen10 3'!$D$56=Riepilogo!W96,'Lotto2 DL560 Gen10 3'!$C$56,0)","v":0},{"$f":"IF('Lotto2 DL580 1'!$D$53=Riepilogo!W96,'Lotto2 DL580 1'!$C$53,0)","v":0},{"$f":"IF('Lotto2 DL580 2'!$D$53=Riepilogo!W96,'Lotto2 DL580 2'!$C$53,0)","v":0},{"$f":"IF('Lotto2 DL580 3'!$D$53=Riepilogo!W96,'Lotto2 DL580 3'!$C$53,0)","v":0},{"$f":"IF('Lotto2 DL580 Prest 1'!$D$53=Riepilogo!W96,'Lotto2 DL580 Prest 1'!$C$53,0)","v":0},{"$f":"IF('Lotto2 DL580 Prest 2'!$D$53=Riepilogo!W96,'Lotto2 DL580 Prest 2'!$C$53,0)","v":0},{"$f":"IF('Lotto2 DL580 Prest 3'!$D$53=Riepilogo!W96,'Lotto2 DL580 Prest 3'!$C$53,0)","v":0},0,0,0,0,0,0,0,0,0,0,0,0,null,0]
[null,"","",null,null,null,"",null,null,"",null,null,null,null,null,null,null,"",null,"",null,0,"TS1-874-006888",{"$f":"IF('Lotto2 DL560 Gen10 1'!$D$56=Riepilogo!W97,'Lotto2 DL560 Gen10 1'!$C$56,0)","v":0},{"$f":"IF('Lotto2 DL560 Gen10 2'!$D$56=Riepilogo!W97,'Lotto2 DL560 Gen10 2'!$C$56,0)","v":0},{"$f":"IF('Lotto2 DL560 Gen10 3'!$D$56=Riepilogo!W97,'Lotto2 DL560 Gen10 3'!$C$56,0)","v":0},{"$f":"IF('Lotto2 DL580 1'!$D$53=Riepilogo!W97,'Lotto2 DL580 1'!$C$53,0)","v":0},{"$f":"IF('Lotto2 DL580 2'!$D$53=Riepilogo!W97,'Lotto2 DL580 2'!$C$53,0)","v":0},{"$f":"IF('Lotto2 DL580 3'!$D$53=Riepilogo!W97,'Lotto2 DL580 3'!$C$53,0)","v":0},{"$f":"IF('Lotto2 DL580 Prest 1'!$D$53=Riepilogo!W97,'Lotto2 DL580 Prest 1'!$C$53,0)","v":0},{"$f":"IF('Lotto2 DL580 Prest 2'!$D$53=Riepilogo!W97,'Lotto2 DL580 Prest 2'!$C$53,0)","v":0},{"$f":"IF('Lotto2 DL580 Prest 3'!$D$53=Riepilogo!W97,'Lotto2 DL580 Prest 3'!$C$53,0)","v":0},0,0,0,0,0,0,0,0,0,0,0,0,null,0]
[null,"","",null,null,null,"",null,null,"",null,null,null,null,null,null,null,"",null,{"$f":"IF(B98=\"\",\"\",R98*B98)","v":""},null,0,"TS1-874-006902",{"$f":"IF('Lotto2 DL560 Gen10 1'!$D$56=Riepilogo!W98,'Lotto2 DL560 Gen10 1'!$C$56,0)","v":0},{"$f":"IF('Lotto2 DL560 Gen10 2'!$D$56=Riepilogo!W98,'Lotto2 DL560 Gen10 2'!$C$56,0)","v":0},{"$f":"IF('Lotto2 DL560 Gen10 3'!$D$56=Riepilogo!W98,'Lotto2 DL560 Gen10 3'!$C$56,0)","v":0},{"$f":"IF('Lotto2 DL580 1'!$D$53=Riepilogo!W98,'Lotto2 DL580 1'!$C$53,0)","v":0},{"$f":"IF('Lotto2 DL580 2'!$D$53=Riepilogo!W98,'Lotto2 DL580 2'!$C$53,0)","v":0},{"$f":"IF('Lotto2 DL580 3'!$D$53=Riepilogo!W98,'Lotto2 DL580 3'!$C$53,0)","v":0},{"$f":"IF('Lotto2 DL580 Prest 1'!$D$53=Riepilogo!W98,'Lotto2 DL580 Prest 1'!$C$53,0)","v":0},{"$f":"IF('Lotto2 DL580 Prest 2'!$D$53=Riepilogo!W98,'Lotto2 DL580 Prest 2'!$C$53,0)","v":0},{"$f":"IF('Lotto2 DL580 Prest 3'!$D$53=Riepilogo!W98,'Lotto2 DL580 Prest 3'!$C$53,0)","v":0},0,0,0,0,0,0,0,0,0,0,0,0,null,0]
[null,"","",null,null,null,"",null,null,"",null,null,null,null,null,null,null,"",null,{"$f":"IF(B99=\"\",\"\",R99*B99)","v":""},null,0,"TS1-874-006883",{"$f":"IF('Lotto2 DL560 Gen10 1'!$D$56=Riepilogo!W99,'Lotto2 DL560 Gen10 1'!$C$56,0)","v":0},{"$f":"IF('Lotto2 DL560 Gen10 2'!$D$56=Riepilogo!W99,'Lotto2 DL560 Gen10 2'!$C$56,0)","v":0},{"$f":"IF('Lotto2 DL560 Gen10 3'!$D$56=Riepilogo!W99,'Lotto2 DL560 Gen10 3'!$C$56,0)","v":0},{"$f":"IF('Lotto2 DL580 1'!$D$53=Riepilogo!W99,'Lotto2 DL580 1'!$C$53,0)","v":0},{"$f":"IF('Lotto2 DL580 2'!$D$53=Riepilogo!W99,'Lotto2 DL580 2'!$C$53,0)","v":0},{"$f":"IF('Lotto2 DL580 3'!$D$53=Riepilogo!W99,'Lotto2 DL580 3'!$C$53,0)","v":0},{"$f":"IF('Lotto2 DL580 Prest 1'!$D$53=Riepilogo!W99,'Lotto2 DL580 Prest 1'!$C$53,0)","v":0},{"$f":"IF('Lotto2 DL580 Prest 2'!$D$53=Riepilogo!W99,'Lotto2 DL580 Prest 2'!$C$53,0)","v":0},{"$f":"IF('Lotto2 DL580 Prest 3'!$D$53=Riepilogo!W99,'Lotto2 DL580 Prest 3'!$C$53,0)","v":0},0,0,0,0,0,0,0,0,0,0,0,0,null,0]
[null,"","",null,null,null,"",null,null,"",null,null,null,null,null,null,null,"",null,{"$f":"IF(B100=\"\",\"\",R100*B100)","v":""},null,0,"TS1-874-006894",{"$f":"IF('Lotto2 DL560 Gen10 1'!$D$56=Riepilogo!W100,'Lotto2 DL560 Gen10 1'!$C$56,0)","v":0},{"$f":"IF('Lotto2 DL560 Gen10 2'!$D$56=Riepilogo!W100,'Lotto2 DL560 Gen10 2'!$C$56,0)","v":0},{"$f":"IF('Lotto2 DL560 Gen10 3'!$D$56=Riepilogo!W100,'Lotto2 DL560 Gen10 3'!$C$56,0)","v":0},{"$f":"IF('Lotto2 DL580 1'!$D$53=Riepilogo!W100,'Lotto2 DL580 1'!$C$53,0)","v":0},{"$f":"IF('Lotto2 DL580 2'!$D$53=Riepilogo!W100,'Lotto2 DL580 2'!$C$53,0)","v":0},{"$f":"IF('Lotto2 DL580 3'!$D$53=Riepilogo!W100,'Lotto2 DL580 3'!$C$53,0)","v":0},{"$f":"IF('Lotto2 DL580 Prest 1'!$D$53=Riepilogo!W100,'Lotto2 DL580 Prest 1'!$C$53,0)","v":0},{"$f":"IF('Lotto2 DL580 Prest 2'!$D$53=Riepilogo!W100,'Lotto2 DL580 Prest 2'!$C$53,0)","v":0},{"$f":"IF('Lotto2 DL580 Prest 3'!$D$53=Riepilogo!W100,'Lotto2 DL580 Prest 3'!$C$53,0)","v":0},0,0,0,0,0,0,0,0,0,0,0,0,null,0]
[null,"","",null,null,null,"",null,null,"",null,null,null,null,null,null,null,"",null,{"$f":"IF(B101=\"\",\"\",R101*B101)","v":""},null,0,"TS1-874-006884",{"$f":"IF('Lotto2 DL560 Gen10 1'!$D$56=Riepilogo!W101,'Lotto2 DL560 Gen10 1'!$C$56,0)","v":0},{"$f":"IF('Lotto2 DL560 Gen10 2'!$D$56=Riepilogo!W101,'Lotto2 DL560 Gen10 2'!$C$56,0)","v":0},{"$f":"IF('Lotto2 DL560 Gen10 3'!$D$56=Riepilogo!W101,'Lotto2 DL560 Gen10 3'!$C$56,0)","v":0},{"$f":"IF('Lotto2 DL580 1'!$D$53=Riepilogo!W101,'Lotto2 DL580 1'!$C$53,0)","v":0},{"$f":"IF('Lotto2 DL580 2'!$D$53=Riepilogo!W101,'Lotto2 DL580 2'!$C$53,0)","v":0},{"$f":"IF('Lotto2 DL580 3'!$D$53=Riepilogo!W101,'Lotto2 DL580 3'!$C$53,0)","v":0},{"$f":"IF('Lotto2 DL580 Prest 1'!$D$53=Riepilogo!W101,'Lotto2 DL580 Prest 1'!$C$53,0)","v":0},{"$f":"IF('Lotto2 DL580 Prest 2'!$D$53=Riepilogo!W101,'Lotto2 DL580 Prest 2'!$C$53,0)","v":0},{"$f":"IF('Lotto2 DL580 Prest 3'!$D$53=Riepilogo!W101,'Lotto2 DL580 Prest 3'!$C$53,0)","v":0},0,0,0,0,0,0,0,0,0,0,0,0,null,0]
[null,"","",null,null,null,"",null,null,"",null,null,null,null,null,null,null,"",null,{"$f":"IF(B102=\"\",\"\",R102*B102)","v":""},null,0,"TS1-874-006895",{"$f":"IF('Lotto2 DL560 Gen10 1'!$D$56=Riepilogo!W102,'Lotto2 DL560 Gen10 1'!$C$56,0)","v":0},{"$f":"IF('Lotto2 DL560 Gen10 2'!$D$56=Riepilogo!W102,'Lotto2 DL560 Gen10 2'!$C$56,0)","v":0},{"$f":"IF('Lotto2 DL560 Gen10 3'!$D$56=Riepilogo!W102,'Lotto2 DL560 Gen10 3'!$C$56,0)","v":0},{"$f":"IF('Lotto2 DL580 1'!$D$53=Riepilogo!W102,'Lotto2 DL580 1'!$C$53,0)","v":0},{"$f":"IF('Lotto2 DL580 2'!$D$53=Riepilogo!W102,'Lotto2 DL580 2'!$C$53,0)","v":0},{"$f":"IF('Lotto2 DL580 3'!$D$53=Riepilogo!W102,'Lotto2 DL580 3'!$C$53,0)","v":0},{"$f":"IF('Lotto2 DL580 Prest 1'!$D$53=Riepilogo!W102,'Lotto2 DL580 Prest 1'!$C$53,0)","v":0},{"$f":"IF('Lotto2 DL580 Prest 2'!$D$53=Riepilogo!W102,'Lotto2 DL580 Prest 2'!$C$53,0)","v":0},{"$f":"IF('Lotto2 DL580 Prest 3'!$D$53=Riepilogo!W102,'Lotto2 DL580 Prest 3'!$C$53,0)","v":0},0,0,0,0,0,0,0,0,0,0,0,0,null,0]
[null,"","",null,null,null,{"$f":"IF(AT103>0,W103,\"\")","v":""},null,null,{"$f":"IF(AT103>0,(VLOOKUP(G103,COD_A,5,FALSE)),\"\")","v":""},null,null,null,null,null,null,null,{"$f":"IF(AT103>0,(VLOOKUP(G103,COD_A,3,FALSE)),\"\")","v":""},null,{"$f":"IF(B103=\"\",\"\",R103*B103)","v":""},null,0,"S2-872235-B21",{"$f":"'Lotto2 DL560 Gen10 1'!$C$64","v":0},{"$f":"'Lotto2 DL560 Gen10 2'!$C$64","v":0},{"$f":"'Lotto2 DL560 Gen10 3'!$C$64","v":0},null,null,null,null,null,null,{"$f":"SUM(X103:Z103)","v":0},{"$f":"SUM(AA103:AC103)","v":0},{"$f":"SUM(AD103:AF103)","v":0},{"$f":"X103*$X$14","v":0},{"$f":"Y103*$Y$14","v":0},{"$f":"Z103*$Z$14","v":0},{"$f":"AA103*$X$32","v":0},{"$f":"AB103*$Y$32","v":0},{"$f":"AC103*$Z$32","v":0},{"$f":"AD103*$X$50","v":0},{"$f":"AE103*$Y$50","v":0},{"$f":"AF103*$Z$50","v":0},null,{"$f":"SUM(AJ103:AS103)","v":0}]
[null,"","",null,null,null,"",null,null,"",null,null,null,null,null,null,null,"",null,"",null,{"$f":"IF(B104>=\"\",0,1)","v":0},"S2-872233-B21",{"$f":"'Lotto2 DL560 Gen10 1'!$C$66","v":0},{"$f":"'Lotto2 DL560 Gen10 2'!$C$66","v":0},{"$f":"'Lotto2 DL560 Gen10 3'!$C$66","v":0},null,null,null,null,null,null,0,0,0,0,0,0,0,0,0,0,0,0,null,0]
[null,"","",null,null,null,"",null,null,"",null,null,null,null,null,null,null,"",null,"",null,0,"S2-870548-B21",{"$f":"'Lotto2 DL560 Gen10 1'!$C$108","v":0},{"$f":"'Lotto2 DL560 Gen10 2'!$C$108","v":0},{"$f":"'Lotto2 DL560 Gen10 3'!$C$108","v":0},null,null,null,null,null,null,{"$f":"SUM(X105:Z105)","v":0},{"$f":"SUM(AA105:AC105)","v":0},{"$f":"SUM(AD105:AF105)","v":0},{"$f":"X105*$X$14","v":0},{"$f":"Y105*$Y$14","v":0},{"$f":"Z105*$Z$14","v":0},{"$f":"AA105*$X$32","v":0},{"$f":"AB105*$Y$32","v":0},{"$f":"AC105*$Z$32","v":0},{"$f":"AD105*$X$50","v":0},{"$f":"AE105*$Y$50","v":0},{"$f":"AF105*$Z$50","v":0},null,{"$f":"SUM(AJ105:AS105)","v":0}]
[null,"","",null,null,null,"",null,null,"",null,null,null,null,null,null,null,"",null,"",null,0,"S2-872253-B21",{"$f":"'Lotto2 DL560 Gen10 1'!$C$112","v":0},{"$f":"'Lotto2 DL560 Gen10 2'!$C$110","v":0},{"$f":"'Lotto2 DL560 Gen10 3'!$C$110","v":0},null,null,null,null,null,null,0,0,0,{"$f":"X106*$X$14","v":0},{"$f":"Y106*$Y$14","v":0},{"$f":"Z106*$Z$14","v":0},{"$f":"AA106*$X$32","v":0},{"$f":"AB106*$Y$32","v":0},{"$f":"AC106*$Z$32","v":0},{"$f":"AD106*$X$50","v":0},{"$f":"AE106*$Y$50","v":0},{"$f":"AF106*$Z$50","v":0},null,{"$f":"SUM(AJ106:AS106)","v":0}]
[null,"","",null,null,null,{"$f":"IF(AT107>0,W107,\"\")","v":""},null,null,{"$f":"IF(AT107>0,(VLOOKUP(G107,COD_A,5,FALSE)),\"\")","v":""},null,null,null,null,null,null,null,{"$f":"IF(AT107>0,(VLOOKUP(G107,COD_A,3,FALSE)),\"\")","v":""},null,"",null,0,"S2-873444-B21",{"$f":"IF('Lotto2 DL560 Gen10 1'!$C$73=\"\",0,1)","v":0},{"$f":"IF('Lotto2 DL560 Gen10 2'!$C$73=\"\",0,1)","v":0},{"$f":"IF('Lotto2 DL560 Gen10 3'!$C$73=\"\",0,1)","v":0},null,null,null,null,null,null,0,0,0,0,0,0,0,0,0,0,0,0,null,0]
[null,"","",null,null,null,{"$f":"IF(AT108>0,W108,\"\")","v":""},null,null,"",null,null,null,null,null,null,null,"",null,"",null,0,"S2-871168-A21",null,null,null,null,null,null,{"$f":"IF('Lotto2 DL580 Prest 1'!D45=Riepilogo!$W$108,'Lotto2 DL580 Prest 1'!$C$45,0)","v":0},{"$f":"IF('Lotto2 DL580 Prest 2'!D45=Riepilogo!$W$108,'Lotto2 DL580 Prest 2'!$C$45,0)","v":0},{"$f":"IF('Lotto2 DL580 Prest 3'!D45=Riepilogo!$W$108,'Lotto2 DL580 Prest 3'!$C$45,0)","v":0},0,0,0,0,0,0,0,0,0,0,0,0,null,0]
[null,"","",null,null,null,"",null,null,"",null,null,null,null,null,null,null,"",null,"",null,0,null,null,null,null,null,null,null,null,null,null,null,null,null,0,0,0,0,0,0,0,0,0,null,0]
[null,{"$f":"IF('RACK, Accessori e Servizi'!J18=0,\"\",'RACK, Accessori e Servizi'!J18)","v":""},{"$f":"IF(B110=\"\",\"\",(VLOOKUP(G110,COD_A,2,FALSE)))","v":""},null,null,null,{"$f":"IF(B110=\"\",\"\",W110)","v":""},null,null,{"$f":"IF(B110=\"\",\"\",(VLOOKUP(G110,COD_A,5,FALSE)))","v":""},null,null,null,null,null,null,null,{"$f":"IF(B110=\"\",\"\",(VLOOKUP(G110,COD_A,3,FALSE)))","v":""},null,"",null,0,"TS1-646861"]
[null,{"$f":"IF('RACK, Accessori e Servizi'!J21=0,\"\",'RACK, Accessori e Servizi'!J21)","v":""},{"$f":"IF(B111=\"\",\"\",(VLOOKUP(G111,COD_A,2,FALSE)))","v":""},null,null,null,{"$f":"IF(B111=\"\",\"\",W111)","v":""},null,null,"",null,null,null,null,null,null,null,"",null,{"$f":"IF(B111=\"\",\"\",R111*B111)","v":""},null,0,"TS1-646875",null,null,null,"580-alt 1","580-alt 2","580-alt 3","580-pre 1","580-pre 2","580-pre 3"]
[null,"",{"$f":"IF(AT112=0,\"\",(VLOOKUP(G112,COD_A,2,FALSE)))","v":""},null,null,null,{"$f":"IF(B112=\"\",\"\",W112)","v":""},null,null,"",null,null,null,null,null,null,null,"",null,{"$f":"IF(B112=\"\",\"\",R112*B112)","v":""},null,0,"S2-9SlotRiser",null,null,null,{"$f":"IF('Lotto2 DL580 1'!$G$97+'Lotto2 DL580 1'!$G$98>0,1,0)","v":0},{"$f":"IF('Lotto2 DL580 2'!$G$97+'Lotto2 DL580 2'!$G$98>0,1,0)","v":0},{"$f":"IF('Lotto2 DL580 3'!$G$97+'Lotto2 DL580 3'!$G$98>0,1,0)","v":0},null,null,null,{"$f":"SUM(X112:Z112)","v":0},{"$f":"SUM(AA112:AC112)","v":0},{"$f":"SUM(AD112:AF112)","v":0},{"$f":"X112*$X$14","v":0},{"$f":"Y112*$Y$14","v":0},{"$f":"Z112*$Z$14","v":0},{"$f":"AA112*$X$32","v":0},{"$f":"AB112*$Y$32","v":0},{"$f":"AC112*$Z$32","v":0},{"$f":"AD112*$X$50","v":0},{"$f":"AE112*$Y$50","v":0},{"$f":"AF112*$Z$50","v":0},null,{"$f":"SUM(AJ112:AS112)","v":0}]
[null,"","",null,null,null,"",null,null,"",null,null,null,null,null,null,null,"",null,"",null,0,"S2-48HDDbay",null,null,null,{"$f":"'Lotto2 DL580 1'!$C$60","v":0},{"$f":"'Lotto2 DL580 2'!$C$60","v":0},{"$f":"'Lotto2 DL580 3'!$C$60","v":0},{"$f":"'Lotto2 DL580 Prest 1'!$C$60","v":0},{"$f":"'Lotto2 DL580 Prest 2'!$C$60","v":0},{"$f":"'Lotto2 DL580 Prest 3'!$C$60","v":0},0,0,0,0,0,0,0,0,0,0,0,0,null,0]
[null,"","",null,null,null,{"$f":"IF(B114=\"\",\"\",W114)","v":""},null,null,"",null,null,null,null,null,null,null,"",null,{"$f":"IF(B114=\"\",\"\",R114*B114)","v":""},null,{"$f":"IF(B114>=\"\",0,1)","v":0},"S2-PwrSply2",null,null,null,{"$f":"IF(AA112>=1,0,'Lotto2 DL580 1'!$C$90/2-1)","v":0},{"$f":"IF(AB112>=1,0,'Lotto2 DL580 2'!$C$90/2-1)","v":0},{"$f":"IF(AC112>=1,0,'Lotto2 DL580 3'!$C$90/2-1)","v":0},{"$f":"'Lotto2 DL580 Prest 1'!$C$91/2","v":0},{"$f":"'Lotto2 DL580 Prest 2'!$C$91/2","v":0},{"$f":"'Lotto2 DL580 Prest 2'!$C$91/2","v":0},{"$f":"SUM(X114:Z114)","v":0},{"$f":"SUM(AA114:AC114)","v":0},{"$f":"SUM(AD114:AF114)","v":0},{"$f":"X114*$X$14","v":0},{"$f":"Y114*$Y$14","v":0},{"$f":"Z114*$Z$14","v":0},{"$f":"AA114*$X$32","v":0},{"$f":"AB114*$Y$32","v":0},{"$f":"AC114*$Z$32","v":0},{"$f":"AD114*$X$50","v":0},{"$f":"AE114*$Y$50","v":0},{"$f":"AF114*$Z$50","v":0},null,{"$f":"SUM(AJ114:AS114)","v":0}]
[null,"","",null,null,null,{"$f":"IF(B115=\"\",\"\",W115)","v":""},null,null,"",null,null,null,null,null,null,null,"",null,{"$f":"IF(B115=\"\",\"\",R115*B115)","v":""},null,{"$f":"IF(B115>=\"\",0,1)","v":0},"TS1-Q0V76A",null,null,null,{"$f":"COUNTIF(AI36:AI48,$W$115)","v":0},{"$f":"COUNTIF(AJ36:AJ48,$W$115)","v":0},{"$f":"COUNTIF(AK36:AK48,$W$115)","v":0},{"$f":"COUNTIF($AI$54:$AI$65,W115)","v":0},{"$f":"COUNTIF($AJ$54:$AJ$65,W115)","v":0},{"$f":"COUNTIF($AK$54:$AK$65,W115)","v":0},null,null,null,null,null,null,{"$f":"AA115*$X$32","v":0},0,{"$f":"AC115*$Z$32","v":0},{"$f":"AD115*$X$50","v":0},0,0,null,0]
[null,"","",null,null,null,"",null,null,"",null,null,null,null,null,null,null,"",null,"",null,0,"TS1-Q0V80A",null,null,null,{"$f":"COUNTIF(AI36:AI48,$W$116)","v":0},{"$f":"COUNTIF(AJ36:AJ48,$W$116)","v":0},{"$f":"COUNTIF(AK36:AK48,$W$116)","v":0},{"$f":"COUNTIF($AI$54:$AI$65,W116)","v":0},{"$f":"COUNTIF($AJ$54:$AJ$65,W116)","v":0},{"$f":"COUNTIF($AK$54:$AK$65,W116)","v":0},null,null,null,null,null,null,0,0,0,0,0,0,null,0]
[null,"","",null,null,null,"",null,null,"",null,null,null,null,null,null,null,"",null,"",null,0,"TS1-Q2N68A",null,null,null,{"$f":"COUNTIF(AI36:AI48,$W$117)","v":0},{"$f":"COUNTIF(AJ36:AJ48,$W$117)","v":0},{"$f":"COUNTIF(AK36:AK48,$W$117)","v":0},0,0,0,null,null,null,null,null,null,0,0,0,0,0,0,null,0]
[null,"","",null,null,null,"",null,null,"",null,null,null,null,null,null,null,"",null,"",null,0,"TS1-871828",null,null,null,{"$f":"'Lotto2 DL580 1'!$C$149","v":0},{"$f":"'Lotto2 DL580 2'!$C$149","v":0},{"$f":"'Lotto2 DL580 3'!$C$149","v":0},{"$f":"'Lotto2 DL580 Prest 1'!$C$145","v":0},{"$f":"'Lotto2 DL580 Prest 2'!$C$145","v":0},{"$f":"'Lotto2 DL580 Prest 3'!$C$145","v":0},null,null,null,null,null,null,0,0,0,0,0,0,null,0]
[null,"","",null,null,null,"",null,null,"",null,null,null,null,null,null,null,"",null,"",null,0,"TS1-871829",null,null,null,{"$f":"'Lotto2 DL580 1'!$C$151","v":0},{"$f":"'Lotto2 DL580 2'!$C$151","v":0},{"$f":"'Lotto2 DL580 3'!$C$151","v":0},{"$f":"'Lotto2 DL580 Prest 1'!$C$147","v":0},{"$f":"'Lotto2 DL580 Prest 2'!$C$147","v":0},{"$f":"'Lotto2 DL580 Prest 3'!$C$147","v":0},null,null,null,null,null,null,0,0,0,0,0,0,null,0]
[null,"","",null,null,null,"",null,null,"",null,null,null,null,null,null,null,"",null,"",null,0,"TS1-P00268",null,null,null,{"$f":"'Lotto2 DL580 1'!$C$153","v":0},{"$f":"'Lotto2 DL580 2'!$C$153","v":0},{"$f":"'Lotto2 DL580 3'!$C$153","v":0},{"$f":"'Lotto2 DL580 Prest 1'!$C$149","v":0},{"$f":"'Lotto2 DL580 Prest 2'!$C$149","v":0},{"$f":"'Lotto2 DL580 Prest 3'!$C$149","v":0},null,null,null,null,null,null,0,0,0,0,0,0,null,0]
[null,"",{"$f":"IF(AT121=0,\"\",(VLOOKUP(G121,COD_A,2,FALSE)))","v":""},null,null,null,{"$f":"IF(B121=\"\",\"\",W121)","v":""},null,null,{"$f":"IF(B121=\"\",\"\",(VLOOKUP(G121,COD_A,5,FALSE)))","v":""},null,null,null,null,null,null,null,{"$f":"IF(B121=\"\",\"\",(VLOOKUP(G121,COD_A,3,FALSE)))","v":""},null,{"$f":"IF(B121=\"\",\"\",R121*B121)","v":""},null,0,"S2-826704",{"$f":"'Lotto2 DL560 Gen10 1'!$C$110","v":0},null,null,null,null,null,null,null,null,null,null,null,{"$f":"X121*$X$14","v":0},{"$f":"Y121*$Y$14","v":0},{"$f":"Z121*$Z$14","v":0},0,0,0,0,0,0,null,0]
[null,"","",null,null,null,"",null,null,"",null,null,null,null,null,null,null,"",null,"",null,0,"TS1-Q0V77A",{"$f":"COUNTIF($AI$18:$AI$25,W122)","v":0},{"$f":"COUNTIF($AJ$18:$AJ$25,W122)","v":0},{"$f":"COUNTIF($AK$18:$AK$25,W122)","v":0},null,null,null,null,null,null,null,null,null,{"$f":"X122*$X$14","v":0},{"$f":"Y122*$Y$14","v":0},{"$f":"Z122*$Z$14","v":0},{"$f":"AA122*$X$32","v":0},{"$f":"AB122*$Y$32","v":0},{"$f":"AC122*$Z$32","v":0},{"$f":"AD122*$X$50","v":0},{"$f":"AE122*$Y$50","v":0},{"$f":"AF122*$Z$50","v":0},null,{"$f":"SUM(AJ122:AS122)","v":0}]
[null,"TOTALE ULTERIORI OPZIONI (I.V.A. Esclusa)",null,null,null,null,null,null,null,null,null,null,null,null,null,null,null,{"$f":"SUM(T89:U122)","v":0},null,null,null,{"$f":"IF(R123>0,1,0)","v":0}]
[null,"TOTALE COSTO (I.V.A. Esclusa)",null,null,null,null,null,null,null,null,null,null,null,null,null,null,null,{"$f":"SUM(T14:U88)","v":0},null,null,null,1]
[null,"I.V.A.",null,null,null,null,null,null,null,null,null,null,null,null,null,null,null,{"$f":"(R124+R123)*22%","v":0},null,null,null,1]
[null,"TOTALE ORDINE",null,null,null,null,null,null,null,null,null,null,null,null,null,null,null,{"$f":"SUM(R123:U125)","v":0},null,null,null,1]
[null,null,null,null,null,null,null,null,null,null,null,null,null,null,null,null,null,null,null,null,null,1]
[null,null,null,null,null,null,null,null,null,null,null,null,null,null,null,null,null,null,null,null,null,1]
[null,null,null,null,null,null,null,null,null,null,null,null,null,null,null,null,null,null,null,null,null,1]
[null,null,null,{"$f":"IF(G6>0,\"DETTAGLIO CONFIGURAZIONI SERVER LOTTO 2 \",\"\")","v":""},null,null,null,null,null,null,null,null,null,null,null,null,null,null,null,null,null,1]
[null,null,null,null,null,null,null,null,null,null,null,null,null,null,null,null,null,null,null,null,null,1]
[null,null,null,null,null,null,null,null,null,null,null,null,null,null,null,null,null,null,null,null,null,1]
[null,null,null,null,null,null,null,null,null,null,null,null,null,null,null,null,null,null,null,null,null,{"$f":"IF($B$14>=\"\",0,1)","v":0}]
[null,"Proliant DL560 Gen10 Conf.1",null,null,{"$f":"SRV_A","v":0},"Server",null,null,"Proliant DL560 Gen10 Conf.2",null,null,{"$f":"SRV_AA","v":0},"Server",null,null,"Proliant DL560 Gen10  Conf.3",null,null,{"$f":"SRV_AAA","v":0},"Server",null,{"$f":"IF($B$14>=\"\",0,1)","v":0}]
[null,null,null,null,null,null,null,null,null,null,null,null,null,null,null,null,null,null,null,null,null,{"$f":"IF($B$14>=\"\",0,1)","v":0}]
[null,{"$f":"IF(SRV_A>0,\"1\",\"-\")","v":"-"},{"$f":"IF(B136=\"-\",\"-\",CONCATENATE(MID($C$14,1,21),\" - \",$G$14))","v":"-"},null,null,null,null,null,{"$f":"IF(SRV_AA>0,\"1\",\"-\")","v":"-"},{"$f":"IF(I136=\"-\",\"-\",CONCATENATE(MID($C$14,1,21),\" - \",$G$14))","v":"-"},null,null,null,null,null,{"$f":"IF(SRV_AAA>0,\"1\",\"-\")","v":"-"},{"$f":"IF(P136=\"-\",\"-\",CONCATENATE(MID($C$14,1,21),\" - \",$G$14))","v":"-"},null,null,null,null,{"$f":"IF($B$14>=\"\",0,1)","v":0}]
[null,{"$f":"IF(X15=0,\"-\",X15)","v":"-"},{"$f":"IF(B137=\"-\",\"-\",CONCATENATE(MID($C$15,1,21),\" - \",$G$15))","v":"-"},null,null,null,null,null,{"$f":"IF(Y15=0,\"-\",Y15)","v":"-"},{"$f":"IF(I137=\"-\",\"-\",CONCATENATE(MID(C15,1,21),\" - \",G15))","v":"-"},null,null,null,null,null,{"$f":"IF(Z15=0,\"-\",Z15)","v":"-"},{"$f":"IF(P137=\"-\",\"-\",CONCATENATE(MID(C15,1,21),\" - \",G15))","v":"-"},null,null,null,null,{"$f":"Z137","v":0},{"$f":"IF(B137=\"-\",0,B137)","v":0},{"$f":"IF(I137=\"-\",0,I137)","v":0},{"$f":"IF(P137=\"-\",0,P137)","v":0},{"$f":"IF(X137+W137+Y137>0,1,0)","v":0}]
[null,"-",{"$f":"IF(B138=\"-\",\"-\",CONCATENATE(MID($C$16,1,21),\" - \",$G$16))","v":"-"},null,null,null,null,null,"-","-",null,null,null,null,null,"-","-",null,null,null,null,{"$f":"Z138","v":0},{"$f":"IF(B138=\"-\",0,B138)","v":0},{"$f":"IF(I138=\"-\",0,I138)","v":0},{"$f":"IF(P138=\"-\",0,P138)","v":0},{"$f":"IF(X138+W138+Y138>0,1,0)","v":0}]
[null,"-",{"$f":"IF(B139=\"-\",\"-\",CONCATENATE(MID($C$17,1,21),\" - \",$G$17))","v":"-"},null,null,null,null,null,"-","-",null,null,null,null,null,"-","-",null,null,null,null,0,0,0,0,0]
[null,"-",{"$f":"IF(B140=\"-\",\"-\",CONCATENATE(MID(C18,1,21),\" - \",G18))","v":"-"},null,null,null,null,null,"-","-",null,null,null,null,null,"-","-",null,null,null,null,0,0,0,0,0]
[null,"-","-",null,null,null,null,null,"-","-",null,null,null,null,null,"-","-",null,null,null,null,0,0,0,0,0]
[null,"-","-",null,null,null,null,null,"-","-",null,null,null,null,null,"-","-",null,null,null,null,0,0,0,0,0]
[null,"-","-",null,null,null,null,null,"-","-",null,null,null,null,null,"-","-",null,null,null,null,0,0,0,0,0]
[null,"-","-",null,null,null,null,null,"-","-",null,null,null,null,null,"-","-",null,null,null,null,0,0,0,0,0]
[null,"-","-",null,null,null,null,null,"-","-",null,null,null,null,null,"-","-",null,null,null,null,0,0,0,0,0]
[null,"-","-",null,null,null,null,null,"-","-",null,null,null,null,null,"-","-",null,null,null,null,0,0,0,0,0]
[null,"-","-",null,null,null,null,null,"-","-",null,null,null,null,null,"-","-",null,null,null,null,0,0,0,0,0]
[null,"-","-",null,null,null,null,null,"-","-",null,null,null,null,null,"-","-",null,null,null,null,0,0,0,0,0]
[null,"-","-",null,null,null,null,null,"-","-",null,null,null,null,null,"-","-",null,null,null,null,0,0,0,0,0]
[null,"-","-",null,null,null,null,null,"-","-",null,null,null,null,null,"-","-",null,null,null,null,0,0,0,0,0]
[null,"-","-",null,null,null,null,null,"-","-",null,null,null,null,null,"-","-",null,null,null,null,0,0,0,0,0]
[null,"-","-",null,null,null,null,null,"-","-",null,null,null,null,null,"-","-",null,null,null,null,0,0,0,0,0]
[null,{"$f":"IF(X71=0,\"-\",X71)","v":"-"},{"$f":"IF(B153=\"-\",\"-\",CONCATENATE(MID(C71,1,21),\" - \",G71))","v":"-"},null,null,null,null,null,{"$f":"IF(Y71=0,\"-\",Y71)","v":"-"},{"$f":"IF(I153=\"-\",\"-\",CONCATENATE(MID(C71,1,21),\" - \",G71))","v":"-"},null,null,null,null,null,{"$f":"IF(Z71=0,\"-\",Z71)","v":"-"},{"$f":"IF(P153=\"-\",\"-\",CONCATENATE(MID(C71,1,21),\" - \",G71))","v":"-"},null,null,null,null,0,0,0,0,0]
[null,"-","-",null,null,null,null,null,"-","-",null,null,null,null,null,"-","-",null,null,null,null,0,0,0,0,0]
[null,"-","-",null,null,null,null,null,"-","-",null,null,null,null,null,"-","-",null,null,null,null,0,0,0,0,0]
[null,"-","-",null,null,null,null,null,"-","-",null,null,null,null,null,"-","-",null,null,null,null,0,0,0,0,0]
[null,"-","-",null,null,null,null,null,"-","-",null,null,null,null,null,"-","-",null,null,null,null,0,0,0,0,0]
[null,"-","-",null,null,null,null,null,"-","-",null,null,null,null,null,"-","-",null,null,null,null,0,0,0,{"$f":"IF(P158=\"-\",0,P158)","v":0},0]
[null,"-","-",null,null,null,null,null,"-","-",null,null,null,null,null,"-","-",null,null,null,null,0,0,0,{"$f":"IF(P159=\"-\",0,P159)","v":0},0]
[null,"-",{"$f":"IF(B160=\"-\",\"-\",CONCATENATE(MID(C78,1,21),\" - \",G78))","v":"-"},null,null,null,null,null,"-",{"$f":"IF(I160=\"-\",\"-\",CONCATENATE(MID(C78,1,21),\" - \",G78))","v":"-"},null,null,null,null,null,"-","-",null,null,null,null,{"$f":"Z160","v":0},{"$f":"IF(B160=\"-\",0,B160)","v":0},{"$f":"IF(I160=\"-\",0,I160)","v":0},{"$f":"IF(P160=\"-\",0,P160)","v":0},{"$f":"IF(X160+W160+Y160>0,1,0)","v":0}]
[null,{"$f":"IF(X86=0,\"-\",X86)","v":"-"},{"$f":"IF(B161=\"-\",\"-\",CONCATENATE(MID($C$86,1,24),\" - \",$G$86))","v":"-"},null,null,null,null,null,{"$f":"IF(Y86=0,\"-\",Y86)","v":"-"},{"$f":"IF(I161=\"-\",\"-\",CONCATENATE(MID(C86,1,24),\" - \",G86))","v":"-"},null,null,null,null,null,{"$f":"IF(Z86=0,\"-\",Z86)","v":"-"},{"$f":"IF(P161=\"-\",\"-\",CONCATENATE(MID(C86,1,24),\" - \",G86))","v":"-"},null,null,null,null,0,0,0,0,0]
[null,"-",{"$f":"IF(B162=\"-\",\"-\",CONCATENATE(MID(C87,1,24),\" - \",G87))","v":"-"},null,null,null,null,null,"-","-",null,null,null,null,null,"-","-",null,null,null,null,0,0,0,0,0]
[null,"-",{"$f":"IF(B163=\"-\",\"-\",CONCATENATE(MID(C88,1,24),\" - \",G88))","v":"-"},null,null,null,null,null,"-","-",null,null,null,null,null,"-","-",null,null,null,null,0,0,0,0,0]
[null,"-",{"$f":"IF(B164=\"-\",\"-\",CONCATENATE(MID(C89,1,24),\" - \",G89))","v":"-"},null,null,null,null,null,"-","-",null,null,null,null,null,"-","-",null,null,null,null,0,0,0,0,0]
[null,"-",{"$f":"IF(B165=\"-\",\"-\",CONCATENATE(MID(C90,1,24),\" - \",G90))","v":"-"},null,null,null,null,null,"-","-",null,null,null,null,null,"-","-",null,null,null,null,0,0,0,0,0]
[null,"-",{"$f":"IF(B166=\"-\",\"-\",CONCATENATE(MID(C91,1,24),\" - \",G91))","v":"-"},null,null,null,null,null,"-","-",null,null,null,null,null,"-","-",null,null,null,null,{"$f":"Z166","v":0},{"$f":"IF(B166=\"-\",0,B166)","v":0},{"$f":"IF(I166=\"-\",0,I166)","v":0},{"$f":"IF(P166=\"-\",0,P166)","v":0},{"$f":"IF(X166+W166+Y166>0,1,0)","v":0}]
[null,{"$f":"IF(X92=0,\"-\",X92)","v":"-"},{"$f":"IF(B167=\"-\",\"-\",CONCATENATE(MID(C92,1,24),\" - \",G92))","v":"-"},null,null,null,null,null,{"$f":"IF(Y92=0,\"-\",Y92)","v":"-"},{"$f":"IF(I167=\"-\",\"-\",CONCATENATE(MID(C92,1,24),\" - \",G92))","v":"-"},null,null,null,null,null,"-",{"$f":"IF(P167=\"-\",\"-\",CONCATENATE(MID(C92,1,24),\" - \",G92))","v":"-"},null,null,null,null,0,{"$f":"IF(B167=\"-\",0,B167)","v":0},{"$f":"IF(I167=\"-\",0,I167)","v":0},{"$f":"IF(P167=\"-\",0,P167)","v":0},{"$f":"IF(X167+W167+Y167>0,1,0)","v":0}]
[null,"-","-",null,null,null,null,null,"-","-",null,null,null,null,null,null," - ",null,null,null,null,0,0,0,0,0]
[null,{"$f":"IF(X94=0,\"-\",X94)","v":"-"},{"$f":"IF(B169=\"-\",\"-\",CONCATENATE(MID(C94,1,24),\" - \",G94))","v":"-"},null,null,null,null,null,{"$f":"IF(Y94=0,\"-\",Y94)","v":"-"},{"$f":"IF(I169=\"-\",\"-\",CONCATENATE(MID(C94,1,24),\" - \",G94))","v":"-"},null,null,null,null,null,{"$f":"IF(Z94=0,\"-\",Z94)","v":"-"},{"$f":"IF(P169=\"-\",\"-\",CONCATENATE(MID(C94,1,24),\" - \",G94))","v":"-"},null,null,null,null,0,0,0,0,0]
[null,"-","-",null,null,null,null,null,"-","-",null,null,null,null,null,"-","-",null,null,null,null,0,0,0,0,0]
[null,"-","-",null,null,null,null,null,"-","-",null,null,null,null,null,"-","-",null,null,null,null,0,0,0,0,0]
[null,"-","-",null,null,null,null,null,"-","-",null,null,null,null,null,"-","-",null,null,null,null,0,0,0,0,0]
[null,"-","-",null,null,null,null,null,"-","-",null,null,null,null,null,"-","-",null,null,null,null,0,0,0,0,0]
[null,"-","-",null,null,null,null,null,"-","-",null,null,null,null,null,"-","-",null,null,null,null,0,0,0,0,0]
[null,"-","-",null,null,null,null,null,"-","-",null,null,null,null,null,"-","-",null,null,null,null,0,0,0,0,0]
[null,"-","-",null,null,null,null,null,"-","-",null,null,null,null,null,"-","-",null,null,null,null,0,0,0,0,0]
[null,"-","-",null,null,null,null,null,"-","-",null,null,null,null,null,"-","-",null,null,null,null,0,0,0,0,0]
[null,"-","-",null,null,null,null,null,"-","-",null,null,null,null,null,"-","-",null,null,null,null,0,0,0,0,0]
[null,"-","-",null,null,null,null,null,"-","-",null,null,null,null,null,"-","-",null,null,null,null,0,0,0,0,0]
[null,"-","-",null,null,null,null,null,"-","-",null,null,null,null,null,"-","-",null,null,null,null,0,0,0,0,0]
[null,"-","-",null,null,null,null,null,"-","-",null,null,null,null,null,"-","-",null,null,null,null,0,0,0,0,0]
[null,"-","-",null,null,null,null,null,"-","-",null,null,null,null,null,"-","-",null,null,null,null,0,0,0,0,0]
[null,{"$f":"IF(X121=0,\"-\",X121)","v":"-"},{"$f":"IF(B183=\"-\",\"-\",CONCATENATE(MID(C121,1,24),\" - \",G121))","v":"-"}]
[null,{"$f":"IF(X122=0,\"-\",X122)","v":"-"},{"$f":"IF(B184=\"-\",\"-\",CONCATENATE(MID(C122,1,24),\" - \",G122))","v":"-"}]
[null,null,null,null,null,null,null,null,null,null,null,null,null,null,null,null,null,null,null,null,null,{"$f":"IF($B$14>=\"\",0,1)","v":0}]
[null,"Configurazione RAID",null,null,null,null,null,null,"Configurazione RAID",null,null,null,null,null,null,"Configurazione RAID",null,null,null,null,null,0]
[null,null,null,null,null,null,null,null,null,null,null,null,null,null,null,null,null,null,null,null,null,0]
[null,{"$f":"'Lotto2 DL560 Gen10 1'!B93","v":"SCRIVERE QUI' LA CONFIGURAZIONE RAID RICHIESTA.\nBASE DL560 Gen10 1\n"},null,null,null,null,null,null,{"$f":"'Lotto2 DL560 Gen10 2'!B93","v":"SCRIVERE QUI' LA CONFIGURAZIONE RAID RICHIESTA.\nBASE DL560 Gen10 2\n"},null,{"$f":"IF(#REF!=0,\"\",'Lotto2 DL580 2'!$B$82)","v":{"$error":"#REF!"}},null,null,null,null,{"$f":"'Lotto2 DL560 Gen10 3'!B93","v":"SCRIVERE QUI' LA CONFIGURAZIONE RAID RICHIESTA.\nBASE DL560 Gen10 3\n"},null,{"$f":"IF(#REF!=0,\"\",'Lotto2 DL580 2'!$B$82)","v":{"$error":"#REF!"}},null,null,null,0]
[null,null,null,null,null,null,null,null,null,null,null,null,null,null,null,null,null,null,null,null,null,0]
[null,null,null,null,null,null,null,null,{"$f":"IF(#REF!=0,\"\",\"Hot spare HDD 300 GB\")","v":{"$error":"#REF!"}},null,null,null,{"$f":"IF(#REF!=0,\"\",'Lotto2 DL580 2'!$C$83)","v":{"$error":"#REF!"}},null,null,{"$f":"IF(#REF!=0,\"\",\"Hot spare HDD 300 GB\")","v":{"$error":"#REF!"}},null,null,null,{"$f":"IF(#REF!=0,\"\",'Lotto2 DL580 2'!$C$83)","v":{"$error":"#REF!"}},null,0]
[null,null,null,null,null,null,null,null,null,null,null,null,null,null,null,null,null,null,null,null,null,0]
[null,null,null,null,null,null,null,null,null,null,null,null,null,null,null,null,null,null,null,null,null,0]
[null,null,null,null,null,null,null,null,{"$f":"IF(#REF!=0,\"\",\"HDD 1000 GB\")","v":{"$error":"#REF!"}},null,{"$f":"IF(#REF!=0,\"\",'Lotto2 DL580 2'!$B$86)","v":{"$error":"#REF!"}},null,null,null,null,{"$f":"IF(#REF!=0,\"\",\"HDD 1000 GB\")","v":{"$error":"#REF!"}},null,{"$f":"IF(#REF!=0,\"\",'Lotto2 DL580 2'!$B$86)","v":{"$error":"#REF!"}},null,null,null,0]
[null,null,null,null,null,null,null,null,null,null,null,null,null,null,null,null,null,null,null,null,null,0]
[null,null,null,null,null,null,null,null,{"$f":"IF(#REF!=0,\"\",\"Hot spare HDD 1000 GB\")","v":{"$error":"#REF!"}},null,null,null,{"$f":"IF(#REF!=0,\"\",'Lotto2 DL580 2'!$C$87)","v":{"$error":"#REF!"}},null,null,{"$f":"IF(#REF!=0,\"\",\"Hot spare HDD 1000 GB\")","v":{"$error":"#REF!"}},null,null,null,{"$f":"IF(#REF!=0,\"\",'Lotto2 DL580 2'!$C$87)","v":{"$error":"#REF!"}},null,0]
[null,null,null,null,null,null,null,null,null,null,null,null,null,null,null,null,null,null,null,null,null,0]
[null,null,null,null,null,null,null,null,null,null,null,null,null,null,null,null,null,null,null,null,null,0]
[null,null,null,null,null,null,null,null,"Note RAID",null,null,null,null,null,null,"Note RAID",null,null,null,null,null,0]
[null,null,null,null,null,null,null,null,{"$f":"IF('Lotto2 DL580 2'!#REF!=0,\"\",'Lotto2 DL580 2'!#REF!)","v":{"$error":"#REF!"}},null,null,null,null,null,null,{"$f":"IF('Lotto2 DL580 2'!#REF!=0,\"\",'Lotto2 DL580 2'!#REF!)","v":{"$error":"#REF!"}},null,null,null,null,null,0]
[null,null,null,null,null,null,null,null,null,null,null,null,null,null,null,null,null,null,null,null,null,0]
[null,null,null,null,null,null,null,null,null,null,null,null,null,null,null,null,null,null,null,null,null,0]
[null,null,null,null,null,null,null,null,{"$f":"IF('Lotto2 DL580 2'!$I$85=0,\"\",'Lotto2 DL580 2'!$I$85)","v":""},null,null,null,null,null,null,{"$f":"IF('Lotto2 DL580 2'!$I$85=0,\"\",'Lotto2 DL580 2'!$I$85)","v":""},null,null,null,null,null,0]
[null,null,null,null,null,null,null,null,null,null,null,null,null,null,null,null,null,null,null,null,null,0]
[null,null,null,null,null,null,null,null,null,null,null,null,null,null,null,null,null,null,null,null,null,0]
[null,null,null,null,null,null,null,null,null,null,null,null,null,null,null,null,null,null,null,null,null,{"$f":"IF($B$14>=\"\",0,1)","v":0},null,null,null,"Calcolo x filtro"]
[null,null,null,null,null,null,null,null,null,null,null,null,null,null,null,null,null,null,null,null,null,{"$f":"IF($AA$206=0,0,1)","v":0},null,null,null,null,{"$f":"S207+L207+E207","v":0}]
[null,"Proliant DL580 Gen10 Conf.1",null,null,{"$f":"SRV_B","v":0},"Server",null,null,"Proliant DL580 Gen10 Conf.2",null,null,{"$f":"SRV_BB","v":0},"Server",null,null,"Proliant DL580 Gen10 Conf.3",null,null,{"$f":"SRV_BBB","v":0},"Server",null,{"$f":"IF($AA$206=0,0,1)","v":0},"DL580 1","DL580 2","DL580 3"]
[null,null,null,null,null,null,null,null,null,null,null,null,null,null,null,null,null,null,null,null,null,{"$f":"IF($AA$206=0,0,1)","v":0},"CPU BASE","CPU BASE","CPU BASE"]
[null,{"$f":"IF(SRV_B>0,\"1\",\"-\")","v":"-"},{"$f":"IF(B209=\"-\",\"-\",CONCATENATE(MID(C32,1,24),\" - \",G32))","v":"-"},null,null,null,null,null,{"$f":"IF(SRV_BB>0,\"1\",\"-\")","v":"-"},{"$f":"IF(I209=\"-\",\"-\",CONCATENATE(MID(C32,1,24),\" - \",G32))","v":"-"},null,null,null,null,null,{"$f":"IF(SRV_BBB>0,\"1\",\"-\")","v":"-"},{"$f":"IF(P209=\"-\",\"-\",CONCATENATE(MID(C32,1,24),\" - \",G32))","v":"-"},null,null,null,null,{"$f":"IF($AA$206=0,0,1)","v":0},{"$f":"IF(B209=\"-\",0,2)","v":0},{"$f":"IF(I209=\"-\",0,2)","v":0},{"$f":"IF(P209=\"-\",0,2)","v":0}]
[null,{"$f":"IF(X33=0,\"-\",X33)","v":"-"},"-",null,null,null,null,null,{"$f":"IF(Y33=0,\"-\",Y33)","v":"-"},"-",null,null,null,null,null,{"$f":"IF(Z33=0,\"-\",Z33)","v":"-"},"-",null,null,null,null,{"$f":"IF(AA210=0,0,1)","v":0},"CPU AGGIUNTIVE",null,null,null,{"$f":"SUM(AB210:AD210)","v":0},{"$f":"IF(B210=\"-\",0,1)","v":0},{"$f":"IF(I210=\"-\",0,1)","v":0},{"$f":"IF(P210=\"-\",0,1)","v":0}]
[null,"-","-",null,null,null,null,null,"-","-",null,null,null,null,null,"-","-",null,null,null,null,{"$f":"IF(AA211=0,0,1)","v":0},{"$f":"'Lotto2 DL580 1'!$C$27","v":0},{"$f":"'Lotto2 DL580 2'!$C$27","v":0},{"$f":"'Lotto2 DL580 3'!$C$27","v":0},null,{"$f":"SUM(AB211:AD211)","v":0},{"$f":"IF(B211=\"-\",0,1)","v":0},{"$f":"IF(I211=\"-\",0,1)","v":0},{"$f":"IF(P211=\"-\",0,1)","v":0}]
[null,"-","-",null,null,null,null,null,"-","-",null,null,null,null,null,"-","-",null,null,null,null,0,null,null,null,null,0,0,0,0]
[null,"-","-",null,null,null,null,null,"-","-",null,null,null,null,null,"-","-",null,null,null,null,0,"Memory Slot",null,null,null,0,0,0,0]
[null,"-","-",null,null,null,null,null,"-","-",null,null,null,null,null,"-","-",null,null,null,null,0,null,{"$f":"'Lotto2 DL580 2'!$C$30","v":""},{"$f":"'Lotto2 DL580 3'!$C$30","v":""},null,0,0,0,0]
[null,"-","-",null,null,null,null,null,"-","-",null,null,null,null,null,"-","-",null,null,null,null,0,null,null,null,null,0,0,0,0]
[null,"-","-",null,null,null,null,null,"-","-",null,null,null,null,null,"-","-",null,null,null,null,0,null,{"$f":"SUM(X209:X214)","v":0},{"$f":"SUM(Y209:Y214)","v":0},null,0,0,0,0]
[null,"-","-",null,null,null,null,null,"-","-",null,null,null,null,null,"-","-",null,null,null,null,0,null,{"$f":"IF(X216=W226,X226,IF(X216=W225,X225,IF(X216=W224,X224,IF(X216=W223,X223,\"-\"))))","v":"-"},{"$f":"IF(Y216=W226,X226,IF(Y216=W225,X225,IF(Y216=W224,X224,IF(Y216=W223,X223,\"-\"))))","v":"-"},null,0,0,0,0]
[null,"-","-",null,null,null,null,null,"-","-",null,null,null,null,null,"-","-",null,null,null,null,0,null,{"$f":"IF(X216=W226,Y226,IF(X216=W225,Y225,IF(X216=W224,Y224,IF(X216=W223,Y223,\"-\"))))","v":"-"},{"$f":"IF(Y216=W226,Y226,IF(Y216=W225,Y225,IF(Y216=W224,Y224,IF(Y216=W223,Y223,\"-\"))))","v":"-"},null,0,0,0,0]
[null,"-","-",null,null,null,null,null,"-","-",null,null,null,null,null,"-","-",null,null,null,null,0,null,null,null,null,0,0,0,0]
[null,"-","-",null,null,null,null,null,"-","-",null,null,null,null,null,"-","-",null,null,null,null,0,null,null,null,null,0,0,0,0]
[null,"-","-",null,null,null,null,null,"-","-",null,null,null,null,null,"-","-",null,null,null,null,0,null,null,null,null,0,0,0,0]
[null,"-","-",null,null,null,null,null,"-","-",null,null,null,null,null,"-","-",null,null,null,null,0,null,null,null,null,0,0,0,0]
[null,"-","-",null,null,null,null,null,"-","-",null,null,null,null,null,"-","-",null,null,null,null,0,12,"TS1L2-ALT-4","TS1L2-CPU-580-4",null,0,0,0,0]
[null,"-","-",null,null,null,null,null,"-","-",null,null,null,null,null,"-","-",null,null,null,null,0,8,"TS1L2-ALT-2","TS1L2-CPU-580-2",null,0,0,0,0]
[null,"-","-",null,null,null,null,null,"-","-",null,null,null,null,null,"-","-",null,null,null,null,0,6,"TS1L2-ALT-4",null,null,0,0,0,0]
[null,{"$f":"IF(AA71=0,\"-\",AA71)","v":"-"},{"$f":"IF(B226=\"-\",\"-\",CONCATENATE(MID(C71,1,24),\" - \",G71))","v":"-"},null,null,null,null,null,{"$f":"IF(AB71=0,\"-\",AB71)","v":"-"},{"$f":"IF(I226=\"-\",\"-\",CONCATENATE(MID(C71,1,24),\" - \",G71))","v":"-"},null,null,null,null,null,{"$f":"IF(AC71=0,\"-\",AC71)","v":"-"},{"$f":"IF(P226=\"-\",\"-\",CONCATENATE(MID(C71,1,24),\" - \",G71))","v":"-"},null,null,null,null,0,4,"TS1L2-ALT-2",null,null,0,0,0,0]
[null,"-","-",null,null,null,null,null,"-","-",null,null,null,null,null,"-","-",null,null,null,null,0,null,null,null,null,0,0,0,0]
[null,"-","-",null,null,null,null,null,"-","-",null,null,null,null,null,"-","-",null,null,null,null,0,null,null,null,null,0,0,0,0]
[null,"-","-",null,null,null,null,null,"-","-",null,null,null,null,null,"-","-",null,null,null,null,0,null,null,null,null,0,0,0,0]
[null,"-","-",null,null,null,null,null,"-","-",null,null,null,null,null,"-","-",null,null,null,null,0,null,null,null,null,0,0,0,0]
[null,"-","-",null,null,null,null,null,"-","-",null,null,null,null,null,"-","-",null,null,null,null,0,null,null,null,null,0,0,0,0]
[null,"-","-",null,null,null,null,null,"-","-",null,null,null,null,null,"-","-",null,null,null,null,0,null,null,null,null,0,0,0,0]
[null,"-","-",null,null,null,null,null,"-","-",null,null,null,null,null,"-","-",null,null,null,null,0,null,null,null,null,0,0,0,0]
[null,{"$f":"IF(AA86=0,\"-\",AA86)","v":"-"},{"$f":"IF(B234=\"-\",\"-\",CONCATENATE(MID(C86,1,24),\" - \",G86))","v":"-"},null,null,null,null,null,{"$f":"IF(AB86=0,\"-\",AB86)","v":"-"},{"$f":"IF(I234=\"-\",\"-\",CONCATENATE(MID(C86,1,24),\" - \",G86))","v":"-"},null,null,null,null,null,{"$f":"IF(AC86=0,\"-\",AC86)","v":"-"},{"$f":"IF(P234=\"-\",\"-\",CONCATENATE(MID(C86,1,24),\" - \",G86))","v":"-"},null,null,null,null,0,null,null,null,null,0,0,0,0]
[null,{"$f":"IF(AA88=0,\"-\",AA88)","v":"-"},{"$f":"IF(B235=\"-\",\"-\",CONCATENATE(MID(C88,1,24),\" - \",G88))","v":"-"},null,null,null,null,null,{"$f":"IF(AB88=0,\"-\",AB88)","v":"-"},{"$f":"IF(I235=\"-\",\"-\",CONCATENATE(MID(C88,1,24),\" - \",G88))","v":"-"},null,null,null,null,null,{"$f":"IF(AC88=0,\"-\",AC88)","v":"-"},{"$f":"IF(P235=\"-\",\"-\",CONCATENATE(MID(C88,1,24),\" - \",G88))","v":"-"},null,null,null,null,0,null,null,null,null,0,0,0,0]
[null,{"$f":"IF(AA89=0,\"-\",AA89)","v":"-"},{"$f":"IF(B236=\"-\",\"-\",CONCATENATE(MID(C89,1,24),\" - \",G89))","v":"-"},null,null,null,null,null,{"$f":"IF(AB89=0,\"-\",AB89)","v":"-"},{"$f":"IF(I236=\"-\",\"-\",CONCATENATE(MID(C89,1,24),\" - \",G89))","v":"-"},null,null,null,null,null,{"$f":"IF(AC89=0,\"-\",AC89)","v":"-"},{"$f":"IF(P236=\"-\",\"-\",CONCATENATE(MID(C89,1,24),\" - \",G89))","v":"-"},null,null,null,null,0,null,null,null,null,0,0,0,0]
[null,{"$f":"IF(AA90=0,\"-\",AA90)","v":"-"},{"$f":"IF(B237=\"-\",\"-\",CONCATENATE(MID(C90,1,24),\" - \",G90))","v":"-"},null,null,null,null,null,{"$f":"IF(AB90=0,\"-\",AB90)","v":"-"},{"$f":"IF(I237=\"-\",\"-\",CONCATENATE(MID(C90,1,24),\" - \",G90))","v":"-"},null,null,null,null,null,{"$f":"IF(AC90=0,\"-\",AC90)","v":"-"},{"$f":"IF(P237=\"-\",\"-\",CONCATENATE(MID(C90,1,24),\" - \",G90))","v":"-"},null,null,null,null,0,null,null,null,null,0,0,0,0]
[null,{"$f":"IF(AA91=0,\"-\",AA91)","v":"-"},{"$f":"IF(B238=\"-\",\"-\",CONCATENATE(MID(C91,1,24),\" - \",G91))","v":"-"},null,null,null,null,null,{"$f":"IF(AB91=0,\"-\",AB91)","v":"-"},{"$f":"IF(I238=\"-\",\"-\",CONCATENATE(MID(C91,1,24),\" - \",G91))","v":"-"},null,null,null,null,null,{"$f":"IF(AC91=0,\"-\",AC91)","v":"-"},{"$f":"IF(P238=\"-\",\"-\",CONCATENATE(MID(C91,1,24),\" - \",G91))","v":"-"},null,null,null,null,0,null,null,null,null,{"$f":"SUM(AB238:AD238)","v":0},{"$f":"IF(B238=\"-\",0,1)","v":0},{"$f":"IF(I238=\"-\",0,1)","v":0},{"$f":"IF(P238=\"-\",0,1)","v":0}]
[null,{"$f":"IF(AA92=0,\"-\",AA92)","v":"-"},{"$f":"IF(B239=\"-\",\"-\",CONCATENATE(MID(C92,1,24),\" - \",G92))","v":"-"},null,null,null,null,null,{"$f":"IF(AB92=0,\"-\",AB92)","v":"-"},{"$f":"IF(I239=\"-\",\"-\",CONCATENATE(MID(C92,1,24),\" - \",G92))","v":"-"},null,null,null,null,null,{"$f":"IF(AC92=0,\"-\",AC92)","v":"-"},{"$f":"IF(P239=\"-\",\"-\",CONCATENATE(MID(C92,1,24),\" - \",G92))","v":"-"},null,null,null,null,{"$f":"IF(AA239=0,0,1)","v":0},null,null,null,null,{"$f":"SUM(AB239:AD239)","v":0},{"$f":"IF(B239=\"-\",0,1)","v":0},{"$f":"IF(I239=\"-\",0,1)","v":0},{"$f":"IF(P239=\"-\",0,1)","v":0}]
[null,"-","-",null,null,null,null,null,"-","-",null,null,null,null,null,"-","-",null,null,null,null,0,null,null,null,null,0,0,0,0]
[null,{"$f":"IF(AA94=0,\"-\",AA94)","v":"-"},{"$f":"IF(B241=\"-\",\"-\",CONCATENATE(MID(C94,1,24),\" - \",G94))","v":"-"},null,null,null,null,null,{"$f":"IF(AB94=0,\"-\",AB94)","v":"-"},{"$f":"IF(I241=\"-\",\"-\",CONCATENATE(MID(C94,1,24),\" - \",G94))","v":"-"},null,null,null,null,null,{"$f":"IF(AC94=0,\"-\",AC94)","v":"-"},{"$f":"IF(P241=\"-\",\"-\",CONCATENATE(MID(C94,1,24),\" - \",G94))","v":"-"},null,null,null,null,0,null,null,null,null,0,0,0,0]
[null,"-","-",null,null,null,null,null,"-","-",null,null,null,null,null,"-","-",null,null,null,null,0,null,null,null,null,0,0,0,0]
[null,"-","-",null,null,null,null,null,"-","-",null,null,null,null,null,"-","-",null,null,null,null,0,null,null,null,null,0,0,0,0]
[null,"-","-",null,null,null,null,null,"-","-",null,null,null,null,null,"-","-",null,null,null,null,0,null,null,null,null,0,0,0,0]
[null,"-","-",null,null,null,null,null,"-","-",null,null,null,null,null,"-","-",null,null,null,null,0,null,null,null,null,0,0,0,0]
[null,"-","-",null,null,null,null,null,"-","-",null,null,null,null,null,"-","-",null,null,null,null,0,null,null,null,null,0,0,0,0]
[null,"-","-",null,null,null,null,null,"-","-",null,null,null,null,null,"-","-",null,null,null,null,0,null,null,null,null,0,0,0,0]
[null,"-","-",null,null,null,null,null,"-","-",null,null,null,null,null,"-","-",null,null,null,null,0,null,null,null,null,0,0,0,0]
[null,"-","-",null,null,null,null,null,"-","-",null,null,null,null,null,"-","-",null,null,null,null,0,null,null,null,null,0,0,0,0]
[null,"-","-",null,null,null,null,null,"-","-",null,null,null,null,null,"-","-",null,null,null,null,0,null,null,null,null,0,0,0,0]
[null,{"$f":"IF(AA112=0,\"-\",AA112)","v":"-"},{"$f":"IF(B251=\"-\",\"-\",CONCATENATE(MID(C112,1,24),\" - \",G112))","v":"-"},null,null,null,null,null,{"$f":"IF(AB112=0,\"-\",AB112)","v":"-"},{"$f":"IF(I251=\"-\",\"-\",CONCATENATE(MID(C112,1,24),\" - \",G112))","v":"-"},null,null,null,null,null,{"$f":"IF(AC112=0,\"-\",AC112)","v":"-"},{"$f":"IF(P251=\"-\",\"-\",CONCATENATE(MID(C112,1,24),\" - \",G112))","v":"-"},null,null,null,null,0,null,null,null,null,{"$f":"SUM(AB251:AD251)","v":0},{"$f":"IF(B251=\"-\",0,1)","v":0},{"$f":"IF(I251=\"-\",0,1)","v":0},{"$f":"IF(P251=\"-\",0,1)","v":0}]
[null,"-","-",null,null,null,null,null,"-","-",null,null,null,null,null,"-","-",null,null,null,null,0,null,null,null,null,{"$f":"SUM(AB252:AD252)","v":0},{"$f":"IF(B252=\"-\",0,1)","v":0},{"$f":"IF(I252=\"-\",0,1)","v":0},{"$f":"IF(P252=\"-\",0,1)","v":0}]
[null,"-","-",null,null,null,null,null,"-","-",null,null,null,null,null,"-","-",null,null,null,null,0,null,null,null,null,{"$f":"SUM(AB253:AD253)","v":0},{"$f":"IF(B253=\"-\",0,1)","v":0},{"$f":"IF(I253=\"-\",0,1)","v":0},{"$f":"IF(P253=\"-\",0,1)","v":0}]
[null,"-","-",null,null,null,null,null,"-","-",null,null,null,null,null,"-","-",null,null,null,null,0,null,null,null,null,0,0,0,0]
[null,"-","-",null,null,null,null,null,"-","-",null,null,null,null,null,"-","-",null,null,null,null,0,null,null,null,null,0,0,0,0]
[null,"-","-",null,null,null,null,null,"-","-",null,null,null,null,null,"-","-",null,null,null,null,0,null,null,null,null,0,0,0,0]
[null,"-","-",null,null,null,null,null,"-","-",null,null,null,null,null,"-","-",null,null,null,null,0,null,null,null,null,0,0,0,0]
[null,"-","-",null,null,null,null,null,"-","-",null,null,null,null,null,"-","-",null,null,null,null,0,null,null,null,null,0,0,0,0]
[null,"-","-",null,null,null,null,null,"-","-",null,null,null,null,null,"-","-",null,null,null,null,0,null,null,null,null,0,0,0,0]
[null,{"$f":"IF(AA113=0,\"-\",AA113)","v":"-"},{"$f":"IF(B260=\"-\",\"-\",CONCATENATE(MID(C113,1,24),\" - \",G113))","v":"-"},null,null,null,null,null,{"$f":"IF(AB113=0,\"-\",AB113)","v":"-"},{"$f":"IF(I260=\"-\",\"-\",CONCATENATE(MID(C113,1,24),\" - \",G113))","v":"-"},null,null,null,null,null,{"$f":"IF(AC113=0,\"-\",AC113)","v":"-"},{"$f":"IF(P260=\"-\",\"-\",CONCATENATE(MID(C113,1,24),\" - \",G113))","v":"-"},null,null,null,null,0,null,null,null,null,0,0,0,0]
[null,null,null,null,null,null,null,null,null,null,null,null,null,null,null,null,null,null,null,null,null,{"$f":"IF($AA$206=0,0,1)","v":0}]
[null,"Configurazione RAID",null,null,null,null,null,null,"Configurazione RAID",null,null,null,null,null,null,"Configurazione RAID",null,null,null,null,null,0]
[null,null,null,null,null,null,null,null,null,null,null,null,null,null,null,null,null,null,null,null,null,0]
[null,{"$f":"'Lotto2 DL580 1'!B81","v":"SCRIVERE QUI' LA CONFIGURAZIONE RAID RICHIESTA.\nBASE ALTERNATIVO DL580 1"},null,null,null,null,null,null,{"$f":"'Lotto2 DL580 2'!B81","v":"SCRIVERE QUI' LA CONFIGURAZIONE RAID RICHIESTA.\nBASE ALTERNATIVO DL580 2\n"},null,{"$f":"IF(Y32=0,\"\",'Lotto2 DL580 2'!$B$82)","v":""},null,null,null,null,{"$f":"'Lotto2 DL580 3'!B81","v":"SCRIVERE QUI' LA CONFIGURAZIONE RAID RICHIESTA.\nBASE ALTERNATIVO DL580 3\n"},null,{"$f":"IF(Z32=0,\"\",'Lotto2 DL580 3'!$B$82)","v":""},null,null,null,0]
[null,null,null,null,null,null,null,null,null,null,null,null,null,null,null,null,null,null,null,null,null,0]
[null,null,null,null,null,null,null,null,{"$f":"IF(Y32=0,\"\",\"Hot spare HDD 300 GB\")","v":""},null,null,null,{"$f":"IF(Y32=0,\"\",'Lotto2 DL580 2'!$C$83)","v":""},null,null,{"$f":"IF(Z32=0,\"\",\"Hot spare HDD 300 GB\")","v":""},null,null,null,{"$f":"IF(Z32=0,\"\",'Lotto2 DL580 3'!$C$83)","v":""},null,0]
[null,null,null,null,null,null,null,null,null,null,null,null,null,null,null,null,null,null,null,null,null,0]
[null,null,null,null,null,null,null,null,null,null,null,null,null,null,null,null,null,null,null,null,null,0]
[null,null,null,null,null,null,null,null,{"$f":"IF(Y44=0,\"\",\"HDD 1000 GB\")","v":""},null,{"$f":"IF(Y44=0,\"\",'Lotto2 DL580 2'!$B$86)","v":""},null,null,null,null,{"$f":"IF(Z44=0,\"\",\"HDD 1000 GB\")","v":""},null,{"$f":"IF(Z44=0,\"\",'Lotto2 DL580 3'!$B$86)","v":""},null,null,null,0]
[null,null,null,null,null,null,null,null,null,null,null,null,null,null,null,null,null,null,null,null,null,0]
[null,null,null,null,null,null,null,null,{"$f":"IF(Y44=0,\"\",\"Hot spare HDD 1000 GB\")","v":""},null,null,null,{"$f":"IF(Y44=0,\"\",'Lotto2 DL580 2'!$C$87)","v":""},null,null,{"$f":"IF(Z44=0,\"\",\"Hot spare HDD 1000 GB\")","v":""},null,null,null,{"$f":"IF(Z44=0,\"\",'Lotto2 DL580 3'!$C$87)","v":""},null,0]
[null,null,null,null,null,null,null,null,null,null,null,null,null,null,null,null,null,null,null,null,null,0]
[null,null,null,null,null,null,null,null,null,null,null,null,null,null,null,null,null,null,null,null,null,0]
[null,null,null,null,null,null,null,null,"Note RAID",null,null,null,null,null,null,"Note RAID",null,null,null,null,null,0]
[null,null,null,null,null,null,null,null,{"$f":"IF('Lotto2 DL580 2'!#REF!=0,\"\",'Lotto2 DL580 2'!#REF!)","v":{"$error":"#REF!"}},null,null,null,null,null,null,{"$f":"IF('Lotto2 DL580 3'!$I$80=0,\"\",'Lotto2 DL580 3'!$I$80)","v":""},null,null,null,null,null,0]
[null,null,null,null,null,null,null,null,null,null,null,null,null,null,null,null,null,null,null,null,null,0]
[null,null,null,null,null,null,null,null,null,null,null,null,null,null,null,null,null,null,null,null,null,0]
[null,null,null,null,null,null,null,null,{"$f":"IF('Lotto2 DL580 2'!$I$85=0,\"\",'Lotto2 DL580 2'!$I$85)","v":""},null,null,null,null,null,null,{"$f":"IF('Lotto2 DL580 3'!$I$85=0,\"\",'Lotto2 DL580 3'!$I$85)","v":""},null,null,null,null,null,0]
[null,null,null,null,null,null,null,null,null,null,null,null,null,null,null,null,null,null,null,null,null,0]
[null,null,null,null,null,null,null,null,null,null,null,null,null,null,null,null,null,null,null,null,null,0]
[null,null,null,null,null,null,null,null,null,null,null,null,null,null,null,null,null,null,null,null,null,0]
[null,null,null,null,null,null,null,null,null,null,null,null,null,null,null,null,null,null,null,null,null,{"$f":"IF($AA$282=0,0,1)","v":0},null,null,null,null,{"$f":"S283+L283+E283","v":0}]
[null,"DL580 Gen10 Prest Conf.1",null,null,{"$f":"SRV_C","v":0},"Server",null,null,"DL580 Gen10 Prest Conf.2",null,null,{"$f":"SRV_CC","v":0},"Server",null,null,"DL580 Gen10 Prest Conf.3",null,null,{"$f":"SRV_CCC","v":0},"Server",null,{"$f":"IF($AA$282=0,0,1)","v":0},"DL580 1","DL580 2","DL580 3"]
[null,null,null,null,null,null,null,null,null,null,null,null,null,null,null,null,null,null,null,null,null,0,"CPU BASE","CPU BASE","CPU BASE"]
[null,{"$f":"IF(SRV_C>0,\"1\",\"-\")","v":"-"},{"$f":"IF(B285=\"-\",\"-\",CONCATENATE(MID(C50,1,24),\" - \",G50))","v":"-"},null,null,null,null,null,{"$f":"IF(SRV_CC>0,\"1\",\"-\")","v":"-"},{"$f":"IF(I285=\"-\",\"-\",CONCATENATE(MID(C50,1,24),\" - \",G50))","v":"-"},null,null,null,null,null,{"$f":"IF(SRV_CCC>0,\"1\",\"-\")","v":"-"},{"$f":"IF(P285=\"-\",\"-\",CONCATENATE(MID(C50,1,24),\" - \",G50))","v":"-"},null,null,null,null,0,{"$f":"IF(B285=\"-\",0,2)","v":0},{"$f":"IF(I285=\"-\",0,2)","v":0},{"$f":"IF(P285=\"-\",0,2)","v":0}]
[null,{"$f":"IF(X51=0,\"-\",X51)","v":"-"},"-",null,null,null,null,null,{"$f":"IF(Y51=0,\"-\",Y51)","v":"-"},"-",null,null,null,null,null,{"$f":"IF(Z51=0,\"-\",Z51)","v":"-"},"-",null,null,null,null,{"$f":"IF(AA286=0,0,1)","v":0},"CPU AGGIUNTIVE",null,null,null,{"$f":"SUM(AB286:AD286)","v":0},{"$f":"IF(B286=\"-\",0,1)","v":0},{"$f":"IF(I286=\"-\",0,1)","v":0},{"$f":"IF(P286=\"-\",0,1)","v":0}]
[null,"-","-",null,null,null,null,null,"-","-",null,null,null,null,null,"-","-",null,null,null,null,{"$f":"IF(AA287=0,0,1)","v":0},{"$f":"'Lotto2 DL580 Prest 1'!$C$27","v":0},{"$f":"'Lotto2 DL580 Prest 2'!$C$27","v":0},{"$f":"'Lotto2 DL580 Prest 3'!$C$27","v":0},null,{"$f":"SUM(AB287:AD287)","v":0},{"$f":"IF(B287=\"-\",0,1)","v":0},{"$f":"IF(I287=\"-\",0,1)","v":0},{"$f":"IF(P287=\"-\",0,1)","v":0}]
[null,"-","-",null,null,null,null,null,"-","-",null,null,null,null,null,"-","-",null,null,null,null,0,null,null,null,null,0,0,0,0]
[null,"-","-",null,null,null,null,null,"-","-",null,null,null,null,null,"-","-",null,null,null,null,0,"Memory Slot",null,null,null,0,0,0,0]
[null,"-","-",null,null,null,null,null,"-","-",null,null,null,null,null,"-","-",null,null,null,null,0,{"$f":"'Lotto2 DL580 Prest 1'!$C$30","v":""},{"$f":"'Lotto2 DL580 Prest 2'!$C$30","v":""},{"$f":"'Lotto2 DL580 Prest 3'!$C$30","v":""},null,0,0,0,0]
[null,"-","-",null,null,null,null,null,"-","-",null,null,null,null,null,"-","-",null,null,null,null,0,null,null,null,null,0,0,0,0]
[null,"-","-",null,null,null,null,null,"-","-",null,null,null,null,null,"-","-",null,null,null,null,0,{"$f":"SUM(W285:W290)","v":0},{"$f":"SUM(X285:X290)","v":0},{"$f":"SUM(Y285:Y290)","v":0},null,0,0,0,0]
[null,"-","-",null,null,null,null,null,"-","-",null,null,null,null,null,"-","-",null,null,null,null,0,{"$f":"IF(W292=W302,X302,IF(W292=W301,X301,IF(W292=W300,X300,IF(W292=W299,X299,\"-\"))))","v":"-"},{"$f":"IF(X292=W302,X302,IF(X292=W301,X301,IF(X292=W300,X300,IF(X292=W299,X299,\"-\"))))","v":"-"},{"$f":"IF(Y292=W302,X302,IF(Y292=W301,X301,IF(Y292=W300,X300,IF(Y292=W299,X299,\"-\"))))","v":"-"},null,0,0,0,0]
[null,"-","-",null,null,null,null,null,"-","-",null,null,null,null,null,"-","-",null,null,null,null,0,{"$f":"IF(W292=W302,Y302,IF(W292=W301,Y301,IF(W292=W300,Y300,IF(W292=W299,Y299,\"-\"))))","v":"-"},{"$f":"IF(X292=W302,Y302,IF(X292=W301,Y301,IF(X292=W300,Y300,IF(X292=W299,Y299,\"-\"))))","v":"-"},{"$f":"IF(Y292=W302,Y302,IF(Y292=W301,Y301,IF(Y292=W300,Y300,IF(Y292=W299,Y299,\"-\"))))","v":"-"},null,0,0,0,0]
[null,"-","-",null,null,null,null,null,"-","-",null,null,null,null,null,"-","-",null,null,null,null,0,null,null,null,null,0,0,0,0]
[null,"-","-",null,null,null,null,null,"-","-",null,null,null,null,null,"-","-",null,null,null,null,0,null,null,null,null,0,0,0,0]
[null,"-","-",null,null,null,null,null,"-","-",null,null,null,null,null,"-","-",null,null,null,null,0,null,null,null,null,0,0,0,0]
[null,"-","-",null,null,null,null,null,"-","-",null,null,null,null,null,"-","-",null,null,null,null,0,null,null,null,null,0,0,0,0]
[null,"-","-",null,null,null,null,null,"-","-",null,null,null,null,null,"-","-",null,null,null,null,0,12,"TS1L2-ALT-4","TS1L2-CPU-580-4",null,0,0,0,0]
[null,"-","-",null,null,null,null,null,"-","-",null,null,null,null,null,"-","-",null,null,null,null,0,8,"TS1L2-ALT-2","TS1L2-CPU-580-2",null,0,0,0,0]
[null,"-","-",null,null,null,null,null,"-","-",null,null,null,null,null,"-","-",null,null,null,null,0,6,"TS1L2-ALT-4",null,null,0,0,0,0]
[null,"-","-",null,null,null,null,null,"-","-",null,null,null,null,null,"-","-",null,null,null,null,0,4,"TS1L2-ALT-2",null,null,0,0,0,0]
[null,"-","-",null,null,null,null,null,"-","-",null,null,null,null,null,"-","-",null,null,null,null,0,null,null,null,null,0,0,0,0]
[null,{"$f":"IF(AD71=0,\"-\",AD71)","v":"-"},{"$f":"IF(B304=\"-\",\"-\",CONCATENATE(MID($C$71,1,24),\" - \",$G$71))","v":"-"},null,null,null,null,null,{"$f":"IF(AE71=0,\"-\",AE71)","v":"-"},{"$f":"IF(I304=\"-\",\"-\",CONCATENATE(MID(C71,1,24),\" - \",G71))","v":"-"},null,null,null,null,null,{"$f":"IF(AF71=0,\"-\",AF71)","v":"-"},{"$f":"IF(P304=\"-\",\"-\",CONCATENATE(MID(C71,1,24),\" - \",G71))","v":"-"},null,null,null,null,0,null,null,null,null,0,0,0,0]
[null,"-",{"$f":"IF(B305=\"-\",\"-\",CONCATENATE(MID(C72,1,24),\" - \",G72))","v":"-"},null,null,null,null,null,"-","-",null,null,null,null,null,"-","-",null,null,null,null,0,null,null,null,null,0,0,0,0]
[null,"-","-",null,null,null,null,null,"-","-",null,null,null,null,null,"-","-",null,null,null,null,0,null,null,null,null,0,0,0,0]
[null,"-","-",null,null,null,null,null,"-","-",null,null,null,null,null,"-","-",null,null,null,null,0,null,null,null,null,0,0,0,0]
[null,"-","-",null,null,null,null,null,"-","-",null,null,null,null,null,"-","-",null,null,null,null,0,null,null,null,null,0,0,0,0]
[null,"-","-",null,null,null,null,null,"-","-",null,null,null,null,null,"-","-",null,null,null,null,0,null,null,null,null,0,0,0,0]
[null,"-","-",null,null,null,null,null,"-","-",null,null,null,null,null,"-","-",null,null,null,null,0,null,null,null,null,0,0,0,0]
[null,"-","-",null,null,null,null,null,"-","-",null,null,null,null,null,"-","-",null,null,null,null,0,null,null,null,null,0,0,0,0]
[null,{"$f":"IF(AD86=0,\"-\",AD86)","v":"-"},{"$f":"IF(B312=\"-\",\"-\",CONCATENATE(MID(C86,1,24),\" - \",G86))","v":"-"},null,null,null,null,null,{"$f":"IF(AE86=0,\"-\",AE86)","v":"-"},{"$f":"IF(I312=\"-\",\"-\",CONCATENATE(MID(C86,1,24),\" - \",G86))","v":"-"},null,null,null,null,null,{"$f":"IF(AF86=0,\"-\",AF86)","v":"-"},{"$f":"IF(P312=\"-\",\"-\",CONCATENATE(MID(C86,1,24),\" - \",G86))","v":"-"},null,null,null,null,0,null,null,null,null,0,0,0,0]
[null,{"$f":"IF(AD88=0,\"-\",AD88)","v":"-"},{"$f":"IF(B313=\"-\",\"-\",CONCATENATE(MID(C88,1,24),\" - \",G88))","v":"-"},null,null,null,null,null,{"$f":"IF(AE88=0,\"-\",AE88)","v":"-"},{"$f":"IF(I313=\"-\",\"-\",CONCATENATE(MID(C88,1,24),\" - \",G88))","v":"-"},null,null,null,null,null,{"$f":"IF(AF88=0,\"-\",AF88)","v":"-"},{"$f":"IF(P313=\"-\",\"-\",CONCATENATE(MID(C88,1,24),\" - \",G88))","v":"-"},null,null,null,null,0,null,null,null,null,0,0,0,0]
[null,"-","-",null,null,null,null,null,"-","-",null,null,null,null,null,"-","-",null,null,null,null,0,null,null,null,null,0,0,0,0]
[null,"-","-",null,null,null,null,null,"-","-",null,null,null,null,null,"-","-",null,null,null,null,{"$f":"IF(AA315=0,0,1)","v":0},null,null,null,null,0,0,0,0]
[null,"-","-",null,null,null,null,null,"-","-",null,null,null,null,null,"-","-",null,null,null,null,{"$f":"IF(AA316=0,0,1)","v":0},null,null,null,null,{"$f":"SUM(AB316:AD316)","v":0},{"$f":"IF(B316=\"-\",0,1)","v":0},{"$f":"IF(I316=\"-\",0,1)","v":0},{"$f":"IF(P316=\"-\",0,1)","v":0}]
[null,"-","-",null,null,null,null,null,"-","-",null,null,null,null,null,"-","-",null,null,null,null,{"$f":"IF(AA317=0,0,1)","v":0},null,null,null,null,{"$f":"SUM(AB317:AD317)","v":0},{"$f":"IF(B317=\"-\",0,1)","v":0},{"$f":"IF(I317=\"-\",0,1)","v":0},{"$f":"IF(P317=\"-\",0,1)","v":0}]
[null,"-","-",null,null,null,null,null,"-","-",null,null,null,null,null,"-","-",null,null,null,null,0,null,null,null,null,0,0,0,0]
[null,"-","-",null,null,null,null,null,"-","-",null,null,null,null,null,"-","-",null,null,null,null,0,null,null,null,null,0,0,0,0]
[null,"-","-",null,null,null,null,null,"-","-",null,null,null,null,null,"-","-",null,null,null,null,0,null,null,null,null,0,0,0,0]
[null,"-","-",null,null,null,null,null,"-","-",null,null,null,null,null,"-","-",null,null,null,null,0,null,null,null,null,0,0,0,0]
[null,"-","-",null,null,null,null,null,"-","-",null,null,null,null,null,"-","-",null,null,null,null,0,null,null,null,null,0,0,0,0]
[null,"-","-",null,null,null,null,null,"-","-",null,null,null,null,null,"-","-",null,null,null,null,0,null,null,null,null,0,0,0,0]
[null,"-","-",null,null,null,null,null,"-","-",null,null,null,null,null,"-","-",null,null,null,null,0,null,null,null,null,0,0,0,0]
[null,"-","-",null,null,null,null,null,"-","-",null,null,null,null,null,"-","-",null,null,null,null,0,null,null,null,null,0,0,0,0]
[null,"-","-",null,null,null,null,null,"-","-",null,null,null,null,null,"-","-",null,null,null,null,0,null,null,null,null,0,0,0,0]
[null,"-","-",null,null,null,null,null,"-","-",null,null,null,null,null,"-","-",null,null,null,null,0,null,null,null,null,0,{"$f":"IF(B327=\"-\",0,1)","v":0},{"$f":"IF(I327=\"-\",0,1)","v":0},{"$f":"IF(P327=\"-\",0,1)","v":0}]
[null,{"$f":"IF(AD108=0,\"-\",AD108)","v":"-"},{"$f":"IF(B328=\"-\",\"-\",CONCATENATE(MID(C108,1,24),\" - \",G108))","v":"-"},null,null,null,null,null,{"$f":"IF(AE108=0,\"-\",AE108)","v":"-"},{"$f":"IF(I328=\"-\",\"-\",CONCATENATE(MID(C108,1,24),\" - \",G108))","v":"-"},null,null,null,null,null,{"$f":"IF(AF108=0,\"-\",AF108)","v":"-"},{"$f":"IF(P328=\"-\",\"-\",CONCATENATE(MID(C108,1,24),\" - \",G108))","v":"-"},null,null,null,null,0,null,null,null,null,{"$f":"SUM(AB328:AD328)","v":0},{"$f":"IF(B328=\"-\",0,1)","v":0},{"$f":"IF(I328=\"-\",0,1)","v":0},{"$f":"IF(P328=\"-\",0,1)","v":0}]
[null,{"$f":"IF(AD113=0,\"-\",AD113)","v":"-"},{"$f":"IF(B329=\"-\",\"-\",CONCATENATE(MID(C113,1,24),\" - \",G113))","v":"-"},null,null,null,null,null,{"$f":"IF(AE113=0,\"-\",AE113)","v":"-"},{"$f":"IF(I329=\"-\",\"-\",CONCATENATE(MID(C113,1,24),\" - \",G113))","v":"-"},null,null,null,null,null,{"$f":"IF(AF113=0,\"-\",AF113)","v":"-"},{"$f":"IF(P329=\"-\",\"-\",CONCATENATE(MID(C113,1,24),\" - \",G113))","v":"-"},null,null,null,null,0,null,null,null,null,0,0,0,0]
[null,"-","-",null,null,null,null,null,"-","-",null,null,null,null,null,"-","-",null,null,null,null,0,null,null,null,null,0,0,0,0]
[null,"-","-",null,null,null,null,null,"-","-",null,null,null,null,null,"-","-",null,null,null,null,0,null,null,null,null,{"$f":"SUM(AB331:AD331)","v":0},{"$f":"IF(B331=\"-\",0,1)","v":0},{"$f":"IF(I331=\"-\",0,1)","v":0},{"$f":"IF(P331=\"-\",0,1)","v":0}]
[null,"-","-",null,null,null,null,null,"-","-",null,null,null,null,null,"-","-",null,null,null,null,0,null,null,null,null,0,0,0,0]
[null,"-","-",null,null,null,null,null,"-","-",null,null,null,null,null,"-","-",null,null,null,null,0,null,null,null,null,0,0,0,0]
[null,"-","-",null,null,null,null,null,"-","-",null,null,null,null,null,"-","-",null,null,null,null,0,null,null,null,null,0,0,0,0]
[null,"-","-",null,null,null,null,null,"-","-",null,null,null,null,null,"-","-",null,null,null,null,0,null,null,null,null,0,0,0,0]
[null,"-","-",null,null,null,null,null,"-","-",null,null,null,null,null,"-","-",null,null,null,null,0,null,null,null,null,0,0,0,0]
[null,null,null,null,null,null,null,null,null,null,null,null,null,null,null,null,null,null,null,null,null,{"$f":"IF($AA$282=0,0,1)","v":0}]
[null,"Configurazione RAID",null,null,null,null,null,null,"Configurazione RAID",null,null,null,null,null,null,"Configurazione RAID",null,null,null,null,null,{"$f":"IF($AA$282=0,0,1)","v":0}]
[null,null,null,null,null,null,null,null,null,null,null,null,null,null,null,null,null,null,null,null,null,0]
[null,{"$f":"'Lotto2 DL580 Prest 1'!B81","v":"SCRIVERE QUI' LA CONFIGURAZIONE RAID RICHIESTA.\nDL580 Prestazionale 1"},null,null,null,null,null,null,{"$f":"'Lotto2 DL580 Prest 2'!B81","v":"SCRIVERE QUI' LA CONFIGURAZIONE RAID RICHIESTA.\nDL580 Prestazionale 2"},null,{"$f":"IF(Y99=0,\"\",'Lotto2 DL580 2'!$B$82)","v":""},null,null,null,null,{"$f":"'Lotto2 DL580 Prest 3'!B81","v":"SCRIVERE QUI' LA CONFIGURAZIONE RAID RICHIESTA.\nDL580 Prestazionale 3"},null,{"$f":"IF(Z99=0,\"\",'Lotto2 DL580 3'!$B$82)","v":""},null,null,null,0]
[null,null,null,null,null,null,null,null,null,null,null,null,null,null,null,null,null,null,null,null,null,0]
[null,null,null,null,null,null,null,null,{"$f":"IF(Y99=0,\"\",\"Hot spare HDD 300 GB\")","v":""},null,null,null,{"$f":"IF(Y99=0,\"\",'Lotto2 DL580 2'!$C$83)","v":""},null,null,{"$f":"IF(Z99=0,\"\",\"Hot spare HDD 300 GB\")","v":""},null,null,null,{"$f":"IF(Z99=0,\"\",'Lotto2 DL580 3'!$C$83)","v":""},null,0]
[null,null,null,null,null,null,null,null,null,null,null,null,null,null,null,null,null,null,null,null,null,0]
[null,null,null,null,null,null,null,null,null,null,null,null,null,null,null,null,null,null,null,null,null,0]
[null,null,null,null,null,null,null,null,{"$f":"IF(Y121=0,\"\",\"HDD 1000 GB\")","v":""},null,{"$f":"IF(Y121=0,\"\",'Lotto2 DL580 2'!$B$86)","v":""},null,null,null,null,{"$f":"IF(Z121=0,\"\",\"HDD 1000 GB\")","v":""},null,{"$f":"IF(Z121=0,\"\",'Lotto2 DL580 3'!$B$86)","v":""},null,null,null,0]
[null,null,null,null,null,null,null,null,null,null,null,null,null,null,null,null,null,null,null,null,null,0]
[null,null,null,null,null,null,null,null,{"$f":"IF(Y121=0,\"\",\"Hot spare HDD 1000 GB\")","v":""},null,null,null,{"$f":"IF(Y121=0,\"\",'Lotto2 DL580 2'!$C$87)","v":""},null,null,{"$f":"IF(Z121=0,\"\",\"Hot spare HDD 1000 GB\")","v":""},null,null,null,{"$f":"IF(Z121=0,\"\",'Lotto2 DL580 3'!$C$87)","v":""},null,0]
[null,null,null,null,null,null,null,null,null,null,null,null,null,null,null,null,null,null,null,null,null,0]
[null,null,null,null,null,null,null,null,null,null,null,null,null,null,null,null,null,null,null,null,null,0]
[null,null,null,null,null,null,null,null,"Note RAID",null,null,null,null,null,null,"Note RAID",null,null,null,null,null,0]
[null,null,null,null,null,null,null,null,{"$f":"IF('Lotto2 DL580 2'!#REF!=0,\"\",'Lotto2 DL580 2'!#REF!)","v":{"$error":"#REF!"}},null,null,null,null,null,null,{"$f":"IF('Lotto2 DL580 3'!$I$80=0,\"\",'Lotto2 DL580 3'!$I$80)","v":""},null,null,null,null,null,0]
[null,null,null,null,null,null,null,null,null,null,null,null,null,null,null,null,null,null,null,null,null,0]
[null,null,null,null,null,null,null,null,null,null,null,null,null,null,null,null,null,null,null,null,null,0]
[null,null,null,null,null,null,null,null,{"$f":"IF('Lotto2 DL580 2'!$I$85=0,\"\",'Lotto2 DL580 2'!$I$85)","v":""},null,null,null,null,null,null,{"$f":"IF('Lotto2 DL580 3'!$I$85=0,\"\",'Lotto2 DL580 3'!$I$85)","v":""},null,null,null,null,null,0]
[null,null,null,null,null,null,null,null,null,null,null,null,null,null,null,null,null,null,null,null,null,0]
[null,null,null,null,null,null,null,null,null,null,null,null,null,null,null,null,null,null,null,null,null,0]
[null,null,null,null,null,null,null,null,null,null,null,null,null,null,null,null,null,null,null,null,null,0]
[null,null,null,null,null,null,null,null,null,null,null,null,null,null,null,null,null,null,null,null,null,1]
[null,null,null,null,null,null,null,null,null,null,null,null,null,null,null,null,null,null,null,null,null,1]
[null,null,null,{"$f":"MID(C358,13,5)","v":""},null,{"$f":"MID(E358,13,5)","v":""},null,"",null,"",null,"",null,"",null,"",null,"",null,"",null,1]
[null,null,null,"AREA RISERVATA AL FORNITORE",null,null,null,null,null,null,null,null,null,null,null,null,null,null,null,null,null,1]
[null,null,null,null,null,null,null,null,null,null,null,null,null,null,null,null,null,null,null,null,null,1]
[null,null,null,null,null,null,null,null,null,null,null,null,null,null,null,null,null,null,null,null,null,1]
[null,null,"VERIFICA STAGING",null,null,null,null,null,null,null,null,null,null,null,"VERIFICA INSTALLATORE",null,null,null,null,null,null,1]
[null,null,null,null,null,null,null,null,null,null,null,null,null,null,null,null,null,null,null,null,null,1]
[null,null,null,null,null,null,null,null,null,null,null,null,null,null,null,null,null,null,null,null,null,1]
[null,null,null,null,null,null,null,null,null,null,null,null,null,null,null,null,null,null,null,null,null,1]
[null,null,null,null,null,null,null,null,null,null,null,null,null,null,null,null,null,null,null,null,null,1]

{"sheet":"Lotto2 DL560 Gen10 2","index":5,"n_rows":152,"n_cols":11,"rows_kept":152,"cut":false,"hidden":false,"merged":[[18,2,18,4],[4,0,4,4],[5,0,5,4],[10,0,11,5],[12,0,12,5],[48,1,48,4],[20,1,20,4],[24,2,24,4],[27,1,27,4],[28,2,28,4],[30,1,30,4],[31,2,31,4],[33,1,33,4],[36,1,36,4],[37,2,37,4],[43,1,43,4],[44,2,44,4],[34,2,34,3],[104,2,104,4],[93,8,96,10],[96,1,96,4],[49,2,49,4],[53,1,53,4],[56,1,56,4],[59,1,59,4],[67,2,67,4],[73,1,73,4],[74,2,74,4],[90,1,90,4],[91,2,91,4],[92,1,92,3],[93,2,93,4],[97,2,97,4],[97,8,100,10],[100,1,100,4],[101,2,101,4],[103,1,103,4],[143,1,143,4],[144,2,144,4],[128,1,128,4],[129,2,129,4],[131,1,131,4],[132,2,132,4],[134,1,134,4],[135,2,135,4],[137,1,137,4],[138,2,138,4],[140,1,140,4],[141,2,141,4],[126,2,126,4],[110,1,110,4],[111,2,111,4],[113,1,113,4],[114,2,114,4],[116,1,116,4],[113,7,113,8],[113,10,113,12],[152,1,152,4],[117,2,117,4],[146,1,146,4],[147,2,147,4],[149,1,149,4],[150,2,150,4],[119,1,119,4],[120,2,120,4],[122,1,122,4],[123,2,123,4],[125,1,125,4]]}
["IN ROSSO LE OPZIONI 20%",null,null,null,null,null,null,"TOTALE CONVENZIONE",{"$f":"I13","v":0},"Totale Ulteriori Opzioni ",{"$f":"I11","v":0}]
[]
[]
[]
["Tecnologie Server1 Lotto2 Base DL560 Gen10"]
[]
[]
[]
[]
[null,null,null,null,null,null,null,"Totale Server e Opzioni",{"$f":"F17*SRV_AA","v":0}]
["Components: \nServer HPE Proliant DL560 Gen10 (2CPU Intel® Xeon-Gold 5118, 64GB , 2xHDD 300GB 15K RPM SAS 12Gbps 2.5in)",null,null,null,null,null,null,"Totale Ulteriori Opzioni ",{"$f":"G17*SRV_AA","v":0}]
[]
[null,null,null,null,null,null,null,"TOTALE CONVENZIONE",{"$f":"I11+I10","v":0}]
[]
["Proliant DL560 Gen10","Category: Server",null,null,null,3864]
[null,"Quantity: ",null,null,null,{"$f":"SUM(F20:F153)","v":0}]
[null,null,null,null,null,{"$f":"SUM(F15:F16)","v":3864},{"$f":"SUM(G20:G153)","v":0}]
[]
[null,"Base"]
[null,"HPE DL560 Gen10 8SFF CTO Server",1,null,"841730-B21"]
[]
[null,"Configurazione dello chassis"]
[null,"HP DL560 Gen9 2SFF Media Bay Kit",1,null,"795090-B21"]
[]
[null,"Processore"]
[null,"HPE DL560 Gen10 Intel® Xeon-Gold 5118 (2.3GHz/12-core/105W) Processor",1,null,"840399-L21"]
[null,"HPE DL560 Gen10 Intel® Xeon-Gold 5118 (2.3GHz/12-core/105W) Processor",1,null,"840399-B21"]
[]
[null,"Processore aggiuntivo"]
[null,"No Additional Processor",{"$f":"VLOOKUP($B$30, CPU_A, 2, FALSE)","v":0},{"$f":"VLOOKUP($B$30, CPU_A, 3, FALSE)","v":""},{"$f":"VLOOKUP($B$30, CPU_A, 5, FALSE)","v":""},{"$f":"VLOOKUP(B30, CPU_A, 12, FALSE)","v":0}]
[]
[null,"Mezz Board Option"]
[null,{"$f":"VLOOKUP($B$30, CPU_A, 6, FALSE)","v":""},{"$f":"VLOOKUP($B$30, CPU_A, 7, FALSE)","v":""},null,{"$f":"VLOOKUP($B$30, CPU_A, 8, FALSE)","v":""}]
[]
[null,"Memoria Totale in GB",{"$f":"IF(F30=2584,IF(B36=64,\"ATTENZIONE: AUMENTARE LA RAM\",\"\"),\"\")","v":""}]
[null,64]
[]
[null,"Capacità di memoria"]
[null,{"$f":"IF($B$30=\"No Additional Processor\",VLOOKUP($B$36, MEM_A1, 8, FALSE),VLOOKUP($B$36, MEM_A2, 8, FALSE))","v":"HPE 32GB (1x32GB) Dual Rank x4 DDR4-2666 CAS-19-19-19 Registered Smart Memory Kit"},{"$f":"IF($B$30=\"No Additional Processor\",VLOOKUP($B$36, MEM_A1, 9, FALSE),VLOOKUP($B$36, MEM_A2, 9, FALSE))","v":"2"},null,{"$f":"IF($B$30=\"No Additional Processor\",VLOOKUP($B$36, MEM_A1, 10, FALSE),VLOOKUP($B$36, MEM_A2, 10, FALSE))","v":"815100-B21"}]
[]
[null,{"$f":"IF($B$30=\"No Additional Processor\",VLOOKUP($B$36, MEM_A1, 2, FALSE),VLOOKUP($B$36, MEM_A2, 2, FALSE))","v":""},{"$f":"IF($B$30=\"No Additional Processor\",VLOOKUP($B$36, MEM_A1, 3, FALSE),VLOOKUP($B$36, MEM_A2, 3, FALSE))","v":""},{"$f":"IF($B$30=\"No Additional Processor\",VLOOKUP($B$36, MEM_A1, 4, FALSE),VLOOKUP($B$36, MEM_A2, 4, FALSE))","v":""},{"$f":"IF($B$30=\"No Additional Processor\",VLOOKUP($B$36, MEM_A1, 6, FALSE),VLOOKUP($B$36, MEM_A2, 6, FALSE))","v":""},{"$f":"IF($B$30=\"No Additional Processor\",VLOOKUP($B$36, MEM_A1, 7, FALSE),VLOOKUP($B$36, MEM_A2, 7, FALSE))","v":""}]
[]
[null,{"$f":"IF($B$30=\"No Additional Processor\",VLOOKUP($B$36, MEM_A1, 11, FALSE),VLOOKUP($B$36, MEM_A2, 11, FALSE))","v":""},{"$f":"IF($B$30=\"No Additional Processor\",VLOOKUP($B$36, MEM_A1, 12, FALSE),VLOOKUP($B$36, MEM_A2, 12, FALSE))","v":""},{"$f":"IF($B$30=\"No Additional Processor\",VLOOKUP($B$36, MEM_A1, 13, FALSE),VLOOKUP($B$36, MEM_A2, 13, FALSE))","v":""},{"$f":"IF($B$30=\"No Additional Processor\",VLOOKUP($B$36, MEM_A1, 15, FALSE),VLOOKUP($B$36, MEM_A2, 15, FALSE))","v":""},{"$f":"IF($B$30=\"No Additional Processor\",VLOOKUP($B$36, MEM_A1, 16, FALSE),VLOOKUP($B$36, MEM_A2, 16, FALSE))","v":""}]
[]
[null,"Sistema operativo preinstallato"]
[null,"No Operating System",{"$f":"VLOOKUP($B$46, OS_A, 2, FALSE)","v":""},{"$f":"VLOOKUP($B$46, OS_A, 3, FALSE)","v":""},{"$f":"VLOOKUP($B$46, OS_A, 5, FALSE)","v":""},{"$f":"VLOOKUP($B$46, OS_A, 6, FALSE)","v":""}]
[null,{"$f":"IF($B$30=\"No Additional Processor\",VLOOKUP($B$46, OS_A, 19, FALSE),VLOOKUP($B$46, OS_A2, 19, FALSE))","v":""},{"$f":"IF($B$30=\"No Additional Processor\",VLOOKUP($B$46, OS_A, 20, FALSE),VLOOKUP($B$46, OS_A2, 20, FALSE))","v":0},{"$f":"IF($B$30=\"No Additional Processor\",VLOOKUP($B$46, OS_A, 21, FALSE),VLOOKUP($B$46, OS_A2, 21, FALSE))","v":""},{"$f":"IF($B$30=\"No Additional Processor\",VLOOKUP($B$46, OS_A, 23, FALSE),VLOOKUP($B$46, OS_A2, 23, FALSE))","v":""},{"$f":"IF($B$30=\"No Additional Processor\",VLOOKUP($B$46, OS_A, 24, FALSE)*C47,VLOOKUP($B$46, OS_A2, 24, FALSE)*C47)","v":0},null,{"$f":"IF(D46=\"TS1L2-WIN1\",3,IF(D46=\"TS1L2-WINDC1\",4,0))","v":0}]
[null,{"$f":"IF($B$30=\"No Additional Processor\",VLOOKUP($B$46, OS_A, 25, FALSE),VLOOKUP($B$46, OS_A2, 25, FALSE))","v":""},{"$f":"IF($B$30=\"No Additional Processor\",VLOOKUP($B$46, OS_A, 26, FALSE),VLOOKUP($B$46, OS_A2, 26, FALSE))","v":0},{"$f":"IF($B$30=\"No Additional Processor\",VLOOKUP($B$46, OS_A, 27, FALSE),VLOOKUP($B$46, OS_A2, 27, FALSE))","v":""},{"$f":"IF($B$30=\"No Additional Processor\",VLOOKUP($B$46, OS_A, 29, FALSE),VLOOKUP($B$46, OS_A2, 29, FALSE))","v":""},{"$f":"IF($B$30=\"No Additional Processor\",VLOOKUP($B$46, OS_A, 30, FALSE)*C48,VLOOKUP($B$46, OS_A2, 30, FALSE)*C48)","v":0}]
[]
[null,"Client Access Licenses"]
[null,{"$f":"VLOOKUP($B$46, OS_A, 7, FALSE)","v":"None"},null,{"$f":"VLOOKUP($B$46, OS_A, 9, FALSE)","v":""},{"$f":"VLOOKUP($B$46, OS_A, 11, FALSE)","v":""},{"$f":"VLOOKUP($B$46, OS_A, 12, FALSE)*C51","v":0}]
[]
[null,{"$f":"VLOOKUP($B$46, OS_A, 13, FALSE)","v":"None"},null,{"$f":"VLOOKUP($B$46, OS_A, 15, FALSE)","v":""},{"$f":"VLOOKUP($B$46, OS_A, 17, FALSE)","v":""},{"$f":"VLOOKUP($B$46, OS_A, 18, FALSE)*C53","v":0}]
[]
[null,"Sistema opertivo SUSE Linux Enterprise Server"]
[null,"None\n",{"$f":"IF(D56=\"\",0,(C26+C27+C30)/2)","v":0},{"$f":"VLOOKUP($B$56, SUSE, 3, FALSE)","v":""},{"$f":"VLOOKUP($B$56, SUSE, 5, FALSE)","v":""},null,{"$f":"VLOOKUP($B$56, SUSE, 6, FALSE)*C56","v":0}]
[]
[null,"HPE OneView Advanced (with HPE iLO Advanced)"]
[null,"None",{"$f":"VLOOKUP($B$59, OpzOVAdv, 2, FALSE)","v":0},{"$f":"VLOOKUP($B$59, OpzOVAdv, 3, FALSE)","v":""},{"$f":"VLOOKUP($B$59, OpzOVAdv, 5, FALSE)","v":""},null,{"$f":"VLOOKUP($B$59, OpzOVAdv, 6, FALSE)","v":0}]
[]
[null,"Configurazione dello chassis"]
[null,"HPE DL560 Gen10 8SFF HDD Bay3 Kit",1,null,"872237-B21"]
[]
[null,"HPE DL560 Gen10 8SFF HDD Bay2 Kit",0,{"$f":"VLOOKUP($C$64, HDD_Bay2, 2, FALSE)","v":""},{"$f":"VLOOKUP($C$64, HDD_Bay2, 3, FALSE)","v":""},{"$f":"VLOOKUP($C$64, HDD_Bay2, 4, FALSE)","v":""},{"$f":"VLOOKUP($C$64, HDD_Bay2, 5, FALSE)","v":0}]
[]
[null,"HPE DL560 Gen10 8SFF HDD Bay1 Kit",0,{"$f":"VLOOKUP($C$66, HDD_BAY1, 2, FALSE)","v":""},{"$f":"VLOOKUP($C$66, HDD_BAY1, 3, FALSE)","v":""},{"$f":"VLOOKUP($C$66, HDD_BAY1, 4, FALSE)","v":""},{"$f":"VLOOKUP($C$66, HDD_BAY1, 5, FALSE)","v":0}]
[]
[null,"Controller RAID"]
[null,"HPE Smart Array P408i-a SR G10 LH Ctrlr",1,null,"869081-B21"]
[]
[null,"HPE 96W Smart Storage Battery with 145mm Cable Kit",1,null,"P01366-B21"]
[]
[null,{"$f":"IF(C64+C66=0,\"\",\"HPE DL5x0 Gen10 12Gb SAS Expander Card Kit with Cables\")","v":""},{"$f":"IF(C64+C66=0,\"\",1)","v":""},{"$f":"IF(C64+C66=0,\"\",\"S2-873444-B21\")","v":""},{"$f":"IF(C64+C66=0,\"\",\"873444-B21\")","v":""},null,{"$f":"IF(C64+C66=0,\"\",540)","v":""}]
[]
[null,{"$f":"IF(C62+C64+C66=1,\"Dischi rigidi  (numero massimo totale 8)\",(IF(C62+C64+C66=2,\"Dischi rigidi  (numero massimo totale 16)\",\"Dischi rigidi  (numero massimo totale 24)\")))","v":"Dischi rigidi  (numero massimo totale 8)"}]
[null,"HPE 300GB SAS 15K SFF SC DS HDD",2,null,"870753-B21"]
[]
[null,"HPE 300GB SAS 15K SFF SC DS HDD",null,"TS1L2-HD300","870753-B21",{"$f":"C78*156","v":0}]
[]
[null,"HPE 1.2TB SAS 10K SFF SC DS HDD",null,"TS1L2-HD1200","872479-B21",{"$f":"C80*292","v":0}]
[]
[null,"HPE 1.8TB SAS 10K SFF SC DS HDD",null,"TS1L2-HD1800-560","872481-B21",null,{"$f":"C82*467","v":0}]
[]
[null,"HPE 480GB SAS 12G Read Intensive SFF SC DS SSD",null,"S2-875311-B21","875311-B21",null,{"$f":"C84*749","v":0}]
[]
[null,"HPE 960GB SAS 12G Read Intensive SFF SC DS SSD",null,"TS1L2-SSD960-560","872390-B21",null,{"$f":"C86*1571","v":0}]
[]
[null,"HPE 1.92TB SAS 12G Read Intensive SFF SC DS SSD",null,"TS1L2-SSD1920-560","875326-B21",null,{"$f":"C88*2667","v":0}]
[]
[null,"DISCHI TOTALI",{"$f":"SUM(C76:C89)","v":2},{"$f":"IF(C90<=((C62+C64+C66)*8),\"      OK\",\"     ERRORE:   Totale n° di dischi superiore al consentito\")","v":"      OK"}]
[]
[null,"Configurazione RAID"]
[null,"SCRIVERE QUI' LA CONFIGURAZIONE RAID RICHIESTA.\nBASE DL560 Gen10 2\n"]
[null,"Configurazione RAID con HDD 300GB"]
[null,"RAID 1  (2 HDDs)",1,null,{"$f":"VLOOKUP($B$95,  RAID_A1, 2, FALSE)","v":{"$error":"#N/A"}}]
[null,"Hot Spare for 300GB HDD","No"]
[]
[null,"Configurazione RAID con HDD 1TB"]
[null,"",1,null,{"$f":"VLOOKUP($B$99,  RAID_A2, 2, FALSE)","v":{"$error":"#N/A"}}]
[null,"Hot Spare for 1TB HDD","No"]
[]
[null,"Alimentatore"]
[null,"HPE 1600W Flex Slot Platinum Hot Plug Low Halogen Power Supply Kit",2,null,"830272-B21"]
[]
[null,"PCIe Riser"]
[null,"Primary Riser",1]
[]
[null,"Secondary Riser",0,{"$f":"VLOOKUP($C$108, Riser2, 2, FALSE)","v":""},{"$f":"VLOOKUP($C$108, Riser2, 3, FALSE)","v":""},{"$f":"VLOOKUP($C$108, Riser2, 4, FALSE)","v":""},{"$f":"VLOOKUP($C$108, Riser2, 5, FALSE)","v":0}]
[]
[null,"Tertiary riser",0,{"$f":"VLOOKUP($C$110, Riser3, 2, FALSE)","v":""},{"$f":"VLOOKUP($C$110, Riser3, 3, FALSE)","v":""},{"$f":"VLOOKUP($C$110, Riser3, 4, FALSE)","v":""},{"$f":"VLOOKUP($C$110, Riser3, 5, FALSE)","v":0}]
[]
[null,"Scheda FlexibleLOM"]
[null,"HPE FlexFabric 10Gb 2-port 534FLR-SFP+ Adapter",1,null,"700751-B21"]
[null,null,null,null,null,null,null,"PRIMARY RISER",null,"SECONDARY RISER","TERTIARY RISER"]
[null,"Additional Card for PCIe Slot 1"]
[null,"HPE Ethernet 1Gb 4-port 331T Adapter",1,"","647594-B21","",0]
[]
[null,"Additional Card for PCIe Slot 2"]
[null,"None",{"$f":"IF(B119=B73,\"\",VLOOKUP(B119,  PCI_A2, 2, FALSE))","v":""},{"$f":"IF(B119=B73,\"\",VLOOKUP(B119,  PCI_A2, 3, FALSE))","v":""},{"$f":"IF(B119=B73,\"\",VLOOKUP(B119,  PCI_A2, 5, FALSE))","v":""},{"$f":"IF(B119=B73,\"\",VLOOKUP(B119,  PCI_A2, 6, FALSE))","v":""},{"$f":"IF(B119=B73,\"\",VLOOKUP(B119,  PCI_A2, 9, FALSE))","v":0}]
[]
[null,"Additional Card for PCIe Slot 3"]
[null,"None",{"$f":"VLOOKUP(B122,  PCI_A2, 2, FALSE)","v":""},{"$f":"VLOOKUP(B122,  PCI_A2, 3, FALSE)","v":""},{"$f":"VLOOKUP(B122,  PCI_A2, 5, FALSE)","v":""},{"$f":"VLOOKUP(B122,  PCI_A2, 6, FALSE)","v":""},{"$f":"VLOOKUP(B122,  PCI_A2, 9, FALSE)","v":0}]
[]
[null,"Additional Card for PCIe Slot 4"]
[null,"None",{"$f":"IF($B$125=\"Aggiungere Secondary Riser\",\"\",VLOOKUP($B$125,  PCI_A4, 2, FALSE))","v":""},{"$f":"IF($B$125=\"Aggiungere Secondary Riser\",\"\",VLOOKUP($B$125,  PCI_A4, 3, FALSE))","v":""},{"$f":"IF($B$125=\"Aggiungere Secondary Riser\",\"\",VLOOKUP($B$125,  PCI_A4, 5, FALSE))","v":""},{"$f":"IF($B$125=\"Aggiungere Secondary Riser\",\"\",VLOOKUP($B$125,  PCI_A4, 6, FALSE))","v":""},{"$f":"IF($B$125=\"Aggiungere Secondary Riser\",\"\",VLOOKUP($B$125,  PCI_A4, 9, FALSE))","v":0}]
[]
[null,"Additional Card for PCIe Slot 5"]
[null,"None",{"$f":"IF($B$128=\"Aggiungere Secondary Riser\",\"\",VLOOKUP($B$128,  PCI_A4, 2, FALSE))","v":""},{"$f":"IF($B$128=\"Aggiungere Secondary Riser\",\"\",VLOOKUP($B$128,  PCI_A4, 3, FALSE))","v":""},{"$f":"IF($B$128=\"Aggiungere Secondary Riser\",\"\",VLOOKUP($B$128,  PCI_A4, 5, FALSE))","v":""},{"$f":"IF($B$128=\"Aggiungere Secondary Riser\",\"\",VLOOKUP($B$128,  PCI_A4, 6, FALSE))","v":""},{"$f":"IF($B$128=\"Aggiungere Secondary Riser\",\"\",VLOOKUP($B$128,  PCI_A4, 9, FALSE))","v":0}]
[]
[null,"Additional Card for PCIe Slot 6"]
[null,"None",{"$f":"IF($B$131=\"Aggiungere Secondary Riser\",\"\",VLOOKUP($B$131,  PCI_A4, 2, FALSE))","v":""},{"$f":"IF($B$131=\"Aggiungere Secondary Riser\",\"\",VLOOKUP($B$131,  PCI_A4, 3, FALSE))","v":""},{"$f":"IF($B$131=\"Aggiungere Secondary Riser\",\"\",VLOOKUP($B$131,  PCI_A4, 5, FALSE))","v":""},{"$f":"IF($B$131=\"Aggiungere Secondary Riser\",\"\",VLOOKUP($B$131,  PCI_A4, 6, FALSE))","v":""},{"$f":"IF($B$131=\"Aggiungere Secondary Riser\",\"\",VLOOKUP($B$131,  PCI_A4, 9, FALSE))","v":0}]
[]
[null,"Additional Card for PCIe Slot 7"]
[null,"None",{"$f":"IF($B$134=\"Aggiungere Tertiary Riser\",\"\",VLOOKUP($B$134,  PCI_A7, 2, FALSE))","v":""},{"$f":"IF($B$134=\"Aggiungere Tertiary Riser\",\"\",VLOOKUP($B$134,  PCI_A7, 3, FALSE))","v":""},{"$f":"IF($B$134=\"Aggiungere Tertiary Riser\",\"\",VLOOKUP($B$134,  PCI_A7, 5, FALSE))","v":""},{"$f":"IF($B$134=\"Aggiungere Tertiary Riser\",\"\",VLOOKUP($B$134,  PCI_A7, 6, FALSE))","v":""},{"$f":"IF($B$134=\"Aggiungere Tertiary Riser\",\"\",VLOOKUP($B$134,  PCI_A7, 9, FALSE))","v":0}]
[]
[null,"Additional Card for PCIe Slot 8"]
[null,"None",{"$f":"IF($B$137=\"Aggiungere Tertiary Riser\",\"\",VLOOKUP($B$137,  PCI_A7, 2, FALSE))","v":""},{"$f":"IF($B$137=\"Aggiungere Tertiary Riser\",\"\",VLOOKUP($B$137,  PCI_A7, 3, FALSE))","v":""},{"$f":"IF($B$137=\"Aggiungere Tertiary Riser\",\"\",VLOOKUP($B$137,  PCI_A7, 5, FALSE))","v":""},{"$f":"IF($B$137=\"Aggiungere Tertiary Riser\",\"\",VLOOKUP($B$137,  PCI_A7, 6, FALSE))","v":""},{"$f":"IF($B$137=\"Aggiungere Tertiary Riser\",\"\",VLOOKUP($B$137,  PCI_A7, 9, FALSE))","v":0}]
[]
[null,"Bezel"]
[null,"None",1]
[]
[null,"Unità ottica"]
[null,"HP Mobile USB DVDRW Drive",1,null,"701498-B21"]
[]
[null,"Accessori per Server"]
[null,"HP BLc 10G SFP+ SR Transceiver",{"$f":"(VLOOKUP(B116,PCI_A1,8,FALSE))+((VLOOKUP(B119,PCI_A2,8,FALSE)))+((VLOOKUP(B122,PCI_A2,8,FALSE)))+((VLOOKUP(B125,PCI_A4,8,FALSE)))+((VLOOKUP(B128,PCI_A4,8,FALSE)))+((VLOOKUP(B131,PCI_A4,8,FALSE)))+((VLOOKUP(B134,PCI_A7,8,FALSE))+((VLOOKUP(B137,PCI_A7,8,FALSE))))","v":0},null,"455883-B21"]
[]
[null,"Estensione di Garanzia"]
[null,"None",{"$f":"VLOOKUP($B$149,  SO_B1,2, FALSE)","v":""},{"$f":"VLOOKUP($B$149,  SO_B1, 3, FALSE)","v":""},{"$f":"VLOOKUP($B$149,  SO_B1, 5, FALSE)","v":""},{"$f":"VLOOKUP($B$149,  SO_B1, 6, FALSE)","v":""}]
[]
[null,"Protezione dei dati - Keep Your Hard Drive "]
[null,"None",{"$f":"VLOOKUP($B$152,  SO_A2, 2, FALSE)","v":""},{"$f":"VLOOKUP($B$152,  SO_A2, 3, FALSE)","v":""},{"$f":"VLOOKUP($B$152,  SO_A2,5, FALSE)","v":""},{"$f":"VLOOKUP($B$152,  SO_A2, 6, FALSE)","v":""}]

{"sheet":"Lotto2 DL560 Gen10 3","index":6,"n_rows":152,"n_cols":11,"rows_kept":152,"cut":false,"hidden":false,"merged":[[18,2,18,4],[4,0,4,4],[5,0,5,4],[10,0,11,5],[12,0,12,5],[48,1,48,4],[20,1,20,4],[24,2,24,4],[27,1,27,4],[28,2,28,4],[30,1,30,4],[31,2,31,4],[33,1,33,4],[36,1,36,4],[37,2,37,4],[43,1,43,4],[44,2,44,4],[34,2,34,3],[104,2,104,4],[93,8,96,10],[96,1,96,4],[49,2,49,4],[53,1,53,4],[56,1,56,4],[59,1,59,4],[67,2,67,4],[73,1,73,4],[74,2,74,4],[90,1,90,4],[91,2,91,4],[92,1,92,3],[93,2,93,4],[97,2,97,4],[97,8,100,10],[100,1,100,4],[101,2,101,4],[103,1,103,4],[143,1,143,4],[144,2,144,4],[128,1,128,4],[129,2,129,4],[131,1,131,4],[132,2,132,4],[134,1,134,4],[135,2,135,4],[137,1,137,4],[138,2,138,4],[140,1,140,4],[141,2,141,4],[126,2,126,4],[110,1,110,4],[111,2,111,4],[113,1,113,4],[114,2,114,4],[116,1,116,4],[113,7,113,8],[113,10,113,12],[152,1,152,4],[117,2,117,4],[146,1,146,4],[147,2,147,4],[149,1,149,4],[150,2,150,4],[119,1,119,4],[120,2,120,4],[122,1,122,4],[123,2,123,4],[125,1,125,4]]}
["IN ROSSO LE OPZIONI 20%",null,null,null,null,null,null,"TOTALE CONVENZIONE",{"$f":"I13","v":0},"Totale Ulteriori Opzioni ",{"$f":"I11","v":0}]
[]
[]
[]
["Tecnologie Server1 Lotto2 Base DL560 Gen10"]
[]
[]
[]
[]
[null,null,null,null,null,null,null,"Totale Server e Opzioni",{"$f":"F17*SRV_AAA","v":0}]
["Components: \nServer HPE Proliant DL560 Gen10 (2CPU Intel® Xeon-Gold 5118, 64GB , 2xHDD 300GB 15K RPM SAS 12Gbps 2.5in)",null,null,null,null,null,null,"Totale Ulteriori Opzioni ",{"$f":"G17*SRV_AAA","v":0}]
[]
[null,null,null,null,null,null,null,"TOTALE CONVENZIONE",{"$f":"I11+I10","v":0}]
[]
["Proliant DL560 Gen10","Category: Server",null,null,null,3864]
[null,"Quantity: ",null,null,null,{"$f":"SUM(F20:F153)","v":0}]
[null,null,null,null,null,{"$f":"SUM(F15:F16)","v":3864},{"$f":"SUM(G20:G153)","v":0}]
[]
[null,"Base"]
[null,"HPE DL560 Gen10 8SFF CTO Server",1,null,"841730-B21"]
[]
[null,"Configurazione dello chassis"]
[null,"HP DL560 Gen9 2SFF Media Bay Kit",1,null,"795090-B21"]
[]
[null,"Processore"]
[null,"HPE DL560 Gen10 Intel® Xeon-Gold 5118 (2.3GHz/12-core/105W) Processor",1,null,"840399-L21"]
[null,"HPE DL560 Gen10 Intel® Xeon-Gold 5118 (2.3GHz/12-core/105W) Processor",1,null,"840399-B21"]
[]
[null,"Processore aggiuntivo"]
[null,"No Additional Processor",{"$f":"VLOOKUP($B$30, CPU_A, 2, FALSE)","v":0},{"$f":"VLOOKUP($B$30, CPU_A, 3, FALSE)","v":""},{"$f":"VLOOKUP($B$30, CPU_A, 5, FALSE)","v":""},{"$f":"VLOOKUP(B30, CPU_A, 12, FALSE)","v":0}]
[]
[null,"Mezz Board Option"]
[null,{"$f":"VLOOKUP($B$30, CPU_A, 6, FALSE)","v":""},{"$f":"VLOOKUP($B$30, CPU_A, 7, FALSE)","v":""},null,{"$f":"VLOOKUP($B$30, CPU_A, 8, FALSE)","v":""}]
[]
[null,"Memoria Totale in GB",{"$f":"IF(F30=2584,IF(B36=64,\"ATTENZIONE: AUMENTARE LA RAM\",\"\"),\"\")","v":""}]
[null,64]
[]
[null,"Capacità di memoria"]
[null,{"$f":"IF($B$30=\"No Additional Processor\",VLOOKUP($B$36, MEM_A1, 8, FALSE),VLOOKUP($B$36, MEM_A2, 8, FALSE))","v":"HPE 32GB (1x32GB) Dual Rank x4 DDR4-2666 CAS-19-19-19 Registered Smart Memory Kit"},{"$f":"IF($B$30=\"No Additional Processor\",VLOOKUP($B$36, MEM_A1, 9, FALSE),VLOOKUP($B$36, MEM_A2, 9, FALSE))","v":"2"},null,{"$f":"IF($B$30=\"No Additional Processor\",VLOOKUP($B$36, MEM_A1, 10, FALSE),VLOOKUP($B$36, MEM_A2, 10, FALSE))","v":"815100-B21"}]
[]
[null,{"$f":"IF($B$30=\"No Additional Processor\",VLOOKUP($B$36, MEM_A1, 2, FALSE),VLOOKUP($B$36, MEM_A2, 2, FALSE))","v":""},{"$f":"IF($B$30=\"No Additional Processor\",VLOOKUP($B$36, MEM_A1, 3, FALSE),VLOOKUP($B$36, MEM_A2, 3, FALSE))","v":""},{"$f":"IF($B$30=\"No Additional Processor\",VLOOKUP($B$36, MEM_A1, 4, FALSE),VLOOKUP($B$36, MEM_A2, 4, FALSE))","v":""},{"$f":"IF($B$30=\"No Additional Processor\",VLOOKUP($B$36, MEM_A1, 6, FALSE),VLOOKUP($B$36, MEM_A2, 6, FALSE))","v":""},{"$f":"IF($B$30=\"No Additional Processor\",VLOOKUP($B$36, MEM_A1, 7, FALSE),VLOOKUP($B$36, MEM_A2, 7, FALSE))","v":""}]
[]
[null,{"$f":"IF($B$30=\"No Additional Processor\",VLOOKUP($B$36, MEM_A1, 11, FALSE),VLOOKUP($B$36, MEM_A2, 11, FALSE))","v":""},{"$f":"IF($B$30=\"No Additional Processor\",VLOOKUP($B$36, MEM_A1, 12, FALSE),VLOOKUP($B$36, MEM_A2, 12, FALSE))","v":""},{"$f":"IF($B$30=\"No Additional Processor\",VLOOKUP($B$36, MEM_A1, 13, FALSE),VLOOKUP($B$36, MEM_A2, 13, FALSE))","v":""},{"$f":"IF($B$30=\"No Additional Processor\",VLOOKUP($B$36, MEM_A1, 15, FALSE),VLOOKUP($B$36, MEM_A2, 15, FALSE))","v":""},{"$f":"IF($B$30=\"No Additional Processor\",VLOOKUP($B$36, MEM_A1, 16, FALSE),VLOOKUP($B$36, MEM_A2, 16, FALSE))","v":""}]
[]
[null,"Sistema operativo preinstallato"]
[null,"No Operating System",{"$f":"VLOOKUP($B$46, OS_A, 2, FALSE)","v":""},{"$f":"VLOOKUP($B$46, OS_A, 3, FALSE)","v":""},{"$f":"VLOOKUP($B$46, OS_A, 5, FALSE)","v":""},{"$f":"VLOOKUP($B$46, OS_A, 6, FALSE)","v":""}]
[null,{"$f":"IF($B$30=\"No Additional Processor\",VLOOKUP($B$46, OS_A, 19, FALSE),VLOOKUP($B$46, OS_A2, 19, FALSE))","v":""},{"$f":"IF($B$30=\"No Additional Processor\",VLOOKUP($B$46, OS_A, 20, FALSE),VLOOKUP($B$46, OS_A2, 20, FALSE))","v":0},{"$f":"IF($B$30=\"No Additional Processor\",VLOOKUP($B$46, OS_A, 21, FALSE),VLOOKUP($B$46, OS_A2, 21, FALSE))","v":""},{"$f":"IF($B$30=\"No Additional Processor\",VLOOKUP($B$46, OS_A, 23, FALSE),VLOOKUP($B$46, OS_A2, 23, FALSE))","v":""},{"$f":"IF($B$30=\"No Additional Processor\",VLOOKUP($B$46, OS_A, 24, FALSE)*C47,VLOOKUP($B$46, OS_A2, 24, FALSE)*C47)","v":0},null,{"$f":"IF(D46=\"TS1L2-WIN1\",3,IF(D46=\"TS1L2-WINDC1\",4,0))","v":0}]
[null,{"$f":"IF($B$30=\"No Additional Processor\",VLOOKUP($B$46, OS_A, 25, FALSE),VLOOKUP($B$46, OS_A2, 25, FALSE))","v":""},{"$f":"IF($B$30=\"No Additional Processor\",VLOOKUP($B$46, OS_A, 26, FALSE),VLOOKUP($B$46, OS_A2, 26, FALSE))","v":0},{"$f":"IF($B$30=\"No Additional Processor\",VLOOKUP($B$46, OS_A, 27, FALSE),VLOOKUP($B$46, OS_A2, 27, FALSE))","v":""},{"$f":"IF($B$30=\"No Additional Processor\",VLOOKUP($B$46, OS_A, 29, FALSE),VLOOKUP($B$46, OS_A2, 29, FALSE))","v":""},{"$f":"IF($B$30=\"No Additional Processor\",VLOOKUP($B$46, OS_A, 30, FALSE)*C48,VLOOKUP($B$46, OS_A2, 30, FALSE)*C48)","v":0}]
[]
[null,"Client Access Licenses"]
[null,{"$f":"VLOOKUP($B$46, OS_A, 7, FALSE)","v":"None"},null,{"$f":"VLOOKUP($B$46, OS_A, 9, FALSE)","v":""},{"$f":"VLOOKUP($B$46, OS_A, 11, FALSE)","v":""},{"$f":"VLOOKUP($B$46, OS_A, 12, FALSE)*C51","v":0}]
[]
[null,{"$f":"VLOOKUP($B$46, OS_A, 13, FALSE)","v":"None"},null,{"$f":"VLOOKUP($B$46, OS_A, 15, FALSE)","v":""},{"$f":"VLOOKUP($B$46, OS_A, 17, FALSE)","v":""},{"$f":"VLOOKUP($B$46, OS_A, 18, FALSE)*C53","v":0}]
[]
[null,"Sistema opertivo SUSE Linux Enterprise Server"]
[null,"None\n",{"$f":"IF(D56=\"\",0,(C26+C27+C30)/2)","v":0},{"$f":"VLOOKUP($B$56, SUSE, 3, FALSE)","v":""},{"$f":"VLOOKUP($B$56, SUSE, 5, FALSE)","v":""},null,{"$f":"VLOOKUP($B$56, SUSE, 6, FALSE)*C56","v":0}]
[]
[null,"HPE OneView Advanced (with HPE iLO Advanced)"]
[null,"None",{"$f":"VLOOKUP($B$59, OpzOVAdv, 2, FALSE)","v":0},{"$f":"VLOOKUP($B$59, OpzOVAdv, 3, FALSE)","v":""},{"$f":"VLOOKUP($B$59, OpzOVAdv, 5, FALSE)","v":""},null,{"$f":"VLOOKUP($B$59, OpzOVAdv, 6, FALSE)","v":0}]
[]
[null,"Configurazione dello chassis"]
[null,"HPE DL560 Gen10 8SFF HDD Bay3 Kit",1,null,"872237-B21"]
[]
[null,"HPE DL560 Gen10 8SFF HDD Bay2 Kit",0,{"$f":"VLOOKUP($C$64, HDD_Bay2, 2, FALSE)","v":""},{"$f":"VLOOKUP($C$64, HDD_Bay2, 3, FALSE)","v":""},{"$f":"VLOOKUP($C$64, HDD_Bay2, 4, FALSE)","v":""},{"$f":"VLOOKUP($C$64, HDD_Bay2, 5, FALSE)","v":0}]
[]
[null,"HPE DL560 Gen10 8SFF HDD Bay1 Kit",0,{"$f":"VLOOKUP($C$66, HDD_BAY1, 2, FALSE)","v":""},{"$f":"VLOOKUP($C$66, HDD_BAY1, 3, FALSE)","v":""},{"$f":"VLOOKUP($C$66, HDD_BAY1, 4, FALSE)","v":""},{"$f":"VLOOKUP($C$66, HDD_BAY1, 5, FALSE)","v":0}]
[]
[null,"Controller RAID"]
[null,"HPE Smart Array P408i-a SR G10 LH Ctrlr",1,null,"869081-B21"]
[]
[null,"HPE 96W Smart Storage Battery with 145mm Cable Kit",1,null,"P01366-B21"]
[]
[null,{"$f":"IF(C64+C66=0,\"\",\"HPE DL5x0 Gen10 12Gb SAS Expander Card Kit with Cables\")","v":""},{"$f":"IF(C64+C66=0,\"\",1)","v":""},{"$f":"IF(C64+C66=0,\"\",\"S2-873444-B21\")","v":""},{"$f":"IF(C64+C66=0,\"\",\"873444-B21\")","v":""},null,{"$f":"IF(C64+C66=0,\"\",540)","v":""}]
[]
[null,{"$f":"IF(C62+C64+C66=1,\"Dischi rigidi  (numero massimo totale 8)\",(IF(C62+C64+C66=2,\"Dischi rigidi  (numero massimo totale 16)\",\"Dischi rigidi  (numero massimo totale 24)\")))","v":"Dischi rigidi  (numero massimo totale 8)"}]
[null,"HPE 300GB SAS 15K SFF SC DS HDD",2,null,"870753-B21"]
[]
[null,"HPE 300GB SAS 15K SFF SC DS HDD",null,"TS1L2-HD300","870753-B21",{"$f":"C78*156","v":0}]
[]
[null,"HPE 1.2TB SAS 10K SFF SC DS HDD",null,"TS1L2-HD1200","872479-B21",{"$f":"C80*292","v":0}]
[]
[null,"HPE 1.8TB SAS 10K SFF SC DS HDD",null,"TS1L2-HD1800-560","872481-B21",null,{"$f":"C82*467","v":0}]
[]
[null,"HPE 480GB SAS 12G Read Intensive SFF SC DS SSD",null,"S2-875311-B21","875311-B21",null,{"$f":"C84*749","v":0}]
[]
[null,"HPE 960GB SAS 12G Read Intensive SFF SC DS SSD",null,"TS1L2-SSD960-560","872390-B21",null,{"$f":"C86*1571","v":0}]
[]
[null,"HPE 1.92TB SAS 12G Read Intensive SFF SC DS SSD",null,"TS1L2-SSD1920-560","875326-B21",null,{"$f":"C88*2667","v":0}]
[]
[null,"DISCHI TOTALI",{"$f":"SUM(C76:C89)","v":2},{"$f":"IF(C90<=((C62+C64+C66)*8),\"      OK\",\"     ERRORE:   Totale n° di dischi superiore al consentito\")","v":"      OK"}]
[]
[null,"Configurazione RAID"]
[null,"SCRIVERE QUI' LA CONFIGURAZIONE RAID RICHIESTA.\nBASE DL560 Gen10 3\n"]
[null,"Configurazione RAID con HDD 300GB"]
[null,"RAID 1  (2 HDDs)",1,null,{"$f":"VLOOKUP($B$95,  RAID_A1, 2, FALSE)","v":{"$error":"#N/A"}}]
[null,"Hot Spare for 300GB HDD","No"]
[]
[null,"Configurazione RAID con HDD 1TB"]
[null,"",1,null,{"$f":"VLOOKUP($B$99,  RAID_A2, 2, FALSE)","v":{"$error":"#N/A"}}]
[null,"Hot Spare for 1TB HDD","No"]
[]
[null,"Alimentatore"]
[null,"HPE 1600W Flex Slot Platinum Hot Plug Low Halogen Power Supply Kit",2,null,"830272-B21"]
[]
[null,"PCIe Riser"]
[null,"Primary Riser",1]
[]
[null,"Secondary Riser",0,{"$f":"VLOOKUP($C$108, Riser2, 2, FALSE)","v":""},{"$f":"VLOOKUP($C$108, Riser2, 3, FALSE)","v":""},{"$f":"VLOOKUP($C$108, Riser2, 4, FALSE)","v":""},{"$f":"VLOOKUP($C$108, Riser2, 5, FALSE)","v":0}]
[]
[null,"Tertiary riser",0,{"$f":"VLOOKUP($C$110, Riser3, 2, FALSE)","v":""},{"$f":"VLOOKUP($C$110, Riser3, 3, FALSE)","v":""},{"$f":"VLOOKUP($C$110, Riser3, 4, FALSE)","v":""},{"$f":"VLOOKUP($C$110, Riser3, 5, FALSE)","v":0}]
[]
[null,"Scheda FlexibleLOM"]
[null,"HPE FlexFabric 10Gb 2-port 534FLR-SFP+ Adapter",1,null,"700751-B21"]
[null,null,null,null,null,null,null,"PRIMARY RISER",null,"SECONDARY RISER","TERTIARY RISER"]
[null,"Additional Card for PCIe Slot 1"]
[null,"HPE Ethernet 1Gb 4-port 331T Adapter",1,"","647594-B21","",0]
[]
[null,"Additional Card for PCIe Slot 2"]
[null,"None",{"$f":"IF(B119=B73,\"\",VLOOKUP(B119,  PCI_A2, 2, FALSE))","v":""},{"$f":"IF(B119=B73,\"\",VLOOKUP(B119,  PCI_A2, 3, FALSE))","v":""},{"$f":"IF(B119=B73,\"\",VLOOKUP(B119,  PCI_A2, 5, FALSE))","v":""},{"$f":"IF(B119=B73,\"\",VLOOKUP(B119,  PCI_A2, 6, FALSE))","v":""},{"$f":"IF(B119=B73,\"\",VLOOKUP(B119,  PCI_A2, 9, FALSE))","v":0}]
[]
[null,"Additional Card for PCIe Slot 3"]
[null,"None",{"$f":"VLOOKUP(B122,  PCI_A2, 2, FALSE)","v":""},{"$f":"VLOOKUP(B122,  PCI_A2, 3, FALSE)","v":""},{"$f":"VLOOKUP(B122,  PCI_A2, 5, FALSE)","v":""},{"$f":"VLOOKUP(B122,  PCI_A2, 6, FALSE)","v":""},{"$f":"VLOOKUP(B122,  PCI_A2, 9, FALSE)","v":0}]
[]
[null,"Additional Card for PCIe Slot 4"]
[null,"None",{"$f":"IF($B$125=\"Aggiungere Secondary Riser\",\"\",VLOOKUP($B$125,  PCI_A4, 2, FALSE))","v":""},{"$f":"IF($B$125=\"Aggiungere Secondary Riser\",\"\",VLOOKUP($B$125,  PCI_A4, 3, FALSE))","v":""},{"$f":"IF($B$125=\"Aggiungere Secondary Riser\",\"\",VLOOKUP($B$125,  PCI_A4, 5, FALSE))","v":""},{"$f":"IF($B$125=\"Aggiungere Secondary Riser\",\"\",VLOOKUP($B$125,  PCI_A4, 6, FALSE))","v":""},{"$f":"IF($B$125=\"Aggiungere Secondary Riser\",\"\",VLOOKUP($B$125,  PCI_A4, 9, FALSE))","v":0}]
[]
[null,"Additional Card for PCIe Slot 5"]
[null,"None",{"$f":"IF($B$128=\"Aggiungere Secondary Riser\",\"\",VLOOKUP($B$128,  PCI_A4, 2, FALSE))","v":""},{"$f":"IF($B$128=\"Aggiungere Secondary Riser\",\"\",VLOOKUP($B$128,  PCI_A4, 3, FALSE))","v":""},{"$f":"IF($B$128=\"Aggiungere Secondary Riser\",\"\",VLOOKUP($B$128,  PCI_A4, 5, FALSE))","v":""},{"$f":"IF($B$128=\"Aggiungere Secondary Riser\",\"\",VLOOKUP($B$128,  PCI_A4, 6, FALSE))","v":""},{"$f":"IF($B$128=\"Aggiungere Secondary Riser\",\"\",VLOOKUP($B$128,  PCI_A4, 9, FALSE))","v":0}]
[]
[null,"Additional Card for PCIe Slot 6"]
[null,"None",{"$f":"IF($B$131=\"Aggiungere Secondary Riser\",\"\",VLOOKUP($B$131,  PCI_A4, 2, FALSE))","v":""},{"$f":"IF($B$131=\"Aggiungere Secondary Riser\",\"\",VLOOKUP($B$131,  PCI_A4, 3, FALSE))","v":""},{"$f":"IF($B$131=\"Aggiungere Secondary Riser\",\"\",VLOOKUP($B$131,  PCI_A4, 5, FALSE))","v":""},{"$f":"IF($B$131=\"Aggiungere Secondary Riser\",\"\",VLOOKUP($B$131,  PCI_A4, 6, FALSE))","v":""},{"$f":"IF($B$131=\"Aggiungere Secondary Riser\",\"\",VLOOKUP($B$131,  PCI_A4, 9, FALSE))","v":0}]
[]
[null,"Additional Card for PCIe Slot 7"]
[null,"None",{"$f":"IF($B$134=\"Aggiungere Tertiary Riser\",\"\",VLOOKUP($B$134,  PCI_A7, 2, FALSE))","v":""},{"$f":"IF($B$134=\"Aggiungere Tertiary Riser\",\"\",VLOOKUP($B$134,  PCI_A7, 3, FALSE))","v":""},{"$f":"IF($B$134=\"Aggiungere Tertiary Riser\",\"\",VLOOKUP($B$134,  PCI_A7, 5, FALSE))","v":""},{"$f":"IF($B$134=\"Aggiungere Tertiary Riser\",\"\",VLOOKUP($B$134,  PCI_A7, 6, FALSE))","v":""},{"$f":"IF($B$134=\"Aggiungere Tertiary Riser\",\"\",VLOOKUP($B$134,  PCI_A7, 9, FALSE))","v":0}]
[]
[null,"Additional Card for PCIe Slot 8"]
[null,"None",{"$f":"IF($B$137=\"Aggiungere Tertiary Riser\",\"\",VLOOKUP($B$137,  PCI_A7, 2, FALSE))","v":""},{"$f":"IF($B$137=\"Aggiungere Tertiary Riser\",\"\",VLOOKUP($B$137,  PCI_A7, 3, FALSE))","v":""},{"$f":"IF($B$137=\"Aggiungere Tertiary Riser\",\"\",VLOOKUP($B$137,  PCI_A7, 5, FALSE))","v":""},{"$f":"IF($B$137=\"Aggiungere Tertiary Riser\",\"\",VLOOKUP($B$137,  PCI_A7, 6, FALSE))","v":""},{"$f":"IF($B$137=\"Aggiungere Tertiary Riser\",\"\",VLOOKUP($B$137,  PCI_A7, 9, FALSE))","v":0}]
[]
[null,"Bezel"]
[null,"None",1]
[]
[null,"Unità ottica"]
[null,"HP Mobile USB DVDRW Drive",1,null,"701498-B21"]
[]
[null,"Accessori per Server"]
[null,"HP BLc 10G SFP+ SR Transceiver",{"$f":"(VLOOKUP(B116,PCI_A1,8,FALSE))+((VLOOKUP(B119,PCI_A2,8,FALSE)))+((VLOOKUP(B122,PCI_A2,8,FALSE)))+((VLOOKUP(B125,PCI_A4,8,FALSE)))+((VLOOKUP(B128,PCI_A4,8,FALSE)))+((VLOOKUP(B131,PCI_A4,8,FALSE)))+((VLOOKUP(B134,PCI_A7,8,FALSE))+((VLOOKUP(B137,PCI_A7,8,FALSE))))","v":0},null,"455883-B21"]
[]
[null,"Estensione di Garanzia"]
[null,"None",{"$f":"VLOOKUP($B$149,  SO_B1,2, FALSE)","v":""},{"$f":"VLOOKUP($B$149,  SO_B1, 3, FALSE)","v":""},{"$f":"VLOOKUP($B$149,  SO_B1, 5, FALSE)","v":""},{"$f":"VLOOKUP($B$149,  SO_B1, 6, FALSE)","v":""}]
[]
[null,"Protezione dei dati - Keep Your Hard Drive "]
[null,"None",{"$f":"VLOOKUP($B$152,  SO_A2, 2, FALSE)","v":""},{"$f":"VLOOKUP($B$152,  SO_A2, 3, FALSE)","v":""},{"$f":"VLOOKUP($B$152,  SO_A2,5, FALSE)","v":""},{"$f":"VLOOKUP($B$152,  SO_A2, 6, FALSE)","v":""}]

{"sheet":"Lotto2 DL580 2","index":7,"n_rows":168,"n_cols":13,"rows_kept":168,"cut":false,"hidden":false,"merged":[[119,1,119,4],[120,2,120,4],[122,1,122,4],[168,1,168,4],[160,2,160,4],[162,1,162,4],[154,2,154,4],[156,1,156,4],[157,2,157,4],[159,1,159,4],[147,2,147,4],[153,1,153,4],[163,2,163,4],[165,1,165,4],[166,2,166,4],[123,2,123,4],[111,2,111,4],[113,1,113,4],[114,2,114,4],[116,1,116,4],[117,2,117,4],[98,1,98,4],[101,1,101,4],[104,1,104,4],[107,1,107,4],[110,1,110,4],[45,1,45,4],[87,1,87,4],[88,2,88,4],[90,1,90,4],[93,1,93,4],[60,1,60,4],[91,2,91,4],[40,1,40,4],[41,2,41,4],[31,2,31,3],[84,2,84,4],[46,2,46,4],[48,1,48,4],[50,1,50,4],[61,2,61,4],[63,1,63,4],[83,1,83,4],[53,1,53,4],[56,1,56,4],[64,2,64,4],[78,1,78,4],[79,2,79,4],[80,1,80,3],[81,8,83,10],[84,8,87,10],[27,1,27,4],[25,2,25,4],[4,0,4,4],[5,0,5,4],[10,0,11,5],[12,0,12,5],[18,2,18,4],[20,1,20,4],[21,2,21,4],[24,1,24,4],[28,2,28,4],[30,1,30,4],[33,1,33,4],[34,2,34,4],[125,1,125,4],[141,2,141,4],[143,1,143,4],[144,2,144,4],[146,1,146,4],[134,1,134,4],[135,2,135,4],[137,1,137,4],[138,2,138,4],[140,1,140,4],[128,1,128,4],[129,2,129,4],[131,1,131,4],[132,2,132,4],[126,2,126,4]]}
["IN ROSSO LE OPZIONI 20%",null,null,null,null,null,null,null,null,"TOTALE CONVENZIONE",{"$f":"K10","v":0},"Totale Ulteriori Opzioni ",{"$f":"K8","v":0}]
[]
[]
[]
["Tecnologie Server1 Lotto2 Base Alternativo DL580"]
[]
[null,null,null,null,null,null,null,null,null,"Totale Server e Opzioni",{"$f":"F17*SRV_BB","v":0}]
[null,null,null,null,null,null,null,null,null,"Totale Ulteriori Opzioni ",{"$f":"G16*SRV_BB","v":0}]
[]
[null,null,null,null,null,null,null,null,null,"TOTALE CONVENZIONE",{"$f":"K8+K7","v":0}]
["Components: \nServer HP Proliant DL580 Gen10 (2CPU Intel® Xeon® Gold 5518, 64GB , 2xHDD 300GB 15K RPM SAS 12Gbps 2.5in)"]
[]
[]
[]
["Proliant DL580 Gen10","Category: Server",null,null,null,{"$f":"3864","v":3864}]
[null,"Quantity: ",null,null,null,{"$f":"SUM(F20:F188)","v":0},{"$f":"SUM(G20:G188)","v":0}]
[null,null,null,null,null,{"$f":"SUM(F15:F16)","v":3864}]
[]
[null,"Base"]
[null,"HPE DL580 Gen10 8SFF CTO Server",1,null,"869854-B21"]
[]
[null,"Processore"]
[null,"HPE DL580 Gen10 Intel® Xeon-Gold 5118 (2.3GHz/12-core/105W) Processor",1,null,"878126-L21"]
[null,"HPE DL580 Gen10 Intel® Xeon-Gold 5118 (2.3GHz/12-core/105W) Processor",1,null,"878126-B21"]
[]
[null,"Processore aggiuntivo"]
[null,"No Additional Processor",{"$f":"VLOOKUP($B$27, CPU_B, 2, FALSE)","v":0},{"$f":"VLOOKUP($B$27, CPU_B, 3, FALSE)","v":""},{"$f":"VLOOKUP($B$27, CPU_B, 5, FALSE)","v":""},{"$f":"VLOOKUP(B27, CPU_B, 12, FALSE)","v":""}]
[]
[null,"Mezz Board Option"]
[null,{"$f":"VLOOKUP($B$27, CPU_B, 6, FALSE)","v":""},{"$f":"VLOOKUP($B$27, CPU_B, 7, FALSE)","v":""},null,{"$f":"VLOOKUP($B$27, CPU_B, 8, FALSE)","v":""}]
[]
[null,"Memoria Totale in GB",{"$f":"IF(F27=2584,IF(B33=64,\"ATTENZIONE: AUMENTARE LA RAM\",\"\"),\"\")","v":""}]
[null,64]
[]
[null,"Capacità di memoria"]
[null,{"$f":"IF($B$27=\"No Additional Processor\",VLOOKUP($B$33, MEM_B1, 8, FALSE),VLOOKUP($B$33, MEM_B2, 8, FALSE))","v":"HPE 32GB (1x32GB) Dual Rank x4 DDR4-2666 CAS-19-19-19 Registered Smart Memory Kit"},{"$f":"IF($B$27=\"No Additional Processor\",VLOOKUP($B$33, MEM_B1, 9, FALSE),VLOOKUP($B$33, MEM_B2, 9, FALSE))","v":"2"},null,{"$f":"IF($B$27=\"No Additional Processor\",VLOOKUP($B$33, MEM_B1, 10, FALSE),VLOOKUP($B$33, MEM_B2, 10, FALSE))","v":"815100-B21"}]
[]
[null,{"$f":"IF($B$27=\"No Additional Processor\",VLOOKUP($B$33, MEM_B1, 2, FALSE),VLOOKUP($B$33, MEM_B2, 2, FALSE))","v":""},{"$f":"IF($B$27=\"No Additional Processor\",VLOOKUP($B$33, MEM_B1, 3, FALSE),VLOOKUP($B$33, MEM_B2, 3, FALSE))","v":""},{"$f":"IF($B$27=\"No Additional Processor\",VLOOKUP($B$33, MEM_B1, 4, FALSE),VLOOKUP($B$33, MEM_B2, 4, FALSE))","v":""},{"$f":"IF($B$27=\"No Additional Processor\",VLOOKUP($B$33, MEM_B1, 6, FALSE),VLOOKUP($B$33, MEM_B2, 6, FALSE))","v":""},{"$f":"IF($B$27=\"No Additional Processor\",VLOOKUP($B$33, MEM_B1, 7, FALSE),VLOOKUP($B$33, MEM_B2, 7, FALSE))","v":""}]
[]
[null,{"$f":"IF($B$27=\"No Additional Processor\",VLOOKUP($B$33, MEM_B1, 11, FALSE),VLOOKUP($B$33, MEM_B2, 11, FALSE))","v":""},{"$f":"IF($B$27=\"No Additional Processor\",VLOOKUP($B$33, MEM_B1, 12, FALSE),VLOOKUP($B$33, MEM_B2, 12, FALSE))","v":""},{"$f":"IF($B$27=\"No Additional Processor\",VLOOKUP($B$33, MEM_B1, 13, FALSE),VLOOKUP($B$33, MEM_B2, 13, FALSE))","v":""},{"$f":"IF($B$27=\"No Additional Processor\",VLOOKUP($B$33, MEM_B1, 15, FALSE),VLOOKUP($B$33, MEM_B2, 15, FALSE))","v":""},{"$f":"IF($B$27=\"No Additional Processor\",VLOOKUP($B$33, MEM_B1, 16, FALSE),VLOOKUP($B$33, MEM_B2, 16, FALSE))","v":""}]
[]
[null,"Sistema operativo preinstallato"]
[null,"No Operating System",{"$f":"VLOOKUP($B$43, OS_B, 2, FALSE)","v":""},{"$f":"VLOOKUP($B$43, OS_B, 3, FALSE)","v":""},{"$f":"VLOOKUP($B$43, OS_B, 5, FALSE)","v":""},{"$f":"VLOOKUP($B$43, OS_B, 6, FALSE)","v":""}]
[null,{"$f":"IF($B$27=\"No Additional Processor\",VLOOKUP($B$43, OS_B, 19, FALSE),VLOOKUP($B$43, OS_B2, 19, FALSE))","v":""},{"$f":"IF($B$27=\"No Additional Processor\",VLOOKUP($B$43, OS_B, 20, FALSE),VLOOKUP($B$43, OS_B2, 20, FALSE))","v":0},{"$f":"IF($B$27=\"No Additional Processor\",VLOOKUP($B$43, OS_B, 21, FALSE),VLOOKUP($B$43, OS_B2, 21, FALSE))","v":""},{"$f":"IF($B$27=\"No Additional Processor\",VLOOKUP($B$43, OS_B, 23, FALSE),VLOOKUP($B$43, OS_B2, 23, FALSE))","v":""},{"$f":"IF($B$27=\"No Additional Processor\",VLOOKUP($B$43, OS_B, 24, FALSE)*C44,VLOOKUP($B$43, OS_B2, 24, FALSE)*C44)","v":0},null,{"$f":"IF(D43=\"TS1L2-WIN1\",3,IF(D43=\"TS1L2-WINDC1\",4,0))","v":0}]
[null,{"$f":"IF($B$27=\"No Additional Processor\",VLOOKUP($B$43, OS_B, 25, FALSE),VLOOKUP($B$43, OS_B2, 25, FALSE))","v":""},{"$f":"IF($B$27=\"No Additional Processor\",VLOOKUP($B$43, OS_B, 26, FALSE),VLOOKUP($B$43, OS_B2, 26, FALSE))","v":0},{"$f":"IF($B$27=\"No Additional Processor\",VLOOKUP($B$43, OS_B, 27, FALSE),VLOOKUP($B$43, OS_B2, 27, FALSE))","v":""},{"$f":"IF($B$27=\"No Additional Processor\",VLOOKUP($B$43, OS_B, 29, FALSE),VLOOKUP($B$43, OS_B2, 29, FALSE))","v":""},{"$f":"IF($B$27=\"No Additional Processor\",VLOOKUP($B$43, OS_B, 30, FALSE)*C45,VLOOKUP($B$43, OS_B2, 30, FALSE)*C45)","v":0}]
[]
[null,"Client Access Licenses"]
[null,{"$f":"VLOOKUP($B$43, OS_B, 7, FALSE)","v":"None"},null,{"$f":"VLOOKUP($B$43, OS_B, 9, FALSE)","v":""},{"$f":"VLOOKUP($B$43, OS_B, 11, FALSE)","v":""},{"$f":"VLOOKUP($B$43, OS_B, 12, FALSE)*C48","v":0}]
[]
[null,{"$f":"VLOOKUP($B$43, OS_B, 13, FALSE)","v":"None"},null,{"$f":"VLOOKUP($B$43, OS_B, 15, FALSE)","v":""},{"$f":"VLOOKUP($B$43, OS_B, 17, FALSE)","v":""},{"$f":"VLOOKUP($B$43, OS_B, 18, FALSE)*C50","v":0}]
[]
[null,"Sistema opertivo SUSE Linux Enterprise Server"]
[null,"None\n",{"$f":"IF(D53=\"\",0,(C23+C24+C27)/2)","v":0},{"$f":"VLOOKUP($B$53, SUSE, 3, FALSE)","v":""},{"$f":"VLOOKUP($B$53, SUSE, 5, FALSE)","v":""},null,{"$f":"VLOOKUP($B$53, SUSE, 6, FALSE)*C53","v":0}]
[]
[null,"HPE OneView Advanced (with HPE iLO Advanced)"]
[null,"None",{"$f":"VLOOKUP($B$56, OpzOVAdv, 2, FALSE)","v":0},{"$f":"VLOOKUP($B$56, OpzOVAdv, 3, FALSE)","v":""},{"$f":"VLOOKUP($B$56, OpzOVAdv, 5, FALSE)","v":""},null,{"$f":"VLOOKUP($B$56, OpzOVAdv, 6, FALSE)","v":0}]
[]
[null,"Configurazione dello chassis"]
[null,"Chassis 16 slot HDD",{"$f":"IF(C60=0,1,0)","v":1},null,"830824-B21"]
[null,"Chassis 48 slot HDD",0,{"$f":"IF(C60=1,\"S2-48HDDbay\",\"\")","v":""},"830824-B21",null,{"$f":"IF(C60=1,1367,0)","v":0}]
[]
[null,"Controller RAID"]
[null,"HPE Smart Array P408i-p SR Gen10 (8 Internal Lanes/2GB Cache) 12G SAS PCIe Plug-in Controller",1,null,"830824-B21"]
[]
[null,{"$f":"IF(C59=1,\"Dischi rigidi (numero massimo totale 16)\",\"Dischi rigidi (numero massimo totale 48)\")","v":"Dischi rigidi (numero massimo totale 16)"}]
[null,"HPE 300GB SAS 15K SFF SC DS HDD",2,null,"870753-B21"]
[]
[null,"HPE 300GB SAS 15K SFF SC DS HDD",null,"TS1L2-HD300","870753-B21",{"$f":"HD300_B*156","v":0}]
[]
[null,"HPE 1.2TB SAS 10K SFF SC DS HDD",null,"TS1L2-HD1200","872479-B21",{"$f":"HD1000_B*292","v":0}]
[]
[null,"HPE 1.8TB SAS 10K SFF SC DS HDD",null,"TS1L2-HD1800","872481-B21",null,{"$f":"C72*467","v":0}]
[]
[null,"HPE 960GB SAS 12G Read Intensive SFF SC DS SSD",null,"TS1L2-SSD960","872390-B21",null,{"$f":"C74*1571","v":0}]
[]
[null,"HPE 1.92TB SAS 12G Read Intensive SFF SC DS SSD",null,"TS1L2-SSD1920","875326-B21",null,{"$f":"C76*2667","v":0}]
[]
[null,"DISCHI TOTALI",{"$f":"SUM(C66:C77)","v":2},{"$f":"IF(C59=1,IF(C78<=16,\"      OK\",\"     ERRORE:   Totale n° di dischi superiore al consentito\"),IF(C78<=48,\"      OK\",\"     ERRORE:   Totale n° di dischi superiore al consentito\"))","v":"      OK"}]
[]
[null,"Configurazione RAID"]
[null,"SCRIVERE QUI' LA CONFIGURAZIONE RAID RICHIESTA.\nBASE ALTERNATIVO DL580 2\n"]
[null,"RAID 1  (2 HDDs)",1,null,{"$f":"VLOOKUP($B$82,  RAID_BB1, 2, FALSE)","v":{"$error":"#N/A"}}]
[null,"Hot Spare for 300GB HDD","No"]
[]
[null,"Configurazione RAID con HDD 1TB"]
[null,"",1,null,{"$f":"VLOOKUP($B$86,  RAID_BB2, 2, FALSE)","v":{"$error":"#N/A"}}]
[null,"Hot Spare for 1TB HDD","No"]
[]
[null,"Alimentatore"]
[null,"HPE 1600W FS Plat Ht Plg LH Pwr Sply Kit",{"$f":"IF(C98+C97>0,4,IF(G110+G104>5000,4,2))","v":2},null,"830272-B21"]
[]
[null,"Scheda FlexibleLOM"]
[null,"HPE FlexFbr 10Gb 534FLR-SFP+ FIO Adptr",1,null,"700751-B21"]
[]
[null,"PCIe Riser"]
[null,"7 slot Primary Riser",1]
[null,"9 slot Secondary Riser (48HDD)",{"$f":"IF(C60=1,1,0)","v":0},{"$f":"VLOOKUP($C$97, SlotRiser9, 2, FALSE)","v":""},{"$f":"VLOOKUP($C$97, SlotRiser9, 3, FALSE)","v":""},{"$f":"VLOOKUP($C$98, SlotRiser9, 4, FALSE)","v":""},{"$f":"VLOOKUP($C$97, SlotRiser9, 5, FALSE)","v":0}]
[null,"9 slot Secondary Riser",0,{"$f":"VLOOKUP($C$98, SlotRiser9, 2, FALSE)","v":""},{"$f":"VLOOKUP($C$98, SlotRiser9, 3, FALSE)","v":""},{"$f":"VLOOKUP($C$98, SlotRiser9, 4, FALSE)","v":""},{"$f":"IF(C60=1,0,VLOOKUP($C$98, SlotRiser9, 5, FALSE))","v":0}]
[]
[null,"Additional Card for PCIe Slot 1 (CPU3)"]
[null,"None",{"$f":"IF(B101=\"Aggiungere Coppia di Processori\",\"\",(VLOOKUP(B101,PCI_B5, 2, FALSE)))","v":""},{"$f":"IF(B101=\"Aggiungere Coppia di Processori\",\"\",(VLOOKUP(B101,PCI_B5, 3, FALSE)))","v":""},{"$f":"IF(B101=\"Aggiungere Coppia di Processori\",\"\",(VLOOKUP(B101,PCI_B5, 5, FALSE)))","v":""},{"$f":"IF(B101=\"Aggiungere Coppia di Processori\",\"\",(VLOOKUP(B101,PCI_B5, 6, FALSE)))","v":""},{"$f":"IF(B101=\"Aggiungere Coppia di Processori\",\"\",(VLOOKUP(B101,PCI_B5, 9, FALSE)))","v":0}]
[]
[null,"Additional Card for PCIe Slot 2 (CPU3) (GPU Slot)"]
[null,"None",{"$f":"IF(B104=\"Aggiungere Coppia di Processori\",\"\",(VLOOKUP(B104,PCI_B6, 2, FALSE)))","v":""},{"$f":"IF(B104=\"Aggiungere Coppia di Processori\",\"\",(VLOOKUP(B104,PCI_B6, 3, FALSE)))","v":""},{"$f":"IF(B104=\"Aggiungere Coppia di Processori\",\"\",(VLOOKUP(B104,PCI_B6, 5, FALSE)))","v":""},{"$f":"IF(B104=\"Aggiungere Coppia di Processori\",\"\",(VLOOKUP(B104,PCI_B6, 6, FALSE)))","v":""},{"$f":"IF(B104=\"Aggiungere Coppia di Processori\",\"\",(VLOOKUP(B104,PCI_B6, 9, FALSE)))","v":0}]
[]
[null,"Additional Card for PCIe Slot 3 (CPU3)"]
[null,"None",{"$f":"IF(B107=\"Aggiungere Coppia di Processori\",\"\",(VLOOKUP(B107,PCI_B5, 2, FALSE)))","v":""},{"$f":"IF(B107=\"Aggiungere Coppia di Processori\",\"\",(VLOOKUP(B107,PCI_B5, 3, FALSE)))","v":""},{"$f":"IF(B107=\"Aggiungere Coppia di Processori\",\"\",(VLOOKUP(B107,PCI_B5, 5, FALSE)))","v":""},{"$f":"IF(B107=\"Aggiungere Coppia di Processori\",\"\",(VLOOKUP(B107,PCI_B5, 6, FALSE)))","v":""},{"$f":"IF(B107=\"Aggiungere Coppia di Processori\",\"\",(VLOOKUP(B107,PCI_B5, 9, FALSE)))","v":0}]
[]
[null,"Additional Card for PCIe Slot 4 (CPU3) (GPU Slot)"]
[null,"None",{"$f":"IF(B110=\"Aggiungere Coppia di Processori\",\"\",(VLOOKUP(B110,PCI_B6, 2, FALSE)))","v":""},{"$f":"IF(B110=\"Aggiungere Coppia di Processori\",\"\",(VLOOKUP(B110,PCI_B6, 3, FALSE)))","v":""},{"$f":"IF(B110=\"Aggiungere Coppia di Processori\",\"\",(VLOOKUP(B110,PCI_B6, 5, FALSE)))","v":""},{"$f":"IF(B110=\"Aggiungere Coppia di Processori\",\"\",(VLOOKUP(B110,PCI_B6, 6, FALSE)))","v":""},{"$f":"IF(B110=\"Aggiungere Coppia di Processori\",\"\",(VLOOKUP(B110,PCI_B6, 9, FALSE)))","v":0}]
[]
[null,"Additional Card for PCIe Slot 5 (CPU1)"]
[null,"HPE Ethernet 1Gb 4-port 331T Adapter",1,null,"647594-B21"]
[]
[null,"Additional Card for PCIe Slot 6 (CPU1)"]
[null,"HPE Smart Array P408i-p SR Gen10 Ctrlr",1,null,"830824-B21"]
[]
[null,"Additional Card for PCIe Slot 7 (CPU1)"]
[null,"HPE DL580 Gen10 12G 24-port SAS Expander",1,null,"881101-B21"]
[]
[null,"Additional Card for PCIe Slot 8 (CPU4)"]
[null,"None",{"$f":"IF(B122=\"Aggiungere Coppia di Processori\",\"\",IF(B122=\"Aggiungere 9 slot Secondary Riser\",\"\",(VLOOKUP(B122,PCI_B5,2,FALSE))))","v":""},{"$f":"IF(B122=\"Aggiungere Coppia di Processori\",\"\",IF(B122=\"Aggiungere 9 slot Secondary Riser\",\"\",(VLOOKUP(B122,PCI_B5,3,FALSE))))","v":""},{"$f":"IF(B122=\"Aggiungere Coppia di Processori\",\"\",IF(B122=\"Aggiungere 9 slot Secondary Riser\",\"\",(VLOOKUP(B122,PCI_B5,5,FALSE))))","v":""},{"$f":"IF(B122=\"Aggiungere Coppia di Processori\",\"\",IF(B122=\"Aggiungere 9 slot Secondary Riser\",\"\",(VLOOKUP(B122,PCI_B5,6,FALSE))))","v":""},{"$f":"IF(B122=\"Aggiungere Coppia di Processori\",\"\",IF(B122=\"Aggiungere 9 slot Secondary Riser\",\"\",(VLOOKUP(B122,PCI_B5,9,FALSE))))","v":0}]
[]
[null,"Additional Card for PCIe Slot 9 (CPU4) (GPU Slot)"]
[null,"None",{"$f":"IF(B125=\"Aggiungere Coppia di Processori\",\"\",IF(B125=\"Aggiungere 9 slot Secondary Riser\",\"\",(VLOOKUP(B125,PCI_B6,2,FALSE))))","v":""},{"$f":"IF(B125=\"Aggiungere Coppia di Processori\",\"\",IF(B125=\"Aggiungere 9 slot Secondary Riser\",\"\",(VLOOKUP(B125,PCI_B6,3,FALSE))))","v":""},{"$f":"IF(B125=\"Aggiungere Coppia di Processori\",\"\",IF(B125=\"Aggiungere 9 slot Secondary Riser\",\"\",(VLOOKUP(B125,PCI_B6,5,FALSE))))","v":""},{"$f":"IF(B125=\"Aggiungere Coppia di Processori\",\"\",IF(B125=\"Aggiungere 9 slot Secondary Riser\",\"\",(VLOOKUP(B125,PCI_B6,6,FALSE))))","v":""},{"$f":"IF(B125=\"Aggiungere Coppia di Processori\",\"\",IF(B125=\"Aggiungere 9 slot Secondary Riser\",\"\",(VLOOKUP(B125,PCI_B6,9,FALSE))))","v":0}]
[]
[null,"Additional Card for PCIe Slot 10 (CPU4)"]
[null,"None",{"$f":"IF(B128=\"Aggiungere Coppia di Processori\",\"\",IF(B128=\"Aggiungere 9 slot Secondary Riser\",\"\",(VLOOKUP(B128,PCI_B5,2,FALSE))))","v":""},{"$f":"IF(B128=\"Aggiungere Coppia di Processori\",\"\",IF(B128=\"Aggiungere 9 slot Secondary Riser\",\"\",(VLOOKUP(B128,PCI_B5,3,FALSE))))","v":""},{"$f":"IF(B128=\"Aggiungere Coppia di Processori\",\"\",IF(B128=\"Aggiungere 9 slot Secondary Riser\",\"\",(VLOOKUP(B128,PCI_B5,5,FALSE))))","v":""},{"$f":"IF(B128=\"Aggiungere Coppia di Processori\",\"\",IF(B128=\"Aggiungere 9 slot Secondary Riser\",\"\",(VLOOKUP(B128,PCI_B5,6,FALSE))))","v":""},{"$f":"IF(B128=\"Aggiungere Coppia di Processori\",\"\",IF(B128=\"Aggiungere 9 slot Secondary Riser\",\"\",(VLOOKUP(B128,PCI_B5,9,FALSE))))","v":0}]
[]
[null,"Additional Card for PCIe Slot 11 (CPU4) (GPU Slot)"]
[null,"None",{"$f":"IF(B131=\"Aggiungere Coppia di Processori\",\"\",IF(B131=\"Aggiungere 9 slot Secondary Riser\",\"\",(VLOOKUP(B131,PCI_B6,2,FALSE))))","v":""},{"$f":"IF(B131=\"Aggiungere Coppia di Processori\",\"\",IF(B131=\"Aggiungere 9 slot Secondary Riser\",\"\",(VLOOKUP(B131,PCI_B6,3,FALSE))))","v":""},{"$f":"IF(B131=\"Aggiungere Coppia di Processori\",\"\",IF(B131=\"Aggiungere 9 slot Secondary Riser\",\"\",(VLOOKUP(B131,PCI_B6,5,FALSE))))","v":""},{"$f":"IF(B131=\"Aggiungere Coppia di Processori\",\"\",IF(B131=\"Aggiungere 9 slot Secondary Riser\",\"\",(VLOOKUP(B131,PCI_B6,6,FALSE))))","v":""},{"$f":"IF(B131=\"Aggiungere Coppia di Processori\",\"\",IF(B131=\"Aggiungere 9 slot Secondary Riser\",\"\",(VLOOKUP(B131,PCI_B6,9,FALSE))))","v":0}]
[]
[null,"Additional Card for PCIe Slot 12 (CPU2)"]
[null,"None",{"$f":"IF(B134=\"Aggiungere Coppia di Processori\",\"\",IF(B134=\"Aggiungere 9 slot Secondary Riser\",\"\",(VLOOKUP(B134,PCI_B5,2,FALSE))))","v":""},{"$f":"IF(B134=\"Aggiungere Coppia di Processori\",\"\",IF(B134=\"Aggiungere 9 slot Secondary Riser\",\"\",(VLOOKUP(B134,PCI_B5,3,FALSE))))","v":""},{"$f":"IF(B134=\"Aggiungere Coppia di Processori\",\"\",IF(B134=\"Aggiungere 9 slot Secondary Riser\",\"\",(VLOOKUP(B134,PCI_B5,5,FALSE))))","v":""},{"$f":"IF(B134=\"Aggiungere Coppia di Processori\",\"\",IF(B134=\"Aggiungere 9 slot Secondary Riser\",\"\",(VLOOKUP(B134,PCI_B5,6,FALSE))))","v":""},{"$f":"IF(B134=\"Aggiungere Coppia di Processori\",\"\",IF(B134=\"Aggiungere 9 slot Secondary Riser\",\"\",(VLOOKUP(B134,PCI_B5,9,FALSE))))","v":0}]
[]
[null,"Additional Card for PCIe Slot 13 (CPU2)"]
[null,"None",{"$f":"IF(B137=\"Aggiungere Coppia di Processori\",\"\",IF(B137=\"Aggiungere 9 slot Secondary Riser\",\"\",(VLOOKUP(B137,PCI_B5,2,FALSE))))","v":""},{"$f":"IF(B137=\"Aggiungere Coppia di Processori\",\"\",IF(B137=\"Aggiungere 9 slot Secondary Riser\",\"\",(VLOOKUP(B137,PCI_B5,3,FALSE))))","v":""},{"$f":"IF(B137=\"Aggiungere Coppia di Processori\",\"\",IF(B137=\"Aggiungere 9 slot Secondary Riser\",\"\",(VLOOKUP(B137,PCI_B5,5,FALSE))))","v":""},{"$f":"IF(B137=\"Aggiungere Coppia di Processori\",\"\",IF(B137=\"Aggiungere 9 slot Secondary Riser\",\"\",(VLOOKUP(B137,PCI_B5,6,FALSE))))","v":""},{"$f":"IF(B137=\"Aggiungere Coppia di Processori\",\"\",IF(B137=\"Aggiungere 9 slot Secondary Riser\",\"\",(VLOOKUP(B137,PCI_B5,9,FALSE))))","v":0}]
[]
[null,"Additional Card for PCIe Slot 14 (CPU2)"]
[null,"None",{"$f":"IF(B140=\"Aggiungere Coppia di Processori\",\"\",IF(B140=\"Aggiungere 9 slot Secondary Riser\",\"\",(VLOOKUP(B140,PCI_B5,2,FALSE))))","v":""},{"$f":"IF(B140=\"Aggiungere Coppia di Processori\",\"\",IF(B140=\"Aggiungere 9 slot Secondary Riser\",\"\",(VLOOKUP(B140,PCI_B5,3,FALSE))))","v":""},{"$f":"IF(B140=\"Aggiungere Coppia di Processori\",\"\",IF(B140=\"Aggiungere 9 slot Secondary Riser\",\"\",(VLOOKUP(B140,PCI_B5,5,FALSE))))","v":""},{"$f":"IF(B140=\"Aggiungere Coppia di Processori\",\"\",IF(B140=\"Aggiungere 9 slot Secondary Riser\",\"\",(VLOOKUP(B140,PCI_B5,6,FALSE))))","v":""},{"$f":"IF(B140=\"Aggiungere Coppia di Processori\",\"\",IF(B140=\"Aggiungere 9 slot Secondary Riser\",\"\",(VLOOKUP(B140,PCI_B5,9,FALSE))))","v":0}]
[]
[null,"Additional Card for PCIe Slot 15 (CPU2)"]
[null,"None",{"$f":"IF(B143=\"Aggiungere Coppia di Processori\",\"\",IF(B143=\"Aggiungere 9 slot Secondary Riser\",\"\",(VLOOKUP(B143,PCI_B4,2,FALSE))))","v":""},{"$f":"IF(B143=\"Aggiungere Coppia di Processori\",\"\",IF(B143=\"Aggiungere 9 slot Secondary Riser\",\"\",(VLOOKUP(B143,PCI_B4,3,FALSE))))","v":""},{"$f":"IF(B143=\"Aggiungere Coppia di Processori\",\"\",IF(B143=\"Aggiungere 9 slot Secondary Riser\",\"\",(VLOOKUP(B143,PCI_B4,5,FALSE))))","v":""},{"$f":"IF(B143=\"Aggiungere Coppia di Processori\",\"\",IF(B143=\"Aggiungere 9 slot Secondary Riser\",\"\",(VLOOKUP(B143,PCI_B4,6,FALSE))))","v":""},{"$f":"IF(B143=\"Aggiungere Coppia di Processori\",\"\",IF(B143=\"Aggiungere 9 slot Secondary Riser\",\"\",(VLOOKUP(B143,PCI_B4,9,FALSE))))","v":0}]
[]
[null,"Additional Card for PCIe Slot 16 (CPU2)"]
[null,"None",{"$f":"IF(B146=\"Aggiungere Coppia di Processori\",\"\",IF(B146=\"Aggiungere 9 slot Secondary Riser\",\"\",(VLOOKUP(B146,PCI_B4,2,FALSE))))","v":""},{"$f":"IF(B146=\"Aggiungere Coppia di Processori\",\"\",IF(B146=\"Aggiungere 9 slot Secondary Riser\",\"\",(VLOOKUP(B146,PCI_B4,3,FALSE))))","v":""},{"$f":"IF(B146=\"Aggiungere Coppia di Processori\",\"\",IF(B146=\"Aggiungere 9 slot Secondary Riser\",\"\",(VLOOKUP(B146,PCI_B4,5,FALSE))))","v":""},{"$f":"IF(B146=\"Aggiungere Coppia di Processori\",\"\",IF(B146=\"Aggiungere 9 slot Secondary Riser\",\"\",(VLOOKUP(B146,PCI_B4,6,FALSE))))","v":""},{"$f":"IF(B146=\"Aggiungere Coppia di Processori\",\"\",IF(B146=\"Aggiungere 9 slot Secondary Riser\",\"\",(VLOOKUP(B146,PCI_B4,9,FALSE))))","v":0}]
[]
[null,"Accessori per GPU"]
[null,"HPE DL38x Gen10 8-pin Cable Kit for P6000 GPU",{"$f":"IF(IF($E$104=\"Q0v76a\",1,0)+IF($E$110=\"Q0v76a\",1,0)+IF($E$125=\"Q0v76a\",1,0)++IF($E$131=\"Q0v76a\",1,0)=0,0,IF(IF($E$104=\"Q0v76a\",1,0)+IF($E$110=\"Q0v76a\",1,0)+IF($E$125=\"Q0v76a\",1,0)++IF($E$131=\"Q0v76a\",1,0)>3,2,1))","v":0},"TS1-871828","871828-B21",null,{"$f":"26*C149","v":0}]
[null,null,null,null,{"$f":"COUNTIF($E$104:$E$131,\"Q2N68A\")+COUNTIF($E$104:$E$131,\"Q0v80a\")","v":0}]
[null,"HPE DL38x Gen10 8-pin Keyed Cable Kit for P40 or V100 GPU",{"$f":"IF(E150=0,0,IF(E150>3,2,1))","v":0},"TS1-871829","871829-B21",null,{"$f":"31*C151","v":0}]
[]
[null,"HPE DL580 Gen10 GPU Bracket Kit for installation in slots 4 or 11",{"$f":"IF($E$110=\"Q2n68A\",1,0)+IF($E$131=\"Q2n68A\",1,0)+IF($E$110=\"Q0v80a\",1,0)+IF($E$131=\"Q0v80a\",1,0)+IF($E$110=\"Q0v76a\",1,0)+IF($E$131=\"Q0v76a\",1,0)","v":0},"TS1-P00268","P00268-B21",null,{"$f":"33*C153","v":0}]
[]
[null,"Bezel"]
[null,"None",1]
[]
[null,"Accessori per Server"]
[null,"HP BLc 10G SFP+ SR Transceiver",2,null,"455883-B21"]
[]
[null,"Unità ottica"]
[null,"HP Mobile USB DVDRW Drive",1,null,"701498-B21"]
[]
[null,"Estensione di Garanzia"]
[null,"None",{"$f":"VLOOKUP($B$165,  SO_B1,2, FALSE)","v":""},{"$f":"VLOOKUP($B$165,  SO_B1, 3, FALSE)","v":""},{"$f":"VLOOKUP($B$165,  SO_B1, 5, FALSE)","v":""},{"$f":"VLOOKUP($B$165,  SO_B1, 6, FALSE)","v":""}]
[]
[null,"Protezione dei dati - Keep Your Hard Drive "]
[null,"None",{"$f":"VLOOKUP($B$168,  SO_BB2, 2, FALSE)","v":""},{"$f":"VLOOKUP($B$168,  SO_BB2, 3, FALSE)","v":""},{"$f":"VLOOKUP($B$168,  SO_BB2,5, FALSE)","v":""},{"$f":"VLOOKUP($B$168,  SO_BB2, 6, FALSE)","v":""}]

{"sheet":"Lotto2 DL580 3","index":8,"n_rows":168,"n_cols":13,"rows_kept":168,"cut":false,"hidden":false,"merged":[[60,1,60,4],[163,2,163,4],[165,1,165,4],[91,2,91,4],[143,1,143,4],[144,2,144,4],[146,1,146,4],[93,1,93,4],[140,1,140,4],[141,2,141,4],[128,1,128,4],[129,2,129,4],[131,1,131,4],[132,2,132,4],[117,2,117,4],[119,1,119,4],[166,2,166,4],[168,1,168,4],[160,2,160,4],[162,1,162,4],[154,2,154,4],[156,1,156,4],[157,2,157,4],[159,1,159,4],[147,2,147,4],[153,1,153,4],[110,1,110,4],[111,2,111,4],[113,1,113,4],[114,2,114,4],[116,1,116,4],[135,2,135,4],[137,1,137,4],[138,2,138,4],[120,2,120,4],[122,1,122,4],[123,2,123,4],[125,1,125,4],[126,2,126,4],[134,1,134,4],[80,1,80,3],[101,1,101,4],[104,1,104,4],[107,1,107,4],[98,1,98,4],[84,8,87,10],[45,1,45,4],[87,1,87,4],[88,2,88,4],[90,1,90,4],[84,2,84,4],[46,2,46,4],[48,1,48,4],[50,1,50,4],[61,2,61,4],[63,1,63,4],[64,2,64,4],[78,1,78,4],[79,2,79,4],[83,1,83,4],[56,1,56,4],[20,1,20,4],[21,2,21,4],[24,1,24,4],[53,1,53,4],[33,1,33,4],[34,2,34,4],[40,1,40,4],[41,2,41,4],[31,2,31,3],[28,2,28,4],[30,1,30,4],[27,1,27,4],[25,2,25,4],[4,0,4,4],[5,0,5,4],[10,0,11,5],[12,0,12,5],[18,2,18,4]]}
["IN ROSSO LE OPZIONI 20%",null,null,null,null,null,null,null,null,"TOTALE CONVENZIONE",{"$f":"K10","v":0},"Totale Ulteriori Opzioni ",{"$f":"K8","v":0}]
[]
[]
[]
["Tecnologie Server1 Lotto2 Base Alternativo DL580"]
[]
[null,null,null,null,null,null,null,null,null,"Totale Server e Opzioni",{"$f":"F17*SRV_BBB","v":0}]
[null,null,null,null,null,null,null,null,null,"Totale Ulteriori Opzioni ",{"$f":"G16*SRV_BBB","v":0}]
[]
[null,null,null,null,null,null,null,null,null,"TOTALE CONVENZIONE",{"$f":"K8+K7","v":0}]
["Components: \nServer HP Proliant DL580 Gen10 (2CPU Intel® Xeon® Gold 5518, 64GB , 2xHDD 300GB 15K RPM SAS 12Gbps 2.5in)"]
[]
[]
[]
["Proliant DL580 Gen10","Category: Server",null,null,null,{"$f":"3864","v":3864}]
[null,"Quantity: ",null,null,null,{"$f":"SUM(F20:F169)","v":0},{"$f":"SUM(G20:G169)","v":0}]
[null,null,null,null,null,{"$f":"SUM(F15:F16)","v":3864}]
[]
[null,"Base"]
[null,"HPE DL580 Gen10 8SFF CTO Server",1,null,"869854-B21"]
[]
[null,"Processore"]
[null,"HPE DL580 Gen10 Intel® Xeon-Gold 5118 (2.3GHz/12-core/105W) Processor",1,null,"878126-L21"]
[null,"HPE DL580 Gen10 Intel® Xeon-Gold 5118 (2.3GHz/12-core/105W) Processor",1,null,"878126-B21"]
[]
[null,"Processore aggiuntivo"]
[null,"No Additional Processor",{"$f":"VLOOKUP($B$27, CPU_B, 2, FALSE)","v":0},{"$f":"VLOOKUP($B$27, CPU_B, 3, FALSE)","v":""},{"$f":"VLOOKUP($B$27, CPU_B, 5, FALSE)","v":""},{"$f":"VLOOKUP(B27, CPU_B, 12, FALSE)","v":""}]
[]
[null,"Mezz Board Option"]
[null,{"$f":"VLOOKUP($B$27, CPU_B, 6, FALSE)","v":""},{"$f":"VLOOKUP($B$27, CPU_B, 7, FALSE)","v":""},null,{"$f":"VLOOKUP($B$27, CPU_B, 8, FALSE)","v":""}]
[]
[null,"Memoria Totale in GB",{"$f":"IF(F27=2584,IF(B33=64,\"ATTENZIONE: AUMENTARE LA RAM\",\"\"),\"\")","v":""}]
[null,64]
[]
[null,"Capacità di memoria"]
[null,{"$f":"IF($B$27=\"No Additional Processor\",VLOOKUP($B$33, MEM_B1, 8, FALSE),VLOOKUP($B$33, MEM_B2, 8, FALSE))","v":"HPE 32GB (1x32GB) Dual Rank x4 DDR4-2666 CAS-19-19-19 Registered Smart Memory Kit"},{"$f":"IF($B$27=\"No Additional Processor\",VLOOKUP($B$33, MEM_B1, 9, FALSE),VLOOKUP($B$33, MEM_B2, 9, FALSE))","v":"2"},null,{"$f":"IF($B$27=\"No Additional Processor\",VLOOKUP($B$33, MEM_B1, 10, FALSE),VLOOKUP($B$33, MEM_B2, 10, FALSE))","v":"815100-B21"}]
[]
[null,{"$f":"IF($B$27=\"No Additional Processor\",VLOOKUP($B$33, MEM_B1, 2, FALSE),VLOOKUP($B$33, MEM_B2, 2, FALSE))","v":""},{"$f":"IF($B$27=\"No Additional Processor\",VLOOKUP($B$33, MEM_B1, 3, FALSE),VLOOKUP($B$33, MEM_B2, 3, FALSE))","v":""},{"$f":"IF($B$27=\"No Additional Processor\",VLOOKUP($B$33, MEM_B1, 4, FALSE),VLOOKUP($B$33, MEM_B2, 4, FALSE))","v":""},{"$f":"IF($B$27=\"No Additional Processor\",VLOOKUP($B$33, MEM_B1, 6, FALSE),VLOOKUP($B$33, MEM_B2, 6, FALSE))","v":""},{"$f":"IF($B$27=\"No Additional Processor\",VLOOKUP($B$33, MEM_B1, 7, FALSE),VLOOKUP($B$33, MEM_B2, 7, FALSE))","v":""}]
[]
[null,{"$f":"IF($B$27=\"No Additional Processor\",VLOOKUP($B$33, MEM_B1, 11, FALSE),VLOOKUP($B$33, MEM_B2, 11, FALSE))","v":""},{"$f":"IF($B$27=\"No Additional Processor\",VLOOKUP($B$33, MEM_B1, 12, FALSE),VLOOKUP($B$33, MEM_B2, 12, FALSE))","v":""},{"$f":"IF($B$27=\"No Additional Processor\",VLOOKUP($B$33, MEM_B1, 13, FALSE),VLOOKUP($B$33, MEM_B2, 13, FALSE))","v":""},{"$f":"IF($B$27=\"No Additional Processor\",VLOOKUP($B$33, MEM_B1, 15, FALSE),VLOOKUP($B$33, MEM_B2, 15, FALSE))","v":""},{"$f":"IF($B$27=\"No Additional Processor\",VLOOKUP($B$33, MEM_B1, 16, FALSE),VLOOKUP($B$33, MEM_B2, 16, FALSE))","v":""}]
[]
[null,"Sistema operativo preinstallato"]
[null,"No Operating System",{"$f":"VLOOKUP($B$43, OS_B, 2, FALSE)","v":""},{"$f":"VLOOKUP($B$43, OS_B, 3, FALSE)","v":""},{"$f":"VLOOKUP($B$43, OS_B, 5, FALSE)","v":""},{"$f":"VLOOKUP($B$43, OS_B, 6, FALSE)","v":""}]
[null,{"$f":"IF($B$27=\"No Additional Processor\",VLOOKUP($B$43, OS_B, 19, FALSE),VLOOKUP($B$43, OS_B2, 19, FALSE))","v":""},{"$f":"IF($B$27=\"No Additional Processor\",VLOOKUP($B$43, OS_B, 20, FALSE),VLOOKUP($B$43, OS_B2, 20, FALSE))","v":0},{"$f":"IF($B$27=\"No Additional Processor\",VLOOKUP($B$43, OS_B, 21, FALSE),VLOOKUP($B$43, OS_B2, 21, FALSE))","v":""},{"$f":"IF($B$27=\"No Additional Processor\",VLOOKUP($B$43, OS_B, 23, FALSE),VLOOKUP($B$43, OS_B2, 23, FALSE))","v":""},{"$f":"IF($B$27=\"No Additional Processor\",VLOOKUP($B$43, OS_B, 24, FALSE)*C44,VLOOKUP($B$43, OS_B2, 24, FALSE)*C44)","v":0},null,{"$f":"IF(D43=\"TS1L2-WIN1\",3,IF(D43=\"TS1L2-WINDC1\",4,0))","v":0}]
[null,{"$f":"IF($B$27=\"No Additional Processor\",VLOOKUP($B$43, OS_B, 25, FALSE),VLOOKUP($B$43, OS_B2, 25, FALSE))","v":""},{"$f":"IF($B$27=\"No Additional Processor\",VLOOKUP($B$43, OS_B, 26, FALSE),VLOOKUP($B$43, OS_B2, 26, FALSE))","v":0},{"$f":"IF($B$27=\"No Additional Processor\",VLOOKUP($B$43, OS_B, 27, FALSE),VLOOKUP($B$43, OS_B2, 27, FALSE))","v":""},{"$f":"IF($B$27=\"No Additional Processor\",VLOOKUP($B$43, OS_B, 29, FALSE),VLOOKUP($B$43, OS_B2, 29, FALSE))","v":""},{"$f":"IF($B$27=\"No Additional Processor\",VLOOKUP($B$43, OS_B, 30, FALSE)*C45,VLOOKUP($B$43, OS_B2, 30, FALSE)*C45)","v":0}]
[]
[null,"Client Access Licenses"]
[null,{"$f":"VLOOKUP($B$43, OS_B, 7, FALSE)","v":"None"},null,{"$f":"VLOOKUP($B$43, OS_B, 9, FALSE)","v":""},{"$f":"VLOOKUP($B$43, OS_B, 11, FALSE)","v":""},{"$f":"VLOOKUP($B$43, OS_B, 12, FALSE)*C48","v":0}]
[]
[null,{"$f":"VLOOKUP($B$43, OS_B, 13, FALSE)","v":"None"},null,{"$f":"VLOOKUP($B$43, OS_B, 15, FALSE)","v":""},{"$f":"VLOOKUP($B$43, OS_B, 17, FALSE)","v":""},{"$f":"VLOOKUP($B$43, OS_B, 18, FALSE)*C50","v":0}]
[]
[null,"Sistema opertivo SUSE Linux Enterprise Server"]
[null,"None\n",{"$f":"IF(D53=\"\",0,(C23+C24+C27)/2)","v":0},{"$f":"VLOOKUP($B$53, SUSE, 3, FALSE)","v":""},{"$f":"VLOOKUP($B$53, SUSE, 5, FALSE)","v":""},null,{"$f":"VLOOKUP($B$53, SUSE, 6, FALSE)*C53","v":0}]
[]
[null,"HPE OneView Advanced (with HPE iLO Advanced)"]
[null,"None",{"$f":"VLOOKUP($B$56, OpzOVAdv, 2, FALSE)","v":0},{"$f":"VLOOKUP($B$56, OpzOVAdv, 3, FALSE)","v":""},{"$f":"VLOOKUP($B$56, OpzOVAdv, 5, FALSE)","v":""},null,{"$f":"VLOOKUP($B$56, OpzOVAdv, 6, FALSE)","v":0}]
[]
[null,"Configurazione dello chassis"]
[null,"Chassis 16 slot HDD",{"$f":"IF(C60=0,1,0)","v":1},null,"830824-B21"]
[null,"Chassis 48 slot HDD",0,{"$f":"IF(C60=1,\"S2-48HDDbay\",\"\")","v":""},"830824-B21",null,{"$f":"IF(C60=1,1367,0)","v":0}]
[]
[null,"Controller RAID"]
[null,"HPE Smart Array P408i-p SR Gen10 (8 Internal Lanes/2GB Cache) 12G SAS PCIe Plug-in Controller",1,null,"830824-B21"]
[]
[null,{"$f":"IF(C59=1,\"Dischi rigidi (numero massimo totale 16)\",\"Dischi rigidi (numero massimo totale 48)\")","v":"Dischi rigidi (numero massimo totale 16)"}]
[null,"HPE 300GB SAS 15K SFF SC DS HDD",2,null,"870753-B21"]
[]
[null,"HPE 300GB SAS 15K SFF SC DS HDD",null,"TS1L2-HD300","870753-B21",{"$f":"HD300_B*156","v":0}]
[]
[null,"HPE 1.2TB SAS 10K SFF SC DS HDD",null,"TS1L2-HD1200","872479-B21",{"$f":"HD1000_B*292","v":0}]
[]
[null,"HPE 1.8TB SAS 10K SFF SC DS HDD",null,"TS1L2-HD1800","872481-B21",null,{"$f":"C72*467","v":0}]
[]
[null,"HPE 960GB SAS 12G Read Intensive SFF SC DS SSD",null,"TS1L2-SSD960","872390-B21",null,{"$f":"C74*1571","v":0}]
[]
[null,"HPE 1.92TB SAS 12G Read Intensive SFF SC DS SSD",null,"TS1L2-SSD1920","875326-B21",null,{"$f":"C76*2667","v":0}]
[]
[null,"DISCHI TOTALI",{"$f":"SUM(C66:C77)","v":2},{"$f":"IF(C59=1,IF(C78<=16,\"      OK\",\"     ERRORE:   Totale n° di dischi superiore al consentito\"),IF(C78<=48,\"      OK\",\"     ERRORE:   Totale n° di dischi superiore al consentito\"))","v":"      OK"}]
[]
[null,"Configurazione RAID"]
[null,"SCRIVERE QUI' LA CONFIGURAZIONE RAID RICHIESTA.\nBASE ALTERNATIVO DL580 3\n"]
[null,"RAID 1  (2 HDDs)",1,null,{"$f":"VLOOKUP($B$82,  RAID_BBB1, 2, FALSE)","v":"[780-BBJK]"}]
[null,"Hot Spare for 300GB HDD","No"]
[]
[null,"Configurazione RAID con HDD 1TB"]
[null,"",1,null,{"$f":"VLOOKUP($B$86,  RAID_BBB2, 2, FALSE)","v":""}]
[null,"Hot Spare for 1TB HDD","No"]
[]
[null,"Alimentatore"]
[null,"HPE 1600W FS Plat Ht Plg LH Pwr Sply Kit",{"$f":"IF(C98+C97>0,4,IF(G110+G104>5000,4,2))","v":2},null,"830272-B21"]
[]
[null,"Scheda FlexibleLOM"]
[null,"HPE FlexFbr 10Gb 534FLR-SFP+ FIO Adptr",1,null,"700751-B21"]
[]
[null,"PCIe Riser"]
[null,"7 slot Primary Riser",1]
[null,"9 slot Secondary Riser (48HDD)",{"$f":"IF(C60=1,1,0)","v":0},{"$f":"VLOOKUP($C$97, SlotRiser9, 2, FALSE)","v":""},{"$f":"VLOOKUP($C$97, SlotRiser9, 3, FALSE)","v":""},{"$f":"VLOOKUP($C$98, SlotRiser9, 4, FALSE)","v":""},{"$f":"VLOOKUP($C$97, SlotRiser9, 5, FALSE)","v":0}]
[null,"9 slot Secondary Riser",0,{"$f":"VLOOKUP($C$98, SlotRiser9, 2, FALSE)","v":""},{"$f":"VLOOKUP($C$98, SlotRiser9, 3, FALSE)","v":""},{"$f":"VLOOKUP($C$98, SlotRiser9, 4, FALSE)","v":""},{"$f":"IF(C60=1,0,VLOOKUP($C$98, SlotRiser9, 5, FALSE))","v":0}]
[]
[null,"Additional Card for PCIe Slot 1 (CPU3)"]
[null,"None",{"$f":"IF(B101=\"Aggiungere Coppia di Processori\",\"\",(VLOOKUP(B101,PCI_B5, 2, FALSE)))","v":""},{"$f":"IF(B101=\"Aggiungere Coppia di Processori\",\"\",(VLOOKUP(B101,PCI_B5, 3, FALSE)))","v":""},{"$f":"IF(B101=\"Aggiungere Coppia di Processori\",\"\",(VLOOKUP(B101,PCI_B5, 5, FALSE)))","v":""},{"$f":"IF(B101=\"Aggiungere Coppia di Processori\",\"\",(VLOOKUP(B101,PCI_B5, 6, FALSE)))","v":""},{"$f":"IF(B101=\"Aggiungere Coppia di Processori\",\"\",(VLOOKUP(B101,PCI_B5, 9, FALSE)))","v":0}]
[]
[null,"Additional Card for PCIe Slot 2 (CPU3) (GPU Slot)"]
[null,"None",{"$f":"IF(B104=\"Aggiungere Coppia di Processori\",\"\",(VLOOKUP(B104,PCI_B6, 2, FALSE)))","v":""},{"$f":"IF(B104=\"Aggiungere Coppia di Processori\",\"\",(VLOOKUP(B104,PCI_B6, 3, FALSE)))","v":""},{"$f":"IF(B104=\"Aggiungere Coppia di Processori\",\"\",(VLOOKUP(B104,PCI_B6, 5, FALSE)))","v":""},{"$f":"IF(B104=\"Aggiungere Coppia di Processori\",\"\",(VLOOKUP(B104,PCI_B6, 6, FALSE)))","v":""},{"$f":"IF(B104=\"Aggiungere Coppia di Processori\",\"\",(VLOOKUP(B104,PCI_B6, 9, FALSE)))","v":0}]
[]
[null,"Additional Card for PCIe Slot 3 (CPU3)"]
[null,"None",{"$f":"IF(B107=\"Aggiungere Coppia di Processori\",\"\",(VLOOKUP(B107,PCI_B5, 2, FALSE)))","v":""},{"$f":"IF(B107=\"Aggiungere Coppia di Processori\",\"\",(VLOOKUP(B107,PCI_B5, 3, FALSE)))","v":""},{"$f":"IF(B107=\"Aggiungere Coppia di Processori\",\"\",(VLOOKUP(B107,PCI_B5, 5, FALSE)))","v":""},{"$f":"IF(B107=\"Aggiungere Coppia di Processori\",\"\",(VLOOKUP(B107,PCI_B5, 6, FALSE)))","v":""},{"$f":"IF(B107=\"Aggiungere Coppia di Processori\",\"\",(VLOOKUP(B107,PCI_B5, 9, FALSE)))","v":0}]
[]
[null,"Additional Card for PCIe Slot 4 (CPU3) (GPU Slot)"]
[null,"None",{"$f":"IF(B110=\"Aggiungere Coppia di Processori\",\"\",(VLOOKUP(B110,PCI_B6, 2, FALSE)))","v":""},{"$f":"IF(B110=\"Aggiungere Coppia di Processori\",\"\",(VLOOKUP(B110,PCI_B6, 3, FALSE)))","v":""},{"$f":"IF(B110=\"Aggiungere Coppia di Processori\",\"\",(VLOOKUP(B110,PCI_B6, 5, FALSE)))","v":""},{"$f":"IF(B110=\"Aggiungere Coppia di Processori\",\"\",(VLOOKUP(B110,PCI_B6, 6, FALSE)))","v":""},{"$f":"IF(B110=\"Aggiungere Coppia di Processori\",\"\",(VLOOKUP(B110,PCI_B6, 9, FALSE)))","v":0}]
[]
[null,"Additional Card for PCIe Slot 5 (CPU1)"]
[null,"HPE Ethernet 1Gb 4-port 331T Adapter",1,null,"647594-B21"]
[]
[null,"Additional Card for PCIe Slot 6 (CPU1)"]
[null,"HPE Smart Array P408i-p SR Gen10 Ctrlr",1,null,"830824-B21"]
[]
[null,"Additional Card for PCIe Slot 7 (CPU1)"]
[null,"HPE DL580 Gen10 12G 24-port SAS Expander",1,null,"881101-B21"]
[]
[null,"Additional Card for PCIe Slot 8 (CPU4)"]
[null,"None",{"$f":"IF(B122=\"Aggiungere Coppia di Processori\",\"\",IF(B122=\"Aggiungere 9 slot Secondary Riser\",\"\",(VLOOKUP(B122,PCI_B5,2,FALSE))))","v":""},{"$f":"IF(B122=\"Aggiungere Coppia di Processori\",\"\",IF(B122=\"Aggiungere 9 slot Secondary Riser\",\"\",(VLOOKUP(B122,PCI_B5,3,FALSE))))","v":""},{"$f":"IF(B122=\"Aggiungere Coppia di Processori\",\"\",IF(B122=\"Aggiungere 9 slot Secondary Riser\",\"\",(VLOOKUP(B122,PCI_B5,5,FALSE))))","v":""},{"$f":"IF(B122=\"Aggiungere Coppia di Processori\",\"\",IF(B122=\"Aggiungere 9 slot Secondary Riser\",\"\",(VLOOKUP(B122,PCI_B5,6,FALSE))))","v":""},{"$f":"IF(B122=\"Aggiungere Coppia di Processori\",\"\",IF(B122=\"Aggiungere 9 slot Secondary Riser\",\"\",(VLOOKUP(B122,PCI_B5,9,FALSE))))","v":0}]
[]
[null,"Additional Card for PCIe Slot 9 (CPU4) (GPU Slot)"]
[null,"None",{"$f":"IF(B125=\"Aggiungere Coppia di Processori\",\"\",IF(B125=\"Aggiungere 9 slot Secondary Riser\",\"\",(VLOOKUP(B125,PCI_B6,2,FALSE))))","v":""},{"$f":"IF(B125=\"Aggiungere Coppia di Processori\",\"\",IF(B125=\"Aggiungere 9 slot Secondary Riser\",\"\",(VLOOKUP(B125,PCI_B6,3,FALSE))))","v":""},{"$f":"IF(B125=\"Aggiungere Coppia di Processori\",\"\",IF(B125=\"Aggiungere 9 slot Secondary Riser\",\"\",(VLOOKUP(B125,PCI_B6,5,FALSE))))","v":""},{"$f":"IF(B125=\"Aggiungere Coppia di Processori\",\"\",IF(B125=\"Aggiungere 9 slot Secondary Riser\",\"\",(VLOOKUP(B125,PCI_B6,6,FALSE))))","v":""},{"$f":"IF(B125=\"Aggiungere Coppia di Processori\",\"\",IF(B125=\"Aggiungere 9 slot Secondary Riser\",\"\",(VLOOKUP(B125,PCI_B6,9,FALSE))))","v":0}]
[]
[null,"Additional Card for PCIe Slot 10 (CPU4)"]
[null,"None",{"$f":"IF(B128=\"Aggiungere Coppia di Processori\",\"\",IF(B128=\"Aggiungere 9 slot Secondary Riser\",\"\",(VLOOKUP(B128,PCI_B5,2,FALSE))))","v":""},{"$f":"IF(B128=\"Aggiungere Coppia di Processori\",\"\",IF(B128=\"Aggiungere 9 slot Secondary Riser\",\"\",(VLOOKUP(B128,PCI_B5,3,FALSE))))","v":""},{"$f":"IF(B128=\"Aggiungere Coppia di Processori\",\"\",IF(B128=\"Aggiungere 9 slot Secondary Riser\",\"\",(VLOOKUP(B128,PCI_B5,5,FALSE))))","v":""},{"$f":"IF(B128=\"Aggiungere Coppia di Processori\",\"\",IF(B128=\"Aggiungere 9 slot Secondary Riser\",\"\",(VLOOKUP(B128,PCI_B5,6,FALSE))))","v":""},{"$f":"IF(B128=\"Aggiungere Coppia di Processori\",\"\",IF(B128=\"Aggiungere 9 slot Secondary Riser\",\"\",(VLOOKUP(B128,PCI_B5,9,FALSE))))","v":0}]
[]
[null,"Additional Card for PCIe Slot 11 (CPU4) (GPU Slot)"]
[null,"None",{"$f":"IF(B131=\"Aggiungere Coppia di Processori\",\"\",IF(B131=\"Aggiungere 9 slot Secondary Riser\",\"\",(VLOOKUP(B131,PCI_B6,2,FALSE))))","v":""},{"$f":"IF(B131=\"Aggiungere Coppia di Processori\",\"\",IF(B131=\"Aggiungere 9 slot Secondary Riser\",\"\",(VLOOKUP(B131,PCI_B6,3,FALSE))))","v":""},{"$f":"IF(B131=\"Aggiungere Coppia di Processori\",\"\",IF(B131=\"Aggiungere 9 slot Secondary Riser\",\"\",(VLOOKUP(B131,PCI_B6,5,FALSE))))","v":""},{"$f":"IF(B131=\"Aggiungere Coppia di Processori\",\"\",IF(B131=\"Aggiungere 9 slot Secondary Riser\",\"\",(VLOOKUP(B131,PCI_B6,6,FALSE))))","v":""},{"$f":"IF(B131=\"Aggiungere Coppia di Processori\",\"\",IF(B131=\"Aggiungere 9 slot Secondary Riser\",\"\",(VLOOKUP(B131,PCI_B6,9,FALSE))))","v":0}]
[]
[null,"Additional Card for PCIe Slot 12 (CPU2)"]
[null,"None",{"$f":"IF(B134=\"Aggiungere Coppia di Processori\",\"\",IF(B134=\"Aggiungere 9 slot Secondary Riser\",\"\",(VLOOKUP(B134,PCI_B5,2,FALSE))))","v":""},{"$f":"IF(B134=\"Aggiungere Coppia di Processori\",\"\",IF(B134=\"Aggiungere 9 slot Secondary Riser\",\"\",(VLOOKUP(B134,PCI_B5,3,FALSE))))","v":""},{"$f":"IF(B134=\"Aggiungere Coppia di Processori\",\"\",IF(B134=\"Aggiungere 9 slot Secondary Riser\",\"\",(VLOOKUP(B134,PCI_B5,5,FALSE))))","v":""},{"$f":"IF(B134=\"Aggiungere Coppia di Processori\",\"\",IF(B134=\"Aggiungere 9 slot Secondary Riser\",\"\",(VLOOKUP(B134,PCI_B5,6,FALSE))))","v":""},{"$f":"IF(B134=\"Aggiungere Coppia di Processori\",\"\",IF(B134=\"Aggiungere 9 slot Secondary Riser\",\"\",(VLOOKUP(B134,PCI_B5,9,FALSE))))","v":0}]
[]
[null,"Additional Card for PCIe Slot 13 (CPU2)"]
[null,"None",{"$f":"IF(B137=\"Aggiungere Coppia di Processori\",\"\",IF(B137=\"Aggiungere 9 slot Secondary Riser\",\"\",(VLOOKUP(B137,PCI_B5,2,FALSE))))","v":""},{"$f":"IF(B137=\"Aggiungere Coppia di Processori\",\"\",IF(B137=\"Aggiungere 9 slot Secondary Riser\",\"\",(VLOOKUP(B137,PCI_B5,3,FALSE))))","v":""},{"$f":"IF(B137=\"Aggiungere Coppia di Processori\",\"\",IF(B137=\"Aggiungere 9 slot Secondary Riser\",\"\",(VLOOKUP(B137,PCI_B5,5,FALSE))))","v":""},{"$f":"IF(B137=\"Aggiungere Coppia di Processori\",\"\",IF(B137=\"Aggiungere 9 slot Secondary Riser\",\"\",(VLOOKUP(B137,PCI_B5,6,FALSE))))","v":""},{"$f":"IF(B137=\"Aggiungere Coppia di Processori\",\"\",IF(B137=\"Aggiungere 9 slot Secondary Riser\",\"\",(VLOOKUP(B137,PCI_B5,9,FALSE))))","v":0}]
[]
[null,"Additional Card for PCIe Slot 14 (CPU2)"]
[null,"None",{"$f":"IF(B140=\"Aggiungere Coppia di Processori\",\"\",IF(B140=\"Aggiungere 9 slot Secondary Riser\",\"\",(VLOOKUP(B140,PCI_B5,2,FALSE))))","v":""},{"$f":"IF(B140=\"Aggiungere Coppia di Processori\",\"\",IF(B140=\"Aggiungere 9 slot Secondary Riser\",\"\",(VLOOKUP(B140,PCI_B5,3,FALSE))))","v":""},{"$f":"IF(B140=\"Aggiungere Coppia di Processori\",\"\",IF(B140=\"Aggiungere 9 slot Secondary Riser\",\"\",(VLOOKUP(B140,PCI_B5,5,FALSE))))","v":""},{"$f":"IF(B140=\"Aggiungere Coppia di Processori\",\"\",IF(B140=\"Aggiungere 9 slot Secondary Riser\",\"\",(VLOOKUP(B140,PCI_B5,6,FALSE))))","v":""},{"$f":"IF(B140=\"Aggiungere Coppia di Processori\",\"\",IF(B140=\"Aggiungere 9 slot Secondary Riser\",\"\",(VLOOKUP(B140,PCI_B5,9,FALSE))))","v":0}]
[]
[null,"Additional Card for PCIe Slot 15 (CPU2)"]
[null,"None",{"$f":"IF(B143=\"Aggiungere Coppia di Processori\",\"\",IF(B143=\"Aggiungere 9 slot Secondary Riser\",\"\",(VLOOKUP(B143,PCI_B4,2,FALSE))))","v":""},{"$f":"IF(B143=\"Aggiungere Coppia di Processori\",\"\",IF(B143=\"Aggiungere 9 slot Secondary Riser\",\"\",(VLOOKUP(B143,PCI_B4,3,FALSE))))","v":""},{"$f":"IF(B143=\"Aggiungere Coppia di Processori\",\"\",IF(B143=\"Aggiungere 9 slot Secondary Riser\",\"\",(VLOOKUP(B143,PCI_B4,5,FALSE))))","v":""},{"$f":"IF(B143=\"Aggiungere Coppia di Processori\",\"\",IF(B143=\"Aggiungere 9 slot Secondary Riser\",\"\",(VLOOKUP(B143,PCI_B4,6,FALSE))))","v":""},{"$f":"IF(B143=\"Aggiungere Coppia di Processori\",\"\",IF(B143=\"Aggiungere 9 slot Secondary Riser\",\"\",(VLOOKUP(B143,PCI_B4,9,FALSE))))","v":0}]
[]
[null,"Additional Card for PCIe Slot 16 (CPU2)"]
[null,"None",{"$f":"IF(B146=\"Aggiungere Coppia di Processori\",\"\",IF(B146=\"Aggiungere 9 slot Secondary Riser\",\"\",(VLOOKUP(B146,PCI_B4,2,FALSE))))","v":""},{"$f":"IF(B146=\"Aggiungere Coppia di Processori\",\"\",IF(B146=\"Aggiungere 9 slot Secondary Riser\",\"\",(VLOOKUP(B146,PCI_B4,3,FALSE))))","v":""},{"$f":"IF(B146=\"Aggiungere Coppia di Processori\",\"\",IF(B146=\"Aggiungere 9 slot Secondary Riser\",\"\",(VLOOKUP(B146,PCI_B4,5,FALSE))))","v":""},{"$f":"IF(B146=\"Aggiungere Coppia di Processori\",\"\",IF(B146=\"Aggiungere 9 slot Secondary Riser\",\"\",(VLOOKUP(B146,PCI_B4,6,FALSE))))","v":""},{"$f":"IF(B146=\"Aggiungere Coppia di Processori\",\"\",IF(B146=\"Aggiungere 9 slot Secondary Riser\",\"\",(VLOOKUP(B146,PCI_B4,9,FALSE))))","v":0}]
[]
[null,"Accessori per GPU"]
[null,"HPE DL38x Gen10 8-pin Cable Kit for P6000 GPU",{"$f":"IF(IF($E$104=\"Q0v76a\",1,0)+IF($E$110=\"Q0v76a\",1,0)+IF($E$125=\"Q0v76a\",1,0)++IF($E$131=\"Q0v76a\",1,0)=0,0,IF(IF($E$104=\"Q0v76a\",1,0)+IF($E$110=\"Q0v76a\",1,0)+IF($E$125=\"Q0v76a\",1,0)++IF($E$131=\"Q0v76a\",1,0)>3,2,1))","v":0},"TS1-871828","871828-B21",null,{"$f":"26*C149","v":0}]
[null,null,null,null,{"$f":"COUNTIF($E$104:$E$131,\"Q2N68A\")+COUNTIF($E$104:$E$131,\"Q0v80a\")","v":0}]
[null,"HPE DL38x Gen10 8-pin Keyed Cable Kit for P40 or V100 GPU",{"$f":"IF(E150=0,0,IF(E150>3,2,1))","v":0},"TS1-871829","871829-B21",null,{"$f":"31*C151","v":0}]
[]
[null,"HPE DL580 Gen10 GPU Bracket Kit for installation in slots 4 or 11",{"$f":"IF($E$110=\"Q2n68A\",1,0)+IF($E$131=\"Q2n68A\",1,0)+IF($E$110=\"Q0v80a\",1,0)+IF($E$131=\"Q0v80a\",1,0)+IF($E$110=\"Q0v76a\",1,0)+IF($E$131=\"Q0v76a\",1,0)","v":0},"TS1-P00268","P00268-B21",null,{"$f":"33*C153","v":0}]
[]
[null,"Bezel"]
[null,"None",1]
[]
[null,"Accessori per Server"]
[null,"HP BLc 10G SFP+ SR Transceiver",2,null,"455883-B21"]
[]
[null,"Unità ottica"]
[null,"HP Mobile USB DVDRW Drive",1,null,"701498-B21"]
[]
[null,"Estensione di Garanzia"]
[null,"None",{"$f":"VLOOKUP($B$165,  SO_B1,2, FALSE)","v":""},{"$f":"VLOOKUP($B$165,  SO_B1, 3, FALSE)","v":""},{"$f":"VLOOKUP($B$165,  SO_B1, 5, FALSE)","v":""},{"$f":"VLOOKUP($B$165,  SO_B1, 6, FALSE)","v":""}]
[]
[null,"Protezione dei dati - Keep Your Hard Drive "]
[null,"None",{"$f":"VLOOKUP($B$168,  SO_BBB2, 2, FALSE)","v":""},{"$f":"VLOOKUP($B$168,  SO_BBB2, 3, FALSE)","v":""},{"$f":"VLOOKUP($B$168,  SO_BBB2,5, FALSE)","v":""},{"$f":"VLOOKUP($B$168,  SO_BBB2, 6, FALSE)","v":""}]

{"sheet":"Lotto2 DL580 Prest 2","index":9,"n_rows":164,"n_cols":13,"rows_kept":164,"cut":false,"hidden":false,"merged":[[143,2,143,4],[149,1,149,4],[161,1,161,4],[162,2,162,4],[164,1,164,4],[152,1,152,4],[153,2,153,4],[155,1,155,4],[156,2,156,4],[158,1,158,4],[159,2,159,4],[110,2,110,4],[150,2,150,4],[134,2,134,4],[136,1,136,4],[137,2,137,4],[139,1,139,4],[112,1,112,4],[113,2,113,4],[115,1,115,4],[116,2,116,4],[118,1,118,4],[119,2,119,4],[121,1,121,4],[122,2,122,4],[124,1,124,4],[125,2,125,4],[100,1,100,4],[103,1,103,4],[106,1,106,4],[107,2,107,4],[109,1,109,4],[88,2,88,4],[94,1,94,4],[97,1,97,4],[91,1,91,4],[92,2,92,4],[56,1,56,4],[61,2,61,4],[63,1,63,4],[64,2,64,4],[81,8,87,10],[87,1,87,4],[78,1,78,4],[79,2,79,4],[80,1,80,3],[83,1,83,4],[84,2,84,4],[60,1,60,4],[53,1,53,4],[27,1,27,4],[28,2,28,4],[30,1,30,4],[33,1,33,4],[34,2,34,4],[40,1,40,4],[41,2,41,4],[45,1,45,4],[46,2,46,4],[48,1,48,4],[50,1,50,4],[31,2,31,3],[25,2,25,4],[4,0,4,4],[5,0,5,4],[10,0,11,5],[12,0,12,5],[18,2,18,4],[20,1,20,4],[21,2,21,4],[24,1,24,4],[140,2,140,4],[142,1,142,4],[127,1,127,4],[128,2,128,4],[130,1,130,4],[131,2,131,4],[133,1,133,4]]}
["IN ROSSO LE OPZIONI 20%",null,null,null,null,null,null,null,null,"TOTALE CONVENZIONE",{"$f":"K10","v":0},"Totale Ulteriori Opzioni ",{"$f":"K8","v":0}]
[]
[]
[]
["Tecnologie Server1 Lotto2 Prestazionale DL580"]
[]
[null,null,null,null,null,null,null,null,null,"Totale Server e Opzioni",{"$f":"F17*SRV_CC","v":0}]
[null,null,null,null,null,null,null,null,null,"Totale Ulteriori Opzioni ",{"$f":"G16*SRV_CC","v":0}]
[]
[null,null,null,null,null,null,null,null,null,"TOTALE CONVENZIONE",{"$f":"K8+K7","v":0}]
["Components: \nServer HP Proliant DL580 Gen10 (2CPU Intel® Xeon® Gold 6140M, 128GB , 2xHDD 300GB 15K RPM SAS 12Gbps 2.5in)"]
[]
[]
[]
["Proliant DL580 Gen10","Category: Server",null,null,null,6092]
[null,"Quantity: ",null,null,null,{"$f":"SUM(F20:F203)","v":0},{"$f":"SUM(G20:G203)","v":0}]
[null,null,null,null,null,{"$f":"SUM(F15:F16)","v":6092}]
[]
[null,"Base"]
[null,"HPE DL580 Gen10 8SFF CTO Server",1,null,"869854-B21"]
[]
[null,"Processore"]
[null,"HPE DL580 Gen10 Intel® Xeon-Gold 6140M (2.3GHz/18-core/140W) ",1,null,"878138-L21"]
[null,"HPE DL580 Gen10 Intel® Xeon-Gold 6140M (2.3GHz/18-core/140W) ",1,null,"878138-B21"]
[]
[null,"Processore aggiuntivo"]
[null,"No Additional Processor",{"$f":"VLOOKUP($B$27, CPU_C, 2, FALSE)","v":0},{"$f":"VLOOKUP($B$27, CPU_C, 3, FALSE)","v":""},{"$f":"VLOOKUP($B$27, CPU_C, 5, FALSE)","v":0},{"$f":"VLOOKUP(B27, CPU_C, 12, FALSE)","v":""}]
[]
[null,"Mezz Board Option"]
[null,{"$f":"VLOOKUP($B$27, CPU_C, 6, FALSE)","v":""},{"$f":"VLOOKUP($B$27, CPU_C, 7, FALSE)","v":""},null,{"$f":"VLOOKUP($B$27, CPU_C, 8, FALSE)","v":""}]
[]
[null,"Memoria Totale in GB",{"$f":"IF(F27=5056,IF(B33=128,\"ATTENZIONE: AUMENTARE LA RAM\",\"\"),\"\")","v":""}]
[null,128]
[]
[null,"Capacità di memoria"]
[null,{"$f":"IF($B$27=\"No Additional Processor\",VLOOKUP($B$33, MEM_C1, 8, FALSE),VLOOKUP($B$33, MEM_C2, 8, FALSE))","v":"HPE 32GB (1x32GB) Dual Rank x4 DDR4-2666 CAS-19-19-19 Registered Smart Memory Kit"},{"$f":"IF($B$27=\"No Additional Processor\",VLOOKUP($B$33, MEM_C1, 9, FALSE),VLOOKUP($B$33, MEM_C2, 9, FALSE))","v":4},null,{"$f":"IF($B$27=\"No Additional Processor\",VLOOKUP($B$33, MEM_C1, 10, FALSE),VLOOKUP($B$33, MEM_C2, 10, FALSE))","v":"815100-B21"}]
[]
[null,{"$f":"IF($B$27=\"No Additional Processor\",VLOOKUP($B$33, MEM_C1, 2, FALSE),VLOOKUP($B$33, MEM_C2, 2, FALSE))","v":""},{"$f":"IF($B$27=\"No Additional Processor\",VLOOKUP($B$33, MEM_C1, 3, FALSE),VLOOKUP($B$33, MEM_C2, 3, FALSE))","v":""},{"$f":"IF($B$27=\"No Additional Processor\",VLOOKUP($B$33, MEM_C1, 4, FALSE),VLOOKUP($B$33, MEM_C2, 4, FALSE))","v":""},{"$f":"IF($B$27=\"No Additional Processor\",VLOOKUP($B$33, MEM_C1, 6, FALSE),VLOOKUP($B$33, MEM_C2, 6, FALSE))","v":0},{"$f":"IF($B$27=\"No Additional Processor\",VLOOKUP($B$33, MEM_C1, 7, FALSE),VLOOKUP($B$33, MEM_C2, 7, FALSE))","v":""}]
[]
[null,{"$f":"IF($B$27=\"No Additional Processor\",VLOOKUP($B$33, MEM_C1, 11, FALSE),VLOOKUP($B$33, MEM_C2, 11, FALSE))","v":""},{"$f":"IF($B$27=\"No Additional Processor\",VLOOKUP($B$33, MEM_C1, 12, FALSE),VLOOKUP($B$33, MEM_C2, 12, FALSE))","v":""},{"$f":"IF($B$27=\"No Additional Processor\",VLOOKUP($B$33, MEM_C1, 13, FALSE),VLOOKUP($B$33, MEM_C2, 13, FALSE))","v":""},{"$f":"IF($B$27=\"No Additional Processor\",VLOOKUP($B$33, MEM_C1, 15, FALSE),VLOOKUP($B$33, MEM_C2, 15, FALSE))","v":""},{"$f":"IF($B$27=\"No Additional Processor\",VLOOKUP($B$33, MEM_C1, 16, FALSE),VLOOKUP($B$33, MEM_C2, 16, FALSE))","v":""}]
[]
[null,"Sistema operativo preinstallato"]
[null,"No Operating System",{"$f":"VLOOKUP($B$43, OS_C, 2, FALSE)","v":""},{"$f":"VLOOKUP($B$43, OS_C, 3, FALSE)","v":""},{"$f":"VLOOKUP($B$43, OS_C, 5, FALSE)","v":""},{"$f":"VLOOKUP($B$43, OS_C, 6, FALSE)","v":""}]
[null,{"$f":"IF($B$27=\"No Additional Processor\",VLOOKUP($B$43, OS_C, 19, FALSE),VLOOKUP($B$43, OS_C2, 19, FALSE))","v":""},{"$f":"IF($B$27=\"No Additional Processor\",VLOOKUP($B$43, OS_C, 20, FALSE),VLOOKUP($B$43, OS_C2, 20, FALSE))","v":0},{"$f":"IF($B$27=\"No Additional Processor\",VLOOKUP($B$43, OS_C, 21, FALSE),VLOOKUP($B$43, OS_C2, 21, FALSE))","v":""},{"$f":"IF($B$27=\"No Additional Processor\",VLOOKUP($B$43, OS_C, 23, FALSE),VLOOKUP($B$43, OS_C2, 23, FALSE))","v":""},{"$f":"IF($B$27=\"No Additional Processor\",VLOOKUP($B$43, OS_C, 24, FALSE)*C44,VLOOKUP($B$43, OS_C2, 24, FALSE)*C44)","v":0},null,{"$f":"IF(D43=\"TS1L2-WIN1\",3,IF(D43=\"TS1L2-WINDC1\",4,0))","v":0}]
[null,{"$f":"IF($B$27=\"No Additional Processor\",VLOOKUP($B$43, OS_C, 25, FALSE),VLOOKUP($B$43, OS_C2, 25, FALSE))","v":""},{"$f":"IF($B$27=\"No Additional Processor\",VLOOKUP($B$43, OS_C, 26, FALSE),VLOOKUP($B$43, OS_C2, 26, FALSE))","v":0},{"$f":"IF($B$27=\"No Additional Processor\",VLOOKUP($B$43, OS_C, 27, FALSE),VLOOKUP($B$43, OS_C2, 27, FALSE))","v":""},{"$f":"IF($B$27=\"No Additional Processor\",VLOOKUP($B$43, OS_C, 29, FALSE),VLOOKUP($B$43, OS_C2, 29, FALSE))","v":""},{"$f":"IF($B$27=\"No Additional Processor\",VLOOKUP($B$43, OS_C, 30, FALSE)*C45,VLOOKUP($B$43, OS_C2, 30, FALSE)*C45)","v":0}]
[]
[null,"Client Access Licenses"]
[null,{"$f":"VLOOKUP($B$43, OS_C, 7, FALSE)","v":"None"},null,{"$f":"VLOOKUP($B$43, OS_C, 9, FALSE)","v":""},{"$f":"VLOOKUP($B$43, OS_C, 11, FALSE)","v":""},{"$f":"VLOOKUP($B$43, OS_C, 12, FALSE)*C48","v":0}]
[]
[null,{"$f":"VLOOKUP($B$43, OS_C, 13, FALSE)","v":"None"},null,{"$f":"VLOOKUP($B$43, OS_C, 15, FALSE)","v":""},{"$f":"VLOOKUP($B$43, OS_C, 17, FALSE)","v":""},{"$f":"VLOOKUP($B$43, OS_C, 18, FALSE)*C50","v":0}]
[]
[null,"Sistema opertivo SUSE Linux Enterprise Server"]
[null,"None\n",{"$f":"IF(D53=\"\",0,(C23+C24+C27)/2)","v":0},{"$f":"VLOOKUP($B$53, SUSE, 3, FALSE)","v":""},{"$f":"VLOOKUP($B$53, SUSE, 5, FALSE)","v":""},null,{"$f":"VLOOKUP($B$53, SUSE, 6, FALSE)*C53","v":0}]
[]
[null,"HPE OneView Advanced (with HPE iLO Advanced)"]
[null,"None",{"$f":"VLOOKUP($B$56, OpzOVAdv, 2, FALSE)","v":0},{"$f":"VLOOKUP($B$56, OpzOVAdv, 3, FALSE)","v":""},{"$f":"VLOOKUP($B$56, OpzOVAdv, 5, FALSE)","v":""},null,{"$f":"VLOOKUP($B$56, OpzOVAdv, 6, FALSE)","v":0}]
[]
[null,"Configurazione dello chassis"]
[null,"Chassis 16 slot HDD",{"$f":"IF(C60=0,1,0)","v":1},null,"830824-B21"]
[null,"Chassis 48 slot HDD",0,{"$f":"IF(C60=1,\"S2-48HDDbay\",\"\")","v":""},"830824-B21",null,{"$f":"IF(C60=1,1367,0)","v":0}]
[]
[null,"Controller RAID (PCIe Slot 16)"]
[null,"HPE Smart Array P408i-p SR Gen10 (8 Internal Lanes/2GB Cache) 12G SAS PCIe Plug-in Controller",1,null,"830824-B21"]
[]
[null,{"$f":"IF(C59=1,\"Dischi rigidi (numero massimo totale 16)\",\"Dischi rigidi (numero massimo totale 48)\")","v":"Dischi rigidi (numero massimo totale 16)"}]
[null,"HPE 300GB SAS 15K SFF SC DS HDD",2,null,"870753-B21"]
[]
[null,"HPE 300GB SAS 15K SFF SC DS HDD",null,"TS1L2-HD300","870753-B21",{"$f":"HD300_C*156","v":0}]
[]
[null,"HPE 1.2TB SAS 10K SFF SC DS HDD",null,"TS1L2-HD1200","872479-B21",{"$f":"HD1000_c*292","v":0}]
[]
[null,"HPE 1.8TB SAS 10K SFF SC DS HDD",null,"TS1L2-HD1800","872481-B21",{"$f":"C72*467","v":0}]
[]
[null,"HPE 960GB SAS 12G Read Intensive SFF SC DS SSD",null,"TS1L2-SSD960","872390-B21",{"$f":"C74*1571","v":0}]
[]
[null,"HPE 1.92TB SAS 12G Read Intensive SFF SC DS SSD",null,"TS1L2-SSD1920","875326-B21",{"$f":"C76*2667","v":0}]
[]
[null,"DISCHI TOTALI",{"$f":"SUM(C66:C77)","v":2},{"$f":"IF(C59=1,IF(C78<=16,\"      OK\",\"     ERRORE:   Totale n° di dischi superiore al consentito\"),IF(C78<=48,\"      OK\",\"     ERRORE:   Totale n° di dischi superiore al consentito\"))","v":"      OK"}]
[]
[null,"Configurazione RAID"]
[null,"SCRIVERE QUI' LA CONFIGURAZIONE RAID RICHIESTA.\nDL580 Prestazionale 2"]
[null,"RAID 1  (2 HDDs)",1,null,{"$f":"VLOOKUP($B$82,  RAID_B1, 2, FALSE)","v":"[780-BBJK]"}]
[null,"Hot Spare for 300GB HDD","No"]
[]
[null,"Configurazione RAID con HDD 1TB"]
[null,"",1,null,{"$f":"VLOOKUP($B$86,  RAID_B2, 2, FALSE)","v":""}]
[null,"Hot Spare for 1TB HDD","No"]
[]
[null,"Alimentatore"]
[null,"HPE 1600W FS Plat Ht Plg LH Pwr Sply Kit",{"$f":"IF(C27=0,2,4)","v":2},null,"830272-B21"]
[null,"HPE 1600W FS Plat Ht Plg LH Pwr Sply Kit",{"$f":"IF(C27+C60>=2,0,IF(C27+C60=0,0,2))","v":0},"S2-PwrSply2","830272-B21",null,{"$f":"IF(C91=0,0,306)","v":0}]
[]
[null,"Scheda FlexibleLOM"]
[null,"HPE FlexFabric 10Gb 2P 534FLR-SFP+ Adptr",1,null,"700751-B21"]
[]
[null,"Additional Card for PCIe Slot 1 (CPU3)"]
[null,"None",{"$f":"IF(B97=\"Aggiungere Coppia di Processori\",\"\",(VLOOKUP(B97,PCI_B5, 2, FALSE)))","v":""},{"$f":"IF(B97=\"Aggiungere Coppia di Processori\",\"\",(VLOOKUP(B97,PCI_B5, 3, FALSE)))","v":""},{"$f":"IF(B97=\"Aggiungere Coppia di Processori\",\"\",(VLOOKUP(B97,PCI_B5, 5, FALSE)))","v":""},{"$f":"IF(B97=\"Aggiungere Coppia di Processori\",\"\",(VLOOKUP(B97,PCI_B5, 6, FALSE)))","v":""},{"$f":"IF(B97=\"Aggiungere Coppia di Processori\",\"\",(VLOOKUP(B97,PCI_B5, 9, FALSE)))","v":0}]
[]
[null,"Additional Card for PCIe Slot 2 (CPU3) (GPU Slot)"]
[null,"None",{"$f":"IF(B100=\"Aggiungere Coppia di Processori\",\"\",(VLOOKUP(B100,PCI_B6, 2, FALSE)))","v":""},{"$f":"IF(B100=\"Aggiungere Coppia di Processori\",\"\",(VLOOKUP(B100,PCI_B6, 3, FALSE)))","v":""},{"$f":"IF(B100=\"Aggiungere Coppia di Processori\",\"\",(VLOOKUP(B100,PCI_B6, 5, FALSE)))","v":""},{"$f":"IF(B100=\"Aggiungere Coppia di Processori\",\"\",(VLOOKUP(B100,PCI_B6, 6, FALSE)))","v":""},{"$f":"IF(B100=\"Aggiungere Coppia di Processori\",\"\",(VLOOKUP(B100,PCI_B6, 9, FALSE)))","v":0}]
[]
[null,"Additional Card for PCIe Slot 3 (CPU3)"]
[null,"None",{"$f":"IF(B103=\"Aggiungere Coppia di Processori\",\"\",(VLOOKUP(B103,PCI_B5, 2, FALSE)))","v":""},{"$f":"IF(B103=\"Aggiungere Coppia di Processori\",\"\",(VLOOKUP(B103,PCI_B5, 3, FALSE)))","v":""},{"$f":"IF(B103=\"Aggiungere Coppia di Processori\",\"\",(VLOOKUP(B103,PCI_B5, 5, FALSE)))","v":""},{"$f":"IF(B103=\"Aggiungere Coppia di Processori\",\"\",(VLOOKUP(B103,PCI_B5, 6, FALSE)))","v":""},{"$f":"IF(B103=\"Aggiungere Coppia di Processori\",\"\",(VLOOKUP(B103,PCI_B5, 9, FALSE)))","v":0}]
[]
[null,"Additional Card for PCIe Slot 4 (CPU3) (GPU Slot)"]
[null,"None",{"$f":"IF(B106=\"Aggiungere Coppia di Processori\",\"\",(VLOOKUP(B106,PCI_B6, 2, FALSE)))","v":""},{"$f":"IF(B106=\"Aggiungere Coppia di Processori\",\"\",(VLOOKUP(B106,PCI_B6, 3, FALSE)))","v":""},{"$f":"IF(B106=\"Aggiungere Coppia di Processori\",\"\",(VLOOKUP(B106,PCI_B6, 5, FALSE)))","v":""},{"$f":"IF(B106=\"Aggiungere Coppia di Processori\",\"\",(VLOOKUP(B106,PCI_B6, 6, FALSE)))","v":""},{"$f":"IF(B106=\"Aggiungere Coppia di Processori\",\"\",(VLOOKUP(B106,PCI_B6, 9, FALSE)))","v":0}]
[]
[null,"Additional Card for PCIe Slot 5 (CPU1)"]
[null,"HPE Ethernet 1Gb 4-port 331T Adapter",1,null,"647594-B21"]
[]
[null,"Additional Card for PCIe Slot 6 (CPU1)"]
[null,"HPE Ethernet 1Gb 2-port 332T Adapter",1,null,"647594-B21"]
[]
[null,"Additional Card for PCIe Slot 7 (CPU1)"]
[null,"HPE DL580 Gen10 12G 24-port SAS Expander",1,null,"881101-B21"]
[]
[null,"Additional Card for PCIe Slot 8 (CPU4)"]
[null,"None",{"$f":"IF(B118=\"Aggiungere Coppia di Processori\",\"\",(VLOOKUP(B118,PCI_B5, 2, FALSE)))","v":""},{"$f":"IF(B118=\"Aggiungere Coppia di Processori\",\"\",(VLOOKUP(B118,PCI_B5, 3, FALSE)))","v":""},{"$f":"IF(B118=\"Aggiungere Coppia di Processori\",\"\",(VLOOKUP(B118,PCI_B5, 5, FALSE)))","v":""},{"$f":"IF(B118=\"Aggiungere Coppia di Processori\",\"\",(VLOOKUP(B118,PCI_B5, 6, FALSE)))","v":""},{"$f":"IF(B118=\"Aggiungere Coppia di Processori\",\"\",(VLOOKUP(B118,PCI_B5, 9, FALSE)))","v":0}]
[]
[null,"Additional Card for PCIe Slot 9 (CPU4) (GPU Slot)"]
[null,"None",{"$f":"IF(B121=\"Aggiungere Coppia di Processori\",\"\",IF(B121=\"Aggiungere 9 slot Secondary Riser\",\"\",(VLOOKUP(B121,PCI_B6,2,FALSE))))","v":""},{"$f":"IF(B121=\"Aggiungere Coppia di Processori\",\"\",IF(B121=\"Aggiungere 9 slot Secondary Riser\",\"\",(VLOOKUP(B121,PCI_B6,3,FALSE))))","v":""},{"$f":"IF(B121=\"Aggiungere Coppia di Processori\",\"\",IF(B121=\"Aggiungere 9 slot Secondary Riser\",\"\",(VLOOKUP(B121,PCI_B6,5,FALSE))))","v":""},{"$f":"IF(B121=\"Aggiungere Coppia di Processori\",\"\",IF(B121=\"Aggiungere 9 slot Secondary Riser\",\"\",(VLOOKUP(B121,PCI_B6,6,FALSE))))","v":""},{"$f":"IF(B121=\"Aggiungere Coppia di Processori\",\"\",IF(B121=\"Aggiungere 9 slot Secondary Riser\",\"\",(VLOOKUP(B121,PCI_B6,9,FALSE))))","v":0}]
[]
[null,"Additional Card for PCIe Slot 10 (CPU4)"]
[null,"None",{"$f":"IF(B124=\"Aggiungere Coppia di Processori\",\"\",(VLOOKUP(B124,PCI_B5, 2, FALSE)))","v":""},{"$f":"IF(B124=\"Aggiungere Coppia di Processori\",\"\",(VLOOKUP(B124,PCI_B5, 3, FALSE)))","v":""},{"$f":"IF(B124=\"Aggiungere Coppia di Processori\",\"\",(VLOOKUP(B124,PCI_B5, 5, FALSE)))","v":""},{"$f":"IF(B124=\"Aggiungere Coppia di Processori\",\"\",(VLOOKUP(B124,PCI_B5, 6, FALSE)))","v":""},{"$f":"IF(B124=\"Aggiungere Coppia di Processori\",\"\",(VLOOKUP(B124,PCI_B5, 9, FALSE)))","v":0}]
[]
[null,"Additional Card for PCIe Slot 11 (CPU4) (GPU Slot)"]
[null,"None",{"$f":"IF(B127=\"Aggiungere Coppia di Processori\",\"\",IF(B127=\"Aggiungere 9 slot Secondary Riser\",\"\",(VLOOKUP(B127,PCI_B6,2,FALSE))))","v":""},{"$f":"IF(B127=\"Aggiungere Coppia di Processori\",\"\",IF(B127=\"Aggiungere 9 slot Secondary Riser\",\"\",(VLOOKUP(B127,PCI_B6,3,FALSE))))","v":""},{"$f":"IF(B127=\"Aggiungere Coppia di Processori\",\"\",IF(B127=\"Aggiungere 9 slot Secondary Riser\",\"\",(VLOOKUP(B127,PCI_B6,5,FALSE))))","v":""},{"$f":"IF(B127=\"Aggiungere Coppia di Processori\",\"\",IF(B127=\"Aggiungere 9 slot Secondary Riser\",\"\",(VLOOKUP(B127,PCI_B6,6,FALSE))))","v":""},{"$f":"IF(B127=\"Aggiungere Coppia di Processori\",\"\",IF(B127=\"Aggiungere 9 slot Secondary Riser\",\"\",(VLOOKUP(B127,PCI_B6,9,FALSE))))","v":0}]
[]
[null,"Additional Card for PCIe Slot 12 (CPU2)"]
[null,"None",{"$f":"VLOOKUP(B130,  PCI_B2, 2, FALSE)","v":""},{"$f":"VLOOKUP(B130,  PCI_B2, 3, FALSE)","v":""},{"$f":"VLOOKUP(B130,  PCI_B2, 5, FALSE)","v":""},{"$f":"VLOOKUP(B130,  PCI_B2, 6, FALSE)","v":""},{"$f":"VLOOKUP(B130,  PCI_B2, 9, FALSE)","v":0}]
[]
[null,"Additional Card for PCIe Slot 13 (CPU2)"]
[null,"None",{"$f":"VLOOKUP(B133,  PCI_B2, 2, FALSE)","v":""},{"$f":"VLOOKUP(B133,  PCI_B2, 3, FALSE)","v":""},{"$f":"VLOOKUP(B133,  PCI_B2, 5, FALSE)","v":""},{"$f":"VLOOKUP(B133,  PCI_B2, 6, FALSE)","v":""},{"$f":"VLOOKUP(B133,  PCI_B2, 9, FALSE)","v":0}]
[]
[null,"Additional Card for PCIe Slot 14 (CPU2)"]
[null,"None",{"$f":"IF(B136=\"Aggiungere Coppia di Processori\",\"\",(VLOOKUP(B136,PCI_B4,2,FALSE)))","v":""},{"$f":"IF(B136=\"Aggiungere Coppia di Processori\",\"\",(VLOOKUP(B136,PCI_B4,3,FALSE)))","v":""},{"$f":"IF($B$136=\"Aggiungere Coppia di Processori\",\"\",(VLOOKUP($B$136,PCI_B4,5,FALSE)))","v":""},{"$f":"IF($B$136=\"Aggiungere Coppia di Processori\",\"\",(VLOOKUP($B$136,PCI_B4,6,FALSE)))","v":""},{"$f":"IF($B$136=\"Aggiungere Coppia di Processori\",\"\",(VLOOKUP($B$136,PCI_B4,9,FALSE)))","v":0}]
[]
[null,"Additional Card for PCIe Slot 15 (CPU2)"]
[null,"None",{"$f":"IF(B139=\"Aggiungere Coppia di Processori\",\"\",(VLOOKUP(B139,PCI_B4,2,FALSE)))","v":""},{"$f":"IF(B139=\"Aggiungere Coppia di Processori\",\"\",(VLOOKUP(B139,PCI_B4,3,FALSE)))","v":""},{"$f":"IF($B$139=\"Aggiungere Coppia di Processori\",\"\",(VLOOKUP($B$139,PCI_B4,5,FALSE)))","v":""},{"$f":"IF($B$139=\"Aggiungere Coppia di Processori\",\"\",(VLOOKUP($B$139,PCI_B4,6,FALSE)))","v":""},{"$f":"IF($B$139=\"Aggiungere Coppia di Processori\",\"\",(VLOOKUP($B$139,PCI_B4,9,FALSE)))","v":0}]
[]
[null,"Additional Card for PCIe Slot 16 (CPU2)"]
[null,"HPE Smart Array P408i-p SR Gen10 Ctrlr",1,null,"830824-B21"]
[]
[null,"Accessori per GPU"]
[null,"HPE DL38x Gen10 8-pin Cable Kit for P6000 GPU",{"$f":"IF(IF($E$100=\"Q0v76a\",1,0)+IF($E$106=\"Q0v76a\",1,0)+IF($E$121=\"Q0v76a\",1,0)++IF($E$127=\"Q0v76a\",1,0)=0,0,IF(IF($E$100=\"Q0v76a\",1,0)+IF($E$106=\"Q0v76a\",1,0)+IF($E$121=\"Q0v76a\",1,0)++IF($E$127=\"Q0v76a\",1,0)>3,2,1))","v":0},"TS1-871828","871828-B21",null,{"$f":"26*C145","v":0}]
[null,null,null,null,{"$f":"COUNTIF($E$100:$E$127,\"Q2N68A\")+COUNTIF($E$100:$E$127,\"Q0v80a\")","v":0}]
[null,"HPE DL38x Gen10 8-pin Keyed Cable Kit for P40 or V100 GPU",{"$f":"IF(E146=0,0,IF(E146>3,2,1))","v":0},"TS1-871829","871829-B21",null,{"$f":"31*C147","v":0}]
[]
[null,"HPE DL580 Gen10 GPU Bracket Kit for installation in slots 4 or 11",{"$f":"IF($E$106=\"Q2n68A\",1,0)+IF($E$127=\"Q2n68A\",1,0)+IF($E$106=\"Q0v80a\",1,0)+IF($E$127=\"Q0v80a\",1,0)+IF($E$106=\"Q0v76a\",1,0)+IF($E$127=\"Q0v76a\",1,0)","v":0},"TS1-P00268","P00268-B21",null,{"$f":"33*C149","v":0}]
[]
[null,"Bezel"]
[null,"None",1]
[]
[null,"Accessori per Server"]
[null,"HP BLc 10G SFP+ SR Transceiver",2,null,"455883-B21"]
[]
[null,"Unità ottica"]
[null,"HP Mobile USB DVDRW Drive",1,null,"701498-B21"]
[]
[null,"Estensione di Garanzia"]
[null,"None",{"$f":"VLOOKUP($B$161,  SO_B1,2, FALSE)","v":""},{"$f":"VLOOKUP($B$161,  SO_B1, 3, FALSE)","v":""},{"$f":"VLOOKUP($B$161,  SO_B1, 5, FALSE)","v":""},{"$f":"VLOOKUP($B$161,  SO_B1, 6, FALSE)","v":""}]
[]
[null,"Protezione dei dati - Keep Your Hard Drive "]
[null,"None",{"$f":"VLOOKUP($B$164,  SO_B2, 2, FALSE)","v":""},{"$f":"VLOOKUP($B$164,  SO_B2, 3, FALSE)","v":""},{"$f":"VLOOKUP($B$164,  SO_B2,5, FALSE)","v":""},{"$f":"VLOOKUP($B$164,  SO_B2, 6, FALSE)","v":""}]

{"sheet":"Lotto2 DL580 Prest 3","index":10,"n_rows":164,"n_cols":13,"rows_kept":164,"cut":false,"hidden":false,"merged":[[161,1,161,4],[162,2,162,4],[164,1,164,4],[152,1,152,4],[153,2,153,4],[155,1,155,4],[156,2,156,4],[158,1,158,4],[159,2,159,4],[150,2,150,4],[133,1,133,4],[134,2,134,4],[136,1,136,4],[137,2,137,4],[139,1,139,4],[140,2,140,4],[142,1,142,4],[143,2,143,4],[149,1,149,4],[100,1,100,4],[103,1,103,4],[106,1,106,4],[107,2,107,4],[109,1,109,4],[88,2,88,4],[94,1,94,4],[97,1,97,4],[91,1,91,4],[92,2,92,4],[79,8,83,10],[80,1,80,3],[83,1,83,4],[84,2,84,4],[84,8,87,10],[87,1,87,4],[79,2,79,4],[56,1,56,4],[61,2,61,4],[63,1,63,4],[64,2,64,4],[78,1,78,4],[60,1,60,4],[53,1,53,4],[27,1,27,4],[28,2,28,4],[30,1,30,4],[33,1,33,4],[34,2,34,4],[40,1,40,4],[41,2,41,4],[45,1,45,4],[46,2,46,4],[48,1,48,4],[50,1,50,4],[31,2,31,3],[25,2,25,4],[4,0,4,4],[5,0,5,4],[10,0,11,5],[12,0,12,5],[18,2,18,4],[20,1,20,4],[21,2,21,4],[24,1,24,4],[110,2,110,4],[112,1,112,4],[113,2,113,4],[115,1,115,4],[116,2,116,4],[118,1,118,4],[119,2,119,4],[121,1,121,4],[122,2,122,4],[124,1,124,4],[125,2,125,4],[127,1,127,4],[128,2,128,4],[130,1,130,4],[131,2,131,4]]}
["IN ROSSO LE OPZIONI 20%",null,null,null,null,null,null,null,null,"TOTALE CONVENZIONE",{"$f":"K10","v":0},"Totale Ulteriori Opzioni ",{"$f":"K8","v":0}]
[]
[]
[]
["Tecnologie Server1 Lotto2 Prestazionale DL580"]
[]
[null,null,null,null,null,null,null,null,null,"Totale Server e Opzioni",{"$f":"F17*SRV_CCC","v":0}]
[null,null,null,null,null,null,null,null,null,"Totale Ulteriori Opzioni ",{"$f":"G16*SRV_CCC","v":0}]
[]
[null,null,null,null,null,null,null,null,null,"TOTALE CONVENZIONE",{"$f":"K8+K7","v":0}]
["Components: \nServer HP Proliant DL580 Gen10 (2CPU Intel® Xeon® Gold 6140M, 128GB , 2xHDD 300GB 15K RPM SAS 12Gbps 2.5in)"]
[]
[]
[]
["Proliant DL580 Gen10","Category: Server",null,null,null,6092]
[null,"Quantity: ",null,null,null,{"$f":"SUM(F20:F203)","v":0},{"$f":"SUM(G20:G203)","v":0}]
[null,null,null,null,null,{"$f":"SUM(F15:F16)","v":6092}]
[]
[null,"Base"]
[null,"HPE DL580 Gen10 8SFF CTO Server",1,null,"869854-B21"]
[]
[null,"Processore"]
[null,"HPE DL580 Gen10 Intel® Xeon-Gold 6140M (2.3GHz/18-core/140W) ",1,null,"878138-L21"]
[null,"HPE DL580 Gen10 Intel® Xeon-Gold 6140M (2.3GHz/18-core/140W) ",1,null,"878138-B21"]
[]
[null,"Processore aggiuntivo"]
[null,"No Additional Processor",{"$f":"VLOOKUP($B$27, CPU_C, 2, FALSE)","v":0},{"$f":"VLOOKUP($B$27, CPU_C, 3, FALSE)","v":""},{"$f":"VLOOKUP($B$27, CPU_C, 5, FALSE)","v":0},{"$f":"VLOOKUP(B27, CPU_C, 12, FALSE)","v":""}]
[]
[null,"Mezz Board Option"]
[null,{"$f":"VLOOKUP($B$27, CPU_C, 6, FALSE)","v":""},{"$f":"VLOOKUP($B$27, CPU_C, 7, FALSE)","v":""},null,{"$f":"VLOOKUP($B$27, CPU_C, 8, FALSE)","v":""}]
[]
[null,"Memoria Totale in GB",{"$f":"IF(F27=5056,IF(B33=128,\"ATTENZIONE: AUMENTARE LA RAM\",\"\"),\"\")","v":""}]
[null,128]
[]
[null,"Capacità di memoria"]
[null,{"$f":"IF($B$27=\"No Additional Processor\",VLOOKUP($B$33, MEM_C1, 8, FALSE),VLOOKUP($B$33, MEM_C2, 8, FALSE))","v":"HPE 32GB (1x32GB) Dual Rank x4 DDR4-2666 CAS-19-19-19 Registered Smart Memory Kit"},{"$f":"IF($B$27=\"No Additional Processor\",VLOOKUP($B$33, MEM_C1, 9, FALSE),VLOOKUP($B$33, MEM_C2, 9, FALSE))","v":4},null,{"$f":"IF($B$27=\"No Additional Processor\",VLOOKUP($B$33, MEM_C1, 10, FALSE),VLOOKUP($B$33, MEM_C2, 10, FALSE))","v":"815100-B21"}]
[]
[null,{"$f":"IF($B$27=\"No Additional Processor\",VLOOKUP($B$33, MEM_C1, 2, FALSE),VLOOKUP($B$33, MEM_C2, 2, FALSE))","v":""},{"$f":"IF($B$27=\"No Additional Processor\",VLOOKUP($B$33, MEM_C1, 3, FALSE),VLOOKUP($B$33, MEM_C2, 3, FALSE))","v":""},{"$f":"IF($B$27=\"No Additional Processor\",VLOOKUP($B$33, MEM_C1, 4, FALSE),VLOOKUP($B$33, MEM_C2, 4, FALSE))","v":""},{"$f":"IF($B$27=\"No Additional Processor\",VLOOKUP($B$33, MEM_C1, 6, FALSE),VLOOKUP($B$33, MEM_C2, 6, FALSE))","v":0},{"$f":"IF($B$27=\"No Additional Processor\",VLOOKUP($B$33, MEM_C1, 7, FALSE),VLOOKUP($B$33, MEM_C2, 7, FALSE))","v":""}]
[]
[null,{"$f":"IF($B$27=\"No Additional Processor\",VLOOKUP($B$33, MEM_C1, 11, FALSE),VLOOKUP($B$33, MEM_C2, 11, FALSE))","v":""},{"$f":"IF($B$27=\"No Additional Processor\",VLOOKUP($B$33, MEM_C1, 12, FALSE),VLOOKUP($B$33, MEM_C2, 12, FALSE))","v":""},{"$f":"IF($B$27=\"No Additional Processor\",VLOOKUP($B$33, MEM_C1, 13, FALSE),VLOOKUP($B$33, MEM_C2, 13, FALSE))","v":""},{"$f":"IF($B$27=\"No Additional Processor\",VLOOKUP($B$33, MEM_C1, 15, FALSE),VLOOKUP($B$33, MEM_C2, 15, FALSE))","v":""},{"$f":"IF($B$27=\"No Additional Processor\",VLOOKUP($B$33, MEM_C1, 16, FALSE),VLOOKUP($B$33, MEM_C2, 16, FALSE))","v":""}]
[]
[null,"Sistema operativo preinstallato"]
[null,"No Operating System",{"$f":"VLOOKUP($B$43, OS_C, 2, FALSE)","v":""},{"$f":"VLOOKUP($B$43, OS_C, 3, FALSE)","v":""},{"$f":"VLOOKUP($B$43, OS_C, 5, FALSE)","v":""},{"$f":"VLOOKUP($B$43, OS_C, 6, FALSE)","v":""}]
[null,{"$f":"IF($B$27=\"No Additional Processor\",VLOOKUP($B$43, OS_C, 19, FALSE),VLOOKUP($B$43, OS_C2, 19, FALSE))","v":""},{"$f":"IF($B$27=\"No Additional Processor\",VLOOKUP($B$43, OS_C, 20, FALSE),VLOOKUP($B$43, OS_C2, 20, FALSE))","v":0},{"$f":"IF($B$27=\"No Additional Processor\",VLOOKUP($B$43, OS_C, 21, FALSE),VLOOKUP($B$43, OS_C2, 21, FALSE))","v":""},{"$f":"IF($B$27=\"No Additional Processor\",VLOOKUP($B$43, OS_C, 23, FALSE),VLOOKUP($B$43, OS_C2, 23, FALSE))","v":""},{"$f":"IF($B$27=\"No Additional Processor\",VLOOKUP($B$43, OS_C, 24, FALSE)*C44,VLOOKUP($B$43, OS_C2, 24, FALSE)*C44)","v":0},null,{"$f":"IF(D43=\"TS1L2-WIN1\",3,IF(D43=\"TS1L2-WINDC1\",4,0))","v":0}]
[null,{"$f":"IF($B$27=\"No Additional Processor\",VLOOKUP($B$43, OS_C, 25, FALSE),VLOOKUP($B$43, OS_C2, 25, FALSE))","v":""},{"$f":"IF($B$27=\"No Additional Processor\",VLOOKUP($B$43, OS_C, 26, FALSE),VLOOKUP($B$43, OS_C2, 26, FALSE))","v":0},{"$f":"IF($B$27=\"No Additional Processor\",VLOOKUP($B$43, OS_C, 27, FALSE),VLOOKUP($B$43, OS_C2, 27, FALSE))","v":""},{"$f":"IF($B$27=\"No Additional Processor\",VLOOKUP($B$43, OS_C, 29, FALSE),VLOOKUP($B$43, OS_C2, 29, FALSE))","v":""},{"$f":"IF($B$27=\"No Additional Processor\",VLOOKUP($B$43, OS_C, 30, FALSE)*C45,VLOOKUP($B$43, OS_C2, 30, FALSE)*C45)","v":0}]
[]
[null,"Client Access Licenses"]
[null,{"$f":"VLOOKUP($B$43, OS_C, 7, FALSE)","v":"None"},null,{"$f":"VLOOKUP($B$43, OS_C, 9, FALSE)","v":""},{"$f":"VLOOKUP($B$43, OS_C, 11, FALSE)","v":""},{"$f":"VLOOKUP($B$43, OS_C, 12, FALSE)*C48","v":0}]
[]
[null,{"$f":"VLOOKUP($B$43, OS_C, 13, FALSE)","v":"None"},null,{"$f":"VLOOKUP($B$43, OS_C, 15, FALSE)","v":""},{"$f":"VLOOKUP($B$43, OS_C, 17, FALSE)","v":""},{"$f":"VLOOKUP($B$43, OS_C, 18, FALSE)*C50","v":0}]
[]
[null,"Sistema opertivo SUSE Linux Enterprise Server"]
[null,"None\n",{"$f":"IF(D53=\"\",0,(C23+C24+C27)/2)","v":0},{"$f":"VLOOKUP($B$53, SUSE, 3, FALSE)","v":""},{"$f":"VLOOKUP($B$53, SUSE, 5, FALSE)","v":""},null,{"$f":"VLOOKUP($B$53, SUSE, 6, FALSE)*C53","v":0}]
[]
[null,"HPE OneView Advanced (with HPE iLO Advanced)"]
[null,"None",{"$f":"VLOOKUP($B$56, OpzOVAdv, 2, FALSE)","v":0},{"$f":"VLOOKUP($B$56, OpzOVAdv, 3, FALSE)","v":""},{"$f":"VLOOKUP($B$56, OpzOVAdv, 5, FALSE)","v":""},null,{"$f":"VLOOKUP($B$56, OpzOVAdv, 6, FALSE)","v":0}]
[]
[null,"Configurazione dello chassis"]
[null,"Chassis 16 slot HDD",{"$f":"IF(C60=0,1,0)","v":1},null,"830824-B21"]
[null,"Chassis 48 slot HDD",0,{"$f":"IF(C60=1,\"S2-48HDDbay\",\"\")","v":""},"830824-B21",null,{"$f":"IF(C60=1,1367,0)","v":0}]
[]
[null,"Controller RAID (PCIe Slot 16)"]
[null,"HPE Smart Array P408i-p SR Gen10 (8 Internal Lanes/2GB Cache) 12G SAS PCIe Plug-in Controller",1,null,"830824-B21"]
[]
[null,{"$f":"IF(C59=1,\"Dischi rigidi (numero massimo totale 16)\",\"Dischi rigidi (numero massimo totale 48)\")","v":"Dischi rigidi (numero massimo totale 16)"}]
[null,"HPE 300GB SAS 15K SFF SC DS HDD",2,null,"870753-B21"]
[]
[null,"HPE 300GB SAS 15K SFF SC DS HDD",null,"TS1L2-HD300","870753-B21",{"$f":"HD300_C*156","v":0}]
[]
[null,"HPE 1.2TB SAS 10K SFF SC DS HDD",null,"TS1L2-HD1200","872479-B21",{"$f":"HD1000_c*292","v":0}]
[]
[null,"HPE 1.8TB SAS 10K SFF SC DS HDD",null,"TS1L2-HD1800","872481-B21",{"$f":"C72*467","v":0}]
[]
[null,"HPE 960GB SAS 12G Read Intensive SFF SC DS SSD",null,"TS1L2-SSD960","872390-B21",{"$f":"C74*1571","v":0}]
[]
[null,"HPE 1.92TB SAS 12G Read Intensive SFF SC DS SSD",null,"TS1L2-SSD1920","875326-B21",{"$f":"C76*2667","v":0}]
[]
[null,"DISCHI TOTALI",{"$f":"SUM(C66:C77)","v":2},{"$f":"IF(C59=1,IF(C78<=16,\"      OK\",\"     ERRORE:   Totale n° di dischi superiore al consentito\"),IF(C78<=48,\"      OK\",\"     ERRORE:   Totale n° di dischi superiore al consentito\"))","v":"      OK"}]
[]
[null,"Configurazione RAID"]
[null,"SCRIVERE QUI' LA CONFIGURAZIONE RAID RICHIESTA.\nDL580 Prestazionale 3"]
[null,"RAID 1  (2 HDDs)",1,null,{"$f":"VLOOKUP($B$82,  RAID_B1, 2, FALSE)","v":"[780-BBJK]"}]
[null,"Hot Spare for 300GB HDD","No"]
[]
[null,"Configurazione RAID con HDD 1TB"]
[null,"",1,null,{"$f":"VLOOKUP($B$86,  RAID_B2, 2, FALSE)","v":""}]
[null,"Hot Spare for 1TB HDD","No"]
[]
[null,"Alimentatore"]
[null,"HPE 1600W FS Plat Ht Plg LH Pwr Sply Kit",{"$f":"IF(C27=0,2,4)","v":2},null,"830272-B21"]
[null,"HPE 1600W FS Plat Ht Plg LH Pwr Sply Kit",{"$f":"IF(C27+C60>=2,0,IF(C27+C60=0,0,2))","v":0},"S2-PwrSply2","830272-B21",null,{"$f":"IF(C91=0,0,306)","v":0}]
[]
[null,"Scheda FlexibleLOM"]
[null,"HPE FlexFabric 10Gb 2P 534FLR-SFP+ Adptr",1,null,"700751-B21"]
[]
[null,"Additional Card for PCIe Slot 1 (CPU3)"]
[null,"None",{"$f":"IF(B97=\"Aggiungere Coppia di Processori\",\"\",(VLOOKUP(B97,PCI_B5, 2, FALSE)))","v":""},{"$f":"IF(B97=\"Aggiungere Coppia di Processori\",\"\",(VLOOKUP(B97,PCI_B5, 3, FALSE)))","v":""},{"$f":"IF(B97=\"Aggiungere Coppia di Processori\",\"\",(VLOOKUP(B97,PCI_B5, 5, FALSE)))","v":""},{"$f":"IF(B97=\"Aggiungere Coppia di Processori\",\"\",(VLOOKUP(B97,PCI_B5, 6, FALSE)))","v":""},{"$f":"IF(B97=\"Aggiungere Coppia di Processori\",\"\",(VLOOKUP(B97,PCI_B5, 9, FALSE)))","v":0}]
[]
[null,"Additional Card for PCIe Slot 2 (CPU3) (GPU Slot)"]
[null,"None",{"$f":"IF(B100=\"Aggiungere Coppia di Processori\",\"\",(VLOOKUP(B100,PCI_B6, 2, FALSE)))","v":""},{"$f":"IF(B100=\"Aggiungere Coppia di Processori\",\"\",(VLOOKUP(B100,PCI_B6, 3, FALSE)))","v":""},{"$f":"IF(B100=\"Aggiungere Coppia di Processori\",\"\",(VLOOKUP(B100,PCI_B6, 5, FALSE)))","v":""},{"$f":"IF(B100=\"Aggiungere Coppia di Processori\",\"\",(VLOOKUP(B100,PCI_B6, 6, FALSE)))","v":""},{"$f":"IF(B100=\"Aggiungere Coppia di Processori\",\"\",(VLOOKUP(B100,PCI_B6, 9, FALSE)))","v":0}]
[]
[null,"Additional Card for PCIe Slot 3 (CPU3)"]
[null,"None",{"$f":"IF(B103=\"Aggiungere Coppia di Processori\",\"\",(VLOOKUP(B103,PCI_B5, 2, FALSE)))","v":""},{"$f":"IF(B103=\"Aggiungere Coppia di Processori\",\"\",(VLOOKUP(B103,PCI_B5, 3, FALSE)))","v":""},{"$f":"IF(B103=\"Aggiungere Coppia di Processori\",\"\",(VLOOKUP(B103,PCI_B5, 5, FALSE)))","v":""},{"$f":"IF(B103=\"Aggiungere Coppia di Processori\",\"\",(VLOOKUP(B103,PCI_B5, 6, FALSE)))","v":""},{"$f":"IF(B103=\"Aggiungere Coppia di Processori\",\"\",(VLOOKUP(B103,PCI_B5, 9, FALSE)))","v":0}]
[]
[null,"Additional Card for PCIe Slot 4 (CPU3) (GPU Slot)"]
[null,"None",{"$f":"IF(B106=\"Aggiungere Coppia di Processori\",\"\",(VLOOKUP(B106,PCI_B6, 2, FALSE)))","v":""},{"$f":"IF(B106=\"Aggiungere Coppia di Processori\",\"\",(VLOOKUP(B106,PCI_B6, 3, FALSE)))","v":""},{"$f":"IF(B106=\"Aggiungere Coppia di Processori\",\"\",(VLOOKUP(B106,PCI_B6, 5, FALSE)))","v":""},{"$f":"IF(B106=\"Aggiungere Coppia di Processori\",\"\",(VLOOKUP(B106,PCI_B6, 6, FALSE)))","v":""},{"$f":"IF(B106=\"Aggiungere Coppia di Processori\",\"\",(VLOOKUP(B106,PCI_B6, 9, FALSE)))","v":0}]
[]
[null,"Additional Card for PCIe Slot 5 (CPU1)"]
[null,"HPE Ethernet 1Gb 4-port 331T Adapter",1,null,"647594-B21"]
[]
[null,"Additional Card for PCIe Slot 6 (CPU1)"]
[null,"HPE Ethernet 1Gb 2-port 332T Adapter",1,null,"647594-B21"]
[]
[null,"Additional Card for PCIe Slot 7 (CPU1)"]
[null,"HPE DL580 Gen10 12G 24-port SAS Expander",1,null,"881101-B21"]
[]
[null,"Additional Card for PCIe Slot 8 (CPU4)"]
[null,"None",{"$f":"IF(B118=\"Aggiungere Coppia di Processori\",\"\",(VLOOKUP(B118,PCI_B5, 2, FALSE)))","v":""},{"$f":"IF(B118=\"Aggiungere Coppia di Processori\",\"\",(VLOOKUP(B118,PCI_B5, 3, FALSE)))","v":""},{"$f":"IF(B118=\"Aggiungere Coppia di Processori\",\"\",(VLOOKUP(B118,PCI_B5, 5, FALSE)))","v":""},{"$f":"IF(B118=\"Aggiungere Coppia di Processori\",\"\",(VLOOKUP(B118,PCI_B5, 6, FALSE)))","v":""},{"$f":"IF(B118=\"Aggiungere Coppia di Processori\",\"\",(VLOOKUP(B118,PCI_B5, 9, FALSE)))","v":0}]
[]
[null,"Additional Card for PCIe Slot 9 (CPU4) (GPU Slot)"]
[null,"None",{"$f":"IF(B121=\"Aggiungere Coppia di Processori\",\"\",IF(B121=\"Aggiungere 9 slot Secondary Riser\",\"\",(VLOOKUP(B121,PCI_B6,2,FALSE))))","v":""},{"$f":"IF(B121=\"Aggiungere Coppia di Processori\",\"\",IF(B121=\"Aggiungere 9 slot Secondary Riser\",\"\",(VLOOKUP(B121,PCI_B6,3,FALSE))))","v":""},{"$f":"IF(B121=\"Aggiungere Coppia di Processori\",\"\",IF(B121=\"Aggiungere 9 slot Secondary Riser\",\"\",(VLOOKUP(B121,PCI_B6,5,FALSE))))","v":""},{"$f":"IF(B121=\"Aggiungere Coppia di Processori\",\"\",IF(B121=\"Aggiungere 9 slot Secondary Riser\",\"\",(VLOOKUP(B121,PCI_B6,6,FALSE))))","v":""},{"$f":"IF(B121=\"Aggiungere Coppia di Processori\",\"\",IF(B121=\"Aggiungere 9 slot Secondary Riser\",\"\",(VLOOKUP(B121,PCI_B6,9,FALSE))))","v":0}]
[]
[null,"Additional Card for PCIe Slot 10 (CPU4)"]
[null,"None",{"$f":"IF(B124=\"Aggiungere Coppia di Processori\",\"\",(VLOOKUP(B124,PCI_B5, 2, FALSE)))","v":""},{"$f":"IF(B124=\"Aggiungere Coppia di Processori\",\"\",(VLOOKUP(B124,PCI_B5, 3, FALSE)))","v":""},{"$f":"IF(B124=\"Aggiungere Coppia di Processori\",\"\",(VLOOKUP(B124,PCI_B5, 5, FALSE)))","v":""},{"$f":"IF(B124=\"Aggiungere Coppia di Processori\",\"\",(VLOOKUP(B124,PCI_B5, 6, FALSE)))","v":""},{"$f":"IF(B124=\"Aggiungere Coppia di Processori\",\"\",(VLOOKUP(B124,PCI_B5, 9, FALSE)))","v":0}]
[]
[null,"Additional Card for PCIe Slot 11 (CPU4) (GPU Slot)"]
[null,"None",{"$f":"IF(B127=\"Aggiungere Coppia di Processori\",\"\",IF(B127=\"Aggiungere 9 slot Secondary Riser\",\"\",(VLOOKUP(B127,PCI_B6,2,FALSE))))","v":""},{"$f":"IF(B127=\"Aggiungere Coppia di Processori\",\"\",IF(B127=\"Aggiungere 9 slot Secondary Riser\",\"\",(VLOOKUP(B127,PCI_B6,3,FALSE))))","v":""},{"$f":"IF(B127=\"Aggiungere Coppia di Processori\",\"\",IF(B127=\"Aggiungere 9 slot Secondary Riser\",\"\",(VLOOKUP(B127,PCI_B6,5,FALSE))))","v":""},{"$f":"IF(B127=\"Aggiungere Coppia di Processori\",\"\",IF(B127=\"Aggiungere 9 slot Secondary Riser\",\"\",(VLOOKUP(B127,PCI_B6,6,FALSE))))","v":""},{"$f":"IF(B127=\"Aggiungere Coppia di Processori\",\"\",IF(B127=\"Aggiungere 9 slot Secondary Riser\",\"\",(VLOOKUP(B127,PCI_B6,9,FALSE))))","v":0}]
[]
[null,"Additional Card for PCIe Slot 12 (CPU2)"]
[null,"None",{"$f":"VLOOKUP(B130,  PCI_B2, 2, FALSE)","v":""},{"$f":"VLOOKUP(B130,  PCI_B2, 3, FALSE)","v":""},{"$f":"VLOOKUP(B130,  PCI_B2, 5, FALSE)","v":""},{"$f":"VLOOKUP(B130,  PCI_B2, 6, FALSE)","v":""},{"$f":"VLOOKUP(B130,  PCI_B2, 9, FALSE)","v":0}]
[]
[null,"Additional Card for PCIe Slot 13 (CPU2)"]
[null,"None",{"$f":"VLOOKUP(B133,  PCI_B2, 2, FALSE)","v":""},{"$f":"VLOOKUP(B133,  PCI_B2, 3, FALSE)","v":""},{"$f":"VLOOKUP(B133,  PCI_B2, 5, FALSE)","v":""},{"$f":"VLOOKUP(B133,  PCI_B2, 6, FALSE)","v":""},{"$f":"VLOOKUP(B133,  PCI_B2, 9, FALSE)","v":0}]
[]
[null,"Additional Card for PCIe Slot 14 (CPU2)"]
[null,"None",{"$f":"IF(B136=\"Aggiungere Coppia di Processori\",\"\",(VLOOKUP(B136,PCI_B4,2,FALSE)))","v":""},{"$f":"IF(B136=\"Aggiungere Coppia di Processori\",\"\",(VLOOKUP(B136,PCI_B4,3,FALSE)))","v":""},{"$f":"IF($B$136=\"Aggiungere Coppia di Processori\",\"\",(VLOOKUP($B$136,PCI_B4,5,FALSE)))","v":""},{"$f":"IF($B$136=\"Aggiungere Coppia di Processori\",\"\",(VLOOKUP($B$136,PCI_B4,6,FALSE)))","v":""},{"$f":"IF($B$136=\"Aggiungere Coppia di Processori\",\"\",(VLOOKUP($B$136,PCI_B4,9,FALSE)))","v":0}]
[]
[null,"Additional Card for PCIe Slot 15 (CPU2)"]
[null,"None",{"$f":"IF(B139=\"Aggiungere Coppia di Processori\",\"\",(VLOOKUP(B139,PCI_B4,2,FALSE)))","v":""},{"$f":"IF(B139=\"Aggiungere Coppia di Processori\",\"\",(VLOOKUP(B139,PCI_B4,3,FALSE)))","v":""},{"$f":"IF($B$139=\"Aggiungere Coppia di Processori\",\"\",(VLOOKUP($B$139,PCI_B4,5,FALSE)))","v":""},{"$f":"IF($B$139=\"Aggiungere Coppia di Processori\",\"\",(VLOOKUP($B$139,PCI_B4,6,FALSE)))","v":""},{"$f":"IF($B$139=\"Aggiungere Coppia di Processori\",\"\",(VLOOKUP($B$139,PCI_B4,9,FALSE)))","v":0}]
[]
[null,"Additional Card for PCIe Slot 16 (CPU2)"]
[null,"HPE Smart Array P408i-p SR Gen10 Ctrlr",1,null,"830824-B21"]
[]
[null,"Accessori per GPU"]
[null,"HPE DL38x Gen10 8-pin Cable Kit for P6000 GPU",{"$f":"IF(IF($E$100=\"Q0v76a\",1,0)+IF($E$106=\"Q0v76a\",1,0)+IF($E$121=\"Q0v76a\",1,0)++IF($E$127=\"Q0v76a\",1,0)=0,0,IF(IF($E$100=\"Q0v76a\",1,0)+IF($E$106=\"Q0v76a\",1,0)+IF($E$121=\"Q0v76a\",1,0)++IF($E$127=\"Q0v76a\",1,0)>3,2,1))","v":0},"TS1-871828","871828-B21",null,{"$f":"26*C145","v":0}]
[null,null,null,null,{"$f":"COUNTIF($E$100:$E$127,\"Q2N68A\")+COUNTIF($E$100:$E$127,\"Q0v80a\")","v":0}]
[null,"HPE DL38x Gen10 8-pin Keyed Cable Kit for P40 or V100 GPU",{"$f":"IF(E146=0,0,IF(E146>3,2,1))","v":0},"TS1-871829","871829-B21",null,{"$f":"31*C147","v":0}]
[]
[null,"HPE DL580 Gen10 GPU Bracket Kit for installation in slots 4 or 11",{"$f":"IF($E$106=\"Q2n68A\",1,0)+IF($E$127=\"Q2n68A\",1,0)+IF($E$106=\"Q0v80a\",1,0)+IF($E$127=\"Q0v80a\",1,0)+IF($E$106=\"Q0v76a\",1,0)+IF($E$127=\"Q0v76a\",1,0)","v":0},"TS1-P00268","P00268-B21",null,{"$f":"33*C149","v":0}]
[]
[null,"Bezel"]
[null,"None",1]
[]
[null,"Accessori per Server"]
[null,"HP BLc 10G SFP+ SR Transceiver",2,null,"455883-B21"]
[]
[null,"Unità ottica"]
[null,"HP Mobile USB DVDRW Drive",1,null,"701498-B21"]
[]
[null,"Estensione di Garanzia"]
[null,"None",{"$f":"VLOOKUP($B$161,  SO_B1,2, FALSE)","v":""},{"$f":"VLOOKUP($B$161,  SO_B1, 3, FALSE)","v":""},{"$f":"VLOOKUP($B$161,  SO_B1, 5, FALSE)","v":""},{"$f":"VLOOKUP($B$161,  SO_B1, 6, FALSE)","v":""}]
[]
[null,"Protezione dei dati - Keep Your Hard Drive "]
[null,"None",{"$f":"VLOOKUP($B$164,  SO_B2, 2, FALSE)","v":""},{"$f":"VLOOKUP($B$164,  SO_B2, 3, FALSE)","v":""},{"$f":"VLOOKUP($B$164,  SO_B2,5, FALSE)","v":""},{"$f":"VLOOKUP($B$164,  SO_B2, 6, FALSE)","v":""}]

{"sheet":"Codici","index":11,"n_rows":275,"n_cols":10,"rows_kept":275,"cut":false,"hidden":true,"merged":[[198,0,199,0],[198,1,199,1],[74,0,75,0],[74,1,75,1],[129,1,132,1],[194,1,195,1],[196,0,197,0],[196,1,197,1],[146,0,148,0],[146,1,148,1],[159,0,160,0],[159,1,160,1],[129,2,132,2],[69,0,70,0],[69,1,70,1],[231,0,232,0],[231,1,232,1],[192,0,193,0],[192,1,193,1],[219,1,222,1],[205,1,206,1],[229,0,230,0],[229,1,230,1],[207,1,208,1],[205,0,206,0],[219,2,222,2],[207,0,208,0],[194,0,195,0],[269,1,272,1],[269,2,272,2],[234,0,236,0],[234,1,236,1],[261,0,263,0],[261,1,263,1],[261,2,263,2],[245,1,246,1],[69,6,70,6],[74,6,75,6],[62,5,64,5],[69,5,70,5],[74,5,75,5],[69,7,70,7],[74,7,75,7],[62,8,64,8],[69,8,70,8],[74,8,75,8],[18,0,19,0],[18,1,19,1],[11,0,13,0],[11,1,13,1],[62,7,64,7],[62,6,64,6],[62,0,64,0],[62,1,64,1],[38,1,41,1],[38,2,41,2],[62,3,64,3],[20,0,21,0],[20,1,21,1],[47,0,49,0],[47,1,49,1],[69,3,70,3],[74,3,75,3],[62,2,64,2],[69,2,70,2],[74,2,75,2],[71,0,72,0],[71,1,72,1],[71,2,72,2],[71,3,72,3],[159,2,160,2],[159,3,160,3],[149,0,151,0],[149,1,151,1],[149,2,151,2],[149,3,151,3],[146,2,148,2],[146,3,148,3],[156,0,157,0],[156,1,157,1],[156,2,157,2],[156,3,157,3]]}
["Codici"]
["TS1L2-560","Server prestazionale",3864,1,"HPE ProLiant DL560 Gen9 Server prestazionale V4\n(2CPU Intel® Xeon® E5-4620 v4, 64GB RDIMM, 2xHDD 300GB 15k RPM SAS 12Gbps 2.5in)"]
[{"$f":"\"\"","v":""},{"$f":"\"\"","v":""},{"$f":"\"\"","v":""},{"$f":"\"\"","v":""},{"$f":"\"\"","v":""}]
["TS1L2-WIN1","OpzWinServ1",556,1,"Microsoft Windows Server 2016 Standard Edition ROK 16 Core"]
["TS1L2-WIN2","OpzWinServ2",526,1,"Microsoft Windows Server 2016 Standard Edition Additional License 16 Core"]
["TS1L2-CALDEV","OpzDeviceCal",22,1,"Microsoft Windows Server 2016 1 Device CAL"]
["TS1L2-CALUSER","OpzUserCal",22,1,"Microsoft Windows Server 2016 1 User CAL"]
["TS1L2-WIN2CORE","OpzWinServ 2 core",56,1,"Microsoft Windows Server 2016 Standard Edition Additional License 2 Core"]
["TS1L2-WINDC1","OpzWinServDC",2174,1,"Microsoft Windows Server 2016 Datacenter Edition ROK 16 Core"]
["TS1L2-WINDC2","OpzWinServDC2",2105,1,"Microsoft Windows Server 2016 Datacenter Edition Additional License 16 Core"]
["TS1L2-LINUX","OpzOpenSource",50,1,"DVD Linux Centos 7.x"]
["TS1L2-CPU-560","Opz2P",2584,2,"Kit 2 CPU Intel® Xeon® E5-Gold 5118\n(Intel Xeon-Gold 5118 2.3GHz, 12 core, 105W)","TS1L2-CPU-560"]
[null,null,null,1,"HPE DL560 Gen9 CPU Mezz Board w/ Mech Kit"]
[]
["TS1L2-16GB","OpzRam16",172,1,"HPE 16GB (1x16GB) Single Rank x4 DDR4-2666 CAS-19-19-19 Registered Smart Memory Kit"]
["TS1L2-32GB","OpzRam32",344,1,"HPE 32GB (1x32GB) Dual Rank x4 DDR4-2666 CAS-19-19-19 Registered Smart Memory Kit"]
["TS1L2-64GB","OpzRam64",750,1,"HPE 64GB (1x64GB) Quad Rank x4 DDR4-2666 CAS-19-19-19 Load Reduced Smart Memory Kit"]
["10L2-LAN1GB","OpzGigabit",35,1,"Scheda LAN Gigabit\n(HPE Ethernet 1Gb 2P 332T Adptr)"]
["10L2-LAN10GB","OpzGigabit 10GB",716,1,"Scheda LAN 10 Gigabit\n(HPE Ethernet 10Gb 2P 530SFP)"]
[null,null,null,2,"HP BLc 10G SFP+ SR Transceiver"]
["10L2-CNA10","OpzGigabit 10GB CNA",778,1,"Scheda CNA\n(HPE StoreFabric CN1200E 10Gb CNA)"]
[null,null,null,2,"HPE BLc 10G SFP+ SR Transceiver"]
["10L2-HDD300GB","OpzStorage300",140,1,"HDD 300Gb SAS\n(HPE HDD 300GB 12G SAS 15K 2.5\"  )"]
["10L2-HDD1TB","OpzStorage1Tb",278,1,"HDD 1TB NLSAS\n(HPE HDD 1TB 6G SAS 7.2K 2.5\")"]
["10L2-FC","OpzFibreChannel",889,1,"Scheda FC\n(HPE 82Q 8Gb Dual Port PCI-e FC HBA)"]
[]
[]
[]
[]
[]
["10L2-UPS","OpzUPS 3000VA",428,1,"UPS MSR 3000 VA"]
["10L2-GUI","OpzGUIRack",466,1,"Console KVM GUI per rack"]
["10L2-KVMIP","OpzSWGUIRack",550,1,"KVM Switch IP per GUI con cavi"]
["10L2-RACK","OpzRack",503,null,"Armadio Rack 42U"]
[]
["10L2-SO-WIN","ServOpzSysManWindows",200,1,"System-Network Mng. svc Windows"]
["10L2-SO-LINUX","ServOpzSysManOS",200,1,"System-Network Mng. svc Linux"]
["10L2-SO-PREV","Manutenzione Preventiva",200,1,"Servizi di manutenzione Preventiva"]
["10L2-SO-HDD","Hard-Disk retention",300,1,"Servizio HDD Retention"]
[null,null,null,1,"3Yr Data Protection - Keep Your Hard Drive",null,3864]
[null,null,null,1,"4Yr Data Protection - Keep Your Hard Drive"]
[null,null,null,1,"5Yr Data Protection - Keep Your Hard Drive"]
["10L2-SO-12M","OpzEstensione12",350,1,"Estensione garanzia 12 mesi Agg."]
["10L2-SO-24M","OpzEstensione24",700,1,"Estensione garanzia 24 mesi Agg."]
["Codici"]
["TS1L2-ALT-U","Server Rack Base Alternativo",3864,1,"Server HP Proliant DL580 Gen10 (2CPU Intel® Xeon® Gold 5518, 64GB , 2xHDD 300GB 15K RPM SAS 12Gbps 2.5in)"]
["TS1L2-560","Server Rack Base",3864,1,"HPE ProLiant DL560 Gen10 Server BASE\n(2CPU Intel® Xeon® E5-Gold 5118, 64GB RDIMM, 2xHDD 300GB 15k RPM SAS 12Gbps 2.5in)"]
["TS1L2-CPU-560","Opz2P",2584,2,"Kit 2 CPU Intel® Xeon® E5-Gold 5118\n(Intel Xeon-Gold 5118 2.3GHz, 12 core, 105W)","TS1L2-CPU-560"]
[null,null,null,1,"HPE DL560 Gen9 CPU Mezz Board w/ Mech Kit"]
[]
["TS1L2-16GB","OpzRam16",172,1,"HPE 16GB (1x16GB) Single Rank x4 DDR4-2666 CAS-19-19-19 Registered Smart Memory Kit"]
["TS1L2-32GB","OpzRam32",344,1,"HPE 32GB (1x32GB) Dual Rank x4 DDR4-2666 CAS-19-19-19 Registered Smart Memory Kit"]
["TS1L2-64GB","OpzRam64",750,1,"HPE 64GB (1x64GB) Quad Rank x4 DDR4-2666 CAS-19-19-19 Load Reduced Smart Memory Kit"]
["TS1L2-WIN1","OpzWinServ1",556,1,"Microsoft Windows Server 2016 Standard Edition ROK 16 Core","TS1L2-WIN1","OpzWinServ1",556,1,"Microsoft Windows Server 2016 Standard Edition ROK 16 Core"]
["TS1L2-WIN2","OpzWinServ2",526,1,"Microsoft Windows Server 2016 Standard Edition Additional License 16 Core","TS1L2-WIN2","OpzWinServ2",526,1,"Microsoft Windows Server 2016 Standard Edition Additional License 16 Core"]
["TS1L2-CALDEV","OpzDeviceCal",22,1,"Microsoft Windows Server 2016 1 Device CAL","TS1L2-CALDEV","OpzDeviceCal",22,1,"Microsoft Windows Server 2016 1 Device CAL"]
["TS1L2-CALUSER","OpzUserCal",22,1,"Microsoft Windows Server 2016 1 User CAL","TS1L2-CALUSER","OpzUserCal",22,1,"Microsoft Windows Server 2016 1 User CAL"]
["TS1L2-WIN2CORE","OpzWinServ 2 core",56,1,"Microsoft Windows Server 2016 Standard Edition Additional License 2 Core","TS1L2-WIN2CORE","OpzWinServ 2 core",56,1,"Microsoft Windows Server 2016 Standard Edition Additional License 2 Core"]
["TS1L2-WINDC1","OpzWinServDC",2174,1,"Microsoft Windows Server 2016 Datacenter Edition ROK 16 Core","TS1L2-WINDC1","OpzWinServDC",2174,1,"Microsoft Windows Server 2016 Datacenter Edition ROK 16 Core"]
["TS1L2-WINDC2","OpzWinServDC2",2105,1,"Microsoft Windows Server 2016 Datacenter Edition Additional License 16 Core","TS1L2-WINDC2","OpzWinServDC2",2105,1,"Microsoft Windows Server 2016 Datacenter Edition Additional License 16 Core"]
["S2-871168-A21","OpzWinServ 2 core DC",530,1,"Microsoft Windows Server 2016 Datacenter Edition Additional License 2 Core"]
["TS1L2-LINUX","OpzOpenSource",50,1,"DVD Linux Centos 7.x","TS1L2-LINUX","OpzOpenSource",50,1,"DVD Linux Centos 7.x"]
["TS1L2-CPU-ALT-U","2 Processori (opz2P)",2584,1,"Kit 2 CPU Intel® Xeon® E5-Gold 5118\n(Intel Xeon-Gold 5118 2.3GHz, 12 core, 105W)","TS1L2-CPU-580","2 Processori (opz2P)",5056,1,"HPE DL580 Gen9 Intel® Xeon® E7-8880v4 (2.2GHz/22-core/55MB/150W) Processor Kit"]
[null,null,null,null,"HPE DL5x0 Gen10 CPU Mezz Kit",null,null,null,null,"HPE 1200W Common Slot Platinum Plus Hot Plug Power Supply Kit"]
[null,null,null,null,"HPE DL580 Gen9 12 DDR4 DIMM Slots Memory Cartridge",null,null,null,null,"HPE DL580 Gen9 12 DDR4 DIMM Slots Memory Cartridge"]
["TS1L2-16GB-2400","OpzRam16",172,1,"HPE 16GB (1x16GB) Dual Rank x4 DDR4-2400 Registered Memory Kit","TS1L2-16GB-2400","OpzRam16",172,1,"HPE 16GB (1x16GB) Dual Rank x4 DDR4-2400 Registered Memory Kit"]
["TS1L2-32GB-2400","OpzRam32",344,1,"HP 32GB (1x32GB) Dual Rank x4 DDR4-2400 Registered Memory Kit","TS1L2-32GB-2400","OpzRam32",344,1,"HP 32GB (1x32GB) Dual Rank x4 DDR4-2400 Registered Memory Kit"]
["TS1L2-64GB-2400","OpzRam64",750,1,"HPE 64GB (1x64GB) Quad Rank x4 DDR4-2400 Load Reduced Memory Kit","TS1L2-64GB-2400","OpzRam64",750,1,"HPE 64GB (1x64GB) Quad Rank x4 DDR4-2400 Load Reduced Memory Kit"]
["TS1L2-1GB","OpzGigabit",29,1,"PE Ethernet 1Gb 2-port 332T Adapter","TS1L2-1GB","OpzGigabit",29,1,"PE Ethernet 1Gb 2-port 332T Adapter"]
["TS1L2-10GB-580","OpzGigabit 10 GBs",259,1,"HPE Ethernet 10Gb 2-port 530SFP Adapter","TS1L2-10GB-580","OpzGigabit 10 GBs",259,1,"HPE Ethernet 10Gb 2-port 546SFP+ Adapter"]
[null,null,null,null,"HPE BLc 10G SFP+ SR Transceiver",null,null,null,null,"HPE BLc 10G SFP+ SR Transceiver"]
["TS1L2-10GB","OpzGigabit 10 GBs",259,1,"HPE Ethernet 10Gb 2-port 530SFP Adapter"]
[null,null,null,null,"HPE BLc 10G SFP+ SR Transceiver"]
["TS1-764302","Opz10baseT4p",690,1,"HPE FlexFabric 10Gb 4-port 536FLR-T Adapter"]
["TS1L2-CNA","OpzGigabit 10 GBs CNA",720,1,"HPE StoreFabric CN1200E 10Gb Converged Network Adapter","TS1L2-CNA","OpzGigabit 10 GBs CNA",720,1,"HPE StoreFabric CN1200E 10Gb Converged Network Adapter"]
[null,null,null,null,"HPE BLc 10G SFP+ SR Transceiver",null,null,null,null,"HPE BLc 10G SFP+ SR Transceiver"]
["TS1L2-HD300","OpzStorage300",156,1,"HPE 300GB SAS 12G Enterprise 15K SFF (2.5in) SC Digitally Signed Firmware HDD","TS1L2-HD300","OpzStorage300",156,1,"HPE 300GB SAS 12G Enterprise 15K SFF (2.5in) SC Digitally Signed Firmware HDD"]
["TS1L2-HD1200","OpzStorage1Tb",292,1,"HPE 1.2TB SAS 12G Enterprise 10K SFF (2.5in) SC Digitally Signed Firmware HDD","TS1L2-HD1200","OpzStorage1Tb",292,1,"HPE 1.2TB SAS 12G Enterprise 10K SFF (2.5in) SC Digitally Signed Firmware HDD"]
["TS1L2-HD1800","OpzStorage2Tb",467,1,"HPE 1.8TB SAS 12G Enterprise 10K SFF (2.5in) SC 512e Digitally Signed Firmware HDD","TS1L2-HD1800","OpzStorage2Tb",467,1,"HPE 1.8TB SAS 12G Enterprise 10K SFF (2.5in) SC 512e Digitally Signed Firmware HDD"]
["TS1L2-SSD960","OpzStorageSSD800",1571,1,"HPE 960GB SAS 12G Read Intensive SFF (2.5in) SC Digitally Signed Firmware SSD","TS1L2-SSD960","OpzStorageSSD800",1571,1,"HPE 960GB SAS 12G Read Intensive SFF (2.5in) SC Digitally Signed Firmware SSD"]
["TS1L2-SSD1920","OpzStorageSSD1,6TB",2667,1,"HPE 1.92TB SAS 12G Read Intensive SFF (2.5in) SCDigitally Signed Firmware SSD","TS1L2-SSD1920","OpzStorageSSD1,6TB",2667,1,"HPE 1.92TB SAS 12G Read Intensive SFF (2.5in) SCDigitally Signed Firmware SSD"]
["TS1L2-FC","OpzFibreChannel",356,null,"HPE 82Q 8Gb 2-port PCIe Fibre Channel Host Bus Adapter"]
["TS1L2-FC-82Q","OpzFibreChannel",356,1,"HPE 82Q 8Gb 2-port PCIe Fibre Channel Host Bus Adapter","TS1L2-FC-82Q","OpzFibreChannel",356,1,"HPE 82Q 8Gb 2-port PCIe Fibre Channel Host Bus Adapter"]
["TS1L2-4ANNI","OpzEstensione12",386,1,"OpzEstensione12","TS1L2-4ANNI","OpzEstensione12",386,1,"OpzEstensione12"]
["TS1L2-5ANNI","OpzEstensione24",724,1,"OpzEstensione24 ","TS1L2-5ANNI","OpzEstensione24",724,1,"OpzEstensione24 "]
["S2-E5Y34A","OpzOVAdv",480,1,"HPE OneView Advanced (with HPE iLO Advanced)"]
["TS1L2-HD1800","OpzStorage2Tb",467,1,"HPE 1.8TB SAS 12G Enterprise 10K SFF (2.5in) SC 512e Digitally Signed Firmware HDD","TS1L2-HD1800","OpzStorage2Tb",467,1,"HPE 1.8TB SAS 12G Enterprise 10K SFF (2.5in) SC 512e Digitally Signed Firmware HDD"]
["TS1L2-HD1800-580-AS","OpzStorage2Tb",467,1,"HPE 1.8TB SAS 12G Enterprise 10K SFF (2.5in) SC 512e Digitally Signed Firmware HDD","TS1L2-HD1800","OpzStorage2Tb",467]
["S2-875311-B21","OpzStorageSSD480",749,null,"HPE 480GB SAS 12G Read Intensive SFF (2.5in) SC Digitally Signed Firmware SSD"]
["TS1L2-SSD960","OpzStorageSSD800",1571,1,"HPE 960GB SAS 12G Read Intensive SFF (2.5in) SC Digitally Signed Firmware SSD","TS1L2-SSD960","OpzStorageSSD800",1571,1,"HPE 960GB SAS 12G Read Intensive SFF (2.5in) SC Digitally Signed Firmware SSD"]
["TS1L2-SSD960-AS","OpzStorageSSD800",1571,1,"HPE 960GB SAS 12G Read Intensive SFF (2.5in) SC Digitally Signed Firmware SSD","TS1L2-SSD960","OpzStorageSSD800",1571,1]
["TS1L2-SSD1920","OpzStorageSSD1,6TB",2667,1,"HPE 1.92TB SAS 12G Read Intensive SFF (2.5in) SCDigitally Signed Firmware SSD","TS1L2-SSD1920","OpzStorageSSD1,6TB",2667,1,"HPE 1.92TB SAS 12G Read Intensive SFF (2.5in) SCDigitally Signed Firmware SSD"]
["S2-P9D94A","OpzFibreChannel2",584,1,"HPE StoreFabric SN1100Q 16Gb Dual Port Fibre Channel Host Bus Adapter","S2-P9D94A","OpzFibreChannel2",584,1,"HPE StoreFabric SN1100Q 16Gb Dual Port Fibre Channel Host Bus Adapter"]
["TS1-656596","Opz10baseT_1",298,1,"HPE Ethernet 10Gb 2P 530T Adptr A20"]
["TS1-867707","Opz10baseT_2",298,1,"HPE Ethernet 10Gb 2-port 521T Adapter A20"]
["TS1-874-006887","OpzSUSE1",1350,1,"SUSE Linux Enterprise Server, x86 & x86-64, 1-2 Sockets or 1-2 Virtual Machines, Standard Subscription, 3 Years","TS1-874-006887","OpzSUSE1",1350,1,"SUSE Linux Enterprise Server, x86 & x86-64, 1-2 Sockets or 1-2 Virtual Machines, Standard Subscription, 3 Years"]
["TS1-874-006898","OpzSUSE2",2242.5,1,"SUSE Linux Enterprise Server, x86 & x86-64, 1-2 Sockets or 1-2 Virtual Machines, Standard Subscription, 5 Years","TS1-874-006898","OpzSUSE2",2242.5,1,"SUSE Linux Enterprise Server, x86 & x86-64, 1-2 Sockets or 1-2 Virtual Machines, Standard Subscription, 5 Years"]
["TS1-874-006888","OpzSUSE3",2692.5,1,"SUSE Linux Enterprise Server, x86 & x86-64, 1-2 Sockets with Unlimited Virtual Machines, Standard Subscription, 3 Years","TS1-874-006888","OpzSUSE3",2692.5,1,"SUSE Linux Enterprise Server, x86 & x86-64, 1-2 Sockets with Unlimited Virtual Machines, Standard Subscription, 3 Years"]
["TS1-874-006902","OpzSUSE4",4500,1,"SUSE Linux Enterprise Server, x86 & x86-64, 1-2 Sockets with Unlimited Virtual Machines, Standard Subscription, 5 Years","TS1-874-006902","OpzSUSE4",4500,1,"SUSE Linux Enterprise Server, x86 & x86-64, 1-2 Sockets with Unlimited Virtual Machines, Standard Subscription, 5 Years"]
["TS1-874-006883","OpzSUSE5",2520,1,"SUSE Linux Enterprise Server, x86 & x86-64, 1-2 Sockets or 1-2 Virtual Machines, Priority Subscription, 3 Year","TS1-874-006883","OpzSUSE5",2520,1,"SUSE Linux Enterprise Server, x86 & x86-64, 1-2 Sockets or 1-2 Virtual Machines, Priority Subscription, 3 Year"]
["TS1-874-006894","OpzSUSE6",4200,1,"SUSE Linux Enterprise Server, x86 & x86-64, 1-2 Sockets or 1-2 Virtual Machines, Priority Subscription, 5 Year","TS1-874-006894","OpzSUSE6",4200,1,"SUSE Linux Enterprise Server, x86 & x86-64, 1-2 Sockets or 1-2 Virtual Machines, Priority Subscription, 5 Year"]
["TS1-874-006884","OpzSUSE7",5100,1,"SUSE Linux Enterprise Server, x86 & x86-64, 1-2 Sockets with Unlimited Virtual Machines, Priority Subscription, 3 Year","TS1-874-006884","OpzSUSE7",5100,1,"SUSE Linux Enterprise Server, x86 & x86-64, 1-2 Sockets with Unlimited Virtual Machines, Priority Subscription, 3 Year"]
["TS1-874-006895","OpzSUSE8",8400,1,"SUSE Linux Enterprise Server, x86 & x86-64, 1-2 Sockets with Unlimited Virtual Machines, Priority Subscription, 5 Year","TS1-874-006895","OpzSUSE8",8400,1,"SUSE Linux Enterprise Server, x86 & x86-64, 1-2 Sockets with Unlimited Virtual Machines, Priority Subscription, 5 Year"]
["S2-872235-B21","OpzBay2HDD",230,null,"HPE DL560 Gen10 8SFF HDD Bay2 Kit"]
["S2-872233-B21","OpzBay1HDD",297,null,"HPE DL560 Gen10 8SFF HDD Bay1 Kit"]
["S2-870548-B21","OpzRiser1",109,null,"HPE DL Gen10 x8/x16/x8 Riser Kit"]
["S2-872253-B21","OpzRiser2",285,null,"HPE DL560 Gen10 x8/x8 Tertiary Riser Kit"]
["TS1-646861","OpzPDU32A",289,null,"PDU Vertical 20+4 outlets C13 with MCB - IEC60309 input"]
["TS1-646875","OpzPDU_TRIFASE",349,null,"PDU Vertical  18+6 outlets (C13+C19)  with MCB and ammeter - IEC60309 input - 3 phase"]
["S2-873444-B21","OpzSasExpander",540,null,"HPE DL5x0 Gen10 12Gb SAS Expander"]
["S2-826704","OpzRiserGPU",109,null,"HPE DL Gen10 x16/x16 GPU Riser Kit A20"]
["TS1-Q0V77A","OpzGPU_P2000","518,00",null,"NVIDIA Quadro P2000 GPU Module A20"]
["TS1-Q0V76A","OpzGPU_P6000",5310,null,"HPE NVIDIA Quadro P6000 GPU Module A20"]
["TS1-Q0V80A","OpzGPU_P40",7552,null,"HPE NVIDIA Tesla P40 24GB Module A20"]
["TS1-Q2N68A","OpzGPU_V100",10583,null,"NVIDIA Tesla V100 PCIe 16GB Computational Accelerator A20"]
["TS1-871828","OpzGPU_Cbl_P6000",26,null,"HPE DL580 Gen10 8-pin Cable Kit  (P6000) A20"]
["TS1-871829","OpzGPU_Cbl_P40_V100",31,null,"HPE DL580 Gen10 8-pin Keyed Cable Kit (P40, V100) A20"]
["TS1-P00268","OpzGPU_bracket",33,null,"HPE DL580 Gen10 GPU Bracket Kit (Extended) A20"]
[]
["TS1L2-UPS","OpzUPS 3000VA",398,1,"UPS MSR 3000 VA"]
["TS1L2-GUI","OpzGUIRack",466,1,"Console KVM GUI per rack"]
["TS1L2-KVMIP","OpzSWGUIRack",573,1,"KVM Switch IP per GUI con cavi"]
["TS1L2-RACK","OpzRack",514,null,"Armadio Rack 42U"]
["S2-9SlotRiser","Opz9SlotRiser",671,1,"Kit di Upgrade 9 slot PCIe comprensivo di coppia alimentatori 1600W"]
["S2-48HDDbay","Opz48HDD",1367,1,"Kit di Upgrade a 48slot HDD totali comprensivo di tutti i componenti necessari"]
["S2-PwrSply2","OpzPwrSply2",306,1,"Kit coppia HPE 1600W Flex Slot Platinum Hot Plug Low Halogen Power Supply"]
["10L2-SO-WIN","ServOpzSysManWindows",200,1,"System-Network Mng. svc Windows"]
["10L2-SO-LINUX","ServOpzSysManOS",200,1,"System-Network Mng. svc Linux"]
["10L2-SO-PREV","Manutenzione Preventiva",200,1,"Servizi di manutenzione Preventiva"]
["10L2-SO-HDD","Hard-Disk retention",300,1,"Servizio HDD Retention"]
[null,null,null,1,"3Yr Data Protection - Keep Your Hard Drive"]
[null,null,null,1,"4Yr Data Protection - Keep Your Hard Drive"]
[null,null,null,1,"5Yr Data Protection - Keep Your Hard Drive"]
["10L2-SO-12M","OpzEstensione12",350,1,"Estensione garanzia 12 mesi Agg."]
["10L2-SO-24M","OpzEstensione24",700,1,"Estensione garanzia 24 mesi Agg."]
[]
["TS1L2-ALT-U","Server Rack Base Alternativo",3864,1,"Server HP Proliant DL580 Gen10 (2CPU Intel® Xeon® Gold 5518, 64GB , 2xHDD 300GB 15K RPM SAS 12Gbps 2.5in)"]
["TS1L2-580-U","Server Rack Prestazionale",6092,1,"Server HP Proliant DL580 Gen10 (2CPU Intel® Xeon® Gold 6140M, 128GB , 2xHDD 300GB 15K RPM SAS 12Gbps 2.5in)"]
["TS1L2-WIN1","OpzWinServ1",556,1,"Microsoft Windows Server 2016 Standard Edition ROK 16 Core"]
["TS1L2-WIN2","OpzWinServ2",526,1,"Microsoft Windows Server 2016 Standard Edition Additional License 16 Core"]
["TS1L2-CALDEV","OpzDeviceCal",22,1,"Microsoft Windows Server 2016 1 Device CAL"]
["TS1L2-CALUSER","OpzUserCal",22,1,"Microsoft Windows Server 2016 1 User CAL"]
["TS1L2-WIN2CORE","OpzWinServ 2 core",56,1,"Microsoft Windows Server 2016 Standard Edition Additional License 2 Core"]
["TS1L2-WINDC1","OpzWinServDC",2174,1,"Microsoft Windows Server 2016 Datacenter Edition ROK 16 Core"]
["TS1L2-WINDC2","OpzWinServDC2",2105,1,"Microsoft Windows Server 2016 Datacenter Edition Additional License 16 Core"]
["TS1L2-LINUX","OpzOpenSource",50,1,"DVD Linux Centos 7.x"]
["TS1L2-CPU-580-U","2 Processori (opz2P)",5056,1,"Kit 2 CPU Intel® Xeon-Gold 6140M\n(Intel Xeon-Gold 6140M 2.3GHz/18-core/140W)"]
[null,null,null,null,"HPE DL5x0 Gen10 CPU Mezz Kit"]
[null,null,null,null,"HPE 1600W FS Plat Ht Plg LH Pwr Sply Kit"]
["TS1L2-CPU-ALT-U","2 Processori (opz2P)",2584,1,"Kit 2 CPU Intel® Xeon® E5-Gold 5118\n(Intel Xeon-Gold 5118 2.3GHz, 12 core, 105W)"]
[null,null,null,null,"HPE DL5x0 Gen10 CPU Mezz Kit"]
[null,null,null,null,"HPE 1600W FS Plat Ht Plg LH Pwr Sply Kit"]
["TS1L2-16GB","OpzRam16",172,1,"HPE 16GB (1x16GB) Single Rank x4 DDR4-2666 CAS-19-19-19 Registered Smart Memory Kit"]
["TS1L2-32GB","OpzRam32",344,1,"HPE 32GB (1x32GB) Dual Rank x4 DDR4-2666 CAS-19-19-19 Registered Smart Memory Kit"]
["TS1L2-64GB","OpzRam64",750,1,"HPE 64GB (1x64GB) Quad Rank x4 DDR4-2666 CAS-19-19-19 Load Reduced Smart Memory Kit"]
["TS1L2-1GB","OpzGigabit",29,1,"PE Ethernet 1Gb 2-port 332T Adapter"]
["TS1L2-10GB","OpzGigabit 10 GBs",259,1,"HPE Ethernet 10Gb 2-port 530SFP Adapter"]
[null,null,null,null,"HPE BLc 10G SFP+ SR Transceiver"]
["TS1-764302","Opz10baseT4p",690,1,"HPE FlexFabric 10Gb 4-port 536FLR-T Adapter"]
["TS1L2-CNA","OpzGigabit 10 GBs CNA",720,1,"HPE StoreFabric CN1200E 10Gb Converged Network Adapter"]
[null,null,null,null,"HPE BLc 10G SFP+ SR Transceiver"]
["TS1L2-HD300","OpzStorage300",156,1,"HPE 300GB SAS 12G Enterprise 15K SFF (2.5in) SC Digitally Signed Firmware HDD"]
["TS1L2-HD1200","OpzStorage1Tb",292,1,"HPE 1.2TB SAS 12G Enterprise 10K SFF (2.5in) SC Digitally Signed Firmware HDD"]
["TS1L2-HD1800","OpzStorage2Tb",467,1,"HPE 1.8TB SAS 12G Enterprise 10K SFF (2.5in) SC 512e Digitally Signed Firmware HDD"]
["TS1L2-SSD960","OpzStorageSSD800",1571,1,"HPE 960GB SAS 12G Read Intensive SFF (2.5in) SC Digitally Signed Firmware SSD"]
["TS1L2-SSD1920","OpzStorageSSD1,6TB",2667,1,"HPE 1.92TB SAS 12G Read Intensive SFF (2.5in) SCDigitally Signed Firmware SSD"]
["TS1L2-FC","OpzFibreChannel",356,null,"HPE 82Q 8Gb 2-port PCIe Fibre Channel Host Bus Adapter"]
["TS1L2-4ANNI","OpzEstensione12",386,1,"OpzEstensione12"]
["TS1L2-5ANNI","OpzEstensione24",724,1,"OpzEstensione24 "]
["S2-E5Y34A","OpzOVAdv",480,1,"HPE OneView Advanced (with HPE iLO Advanced)"]
["TS1L2-HD1800","OpzStorage2Tb",467,1,"HPE 1.8TB SAS 12G Enterprise 10K SFF (2.5in) SC 512e Digitally Signed Firmware HDD"]
["TS1L2-SSD960","OpzStorageSSD800",1571,1,"HPE 960GB SAS 12G Read Intensive SFF (2.5in) SC Digitally Signed Firmware SSD","Coppie Processori installati fisicamenti"]
["TS1L2-SSD1920","OpzStorageSSD1,6TB",2667,1,"HPE 1.92TB SAS 12G Read Intensive SFF (2.5in) SCDigitally Signed Firmware SSD"]
["S2-P9D94A","OpzFibreChannel2",584,1,"HPE StoreFabric SN1100Q 16Gb Dual Port Fibre Channel Host Bus Adapter"]
["TS1-874-006887","OpzSUSE1",1350,1,"SUSE Linux Enterprise Server, x86 & x86-64, 1-2 Sockets or 1-2 Virtual Machines, Standard Subscription, 3 Years"]
["TS1-874-006898","OpzSUSE2",2242.5,1,"SUSE Linux Enterprise Server, x86 & x86-64, 1-2 Sockets or 1-2 Virtual Machines, Standard Subscription, 5 Years"]
["TS1-874-006888","OpzSUSE3",2692.5,1,"SUSE Linux Enterprise Server, x86 & x86-64, 1-2 Sockets with Unlimited Virtual Machines, Standard Subscription, 3 Years"]
["TS1-874-006902","OpzSUSE4",4500,1,"SUSE Linux Enterprise Server, x86 & x86-64, 1-2 Sockets with Unlimited Virtual Machines, Standard Subscription, 5 Years"]
["TS1-874-006883","OpzSUSE5",2520,1,"SUSE Linux Enterprise Server, x86 & x86-64, 1-2 Sockets or 1-2 Virtual Machines, Priority Subscription, 3 Year"]
["TS1-874-006894","OpzSUSE6",4200,1,"SUSE Linux Enterprise Server, x86 & x86-64, 1-2 Sockets or 1-2 Virtual Machines, Priority Subscription, 5 Year"]
["TS1-874-006884","OpzSUSE7",5100,1,"SUSE Linux Enterprise Server, x86 & x86-64, 1-2 Sockets with Unlimited Virtual Machines, Priority Subscription, 3 Year"]
["TS1-874-006895","OpzSUSE8",8400,1,"SUSE Linux Enterprise Server, x86 & x86-64, 1-2 Sockets with Unlimited Virtual Machines, Priority Subscription, 5 Year"]
[{"$f":"\"\"","v":""},{"$f":"\"\"","v":""},{"$f":"\"\"","v":""},{"$f":"\"\"","v":""},{"$f":"\"\"","v":""}]
["10L2-DL580G92","Server enterprise",7444.5,1,"HPE ProLiant DL580 Gen9 Server enterprise V4\n(2CPU Intel® Xeon® E7-4830 v4, 64GB RDIMM, 2xHDD 300GB 15k RPM SAS 12Gbps 2.5in)"]
["10L2-DL580G94","Server enterprise",7444.5,1,"HPE ProLiant DL580 Gen9 Server enterprise V4\n(2CPU Intel® Xeon® E7-4830 v4, 64GB RDIMM, 2xHDD 300GB 15k RPM SAS 12Gbps 2.5in)"]
["10L2-WIN1","OpzWinServ1",540,1,"Microsoft® Windows Server 2012 R2, Standard Edition, 2 Socket, 2Vm, ROK, COA + Media"]
["10L2-WIN2","OpzWinServ2",540,1,"Microsoft® Windows Server 2012 R2, Standard Edition, 2 Socket, 2Vm, Additional License"]
["10L2-WINDC1","OpzWinServ DC1",2440,1,"Microsoft® Windows Server 2012 R2, Datacenter Edition, 2 Socket, unlimited virtualization rights, ROK, COA + Media"]
["10L2-WINDC2","OpzWinServ DC2",2440,1,"Microsoft® Windows Server 2012 R2, Datacenter Edition, 2 Socket, unlimited virtualization rights, Additional License"]
["10L2-CALDEV","OpzDeviceCal",22,1,"MS Windows Server 2012 R2, CAL 1 DEV (1-pack fo Windows Server 2012 R2 Device CALs (Standard or Datacenter))"]
["10L2-CALUSER","OpzUserCal",24,1,"MS Windows Server 2012 R2, CAL 1 USR (1-pack fo Windows Server 2012 R2 User CALs (Standard or Datacenter))"]
["10L2-LINUX","OpzOpenSource",45,null,"DVD Linux Centos 7.x"]
["10L2-CPU-E-U","Opz2P",3601,2,"Kit 2 CPU Intel® Xeon® E7-4830 v4\n(Intel Xeon E7-4830 v4 2.0GHz,35M Cache,8.00GT/s QPI,Turbo,HT,14 core, 28 thread)"]
[null,null,null,2,"HP DL580 Gen9 12 DIMMs Memory Cartridge"]
["10L2-CPU-E4-U","Opz2P",3601,2,"Kit 2 CPU Intel® Xeon® E7-4830 v4 - 4MC\n(Intel Xeon E7-4830 v4 2.0GHz,35M Cache,8.00GT/s QPI,Turbo,HT,14 core, 28 thread)"]
[null,null,null,4,"HP DL580 Gen9 12 DIMMs Memory Cartridge"]
["10L2-CPU-E2-U","Opz2P",3601,2,"Kit 2 CPU Intel® Xeon® E7-4830 v4 - 2MC\n(Intel Xeon E7-4830 v4 2.0GHz,35M Cache,8.00GT/s QPI,Turbo,HT,14 core, 28 thread)"]
[null,null,null,2,"HP DL580 Gen9 12 DIMMs Memory Cartridge"]
["10L2-CPU-E0-U","Opz2P",3601,2,"Kit 2 CPU Intel® Xeon® E7-4830 v4\n(Intel Xeon E7-4830 v4 2.0GHz,35M Cache,8.00GT/s QPI,Turbo,HT,14 core, 28 thread)"]
[null,null,null,0,"HP DL580 Gen9 12 DIMMs Memory Cartridge"]
["10L2-16GB-U","OpzRam16",141,1,"Kit Upgrade Ram 16GB V4\n(16GB RDIMM, 2400MT/s, Dual Rank x4) "]
["10L2-32GB-U","OpzRam32",320,1,"Kit Upgrade Ram 32GB V4\n(32GB RDIMM, 2400MT/s, Dual Rank x4)"]
["10L2B-32GB-L","OpzRam32",320,1,"Upgrade KIT RAM 32GB-L"]
["10L2-64GB-U","OpzRam64",652,1,"Kit Upgrade Ram 64GB V4\n(64GB RDIMM, 2400MT/s, Dual Rank x4)"]
["10L2-LAN1GB","OpzGigabit",35,1,"Scheda LAN Gigabit\n(HPE Ethernet 1Gb 2P 332T Adptr)"]
["10L2-LAN10GB","OpzGigabit 10GB",716,1,"Scheda LAN 10 Gigabit\n(HPE Ethernet 10Gb 2P 530SFP)"]
[null,null,null,2,"HP BLc 10G SFP+ SR Transceiver"]
["10L2-CNA10","OpzGigabit 10GB CNA",778,1,"Scheda CNA\n(HPE StoreFabric CN1200E 10Gb CNA)"]
[null,null,null,2,"HPE BLc 10G SFP+ SR Transceiver"]
["10L2-HDD300GB","OpzStorage300",140,1,"HDD 300Gb SAS\n(HPE HDD 300GB 12G SAS 15K 2.5\"  )"]
["10L2-HDD1TB","OpzStorage1Tb",278,1,"HDD 1TB NLSAS\n(HPE HDD 1TB 6G SAS 7.2K 2.5\")"]
["10L2-FC","OpzFibreChannel",889,1,"Scheda FC\n(HPE 82Q 8Gb Dual Port PCI-e FC HBA)"]
["TS1L2-UPS","OpzUPS 3000VA",403,1,"UPS MSR 3000 VA"]
["TS1L2-GUI","OpzGUIRack",452,1,"Console KVM GUI per rack"]
["TS1L2-KVMIP","OpzSWGUIRack",577,1,"KVM Switch IP per GUI con cavi"]
["TS1L2-RACK","OpzRack",487,null,"Armadio Rack 42U"]
["10L2-SO-WIN","ServOpzSysManWindows",200,1,"System-Network Mng. svc Windows"]
["10L2-SO-LINUX","ServOpzSysManOS",200,1,"System-Network Mng. svc Linux"]
["10L2-SO-PREV","Manutenzione Preventiva",200,1,"Servizi di manutenzione Preventiva"]
["10L2-SO-HDD","Hard-Disk retention",300,1,"Servizio HDD Retention"]
[null,null,null,1,"3Yr Data Protection - Keep Your Hard Drive"]
[null,null,null,1,"4Yr Data Protection - Keep Your Hard Drive"]
[null,null,null,1,"5Yr Data Protection - Keep Your Hard Drive"]
["10L2-SO-12M","OpzEstensione12",350,1,"Estensione garanzia 12 mesi Agg."]
["10L2-SO-24M","OpzEstensione24",700,1,"Estensione garanzia 24 mesi Agg."]
[]
["10L1-T630","Server Tower",2340,1,"Server DELL PowerEdge T630 (1CPU Intel® Xeon® E5-2650 v3, 32GB RDIMM, 2xHDD 300GB 10K RPM SAS 12Gbps 2.5in)"]
[{"$f":"\"\"","v":""},{"$f":"\"\"","v":""},{"$f":"\"\"","v":""},{"$f":"\"\"","v":""},{"$f":"\"\"","v":""}]
["10L1-WIN","OpzWinServ1",505,1,"Kit Windows Server 2012, Standard Edition, 2 Socket, 2VM, ROK, COA + Media"]
["10L1-CALUSER","OpzUserCal",25,1,"1-pack of Windows Server 2012 User CALs (Standard or Datacenter)"]
[null,null,null,1,"CS_Consip9_Windows Server CAL 2012 Italian 1pk DSP OEI 1 Clt User CAL"]
["10L1-CALDEV","OpzDeviceCal",25,1,"1-pack of Windows Server 2012 Device CALs (Standard or Datacenter)"]
[null,null,null,1,"CS_Consip9_Windows Server CAL 2012 Italian 1pk DSP OEI 1 Clt Device CAL"]
["10L1-LINUX","OpzOpenSource",45]
["10L1-CPU-T","Opz1P",800,1,"Intel Xeon E5-2650 v3 2.3GHz,25M Cache,9.60GT/s QPI,Turbo,HT,10C/20T (105W) Max Mem 2133MHz,Customer Kit"]
[null,null,null,1,"Kit - 105W Heatsink for T630"]
[]
["10L1-16GB","OpzRam16",160,1,"16GB RDIMM, 2133 MT/s, Dual Rank, x4 Data Width,CusKit"]
["10L1-32GB","OpzRam32",320,1,"32GB RDIMM, 2133 MT/s, Low Volt, Dual Rank, x4 Data Width"]
["10L1-32GB-L","OpzRam32",320,1,"32GB LRDIMM, 2133 MT/s, Quad Rank, x4 Data Width,CusKit"]
["10L1-64GB","OpzRam64",644,1,"Modulo di memoria sostitutivo certificato Dell 64 GB per alcuni sistemi Dell - LRDIMM 4Rx4 a 2.133 MHz"]
[]
["10L1-LAN1GB","OpzGigabit",35,1,"Broadcom 5720 DP 1Gb Network Interface Card,Full Height,CusKit"]
[]
[]
["10L1-LAN10GB","OpzGigabit 10GB",417,1,"QLogic 57810 Dual Port 10Gb Direct Attach/SFP+ Network Adapter,Full Height,CusKit"]
[null,null,null,2,"PowerEdge SFP+, 10GbE SR/SX, Optical Tranceiver, LC Connector, for Intel and Broadcom,CusKit"]
[]
[]
[]
[]
["10L1-HDD300GB-T","OpzStorage300",91,1,"300GB 10K RPM SAS 12Gbps 2.5in Hot-plug Hard Drive,CusKit"]
["10L1-HDD1TB","OpzStorage1Tb",296,1,"1TB 7.2K RPM NLSAS 6Gbps 2.5in Hot-plug Hard Drive,13G,CusKit"]
[]
["10L1-FC","OpzFibreChannel",940,1,"Emulex LPE 12002, Dual Port 8Gb Fibre Channel HBA,Full Height,CusKit"]
["10L1-RDX","OpzRDX",365,1,"Unità di backup RDX (esterno) + 3 cartucce da 500GB"]
[]
["10L1-UPS-T","OpzUPS 3000VA",407,1,"Riello - UPS MSR3000EVO 3000VA Tower (SNMP+USB+RS232)"]
[]
[]
[]
["10L1-GUI-T","OpzGUIDesk",96,1,"Dell: Kit Monitor 19\" + Mouse + Keyboard"]
[null,null,null,1,"Mice : Dell USB Dual Tone Mouse - Grey - 2 button & Scrollwheel - kit"]
[null,null,null,1,"Dell 19 Monitor | E1916H - 47cm(18.5\") Black ITL"]
[]
[]
["10L1-SO-WIN","ServOpzSysManWindows",193,1,"Servizio Specialistico di System and Network Management per sistema opertivo Windows, erogato on site."]
["10L1-SO-LINUX","ServOpzSysManOS",193,1,"Servizio Specialistico di System and Network Management per sistema opertivo Linux, erogato on site."]
["10L1-SO-PREV","Manutenzione Preventiva",193,1,"Servizi specialistici sistemistici per aggiornare e prevenire malfunzionamenti"]
["10L1-SO-HDD","Hard-Disk retention",150,1,"Data Protection - Keep Your Hard Drive"]
[null,null,null,1,"3Yr Data Protection - Keep Your Hard Drive"]
[null,null,null,1,"4Yr Data Protection - Keep Your Hard Drive"]
[null,null,null,1,"5Yr Data Protection - Keep Your Hard Drive"]
["10L1-SO-12M-T","OpzEstensione12",175,1,"Estensione della manutenzione in garanzia per ulteriori 12 mesi"]
["10L1-SO-24M-T","OpzEstensione24",350,1,"Estensione della manutenzione in garanzia per ulteriori 24 mesi"]

{"sheet":"PCI","index":12,"n_rows":275,"n_cols":16,"rows_kept":275,"cut":false,"hidden":true,"merged":[]}
[]
["HDD Bay2",null,0,{"$f":"\"\"","v":""},{"$f":"\"\"","v":""},{"$f":"\"\"","v":""},0]
[null,null,1,"S2-872235-B21","872235-B21",{"$f":"\"\"","v":""},230]
["HDD Bay1",null,0,{"$f":"\"\"","v":""},{"$f":"\"\"","v":""},{"$f":"\"\"","v":""},0]
[null,null,1,"S2-872233-B21","872233-B21",{"$f":"\"\"","v":""},297]
[]
["Secondary Riser",null,0,{"$f":"\"\"","v":""},{"$f":"\"\"","v":""},{"$f":"\"\"","v":""},0]
[null,null,1,"S2-870548-B21","870548-B21",{"$f":"\"\"","v":""},109]
["Secondary Riser (for GPU)",null,0,{"$f":"\"\"","v":""},{"$f":"\"\"","v":""},{"$f":"\"\"","v":""},0]
[null,null,1,"S2-826704-B21","826704-B21",{"$f":"\"\"","v":""},109]
["Tertiary riser",null,0,{"$f":"\"\"","v":""},{"$f":"\"\"","v":""},{"$f":"\"\"","v":""},0]
[null,null,1,"S2-872253-B21","872253-B21",{"$f":"\"\"","v":""},285]
["9-slot Sec Riser",null,0,{"$f":"\"\"","v":""},{"$f":"\"\"","v":""},{"$f":"\"\"","v":""},0]
[null,null,1,"S2-9SlotRiser","872340 830272",{"$f":"\"\"","v":""},671]
["Additional Card for PCIe Slot 1"]
["DL560"]
["HPE Ethernet 1Gb 4-port 331T Adapter",1,"","","647594-B21","","",0,null,""]
["HPE Ethernet 1Gb 2-port 332T Adapter",1,"TS1L2-1GB","TS1L2-1GB","615732-B21",29,"",0,null,""]
["HPE Ethernet 10Gb 2-port 530SFP Adapter",1,"TS1L2-10GB","TS1L2-10GB","652503-B21",259,"HPE BLc 10G SFP+ SR Transceiver",2,null,"455883-B21"]
["HPE Ethernet 10Gb 2P 530T Adapter",1,"TS1-656596","TS1-656596","656596-B21",null,null,null,298]
["HPE Ethernet 10Gb 2-port 521T Adapter",1,"TS1-867707","TS1-867707","867707-B21",null,null,null,298]
["HPE StoreFabric CN1200E 10Gb Converged Network Adapter",1,"TS1L2-CNA","TS1L2-CNA","E7Y06A",720,"HPE BLc 10G SFP+ SR Transceiver",2,null,"455883-B21"]
["HPE 82Q 8Gb 2-port PCIe Fibre Channel Host Bus Adapter",1,"TS1L2-FC","TS1L2-FC","AJ764A",356,null,0,null,""]
["HPE StoreFabric SN1100Q 16Gb Dual Port Fibre Channel Host Bus Adapter",1,"S2-P9D94A","S2-P9D94A","P9D94A",0,"",0,584,""]
[]
["Additional Card for PCIe Slot 2/3"]
["DL560"]
["None","","","","","","",0,null,""]
["HPE Ethernet 1Gb 2-port 332T Adapter",1,"TS1L2-1GB","TS1L2-1GB","615732-B21",29,"",0,null,""]
["HPE Ethernet 10Gb 2-port 530SFP Adapter",1,"TS1L2-10GB","TS1L2-10GB","652503-B21",259,"HPE BLc 10G SFP+ SR Transceiver",2,null,"455883-B21"]
["HPE StoreFabric CN1200E 10Gb Converged Network Adapter",1,"TS1L2-CNA","TS1L2-CNA","E7Y06A",720,"HPE BLc 10G SFP+ SR Transceiver",2,null,"455883-B21"]
["HPE Ethernet 10Gb 2P 530T Adapter",1,"TS1-656596","TS1-656596","656596-B21",null,null,null,298]
["HPE Ethernet 10Gb 2-port 521T Adapter",1,"TS1-867707","TS1-867707","867707-B21",null,null,null,298]
["HPE 82Q 8Gb 2-port PCIe Fibre Channel Host Bus Adapter",1,"TS1L2-FC","TS1L2-FC","AJ764A",356,null,0,null,""]
["HPE StoreFabric SN1100Q 16Gb Dual Port Fibre Channel Host Bus Adapter",1,"S2-P9D94A","S2-P9D94A","P9D94A",0,"",0,584,""]
[]
["Additional Card for PCIe Slot 3"]
["DL560"]
["None","","","","","","",0,null,""]
["HPE Ethernet 1Gb 2-port 332T Adapter",1,"TS1L2-1GB","TS1L2-1GB","615732-B21",29,"",0,null,""]
["HPE Ethernet 10Gb 2-port 530SFP Adapter",1,"TS1L2-10GB","TS1L2-10GB","652503-B21",259,"HPE BLc 10G SFP+ SR Transceiver",2,null,"455883-B21"]
["HPE Ethernet 10Gb 2P 530T Adapter",1,"TS1-656596","TS1-656596","656596-B21",null,null,null,298]
["HPE Ethernet 10Gb 2-port 521T Adapter",1,"TS1-867707","TS1-867707","867707-B21",null,null,null,298]
["HPE StoreFabric CN1200E 10Gb Converged Network Adapter",1,"TS1L2-CNA","TS1L2-CNA","E7Y06A",720,"HPE BLc 10G SFP+ SR Transceiver",2,null,"455883-B21"]
["HPE 82Q 8Gb 2-port PCIe Fibre Channel Host Bus Adapter",1,"TS1L2-FC","TS1L2-FC","AJ764A",356,null,0,null,""]
["HPE StoreFabric SN1100Q 16Gb Dual Port Fibre Channel Host Bus Adapter",1,"S2-P9D94A","S2-P9D94A","P9D94A",0,"",0,584,""]
[]
["Additional Card for PCIe Slot 4/5/6"]
["DL560"]
["None","","","","","","",0,null,""]
["HPE Ethernet 1Gb 2-port 332T Adapter",1,"TS1L2-1GB","TS1L2-1GB","615732-B21",29,"",0,null,""]
["HPE Ethernet 10Gb 2-port 530SFP Adapter",1,"TS1L2-10GB","TS1L2-10GB","652503-B21",259,"HPE BLc 10G SFP+ SR Transceiver",2,null,"455883-B21"]
["HPE Ethernet 10Gb 2P 530T Adapter",1,"TS1-656596","TS1-656596","656596-B21",null,null,null,298]
["HPE Ethernet 10Gb 2-port 521T Adapter",1,"TS1-867707","TS1-867707","867707-B21",null,null,null,298]
["HPE StoreFabric CN1200E 10Gb Converged Network Adapter",1,"TS1L2-CNA","TS1L2-CNA","E7Y06A",720,"HPE BLc 10G SFP+ SR Transceiver",2,null,"455883-B21"]
["HPE 82Q 8Gb 2-port PCIe Fibre Channel Host Bus Adapter",1,"TS1L2-FC","TS1L2-FC","AJ764A",356,null,0,null,""]
["HPE StoreFabric SN1100Q 16Gb Dual Port Fibre Channel Host Bus Adapter",1,"S2-P9D94A","S2-P9D94A","P9D94A",0,"",0,584,""]
[]
["Additional Card for PCIe Slot 5"]
["DL560"]
["None","","","","","","",0,null,""]
["NVIDIA Quadro P2000 GPU Module",1,"TS1-Q0V77A","TS1-Q0V77A","Q0V77A",null,null,null,518]
["HPE Ethernet 1Gb 2-port 332T Adapter",1,"TS1L2-1GB","TS1L2-1GB","615732-B21",29,"",0,null,""]
["HPE Ethernet 10Gb 2-port 530SFP Adapter",1,"TS1L2-10GB","TS1L2-10GB","652503-B21",259,"HPE BLc 10G SFP+ SR Transceiver",2,null,"455883-B21"]
["HPE Ethernet 10Gb 2P 530T Adapter",1,"TS1-656596","TS1-656596","656596-B21",null,null,null,298]
["HPE Ethernet 10Gb 2-port 521T Adapter",1,"TS1-867707","TS1-867707","867707-B21",null,null,null,298]
["HPE StoreFabric CN1200E 10Gb Converged Network Adapter",1,"TS1L2-CNA","TS1L2-CNA","E7Y06A",720,"HPE BLc 10G SFP+ SR Transceiver",2,null,"455883-B21"]
["HPE 82Q 8Gb 2-port PCIe Fibre Channel Host Bus Adapter",1,"TS1L2-FC","TS1L2-FC","AJ764A",356,null,0,null,""]
["HPE StoreFabric SN1100Q 16Gb Dual Port Fibre Channel Host Bus Adapter",1,"S2-P9D94A","S2-P9D94A","P9D94A",0,"",0,584,""]
[]
["Additional Card for PCIe Slot 6"]
["DL560"]
["None","","","","","","",0,null,""]
["HPE Ethernet 1Gb 2-port 332T Adapter",1,"TS1L2-1GB","TS1L2-1GB","615732-B21",29,"",0,null,""]
["HPE Ethernet 10Gb 2-port 530SFP Adapter",1,"TS1L2-10GB","TS1L2-10GB","652503-B21",259,"HPE BLc 10G SFP+ SR Transceiver",2,null,"455883-B21"]
["HPE Ethernet 10Gb 2P 530T Adapter",1,"TS1-656596","TS1-656596","656596-B21",null,null,null,298]
["HPE Ethernet 10Gb 2-port 521T Adapter",1,"TS1-867707","TS1-867707","867707-B21",null,null,null,298]
["HPE StoreFabric CN1200E 10Gb Converged Network Adapter",1,"TS1L2-CNA","TS1L2-CNA","E7Y06A",720,"HPE BLc 10G SFP+ SR Transceiver",2,null,"455883-B21"]
["HPE 82Q 8Gb 2-port PCIe Fibre Channel Host Bus Adapter",1,"TS1L2-FC","TS1L2-FC","AJ764A",356,null,0,null,""]
["HPE StoreFabric SN1100Q 16Gb Dual Port Fibre Channel Host Bus Adapter",1,"S2-P9D94A","S2-P9D94A","P9D94A",0,"",0,584,""]
[]
["Additional Card for PCIe Slot 7/8"]
["DL560"]
["None","","","","","","",0,null,""]
["HPE Ethernet 1Gb 2-port 332T Adapter",1,"TS1L2-1GB","TS1L2-1GB","615732-B21",29,"",0,null,""]
["HPE Ethernet 10Gb 2-port 530SFP Adapter",1,"TS1L2-10GB","TS1L2-10GB","652503-B21",259,"HPE BLc 10G SFP+ SR Transceiver",2,null,"455883-B21"]
["HPE Ethernet 10Gb 2P 530T Adapter",1,"TS1-656596","TS1-656596","656596-B21",null,null,null,298]
["HPE Ethernet 10Gb 2-port 521T Adapter",1,"TS1-867707","TS1-867707","867707-B21",null,null,null,298]
["HPE StoreFabric CN1200E 10Gb Converged Network Adapter",1,"TS1L2-CNA","TS1L2-CNA","E7Y06A",720,"HPE BLc 10G SFP+ SR Transceiver",2,null,"455883-B21"]
["HPE 82Q 8Gb 2-port PCIe Fibre Channel Host Bus Adapter",1,"TS1L2-FC","TS1L2-FC","AJ764A",356,null,0,null,""]
["HPE StoreFabric SN1100Q 16Gb Dual Port Fibre Channel Host Bus Adapter",1,"S2-P9D94A","S2-P9D94A","P9D94A",0,"",0,584,""]
[]
[]
["Additional Card for PCIe Slot 9 OCCUPATO"]
["DL580"]
["None","","","","","","",0,null,""]
["HPE Ethernet 1Gb 2P 332T Adptr",1,"10L2-LAN1GB","S10L1-DL560-LAN1","615732-B21",35,"",0,null,""]
["HPE Ethernet 10Gb 2P 530SFP+ Adptr",1,"10L2-LAN10GB","S10L1-DL560-LAN10","652503-B21",716,"HPE BLc 10G SFP+ SR Transceiver",2,null,"455883-B21"]
["HPE StoreFabric CN1200E 10Gb CNA",1,"10L2-CNA10","S10L1-DL560-CNA10","E7Y06A",778,"HPE BLc 10G SFP+ SR Transceiver",2,null,"455883-B21"]
["HPE 82Q 8Gb Dual Port PCI-e FC HBA",1,"10L2-FC","S10L1-DL560-FC","AJ764A",889,null,0,null,""]
[]
["Additional Card for PCIe Slot 8",null,null,null,null,null,null,null,null,null,null,1671,{"$f":"L102/100","v":16.71},{"$f":"M102*25","v":417.75},{"$f":"N102+L102","v":2088.75},2100]
["DL580"]
["None","","","","","","",0,null,""]
["HPE Ethernet 1Gb 2-port 332T Adapter",1,"TS1L2-1GB","TS1L2-1GB","615732-B21",29,"",0,null,""]
["HPE Ethernet 10Gb 2-port 530SFP Adapter",1,"TS1L2-10GB","TS1L2-10GB","652503-B21",259,"HPE BLc 10G SFP+ SR Transceiver",2,null,"455883-B21"]
["HPE StoreFabric CN1200E 10Gb Converged Network Adapter",1,"TS1L2-CNA","TS1L2-CNA","E7Y06A",720,"HPE BLc 10G SFP+ SR Transceiver",2,null,"455883-B21"]
["HPE Ethernet 10Gb 2P 530T Adapter",1,"TS1-656596","TS1-656596","656596-B21",null,null,null,298]
["HPE Ethernet 10Gb 2-port 521T Adapter",1,"TS1-867707","TS1-867707","867707-B21",null,null,null,298]
["HPE 82Q 8Gb 2-port PCIe Fibre Channel Host Bus Adapter",1,"TS1L2-FC","TS1L2-FC","AJ764A",356,null,0,null,""]
["HPE StoreFabric SN1100Q 16Gb Dual Port Fibre Channel Host Bus Adapter",1,"S2-P9D94A","S2-P9D94A","P9D94A",0,"",0,584,""]
[]
["Additional Card for PCIe Slot 7"]
["DL580"]
["None","","","","","","",0,null,""]
["HPE Ethernet 1Gb 2-port 332T Adapter",1,"TS1L2-1GB","TS1L2-1GB-ALT","615732-B21",29,"",0,null,""]
["HPE Ethernet 10Gb 2-port 530SFP Adapter",1,"TS1L2-10GB","TS1L2-10GB-ALT","652503-B21",259,"HPE BLc 10G SFP+ SR Transceiver",2,null,"455883-B21"]
["HPE StoreFabric CN1200E 10Gb Converged Network Adapter",1,"TS1L2-CNA","TS1L2-CNA-ALT","E7Y06A",720,"HPE BLc 10G SFP+ SR Transceiver",2,null,"455883-B21"]
["HPE Ethernet 10Gb 2P 530T Adapter",1,"TS1-656596","TS1-656596","656596-B21",null,null,null,298]
["HPE Ethernet 10Gb 2-port 521T Adapter",1,"TS1-867707","TS1-867707","867707-B21",null,null,null,298]
["HPE 82Q 8Gb 2-port PCIe Fibre Channel Host Bus Adapter",1,"TS1L2-FC","TS1L2-FC","AJ764A",356,null,0,null,""]
["HPE StoreFabric SN1100Q 16Gb Dual Port Fibre Channel Host Bus Adapter",1,"S2-P9D94A","S2-P9D94A-ALT","P9D94A",0,"",0,584,""]
[]
["Additional Card for PCIe Slot 6"]
["DL580 Slot 48HDD"]
["None","","","","","","",0,null,""]
["HPE Ethernet 1Gb 2-port 332T Adapter",1,"TS1L2-1GB","TS1L2-1GB-ALT","615732-B21",29,"",0,null,""]
["HPE DL580 Gen10 12G 24-port SAS Expander",1,"","","881101-B21"]
["HPE Smart Array P408i-p SR Gen10 Ctrlr",1,"","","830824-B21"]
["HPE Ethernet 10Gb 2-port 530SFP Adapter",1,"TS1L2-10GB","TS1L2-10GB-ALT","652503-B21",259,"HPE BLc 10G SFP+ SR Transceiver",2,null,"455883-B21"]
["HPE StoreFabric CN1200E 10Gb Converged Network Adapter",1,"TS1L2-CNA","TS1L2-CNA-ALT","E7Y06A",720,"HPE BLc 10G SFP+ SR Transceiver",2,null,"455883-B21"]
["HPE Ethernet 10Gb 2P 530T Adapter",1,"TS1-656596","TS1-656596","656596-B21",null,null,null,298]
["HPE Ethernet 10Gb 2-port 521T Adapter",1,"TS1-867707","TS1-867707","867707-B21",null,null,null,298]
["HPE 82Q 8Gb 2-port PCIe Fibre Channel Host Bus Adapter",1,"TS1L2-FC","TS1L2-FC","AJ764A",356,null,0,null,""]
["HPE StoreFabric SN1100Q 16Gb Dual Port Fibre Channel Host Bus Adapter",1,"S2-P9D94A","S2-P9D94A-ALT","P9D94A",0,"",0,584,""]
[]
["Additional Card for PCIe Slot 5"]
["DL580"]
["None","","","","","","",0,null,""]
["HPE Ethernet 1Gb 2-port 332T Adapter",1,"TS1L2-1GB","TS1L2-1GB","615732-B21",29,"",0,null,""]
["HPE Ethernet 10Gb 2-port 530SFP Adapter",1,"TS1L2-10GB","TS1L2-10GB","652503-B21",259,"HPE BLc 10G SFP+ SR Transceiver",2,null,"455883-B21"]
["HPE StoreFabric CN1200E 10Gb Converged Network Adapter",1,"TS1L2-CNA","TS1L2-CNA","E7Y06A",720,"HPE BLc 10G SFP+ SR Transceiver",2,null,"455883-B21"]
["HPE Ethernet 10Gb 2P 530T Adapter",1,"TS1-656596","TS1-656596","656596-B21",null,null,null,298]
["HPE Ethernet 10Gb 2-port 521T Adapter",1,"TS1-867707","TS1-867707","867707-B21",null,null,null,298]
["HPE 82Q 8Gb 2-port PCIe Fibre Channel Host Bus Adapter",1,"TS1L2-FC","TS1L2-FC","AJ764A",356,null,0,null,""]
["HPE StoreFabric SN1100Q 16Gb Dual Port Fibre Channel Host Bus Adapter",1,"S2-P9D94A","S2-P9D94A","P9D94A",0,"",0,584,""]
[]
["Additional Card for PCIe Slot 4"]
["DL580"]
["None","","","","","","",0,null,""]
["HPE Ethernet 1Gb 2-port 332T Adapter",1,"TS1L2-1GB","TS1L2-1GB","615732-B21",29,"",0,null,""]
["HPE Ethernet 10Gb 2-port 530SFP Adapter",1,"TS1L2-10GB","TS1L2-10GB","652503-B21",259,"HPE BLc 10G SFP+ SR Transceiver",2,null,"455883-B21"]
["HPE StoreFabric CN1200E 10Gb Converged Network Adapter",1,"TS1L2-CNA","TS1L2-CNA","E7Y06A",720,"HPE BLc 10G SFP+ SR Transceiver",2,null,"455883-B21"]
["HPE Ethernet 10Gb 2P 530T Adapter",1,"TS1-656596","TS1-656596","656596-B21",null,null,null,298]
["HPE Ethernet 10Gb 2-port 521T Adapter",1,"TS1-867707","TS1-867707","867707-B21",null,null,null,298]
["HPE 82Q 8Gb 2-port PCIe Fibre Channel Host Bus Adapter",1,"TS1L2-FC","TS1L2-FC","AJ764A",356,null,0,null,""]
["HPE StoreFabric SN1100Q 16Gb Dual Port Fibre Channel Host Bus Adapter",1,"S2-P9D94A","S2-P9D94A","P9D94A",0,"",0,584,""]
["NVIDIA Tesla V100 PCIe 16GB Module",1,"TS1-Q2N68A","TS1-Q2N68A","Q2N68A",null,null,null,10583]
["NVIDIA Tesla P40 24GB Module",1,"TS1-Q0V80A","TS1-Q0V80A","Q0V80A",null,null,null,7552]
["NVIDIA Quadro P6000 GPU Module",1,"TS1-Q0V76A","TS1-Q0V76A","Q0V76A",0,"",0,5310,""]
[]
["Additional Card for PCIe Slot 3"]
["DL580"]
["None","","","","","","",0,null,""]
["HPE Ethernet 1Gb 2-port 332T Adapter",1,"TS1L2-1GB","TS1L2-1GB-ALT","615732-B21",29,"",0,null,""]
["HPE Ethernet 10Gb 2-port 530SFP Adapter",1,"TS1L2-10GB","TS1L2-10GB-ALT","652503-B21",259,"HPE BLc 10G SFP+ SR Transceiver",2,null,"455883-B21"]
["HPE StoreFabric CN1200E 10Gb Converged Network Adapter",1,"TS1L2-CNA","TS1L2-CNA-ALT","E7Y06A",720,"HPE BLc 10G SFP+ SR Transceiver",2,null,"455883-B21"]
["HPE Ethernet 10Gb 2P 530T Adapter",1,"TS1-656596","TS1-656596","656596-B21",null,null,null,298]
["HPE Ethernet 10Gb 2-port 521T Adapter",1,"TS1-867707","TS1-867707","867707-B21",null,null,null,298]
["HPE 82Q 8Gb 2-port PCIe Fibre Channel Host Bus Adapter",1,"TS1L2-FC","TS1L2-FC","AJ764A",356,null,0,null,""]
["HPE StoreFabric SN1100Q 16Gb Dual Port Fibre Channel Host Bus Adapter",1,"S2-P9D94A","S2-P9D94A-ALT","P9D94A",0,"",0,584,""]
[]
["Additional Card for PCIe Slot 2"]
["DL580"]
["None","","","","","","",0,null,""]
["HPE Ethernet 1Gb 2-port 332T Adapter",1,"TS1L2-1GB","TS1L2-1GB-ALT","615732-B21",29,"",0,null,""]
["HPE Ethernet 10Gb 2-port 530SFP Adapter",1,"TS1L2-10GB","TS1L2-10GB-ALT","652503-B21",259,"HPE BLc 10G SFP+ SR Transceiver",2,null,"455883-B21"]
["HPE StoreFabric CN1200E 10Gb Converged Network Adapter",1,"TS1L2-CNA","TS1L2-CNA-ALT","E7Y06A",720,"HPE BLc 10G SFP+ SR Transceiver",2,null,"455883-B21"]
["HPE Ethernet 10Gb 2P 530T Adapter",1,"TS1-656596","TS1-656596","656596-B21",null,null,null,298]
["HPE Ethernet 10Gb 2-port 521T Adapter",1,"TS1-867707","TS1-867707","867707-B21",null,null,null,298]
["HPE 82Q 8Gb 2-port PCIe Fibre Channel Host Bus Adapter",1,"TS1L2-FC","TS1L2-FC","AJ764A",356,null,0,null,""]
["HPE StoreFabric SN1100Q 16Gb Dual Port Fibre Channel Host Bus Adapter",1,"S2-P9D94A","S2-P9D94A-ALT","P9D94A",0,"",0,584,""]
[]
["Additional Card for PCIe Slot 1"]
["DL580"]
["None","","","","","","",0,null,""]
["HPE Ethernet 1Gb 2-port 332T Adapter",1,"TS1L2-1GB","TS1L2-1GB-ALT","615732-B21",29,"",0,null,""]
["HPE Ethernet 10Gb 2-port 530SFP Adapter",1,"TS1L2-10GB","TS1L2-10GB-ALT","652503-B21",259,"HPE BLc 10G SFP+ SR Transceiver",2,null,"455883-B21"]
["HPE StoreFabric CN1200E 10Gb Converged Network Adapter",1,"TS1L2-CNA","TS1L2-CNA-ALT","E7Y06A",720,"HPE BLc 10G SFP+ SR Transceiver",2,null,"455883-B21"]
["HPE Ethernet 10Gb 2P 530T Adapter",1,"TS1-656596","TS1-656596","656596-B21",null,null,null,298]
["HPE Ethernet 10Gb 2-port 521T Adapter",1,"TS1-867707","TS1-867707","867707-B21",null,null,null,298]
["HPE 82Q 8Gb 2-port PCIe Fibre Channel Host Bus Adapter",1,"TS1L2-FC","TS1L2-FC","AJ764A",356,null,0,null,""]
["HPE StoreFabric SN1100Q 16Gb Dual Port Fibre Channel Host Bus Adapter",1,"S2-P9D94A","S2-P9D94A-ALT","P9D94A",0,"",0,584,""]
[]
["Aggiungere Coppia di Processori"]
[]
["Non Disponibile"]
["Aggiungere Secondary Riser"]
["Aggiungere Tertiary riser"]
[]
["Aggiungere 9 slot Secondary Riser"]
[]
[]
[]
[]
[]
[]
[]
[]
[]
[]
[]
[]
[]
[]
[]
[]
[]
[]
[]
[]
[]
[]
[]
[]
[]
[]
[]
["Additional Card for PCIe Slot 1 (Full height) (CPU1)"]
["T630"]
["None",{"$f":"\"\"","v":""},{"$f":"\"\"","v":""},{"$f":"\"\"","v":""},{"$f":"\"\"","v":""},{"$f":"\"\"","v":""},{"$f":"\"\"","v":""},0,{"$f":"\"\"","v":""}]
["Broadcom 5720 DP 1Gb Network Interface Card,Full Height,CusKit",1,"10L1-LAN1GB","S10L1-T630-LAN1","[540-BBGY]",35,"",0,""]
["Emulex LPE 12002, Dual Port 8Gb Fibre Channel HBA,Full Height,CusKit",1,"10L1-FC","S10L1-T630-FC","[406-BBGR]",940,null,0,""]
["QLogic 57810 Dual Port 10Gb Direct Attach/SFP+ Network Adapter,Full Height,CusKit",1,"10L1-LAN10GB","S10L1-T630-LAN10","[540-BBGS]",417,"PowerEdge SFP+, 10GbE SR/SX, Optical Tranceiver, LC Connector, for Intel and Broadcom,CusKit",2,"[407-BBOK]"]
[]
[]
["Additional Card for PCIe Slot 2 (Full height) (CPU1)"]
["T630"]
["None",{"$f":"\"\"","v":""},{"$f":"\"\"","v":""},{"$f":"\"\"","v":""},{"$f":"\"\"","v":""},{"$f":"\"\"","v":""},{"$f":"\"\"","v":""},0,{"$f":"\"\"","v":""}]
["Broadcom 5720 DP 1Gb Network Interface Card,Full Height,CusKit",1,"10L1-LAN1GB","S10L1-T630-LAN1","[540-BBGY]",35,"",0,""]
["Emulex LPE 12002, Dual Port 8Gb Fibre Channel HBA,Full Height,CusKit",1,"10L1-FC","S10L1-T630-FC","[406-BBGR]",940,null,0,""]
["QLogic 57810 Dual Port 10Gb Direct Attach/SFP+ Network Adapter,Full Height,CusKit",1,"10L1-LAN10GB","S10L1-T630-LAN10","[540-BBGS]",417,"PowerEdge SFP+, 10GbE SR/SX, Optical Tranceiver, LC Connector, for Intel and Broadcom,CusKit",2,"[407-BBOK]"]
[]
[]
["Additional Card for PCIe Slot 3 (Full height) (CPU2)"]
["T630"]
["None",{"$f":"\"\"","v":""},{"$f":"\"\"","v":""},{"$f":"\"\"","v":""},{"$f":"\"\"","v":""},{"$f":"\"\"","v":""},{"$f":"\"\"","v":""},0,{"$f":"\"\"","v":""}]
["Broadcom 5720 DP 1Gb Network Interface Card,Full Height,CusKit",1,"10L1-LAN1GB","S10L1-T630-LAN1","[540-BBGY]",35,"",0,""]
["Emulex LPE 12002, Dual Port 8Gb Fibre Channel HBA,Full Height,CusKit",1,"10L1-FC","S10L1-T630-FC","[406-BBGR]",940,null,0,""]
["QLogic 57810 Dual Port 10Gb Direct Attach/SFP+ Network Adapter,Full Height,CusKit",1,"10L1-LAN10GB","S10L1-T630-LAN10","[540-BBGS]",417,"PowerEdge SFP+, 10GbE SR/SX, Optical Tranceiver, LC Connector, for Intel and Broadcom,CusKit",2,"[407-BBOK]"]
[]
[]
["Additional Card for PCIe Slot 4 (Full height) (CPU2)"]
["T630"]
["None",{"$f":"\"\"","v":""},{"$f":"\"\"","v":""},{"$f":"\"\"","v":""},{"$f":"\"\"","v":""},{"$f":"\"\"","v":""},{"$f":"\"\"","v":""},0,{"$f":"\"\"","v":""}]
["Broadcom 5720 DP 1Gb Network Interface Card,Full Height,CusKit",1,"10L1-LAN1GB","S10L1-T630-LAN1","[540-BBGY]",35,"",0,""]
["Emulex LPE 12002, Dual Port 8Gb Fibre Channel HBA,Full Height,CusKit",1,"10L1-FC","S10L1-T630-FC","[406-BBGR]",940,null,0,""]
["QLogic 57810 Dual Port 10Gb Direct Attach/SFP+ Network Adapter,Full Height,CusKit",1,"10L1-LAN10GB","S10L1-T630-LAN10","[540-BBGS]",417,"PowerEdge SFP+, 10GbE SR/SX, Optical Tranceiver, LC Connector, for Intel and Broadcom,CusKit",2,"[407-BBOK]"]
[]
[]
[]
["Additional Card for PCIe Slot 5 (Full height) (CPU2)"]
["T630"]
["None",{"$f":"\"\"","v":""},{"$f":"\"\"","v":""},{"$f":"\"\"","v":""},{"$f":"\"\"","v":""},{"$f":"\"\"","v":""},{"$f":"\"\"","v":""},0,{"$f":"\"\"","v":""}]
["Broadcom 5720 DP 1Gb Network Interface Card,Full Height,CusKit",1,"10L1-LAN1GB","S10L1-T630-LAN1","[540-BBGY]",35,"",0,""]
["Emulex LPE 12002, Dual Port 8Gb Fibre Channel HBA,Full Height,CusKit",1,"10L1-FC","S10L1-T630-FC","[406-BBGR]",940,null,0,""]
["QLogic 57810 Dual Port 10Gb Direct Attach/SFP+ Network Adapter,Full Height,CusKit",1,"10L1-LAN10GB","S10L1-T630-LAN10","[540-BBGS]",417,"PowerEdge SFP+, 10GbE SR/SX, Optical Tranceiver, LC Connector, for Intel and Broadcom,CusKit",2,"[407-BBOK]"]
[]
[]
["Additional Card for PCIe Slot 6 (Full height) (CPU2)"]
["T630"]
["None",{"$f":"\"\"","v":""},{"$f":"\"\"","v":""},{"$f":"\"\"","v":""},{"$f":"\"\"","v":""},{"$f":"\"\"","v":""},{"$f":"\"\"","v":""},0,{"$f":"\"\"","v":""}]
["Broadcom 5720 DP 1Gb Network Interface Card,Full Height,CusKit",1,"10L1-LAN1GB","S10L1-T630-LAN1","[540-BBGY]",35,"",0,""]
["Emulex LPE 12002, Dual Port 8Gb Fibre Channel HBA,Full Height,CusKit",1,"10L1-FC","S10L1-T630-FC","[406-BBGR]",940,null,0,""]
["QLogic 57810 Dual Port 10Gb Direct Attach/SFP+ Network Adapter,Full Height,CusKit",1,"10L1-LAN10GB","S10L1-T630-LAN10","[540-BBGS]",417,"PowerEdge SFP+, 10GbE SR/SX, Optical Tranceiver, LC Connector, for Intel and Broadcom,CusKit",2,"[407-BBOK]"]

{"sheet":"Operating System","index":13,"n_rows":60,"n_cols":30,"rows_kept":60,"cut":false,"hidden":true,"merged":[[0,1,0,2]]}
["Operating System"]
["DL560"]
["No Operating System",{"$f":"\"\"","v":""},{"$f":"\"\"","v":""},{"$f":"\"\"","v":""},{"$f":"\"\"","v":""},{"$f":"\"\"","v":""},"None",{"$f":"\"\"","v":""},{"$f":"\"\"","v":""},{"$f":"\"\"","v":""},{"$f":"\"\"","v":""},0,"None",{"$f":"\"\"","v":""},{"$f":"\"\"","v":""},{"$f":"\"\"","v":""},{"$f":"\"\"","v":""},0,{"$f":"\"\"","v":""},0,{"$f":"\"\"","v":""},{"$f":"\"\"","v":""},{"$f":"\"\"","v":""},0,{"$f":"\"\"","v":""},0,{"$f":"\"\"","v":""},{"$f":"\"\"","v":""},{"$f":"\"\"","v":""},0]
["Microsoft Windows Server 2016 Standard Edition ROK 16 Core",1,"TS1L2-WIN1","TS1L2-WIN1","871148-B21",556,"Microsoft Windows Server 2016 1 User CAL",null,"TS1L2-CALUSER","TS1L2-CALUSER","871175-A21",22,"Microsoft Windows Server 2016 1 Device CAL",null,"TS1L2-CALDEV","TS1L2-CALDEV","871176-A21",22,"Microsoft Windows Server 2016 Standard Edition Additional License 2 Core",4,"TS1L2-WIN2CORE","TS1L2-WIN2CORE","871159-A21",56,{"$f":"\"\"","v":""},0,{"$f":"\"\"","v":""},{"$f":"\"\"","v":""},{"$f":"\"\"","v":""},0]
["Microsoft Windows Server 2016 Datacenter Edition ROK 16 Core",1,"TS1L2-WINDC1","TS1L2-WINDC1","871153-B21",2174,"Microsoft Windows Server 2016 1 User CAL",null,"TS1L2-CALUSER","TS1L2-CALUSER","871175-A21",22,"Microsoft Windows Server 2016 1 Device CAL",null,"TS1L2-CALDEV","TS1L2-CALDEV","871176-A21",22,"Microsoft Windows Server 2016 Datacenter Edition Additional License 16 Core",1,"TS1L2-WINDC2","TS1L2-WINDC2","871166-A21",2105,{"$f":"\"\"","v":""},0,{"$f":"\"\"","v":""},{"$f":"\"\"","v":""},{"$f":"\"\"","v":""},0]
["CentOS 7.0",1,"TS1L2-LINUX","TS1L2-LINUX",null,50,"None",{"$f":"\"\"","v":""},{"$f":"\"\"","v":""},{"$f":"\"\"","v":""},{"$f":"\"\"","v":""},0,"None",{"$f":"\"\"","v":""},{"$f":"\"\"","v":""},{"$f":"\"\"","v":""},{"$f":"\"\"","v":""},0,{"$f":"\"\"","v":""},0,{"$f":"\"\"","v":""},{"$f":"\"\"","v":""},{"$f":"\"\"","v":""},0,{"$f":"\"\"","v":""},0,{"$f":"\"\"","v":""},{"$f":"\"\"","v":""},{"$f":"\"\"","v":""},0]
[]
["DL560 2CPU"]
["No Operating System",{"$f":"\"\"","v":""},{"$f":"\"\"","v":""},{"$f":"\"\"","v":""},{"$f":"\"\"","v":""},{"$f":"\"\"","v":""},"None",{"$f":"\"\"","v":""},{"$f":"\"\"","v":""},{"$f":"\"\"","v":""},{"$f":"\"\"","v":""},0,"None",{"$f":"\"\"","v":""},{"$f":"\"\"","v":""},{"$f":"\"\"","v":""},{"$f":"\"\"","v":""},0,{"$f":"\"\"","v":""},0,{"$f":"\"\"","v":""},{"$f":"\"\"","v":""},{"$f":"\"\"","v":""},0,{"$f":"\"\"","v":""},0,{"$f":"\"\"","v":""},{"$f":"\"\"","v":""},{"$f":"\"\"","v":""},0]
["Microsoft Windows Server 2016 Standard Edition ROK 16 Core",1,"TS1L2-WIN1","TS1L2-WIN1","871148-B21",556,"Microsoft Windows Server 2016 1 User CAL",null,"TS1L2-CALUSER","TS1L2-CALUSER","871175-A21",22,"Microsoft Windows Server 2016 1 Device CAL",null,"TS1L2-CALDEV","TS1L2-CALDEV","871176-A21",22,"Microsoft Windows Server 2016 Standard Edition Additional License 16 Core",2,"TS1L2-WIN2","TS1L2-WIN2","871157-A21",526,{"$f":"\"\"","v":""},0,{"$f":"\"\"","v":""},{"$f":"\"\"","v":""},{"$f":"\"\"","v":""},0]
["Microsoft Windows Server 2016 Datacenter Edition ROK 16 Core",1,"TS1L2-WINDC1","TS1L2-WINDC1","871153-B21",2174,"Microsoft Windows Server 2016 1 User CAL",null,"TS1L2-CALUSER","TS1L2-CALUSER","871175-A21",22,"Microsoft Windows Server 2016 1 Device CAL",null,"TS1L2-CALDEV","TS1L2-CALDEV","871176-A21",22,"Microsoft Windows Server 2016 Datacenter Edition Additional License 16 Core",2,"TS1L2-WINDC2","TS1L2-WINDC2","871166-A21",2105,{"$f":"\"\"","v":""},0,{"$f":"\"\"","v":""},{"$f":"\"\"","v":""},{"$f":"\"\"","v":""},0]
["CentOS 7.0",1,"TS1L2-LINUX","TS1L2-LINUX",null,50,"None",{"$f":"\"\"","v":""},{"$f":"\"\"","v":""},{"$f":"\"\"","v":""},{"$f":"\"\"","v":""},0,"None",{"$f":"\"\"","v":""},{"$f":"\"\"","v":""},{"$f":"\"\"","v":""},{"$f":"\"\"","v":""},0,{"$f":"\"\"","v":""},0,{"$f":"\"\"","v":""},{"$f":"\"\"","v":""},{"$f":"\"\"","v":""},0,{"$f":"\"\"","v":""},0,{"$f":"\"\"","v":""},{"$f":"\"\"","v":""},{"$f":"\"\"","v":""},0]
[]
[]
["DL580 ALTERNATIVO"]
["No Operating System",{"$f":"\"\"","v":""},{"$f":"\"\"","v":""},{"$f":"\"\"","v":""},{"$f":"\"\"","v":""},{"$f":"\"\"","v":""},"None",{"$f":"\"\"","v":""},{"$f":"\"\"","v":""},{"$f":"\"\"","v":""},{"$f":"\"\"","v":""},0,"None",{"$f":"\"\"","v":""},{"$f":"\"\"","v":""},{"$f":"\"\"","v":""},{"$f":"\"\"","v":""},0,{"$f":"\"\"","v":""},0,{"$f":"\"\"","v":""},{"$f":"\"\"","v":""},{"$f":"\"\"","v":""},0,{"$f":"\"\"","v":""},0,{"$f":"\"\"","v":""},{"$f":"\"\"","v":""},{"$f":"\"\"","v":""},0]
["Microsoft Windows Server 2016 Standard Edition ROK 16 Core",1,"TS1L2-WIN1","TS1L2-WIN1","871148-B21",556,"Microsoft Windows Server 2016 1 User CAL",null,"TS1L2-CALUSER","TS1L2-CALUSER","871175-A21",22,"Microsoft Windows Server 2016 1 Device CAL",null,"TS1L2-CALDEV","TS1L2-CALDEV","871176-A21",22,"Microsoft Windows Server 2016 Standard Edition Additional License 2 Core",4,"TS1L2-WIN2CORE","TS1L2-WIN2CORE","871159-A21",56,{"$f":"\"\"","v":""},0,{"$f":"\"\"","v":""},{"$f":"\"\"","v":""},{"$f":"\"\"","v":""},0]
["Microsoft Windows Server 2016 Datacenter Edition ROK 16 Core",1,"TS1L2-WINDC1","TS1L2-WINDC1","871153-B21",2174,"Microsoft Windows Server 2016 1 User CAL",null,"TS1L2-CALUSER","TS1L2-CALUSER","871175-A21",22,"Microsoft Windows Server 2016 1 Device CAL",null,"TS1L2-CALDEV","TS1L2-CALDEV","871176-A21",22,"Microsoft Windows Server 2016 Datacenter Edition Additional License 16 Core",1,"TS1L2-WINDC2","TS1L2-WINDC2","871166-A21",2105,{"$f":"\"\"","v":""},0,{"$f":"\"\"","v":""},{"$f":"\"\"","v":""},{"$f":"\"\"","v":""},0]
["CentOS 7.0",1,"TS1L2-LINUX","TS1L2-LINUX",null,50,"None",{"$f":"\"\"","v":""},{"$f":"\"\"","v":""},{"$f":"\"\"","v":""},{"$f":"\"\"","v":""},0,"None",{"$f":"\"\"","v":""},{"$f":"\"\"","v":""},{"$f":"\"\"","v":""},{"$f":"\"\"","v":""},0,{"$f":"\"\"","v":""},0,{"$f":"\"\"","v":""},{"$f":"\"\"","v":""},{"$f":"\"\"","v":""},0,{"$f":"\"\"","v":""},0,{"$f":"\"\"","v":""},{"$f":"\"\"","v":""},{"$f":"\"\"","v":""},0]
[]
["DL580 ALTERNATIVO 2CPU"]
["No Operating System",{"$f":"\"\"","v":""},{"$f":"\"\"","v":""},{"$f":"\"\"","v":""},{"$f":"\"\"","v":""},{"$f":"\"\"","v":""},"None",{"$f":"\"\"","v":""},{"$f":"\"\"","v":""},{"$f":"\"\"","v":""},{"$f":"\"\"","v":""},0,"None",{"$f":"\"\"","v":""},{"$f":"\"\"","v":""},{"$f":"\"\"","v":""},{"$f":"\"\"","v":""},0,{"$f":"\"\"","v":""},0,{"$f":"\"\"","v":""},{"$f":"\"\"","v":""},{"$f":"\"\"","v":""},0,{"$f":"\"\"","v":""},0,{"$f":"\"\"","v":""},{"$f":"\"\"","v":""},{"$f":"\"\"","v":""},0]
["Microsoft Windows Server 2016 Standard Edition ROK 16 Core",1,"TS1L2-WIN1","TS1L2-WIN1","871148-B21",556,"Microsoft Windows Server 2016 1 User CAL",null,"TS1L2-CALUSER","TS1L2-CALUSER","871175-A21",22,"Microsoft Windows Server 2016 1 Device CAL",null,"TS1L2-CALDEV","TS1L2-CALDEV","871176-A21",22,"Microsoft Windows Server 2016 Standard Edition Additional License 16 Core",2,"TS1L2-WIN2","TS1L2-WIN2","871157-A21",526,{"$f":"\"\"","v":""},0,{"$f":"\"\"","v":""},{"$f":"\"\"","v":""},{"$f":"\"\"","v":""},0]
["Microsoft Windows Server 2016 Datacenter Edition ROK 16 Core",1,"TS1L2-WINDC1","TS1L2-WINDC1","871153-B21",2174,"Microsoft Windows Server 2016 1 User CAL",null,"TS1L2-CALUSER","TS1L2-CALUSER","871175-A21",22,"Microsoft Windows Server 2016 1 Device CAL",null,"TS1L2-CALDEV","TS1L2-CALDEV","871176-A21",22,"Microsoft Windows Server 2016 Datacenter Edition Additional License 16 Core",2,"TS1L2-WINDC2","TS1L2-WINDC2","871166-A21",2105,{"$f":"\"\"","v":""},0,{"$f":"\"\"","v":""},{"$f":"\"\"","v":""},{"$f":"\"\"","v":""},0]
["CentOS 7.0",1,"TS1L2-LINUX","TS1L2-LINUX",null,50,"None",{"$f":"\"\"","v":""},{"$f":"\"\"","v":""},{"$f":"\"\"","v":""},{"$f":"\"\"","v":""},0,"None",{"$f":"\"\"","v":""},{"$f":"\"\"","v":""},{"$f":"\"\"","v":""},{"$f":"\"\"","v":""},0,{"$f":"\"\"","v":""},0,{"$f":"\"\"","v":""},{"$f":"\"\"","v":""},{"$f":"\"\"","v":""},0,{"$f":"\"\"","v":""},0,{"$f":"\"\"","v":""},{"$f":"\"\"","v":""},{"$f":"\"\"","v":""},0]
[]
["Dl580 PREST"]
["No Operating System",{"$f":"\"\"","v":""},{"$f":"\"\"","v":""},{"$f":"\"\"","v":""},{"$f":"\"\"","v":""},{"$f":"\"\"","v":""},"None",{"$f":"\"\"","v":""},{"$f":"\"\"","v":""},{"$f":"\"\"","v":""},{"$f":"\"\"","v":""},0,"None",{"$f":"\"\"","v":""},{"$f":"\"\"","v":""},{"$f":"\"\"","v":""},{"$f":"\"\"","v":""},0,{"$f":"\"\"","v":""},0,{"$f":"\"\"","v":""},{"$f":"\"\"","v":""},{"$f":"\"\"","v":""},0,{"$f":"\"\"","v":""},0,{"$f":"\"\"","v":""},{"$f":"\"\"","v":""},{"$f":"\"\"","v":""},0]
["Microsoft Windows Server 2016 Standard Edition ROK 16 Core",1,"TS1L2-WIN1","TS1L2-WIN1","871148-B21",556,"Microsoft Windows Server 2016 1 User CAL",null,"TS1L2-CALUSER","TS1L2-CALUSER","871175-A21",22,"Microsoft Windows Server 2016 1 Device CAL",null,"TS1L2-CALDEV","TS1L2-CALDEV","871176-A21",22,"Microsoft Windows Server 2016 Standard Edition Additional License 16 Core",1,"TS1L2-WIN2","2+Y23:AD23","871157-A21",526,"Microsoft Windows Server 2016 Standard Edition Additional License 2 Core",2,"TS1L2-WIN2CORE","TS1L2-WIN2CORE","871159-A21",56]
["Microsoft Windows Server 2016 Datacenter Edition ROK 16 Core",1,"TS1L2-WINDC1","TS1L2-WINDC1","871153-B21",2174,"Microsoft Windows Server 2016 1 User CAL",null,"TS1L2-CALUSER","TS1L2-CALUSER","871175-A21",22,"Microsoft Windows Server 2016 1 Device CAL",null,"TS1L2-CALDEV","TS1L2-CALDEV","871176-A21",22,"Microsoft Windows Server 2016 Datacenter Edition Additional License 16 Core",1,"TS1L2-WINDC2","TS1L2-WINDC2","871166-A21",2105,"Microsoft Windows Server 2016 Datacenter Edition Additional License 2 Core",2,"S2-871168-A21","S2-871168-A21",{"$f":"\"\"","v":""},530]
["CentOS 7.0",1,"TS1L2-LINUX","TS1L2-LINUX",null,50,"None",{"$f":"\"\"","v":""},{"$f":"\"\"","v":""},{"$f":"\"\"","v":""},{"$f":"\"\"","v":""},0,"None",{"$f":"\"\"","v":""},{"$f":"\"\"","v":""},{"$f":"\"\"","v":""},{"$f":"\"\"","v":""},0,{"$f":"\"\"","v":""},0,{"$f":"\"\"","v":""},{"$f":"\"\"","v":""},{"$f":"\"\"","v":""},0,{"$f":"\"\"","v":""},0,{"$f":"\"\"","v":""},{"$f":"\"\"","v":""},{"$f":"\"\"","v":""},0]
["Dl580 PREST 2CPU"]
["No Operating System",{"$f":"\"\"","v":""},{"$f":"\"\"","v":""},{"$f":"\"\"","v":""},{"$f":"\"\"","v":""},{"$f":"\"\"","v":""},"None",{"$f":"\"\"","v":""},{"$f":"\"\"","v":""},{"$f":"\"\"","v":""},{"$f":"\"\"","v":""},0,"None",{"$f":"\"\"","v":""},{"$f":"\"\"","v":""},{"$f":"\"\"","v":""},{"$f":"\"\"","v":""},0,{"$f":"\"\"","v":""},0,{"$f":"\"\"","v":""},{"$f":"\"\"","v":""},{"$f":"\"\"","v":""},0,{"$f":"\"\"","v":""},0,{"$f":"\"\"","v":""},{"$f":"\"\"","v":""},{"$f":"\"\"","v":""},0]
["Microsoft Windows Server 2016 Standard Edition ROK 16 Core",1,"TS1L2-WIN1","TS1L2-WIN1","871148-B21",556,"Microsoft Windows Server 2016 1 User CAL",null,"TS1L2-CALUSER","TS1L2-CALUSER","871175-A21",22,"Microsoft Windows Server 2016 1 Device CAL",null,"TS1L2-CALDEV","TS1L2-CALDEV","871176-A21",22,"Microsoft Windows Server 2016 Standard Edition Additional License 16 Core",4,"TS1L2-WIN2","TS1L2-WIN2","871157-A21",526,"Microsoft Windows Server 2016 Standard Edition Additional License 2 Core",4,"TS1L2-WIN2CORE","TS1L2-WIN2CORE","871159-A21",56]
["Microsoft Windows Server 2016 Datacenter Edition ROK 16 Core",1,"TS1L2-WINDC1","TS1L2-WINDC1","871153-B21",2174,"Microsoft Windows Server 2016 1 User CAL",null,"TS1L2-CALUSER","TS1L2-CALUSER","871175-A21",22,"Microsoft Windows Server 2016 1 Device CAL",null,"TS1L2-CALDEV","TS1L2-CALDEV","871176-A21",22,"Microsoft Windows Server 2016 Datacenter Edition Additional License 16 Core",4,"TS1L2-WINDC2","TS1L2-WINDC2","871166-A21",2105,{"$f":"\"\"","v":""},0,{"$f":"\"\"","v":""},{"$f":"\"\"","v":""},{"$f":"\"\"","v":""},0]
["CentOS 7.0",1,"TS1L2-LINUX","TS1L2-LINUX",null,50,"None",{"$f":"\"\"","v":""},{"$f":"\"\"","v":""},{"$f":"\"\"","v":""},{"$f":"\"\"","v":""},0,"None",{"$f":"\"\"","v":""},{"$f":"\"\"","v":""},{"$f":"\"\"","v":""},{"$f":"\"\"","v":""},0,{"$f":"\"\"","v":""},0,{"$f":"\"\"","v":""},{"$f":"\"\"","v":""},{"$f":"\"\"","v":""},0,{"$f":"\"\"","v":""},0,{"$f":"\"\"","v":""},{"$f":"\"\"","v":""},{"$f":"\"\"","v":""},0]
[]
[]
[]
[]
["Microsoft Windows Server 2016 Standard Edition ROK 16 Core",null,"TS1L2-WIN1","TS1L2-WIN1","871148-B21",556,"Microsoft Windows Server 2016 1 User CAL",null,"TS1L2-CALUSER","TS1L2-CALUSER","871175-A21",22,"Microsoft Windows Server 2016 1 Device CAL",null,"TS1L2-CALDEV","TS1L2-CALDEV","871176-A21",22]
["Microsoft Windows Server 2016 Standard Edition Additional License 16 Core",null,"TS1L2-WIN2","TS1L2-WIN2","871157-A21",526]
["Microsoft Windows Server 2016 Standard Edition Additional License 2 Core",null,"TS1L2-WIN2CORE","TS1L2-WIN2CORE","871159-A21",56]
[]
["Microsoft Windows Server 2016 Datacenter Edition ROK 16 Core",null,"TS1L2-WINDC1","TS1L2-WINDC1","871153-B21",2174,"Microsoft Windows Server 2016 1 User CAL",null,"TS1L2-CALUSER","TS1L2-CALUSER","871175-A21",22,"Microsoft Windows Server 2016 1 Device CAL",null,"TS1L2-CALDEV","TS1L2-CALDEV","871176-A21",22]
["Microsoft Windows Server 2016 Datacenter Edition Additional License 16 Core",null,"TS1L2-WINDC2","TS1L2-WINDC2","871166-A21",2105]
[]
["CentOS 7.0",null,"TS1L2-LINUX","TS1L2-LINUX",null,50]
[]
[]
[]
["None\n",0,"","","",0]
["SUSE Linux Enterprise Server, x86 & x86-64, 1-2 Sockets or 1-2 Virtual Machines, Standard Subscription, 3 Years",1,"TS1-874-006887","TS1-874-006887","874-006887",1350]
["SUSE Linux Enterprise Server, x86 & x86-64, 1-2 Sockets or 1-2 Virtual Machines, Standard Subscription, 5 Years",1,"TS1-874-006898","TS1-874-006898","874-006898",2242.5]
["SUSE Linux Enterprise Server, x86 & x86-64, 1-2 Sockets with Unlimited Virtual Machines, Standard Subscription, 3 Years",1,"TS1-874-006888","TS1-874-006888","874-006888",2692.5]
["SUSE Linux Enterprise Server, x86 & x86-64, 1-2 Sockets with Unlimited Virtual Machines, Standard Subscription, 5 Years",1,"TS1-874-006902","TS1-874-006902","874-006902",4500]
["SUSE Linux Enterprise Server, x86 & x86-64, 1-2 Sockets or 1-2 Virtual Machines, Priority Subscription, 3 Year",1,"TS1-874-006883","TS1-874-006883","874-006883",2520]
["SUSE Linux Enterprise Server, x86 & x86-64, 1-2 Sockets or 1-2 Virtual Machines, Priority Subscription, 5 Year",1,"TS1-874-006894","TS1-874-006894","874-006894",4200]
["SUSE Linux Enterprise Server, x86 & x86-64, 1-2 Sockets with Unlimited Virtual Machines, Priority Subscription, 3 Year",1,"TS1-874-006884","TS1-874-006884","874-006884",5100]
["SUSE Linux Enterprise Server, x86 & x86-64, 1-2 Sockets with Unlimited Virtual Machines, Priority Subscription, 5 Year",1,"TS1-874-006895","TS1-874-006895","874-006895",8400]

{"sheet":"Processor","index":14,"n_rows":23,"n_cols":12,"rows_kept":23,"cut":false,"hidden":true,"merged":[]}
["Additional Processor"]
["Server DL560",null,"CPU-A"]
["No Additional Processor",0,{"$f":"\"\"","v":""},null,{"$f":"\"\"","v":""},{"$f":"\"\"","v":""},{"$f":"\"\"","v":""},{"$f":"\"\"","v":""}]
["HPE DL560 Gen10 Intel® Xeon-Gold 5118 (2.3GHz/12-core/105W) Processor Kit",2,"TS1L2-CPU-560","TS1L2-CPU-560","840399-B21","ProLiant HPE DL5x0 Gen10 CPU Mezzanine Board Kit ",1,"872222-B21",null,null,null,2584]
[]
["Server DL580",null,"CPU-B"]
["No Additional Processor",0,{"$f":"\"\"","v":""},null,{"$f":"\"\"","v":""},{"$f":"\"\"","v":""},{"$f":"\"\"","v":""},{"$f":"\"\"","v":""},null,null,null,{"$f":"\"\"","v":""}]
["HPE DL580 Gen10 Intel® Xeon-Gold 5118 (2.3GHz/12-core/105W) FIO Processor Kit",2,"TS1L2-CPU-ALT-U","TS1L2-CPU-ALT-U","878126-L21","ProLiant HPE DL5x0 Gen10 CPU Mezzanine Board Kit ",1,"872222-B21",null,null,null,2584]
[]
["Server DL580 Prestazionale"]
["No Additional Processor",0,{"$f":"\"\"","v":""},null,null,{"$f":"\"\"","v":""},{"$f":"\"\"","v":""},{"$f":"\"\"","v":""},null,null,null,{"$f":"\"\"","v":""}]
["HPE DL580 Gen10 Intel® Xeon-Gold 6140M (2.3GHz/18-core/140W) FIO Processor Kit",2,"TS1L2-CPU-580-U","TS1L2-CPU-580-U","878138-L21","ProLiant HPE DL5x0 Gen10 CPU Mezzanine Board Kit ",1,"872222-B21",null,null,null,5056]
[]
[]
[]
[]
[]
[]
["HPE OneView Advanced standalone licenses"]
["None",0,{"$f":"\"\"","v":""},{"$f":"\"\"","v":""},{"$f":"\"\"","v":""},0,{"$f":"\"\"","v":""},{"$f":"\"\"","v":""},{"$f":"\"\"","v":""},{"$f":"\"\"","v":""},{"$f":"\"\"","v":""},{"$f":"\"\"","v":""}]
["HPE OneView Advanced with iLO Advanced incl 3yr 24x7 Supp Phys 1 Svr Lic",1,"S2-E5Y34A","S2-E5Y34A","E5Y34A",480]
[]
[" "]

{"sheet":"Memory","index":15,"n_rows":80,"n_cols":27,"rows_kept":80,"cut":false,"hidden":true,"merged":[[32,7,32,9],[32,1,32,6],[32,10,32,15]]}
[null,"Total Memory"]
[]
[null,"HPE 16GB (1x16GB) Dual Rank x4 DDR4-2400 Registered Memory Kit",1,"TS1L2-16GB-2400","TS1L2-16GB-580","836220-B21",172,"DL580 Gen9"]
[null,"HP 32GB (1x32GB) Dual Rank x4 DDR4-2400 Registered Memory Kit",1,"TS1L2-32GB-2400","TS1L2-32GB-580","805351-B21",344,"DL580 Gen9"]
[null,"HPE 64GB (1x64GB) Quad Rank x4 DDR4-2400 Load Reduced Memory Kit",1,"TS1L2-64GB-2400","TS1L2-64GB-580","805358-B21",750,"DL580 Gen9"]
[null,"HPE 16GB (1x16GB) Single Rank x4 DDR4-2666 CAS-19-19-19 Registered Smart Memory Kit",1,"TS1L2-16GB","TS1L2-16GB","815098-B21",172]
[null,"HPE 32GB (1x32GB) Dual Rank x4 DDR4-2666 CAS-19-19-19 Registered Smart Memory Kit",1,"TS1L2-32GB","TS1L2-32GB","815100-B21",344]
[null,"HPE 64GB (1x64GB) Quad Rank x4 DDR4-2666 CAS-19-19-19 Load Reduced Smart Memory Kit",1,"TS1L2-64GB","TS1L2-64GB","815101-B21",750]
[]
[]
["2CPU","MEMORY A"]
[64,{"$f":"\"\"","v":""},{"$f":"\"\"","v":""},{"$f":"\"\"","v":""},{"$f":"\"\"","v":""},{"$f":"\"\"","v":""},{"$f":"\"\"","v":""},{"$f":"$B$7","v":"HPE 32GB (1x32GB) Dual Rank x4 DDR4-2666 CAS-19-19-19 Registered Smart Memory Kit"},"2",{"$f":"$F$7","v":"815100-B21"},{"$f":"\"\"","v":""},{"$f":"\"\"","v":""},{"$f":"\"\"","v":""},{"$f":"\"\"","v":""},{"$f":"\"\"","v":""},{"$f":"\"\"","v":""}]
[128,"HPE 32GB (1x32GB) Dual Rank x4 DDR4-2666 CAS-19-19-19 Registered Smart Memory Kit",2,"TS1L2-32GB","TS1L2-32GB","815100-B21",{"$f":"$G$7*C13","v":688},{"$f":"$B$7","v":"HPE 32GB (1x32GB) Dual Rank x4 DDR4-2666 CAS-19-19-19 Registered Smart Memory Kit"},"2",{"$f":"$F$7","v":"815100-B21"},{"$f":"\"\"","v":""},{"$f":"\"\"","v":""},{"$f":"\"\"","v":""},{"$f":"\"\"","v":""},{"$f":"\"\"","v":""},{"$f":"\"\"","v":""}]
[192,"HPE 32GB (1x32GB) Dual Rank x4 DDR4-2666 CAS-19-19-19 Registered Smart Memory Kit",4,"TS1L2-32GB","TS1L2-32GB","815100-B21",{"$f":"$G$7*C14","v":1376},"HPE 32GB (1x32GB) Dual Rank x4 DDR4-2666 CAS-19-19-19 Registered Smart Memory Kit","2","815100-B21",{"$f":"\"\"","v":""},{"$f":"\"\"","v":""},{"$f":"\"\"","v":""},{"$f":"\"\"","v":""},{"$f":"\"\"","v":""},{"$f":"\"\"","v":""}]
[256,"HPE 32GB (1x32GB) Dual Rank x4 DDR4-2666 CAS-19-19-19 Registered Smart Memory Kit",6,"TS1L2-32GB","TS1L2-32GB","815100-B21",2064,"HPE 32GB (1x32GB) Dual Rank x4 DDR4-2666 CAS-19-19-19 Registered Smart Memory Kit","2","815100-B21",{"$f":"\"\"","v":""},{"$f":"\"\"","v":""},{"$f":"\"\"","v":""},{"$f":"\"\"","v":""},{"$f":"\"\"","v":""},{"$f":"\"\"","v":""}]
[384,"HPE 32GB (1x32GB) Dual Rank x4 DDR4-2666 CAS-19-19-19 Registered Smart Memory Kit",10,"TS1L2-32GB","TS1L2-32GB","815100-B21",{"$f":"$G$7*C16","v":3440},"HPE 32GB (1x32GB) Dual Rank x4 DDR4-2666 CAS-19-19-19 Registered Smart Memory Kit","2","815100-B21",{"$f":"\"\"","v":""},{"$f":"\"\"","v":""},{"$f":"\"\"","v":""},{"$f":"\"\"","v":""},{"$f":"\"\"","v":""},{"$f":"\"\"","v":""}]
[512,"HPE 32GB (1x32GB) Dual Rank x4 DDR4-2666 CAS-19-19-19 Registered Smart Memory Kit",14,"TS1L2-32GB","TS1L2-32GB","815100-B21",4816,"HPE 32GB (1x32GB) Dual Rank x4 DDR4-2666 CAS-19-19-19 Registered Smart Memory Kit","2","815100-B21",{"$f":"\"\"","v":""},{"$f":"\"\"","v":""},{"$f":"\"\"","v":""},{"$f":"\"\"","v":""},{"$f":"\"\"","v":""},{"$f":"\"\"","v":""}]
[768,"HPE 32GB (1x32GB) Dual Rank x4 DDR4-2666 CAS-19-19-19 Registered Smart Memory Kit",22,"TS1L2-32GB","TS1L2-32GB","815100-B21",7568,"HPE 32GB (1x32GB) Dual Rank x4 DDR4-2666 CAS-19-19-19 Registered Smart Memory Kit","2","815100-B21",{"$f":"\"\"","v":""},{"$f":"\"\"","v":""},{"$f":"\"\"","v":""},{"$f":"\"\"","v":""},{"$f":"\"\"","v":""},{"$f":"\"\"","v":""}]
[1024,{"$f":"\"\"","v":""},{"$f":"\"\"","v":""},{"$f":"\"\"","v":""},{"$f":"\"\"","v":""},{"$f":"\"\"","v":""},{"$f":"\"\"","v":""},{"$f":"\"\"","v":""},{"$f":"\"\"","v":""},{"$f":"\"\"","v":""},"HPE 64GB (1x64GB) Quad Rank x4 DDR4-2666 CAS-19-19-19 Load Reduced Smart Memory Kit",16,"TS1L2-64GB","TS1L2-64GB","815101-B21",{"$f":"$G$8*L19","v":12000}]
[1536,{"$f":"\"\"","v":""},{"$f":"\"\"","v":""},{"$f":"\"\"","v":""},{"$f":"\"\"","v":""},{"$f":"\"\"","v":""},{"$f":"\"\"","v":""},{"$f":"\"\"","v":""},{"$f":"\"\"","v":""},{"$f":"\"\"","v":""},"HPE 64GB (1x64GB) Quad Rank x4 DDR4-2666 CAS-19-19-19 Load Reduced Smart Memory Kit",24,"TS1L2-64GB","TS1L2-64GB","815101-B21",{"$f":"$G$8*L20","v":18000}]
["4CPU"]
[128,"HPE 32GB (1x32GB) Dual Rank x4 DDR4-2666 CAS-19-19-19 Registered Smart Memory Kit",2,"TS1L2-32GB","TS1L2-32GB","815100-B21",{"$f":"$G$7*C22","v":688},{"$f":"$B$7","v":"HPE 32GB (1x32GB) Dual Rank x4 DDR4-2666 CAS-19-19-19 Registered Smart Memory Kit"},"2",{"$f":"$F$7","v":"815100-B21"},{"$f":"\"\"","v":""},{"$f":"\"\"","v":""},{"$f":"\"\"","v":""},{"$f":"\"\"","v":""},{"$f":"\"\"","v":""},{"$f":"\"\"","v":""}]
[256,"HPE 32GB (1x32GB) Dual Rank x4 DDR4-2666 CAS-19-19-19 Registered Smart Memory Kit",6,"TS1L2-32GB","TS1L2-32GB","815100-B21",{"$f":"$G$7*C23","v":2064},{"$f":"$B$7","v":"HPE 32GB (1x32GB) Dual Rank x4 DDR4-2666 CAS-19-19-19 Registered Smart Memory Kit"},"2",{"$f":"$F$7","v":"815100-B21"},{"$f":"\"\"","v":""},{"$f":"\"\"","v":""},{"$f":"\"\"","v":""},{"$f":"\"\"","v":""},{"$f":"\"\"","v":""},{"$f":"\"\"","v":""}]
[384,"HPE 32GB (1x32GB) Dual Rank x4 DDR4-2666 CAS-19-19-19 Registered Smart Memory Kit",10,"TS1L2-32GB","TS1L2-32GB","815100-B21",{"$f":"$G$7*C24","v":3440},"HPE 32GB (1x32GB) Dual Rank x4 DDR4-2666 CAS-19-19-19 Registered Smart Memory Kit","2","815100-B21",{"$f":"\"\"","v":""},{"$f":"\"\"","v":""},{"$f":"\"\"","v":""},{"$f":"\"\"","v":""},{"$f":"\"\"","v":""},{"$f":"\"\"","v":""}]
[512,"HPE 32GB (1x32GB) Dual Rank x4 DDR4-2666 CAS-19-19-19 Registered Smart Memory Kit",14,"TS1L2-32GB","TS1L2-32GB","815100-B21",4816,"HPE 32GB (1x32GB) Dual Rank x4 DDR4-2666 CAS-19-19-19 Registered Smart Memory Kit","2","815100-B21",{"$f":"\"\"","v":""},{"$f":"\"\"","v":""},{"$f":"\"\"","v":""},{"$f":"\"\"","v":""},{"$f":"\"\"","v":""},{"$f":"\"\"","v":""}]
[768,"HPE 32GB (1x32GB) Dual Rank x4 DDR4-2666 CAS-19-19-19 Registered Smart Memory Kit",22,"TS1L2-32GB","TS1L2-32GB","815100-B21",7568,"HPE 32GB (1x32GB) Dual Rank x4 DDR4-2666 CAS-19-19-19 Registered Smart Memory Kit","2","815100-B21",{"$f":"\"\"","v":""},{"$f":"\"\"","v":""},{"$f":"\"\"","v":""},{"$f":"\"\"","v":""},{"$f":"\"\"","v":""},{"$f":"\"\"","v":""}]
[1024,"HPE 32GB (1x32GB) Dual Rank x4 DDR4-2666 CAS-19-19-19 Registered Smart Memory Kit",30,"TS1L2-32GB","TS1L2-32GB","815100-B21",10320,"HPE 32GB (1x32GB) Dual Rank x4 DDR4-2666 CAS-19-19-19 Registered Smart Memory Kit","2","815100-B21",{"$f":"\"\"","v":""},{"$f":"\"\"","v":""},{"$f":"\"\"","v":""},{"$f":"\"\"","v":""},{"$f":"\"\"","v":""},{"$f":"\"\"","v":""}]
[1536,"HPE 32GB (1x32GB) Dual Rank x4 DDR4-2666 CAS-19-19-19 Registered Smart Memory Kit",46,"TS1L2-32GB","TS1L2-32GB","815100-B21",15824,"HPE 32GB (1x32GB) Dual Rank x4 DDR4-2666 CAS-19-19-19 Registered Smart Memory Kit","2","815100-B21",{"$f":"\"\"","v":""},{"$f":"\"\"","v":""},{"$f":"\"\"","v":""},{"$f":"\"\"","v":""},{"$f":"\"\"","v":""},{"$f":"\"\"","v":""}]
[2048,{"$f":"\"\"","v":""},{"$f":"\"\"","v":""},{"$f":"\"\"","v":""},{"$f":"\"\"","v":""},{"$f":"\"\"","v":""},{"$f":"\"\"","v":""},{"$f":"\"\"","v":""},{"$f":"\"\"","v":""},{"$f":"\"\"","v":""},"HPE 64GB (1x64GB) Quad Rank x4 DDR4-2666 CAS-19-19-19 Load Reduced Smart Memory Kit",32,"TS1L2-64GB","TS1L2-64GB","815101-B21",{"$f":"$G$8*L29","v":24000}]
[3072,{"$f":"\"\"","v":""},{"$f":"\"\"","v":""},{"$f":"\"\"","v":""},{"$f":"\"\"","v":""},{"$f":"\"\"","v":""},{"$f":"\"\"","v":""},{"$f":"\"\"","v":""},{"$f":"\"\"","v":""},{"$f":"\"\"","v":""},"HPE 64GB (1x64GB) Quad Rank x4 DDR4-2666 CAS-19-19-19 Load Reduced Smart Memory Kit",48,"TS1L2-64GB","TS1L2-64GB","815101-B21",{"$f":"$G$8*L30","v":36000}]
[]
[null,"MEMORY B"]
["2CPU","UPGRADE 16GB",null,null,null,null,null,"MEMORIA BASE",null,null,"UPGRADE 32GB",null,null,null,null,null,null,null,null,"Memoria Totale","Prezzo Totale Memorie","Memory Cartridge Totali","DIMM Slot",32,16,16]
[64,{"$f":"\"\"","v":""},{"$f":"\"\"","v":""},{"$f":"\"\"","v":""},{"$f":"\"\"","v":""},{"$f":"\"\"","v":""},{"$f":"\"\"","v":""},{"$f":"$B$7","v":"HPE 32GB (1x32GB) Dual Rank x4 DDR4-2666 CAS-19-19-19 Registered Smart Memory Kit"},"2",{"$f":"$F$7","v":"815100-B21"},{"$f":"\"\"","v":""},{"$f":"\"\"","v":""},{"$f":"\"\"","v":""},{"$f":"\"\"","v":""},{"$f":"\"\"","v":""},{"$f":"\"\"","v":""},null,null,null,null,null,null,null,{"$f":"IF(L34=\"\",0,L34)","v":0},{"$f":"IF(I34=\"\",0,I34)","v":"2"},{"$f":"IF(C34=\"\",0,C34)","v":0},{"$f":"SUM(X34:Z34)","v":0}]
[128,"HPE 32GB (1x32GB) Dual Rank x4 DDR4-2666 CAS-19-19-19 Registered Smart Memory Kit",2,"TS1L2-32GB","TS1L2-32GB","815100-B21",{"$f":"$G$7*C35","v":688},{"$f":"$B$7","v":"HPE 32GB (1x32GB) Dual Rank x4 DDR4-2666 CAS-19-19-19 Registered Smart Memory Kit"},"2",{"$f":"$F$7","v":"815100-B21"},{"$f":"\"\"","v":""},{"$f":"\"\"","v":""},{"$f":"\"\"","v":""},{"$f":"\"\"","v":""},{"$f":"\"\"","v":""},{"$f":"\"\"","v":""},null,null,null,null,null,null,null,0,"2",2,2]
[192,"HPE 32GB (1x32GB) Dual Rank x4 DDR4-2666 CAS-19-19-19 Registered Smart Memory Kit",4,"TS1L2-32GB","TS1L2-32GB","815100-B21",{"$f":"$G$7*C36","v":1376},"HPE 32GB (1x32GB) Dual Rank x4 DDR4-2666 CAS-19-19-19 Registered Smart Memory Kit","2","815100-B21",{"$f":"\"\"","v":""},{"$f":"\"\"","v":""},{"$f":"\"\"","v":""},{"$f":"\"\"","v":""},{"$f":"\"\"","v":""},{"$f":"\"\"","v":""},null,null,null,null,null,null,null,0,"2",4,4]
[256,"HPE 32GB (1x32GB) Dual Rank x4 DDR4-2666 CAS-19-19-19 Registered Smart Memory Kit",6,"TS1L2-32GB","TS1L2-32GB","815100-B21",2064,"HPE 32GB (1x32GB) Dual Rank x4 DDR4-2666 CAS-19-19-19 Registered Smart Memory Kit","2","815100-B21",{"$f":"\"\"","v":""},{"$f":"\"\"","v":""},{"$f":"\"\"","v":""},{"$f":"\"\"","v":""},{"$f":"\"\"","v":""},{"$f":"\"\"","v":""},null,null,null,null,null,null,null,0,"2",6,6]
[384,"HPE 32GB (1x32GB) Dual Rank x4 DDR4-2666 CAS-19-19-19 Registered Smart Memory Kit",10,"TS1L2-32GB","TS1L2-32GB","815100-B21",3440,"HPE 32GB (1x32GB) Dual Rank x4 DDR4-2666 CAS-19-19-19 Registered Smart Memory Kit","2","815100-B21",{"$f":"\"\"","v":""},{"$f":"\"\"","v":""},{"$f":"\"\"","v":""},{"$f":"\"\"","v":""},{"$f":"\"\"","v":""},{"$f":"\"\"","v":""},null,null,null,null,null,null,null,0,"2",10,10]
[512,"HPE 32GB (1x32GB) Dual Rank x4 DDR4-2666 CAS-19-19-19 Registered Smart Memory Kit",14,"TS1L2-32GB","TS1L2-32GB","815100-B21",4816,"HPE 32GB (1x32GB) Dual Rank x4 DDR4-2666 CAS-19-19-19 Registered Smart Memory Kit","2","815100-B21",{"$f":"\"\"","v":""},{"$f":"\"\"","v":""},{"$f":"\"\"","v":""},{"$f":"\"\"","v":""},{"$f":"\"\"","v":""},{"$f":"\"\"","v":""},null,null,null,null,null,null,null,0,"2",14,14]
[768,"HPE 32GB (1x32GB) Dual Rank x4 DDR4-2666 CAS-19-19-19 Registered Smart Memory Kit",22,"TS1L2-32GB","TS1L2-32GB","815100-B21",7568,"HPE 32GB (1x32GB) Dual Rank x4 DDR4-2666 CAS-19-19-19 Registered Smart Memory Kit","2","815100-B21",{"$f":"\"\"","v":""},{"$f":"\"\"","v":""},{"$f":"\"\"","v":""},{"$f":"\"\"","v":""},{"$f":"\"\"","v":""},{"$f":"\"\"","v":""},null,null,null,null,null,null,null,0,"2",22,22]
[1024,{"$f":"\"\"","v":""},{"$f":"\"\"","v":""},{"$f":"\"\"","v":""},{"$f":"\"\"","v":""},{"$f":"\"\"","v":""},{"$f":"\"\"","v":""},{"$f":"\"\"","v":""},{"$f":"\"\"","v":""},{"$f":"\"\"","v":""},"HPE 64GB (1x64GB) Quad Rank x4 DDR4-2666 CAS-19-19-19 Load Reduced Smart Memory Kit",16,"TS1L2-64GB","TS1L2-64GB","815101-B21",{"$f":"$G$8*L41","v":12000},null,null,null,null,null,null,null,16,0,0,16]
[1536,{"$f":"\"\"","v":""},{"$f":"\"\"","v":""},{"$f":"\"\"","v":""},{"$f":"\"\"","v":""},{"$f":"\"\"","v":""},{"$f":"\"\"","v":""},{"$f":"\"\"","v":""},{"$f":"\"\"","v":""},{"$f":"\"\"","v":""},"HPE 64GB (1x64GB) Quad Rank x4 DDR4-2666 CAS-19-19-19 Load Reduced Smart Memory Kit",24,"TS1L2-64GB","TS1L2-64GB","815101-B21",{"$f":"$G$8*L42","v":18000},null,null,null,null,null,null,null,24,0,0,24]
["4CPU"]
[128,"HPE 32GB (1x32GB) Dual Rank x4 DDR4-2666 CAS-19-19-19 Registered Smart Memory Kit",2,"TS1L2-32GB","TS1L2-32GB","815100-B21",{"$f":"$G$7*C44","v":688},{"$f":"$B$7","v":"HPE 32GB (1x32GB) Dual Rank x4 DDR4-2666 CAS-19-19-19 Registered Smart Memory Kit"},"2",{"$f":"$F$7","v":"815100-B21"},{"$f":"\"\"","v":""},{"$f":"\"\"","v":""},{"$f":"\"\"","v":""},{"$f":"\"\"","v":""},{"$f":"\"\"","v":""},{"$f":"\"\"","v":""},null,null,null,null,null,null,null,{"$f":"IF(L44=\"\",0,L44)","v":0},{"$f":"IF(I44=\"\",0,I44)","v":"2"},{"$f":"IF(C44=\"\",0,C44)","v":2},{"$f":"SUM(X44:Z44)","v":2}]
[256,"HPE 32GB (1x32GB) Dual Rank x4 DDR4-2666 CAS-19-19-19 Registered Smart Memory Kit",6,"TS1L2-32GB","TS1L2-32GB","815100-B21",{"$f":"$G$7*C45","v":2064},{"$f":"$B$7","v":"HPE 32GB (1x32GB) Dual Rank x4 DDR4-2666 CAS-19-19-19 Registered Smart Memory Kit"},"2",{"$f":"$F$7","v":"815100-B21"},{"$f":"\"\"","v":""},{"$f":"\"\"","v":""},{"$f":"\"\"","v":""},{"$f":"\"\"","v":""},{"$f":"\"\"","v":""},{"$f":"\"\"","v":""},null,null,null,null,null,null,null,0,"2",6,6]
[384,"HPE 32GB (1x32GB) Dual Rank x4 DDR4-2666 CAS-19-19-19 Registered Smart Memory Kit",10,"TS1L2-32GB","TS1L2-32GB","815100-B21",{"$f":"$G$7*C46","v":3440},"HPE 32GB (1x32GB) Dual Rank x4 DDR4-2666 CAS-19-19-19 Registered Smart Memory Kit","2","815100-B21",{"$f":"\"\"","v":""},{"$f":"\"\"","v":""},{"$f":"\"\"","v":""},{"$f":"\"\"","v":""},{"$f":"\"\"","v":""},{"$f":"\"\"","v":""},null,null,null,null,null,null,null,0,"2",10,10]
[512,"HPE 32GB (1x32GB) Dual Rank x4 DDR4-2666 CAS-19-19-19 Registered Smart Memory Kit",14,"TS1L2-32GB","TS1L2-32GB","815100-B21",4816,"HPE 32GB (1x32GB) Dual Rank x4 DDR4-2666 CAS-19-19-19 Registered Smart Memory Kit","2","815100-B21",{"$f":"\"\"","v":""},{"$f":"\"\"","v":""},{"$f":"\"\"","v":""},{"$f":"\"\"","v":""},{"$f":"\"\"","v":""},{"$f":"\"\"","v":""},null,null,null,null,null,null,null,0,"2",14,14]
[768,"HPE 32GB (1x32GB) Dual Rank x4 DDR4-2666 CAS-19-19-19 Registered Smart Memory Kit",22,"TS1L2-32GB","TS1L2-32GB","815100-B21",7568,"HPE 32GB (1x32GB) Dual Rank x4 DDR4-2666 CAS-19-19-19 Registered Smart Memory Kit","2","815100-B21",{"$f":"\"\"","v":""},{"$f":"\"\"","v":""},{"$f":"\"\"","v":""},{"$f":"\"\"","v":""},{"$f":"\"\"","v":""},{"$f":"\"\"","v":""},null,null,null,null,null,null,null,0,"2",22,22]
[1024,"HPE 32GB (1x32GB) Dual Rank x4 DDR4-2666 CAS-19-19-19 Registered Smart Memory Kit",30,"TS1L2-32GB","TS1L2-32GB","815100-B21",10320,"HPE 32GB (1x32GB) Dual Rank x4 DDR4-2666 CAS-19-19-19 Registered Smart Memory Kit","2","815100-B21",{"$f":"\"\"","v":""},{"$f":"\"\"","v":""},{"$f":"\"\"","v":""},{"$f":"\"\"","v":""},{"$f":"\"\"","v":""},{"$f":"\"\"","v":""},null,null,null,null,null,null,null,0,"2",30,30]
[1536,"HPE 32GB (1x32GB) Dual Rank x4 DDR4-2666 CAS-19-19-19 Registered Smart Memory Kit",46,"TS1L2-32GB","TS1L2-32GB","815100-B21",15824,"HPE 32GB (1x32GB) Dual Rank x4 DDR4-2666 CAS-19-19-19 Registered Smart Memory Kit","2","815100-B21",{"$f":"\"\"","v":""},{"$f":"\"\"","v":""},{"$f":"\"\"","v":""},{"$f":"\"\"","v":""},{"$f":"\"\"","v":""},{"$f":"\"\"","v":""},null,null,null,null,null,null,null,0,"2",46,46]
[2048,{"$f":"\"\"","v":""},{"$f":"\"\"","v":""},{"$f":"\"\"","v":""},{"$f":"\"\"","v":""},{"$f":"\"\"","v":""},{"$f":"\"\"","v":""},{"$f":"\"\"","v":""},{"$f":"\"\"","v":""},{"$f":"\"\"","v":""},"HPE 64GB (1x64GB) Quad Rank x4 DDR4-2666 CAS-19-19-19 Load Reduced Smart Memory Kit",32,"TS1L2-64GB","TS1L2-64GB","815101-B21",{"$f":"$G$8*L51","v":24000},null,null,null,null,null,null,null,32,0,0,32]
[3072,{"$f":"\"\"","v":""},{"$f":"\"\"","v":""},{"$f":"\"\"","v":""},{"$f":"\"\"","v":""},{"$f":"\"\"","v":""},{"$f":"\"\"","v":""},{"$f":"\"\"","v":""},{"$f":"\"\"","v":""},{"$f":"\"\"","v":""},"HPE 64GB (1x64GB) Quad Rank x4 DDR4-2666 CAS-19-19-19 Load Reduced Smart Memory Kit",48,"TS1L2-64GB","TS1L2-64GB","815101-B21",{"$f":"$G$8*L52","v":36000},null,null,null,null,null,null,null,48,0,0,48]
[]
["1CPU","MEMORY C",null,null,null,null,null,null,null,null,null,null,null,null,null,null,null,null,null,"Memoria Totale","Prezzo Totale Memorie","Memory Cartridge Totali","DIMM Slot",32,16,16]
[{"$f":"32*I55","v":128},{"$f":"\"\"","v":""},{"$f":"\"\"","v":""},{"$f":"\"\"","v":""},{"$f":"\"\"","v":""},null,{"$f":"\"\"","v":""},"HPE 32GB (1x32GB) Dual Rank x4 DDR4-2666 CAS-19-19-19 Registered Smart Memory Kit",4,"815100-B21",{"$f":"\"\"","v":""},{"$f":"\"\"","v":""},{"$f":"\"\"","v":""},{"$f":"\"\"","v":""},{"$f":"\"\"","v":""},{"$f":"\"\"","v":""},null,null,null,null,null,null,null,{"$f":"IF(L55=\"\",0,L55)","v":0},{"$f":"IF(I55=\"\",0,I55)","v":4},{"$f":"IF(C55=\"\",0,C55)","v":0},{"$f":"SUM(X55:Z55)","v":4}]
[{"$f":"(32*I56)+(C56*32)","v":256},"HPE 32GB (1x32GB) Dual Rank x4 DDR4-2666 CAS-19-19-19 Registered Smart Memory Kit",4,"TS1L2-32GB","TS1L2-32GB","815100-B21",{"$f":"$G$4*C56","v":1376},"HPE 32GB (1x32GB) Dual Rank x4 DDR4-2666 CAS-19-19-19 Registered Smart Memory Kit",4,"815100-B21",{"$f":"\"\"","v":""},{"$f":"\"\"","v":""},{"$f":"\"\"","v":""},{"$f":"\"\"","v":""},{"$f":"\"\"","v":""},{"$f":"\"\"","v":""},null,null,null,null,null,null,null,{"$f":"IF(L56=\"\",0,L56)","v":0},{"$f":"IF(I56=\"\",0,I56)","v":4},{"$f":"IF(C56=\"\",0,C56)","v":4},{"$f":"SUM(X56:Z56)","v":8}]
[{"$f":"(32*I57)+(C57*32)","v":512},"HPE 32GB (1x32GB) Dual Rank x4 DDR4-2666 CAS-19-19-19 Registered Smart Memory Kit",12,"TS1L2-32GB","TS1L2-32GB","815100-B21",4128,"HPE 32GB (1x32GB) Dual Rank x4 DDR4-2666 CAS-19-19-19 Registered Smart Memory Kit",4,"815100-B21",{"$f":"\"\"","v":""},{"$f":"\"\"","v":""},{"$f":"\"\"","v":""},{"$f":"\"\"","v":""},{"$f":"\"\"","v":""},{"$f":"\"\"","v":""},null,null,null,null,null,null,null,0,4,12,16]
[{"$f":"(32*I58)+(C58*32)","v":640},"HPE 32GB (1x32GB) Dual Rank x4 DDR4-2666 CAS-19-19-19 Registered Smart Memory Kit",16,"TS1L2-32GB","TS1L2-32GB","815100-B21",5504,"HPE 32GB (1x32GB) Dual Rank x4 DDR4-2666 CAS-19-19-19 Registered Smart Memory Kit",4,"815100-B21",{"$f":"\"\"","v":""},{"$f":"\"\"","v":""},{"$f":"\"\"","v":""},{"$f":"\"\"","v":""},{"$f":"\"\"","v":""},{"$f":"\"\"","v":""},null,null,null,null,null,null,null,{"$f":"IF(L58=\"\",0,L58)","v":0},{"$f":"IF(I58=\"\",0,I58)","v":4},{"$f":"IF(C58=\"\",0,C58)","v":16},{"$f":"SUM(X58:Z58)","v":20}]
[768,"HPE 32GB (1x32GB) Dual Rank x4 DDR4-2666 CAS-19-19-19 Registered Smart Memory Kit",20,"TS1L2-32GB","TS1L2-32GB","815100-B21",6880,"HPE 32GB (1x32GB) Dual Rank x4 DDR4-2666 CAS-19-19-19 Registered Smart Memory Kit",4,"815100-B21",{"$f":"\"\"","v":""},{"$f":"\"\"","v":""},{"$f":"\"\"","v":""},{"$f":"\"\"","v":""},{"$f":"\"\"","v":""},{"$f":"\"\"","v":""},null,null,null,null,null,null,null,0,4,20,24]
[{"$f":"(L60*64)","v":1024},{"$f":"\"\"","v":""},{"$f":"\"\"","v":""},{"$f":"\"\"","v":""},{"$f":"\"\"","v":""},{"$f":"\"\"","v":""},{"$f":"\"\"","v":""},{"$f":"\"\"","v":""},{"$f":"\"\"","v":""},{"$f":"\"\"","v":""},"HPE 64GB (1x64GB) Quad Rank x4 DDR4-2666 CAS-19-19-19 Load Reduced Smart Memory Kit",16,"TS1L2-64GB","TS1L2-64GB","815101-B21",{"$f":"$G$8*L60","v":12000},null,null,null,null,null,null,null,16,0,0,16]
[{"$f":"(L61*64)","v":1280},{"$f":"\"\"","v":""},{"$f":"\"\"","v":""},{"$f":"\"\"","v":""},{"$f":"\"\"","v":""},{"$f":"\"\"","v":""},{"$f":"\"\"","v":""},{"$f":"\"\"","v":""},{"$f":"\"\"","v":""},{"$f":"\"\"","v":""},"HPE 64GB (1x64GB) Quad Rank x4 DDR4-2666 CAS-19-19-19 Load Reduced Smart Memory Kit",20,"TS1L2-64GB","TS1L2-64GB","815101-B21",{"$f":"$G$8*L61","v":15000},null,null,null,null,null,null,null,20,0,0,20]
[{"$f":"(L62*64)","v":1536},{"$f":"\"\"","v":""},{"$f":"\"\"","v":""},{"$f":"\"\"","v":""},{"$f":"\"\"","v":""},{"$f":"\"\"","v":""},{"$f":"\"\"","v":""},{"$f":"\"\"","v":""},{"$f":"\"\"","v":""},{"$f":"\"\"","v":""},"HPE 64GB (1x64GB) Quad Rank x4 DDR4-2666 CAS-19-19-19 Load Reduced Smart Memory Kit",24,"TS1L2-64GB","TS1L2-64GB","815101-B21",{"$f":"$G$8*L62","v":18000},null,null,null,null,null,null,null,{"$f":"IF(L62=\"\",0,L62)","v":24},{"$f":"IF(I62=\"\",0,I62)","v":0},{"$f":"IF(C62=\"\",0,C62)","v":0},{"$f":"SUM(X62:Z62)","v":24}]
["2CPU"]
[{"$f":"(32*I64)+(C64*32)","v":256},"HPE 32GB (1x32GB) Dual Rank x4 DDR4-2666 CAS-19-19-19 Registered Smart Memory Kit",4,"TS1L2-32GB","TS1L2-32GB","815100-B21",{"$f":"$G$4*C64","v":1376},"HPE 32GB (1x32GB) Dual Rank x4 DDR4-2666 CAS-19-19-19 Registered Smart Memory Kit",4,"815100-B21",{"$f":"\"\"","v":""},{"$f":"\"\"","v":""},{"$f":"\"\"","v":""},{"$f":"\"\"","v":""},{"$f":"\"\"","v":""},{"$f":"\"\"","v":""},null,null,null,null,null,null,null,{"$f":"IF(L64=\"\",0,L64)","v":0},{"$f":"IF(I64=\"\",0,I64)","v":4},{"$f":"IF(C64=\"\",0,C64)","v":4},{"$f":"SUM(X64:Z64)","v":8}]
[{"$f":"(32*I65)+(C65*32)","v":512},"HPE 32GB (1x32GB) Dual Rank x4 DDR4-2666 CAS-19-19-19 Registered Smart Memory Kit",12,"TS1L2-32GB","TS1L2-32GB","815100-B21",4128,"HPE 32GB (1x32GB) Dual Rank x4 DDR4-2666 CAS-19-19-19 Registered Smart Memory Kit",4,"815100-B21",{"$f":"\"\"","v":""},{"$f":"\"\"","v":""},{"$f":"\"\"","v":""},{"$f":"\"\"","v":""},{"$f":"\"\"","v":""},{"$f":"\"\"","v":""},null,null,null,null,null,null,null,0,4,12,16]
[{"$f":"(32*I66)+(C66*32)","v":640},"HPE 32GB (1x32GB) Dual Rank x4 DDR4-2666 CAS-19-19-19 Registered Smart Memory Kit",16,"TS1L2-32GB","TS1L2-32GB","815100-B21",5504,"HPE 32GB (1x32GB) Dual Rank x4 DDR4-2666 CAS-19-19-19 Registered Smart Memory Kit",4,"815100-B21",{"$f":"\"\"","v":""},{"$f":"\"\"","v":""},{"$f":"\"\"","v":""},{"$f":"\"\"","v":""},{"$f":"\"\"","v":""},{"$f":"\"\"","v":""},null,null,null,null,null,null,null,0,4,16,20]
[{"$f":"(32*I67)+(C67*32)","v":768},"HPE 32GB (1x32GB) Dual Rank x4 DDR4-2666 CAS-19-19-19 Registered Smart Memory Kit",20,"TS1L2-32GB","TS1L2-32GB","815100-B21",6880,"HPE 32GB (1x32GB) Dual Rank x4 DDR4-2666 CAS-19-19-19 Registered Smart Memory Kit",4,"815100-B21",{"$f":"\"\"","v":""},{"$f":"\"\"","v":""},{"$f":"\"\"","v":""},{"$f":"\"\"","v":""},{"$f":"\"\"","v":""},{"$f":"\"\"","v":""},null,null,null,null,null,null,null,0,4,20,24]
[{"$f":"(32*I68)+(C68*32)","v":1024},"HPE 32GB (1x32GB) Dual Rank x4 DDR4-2666 CAS-19-19-19 Registered Smart Memory Kit",28,"TS1L2-32GB","TS1L2-32GB","815100-B21",{"$f":"$G$4*C68","v":9632},"HPE 32GB (1x32GB) Dual Rank x4 DDR4-2666 CAS-19-19-19 Registered Smart Memory Kit",4,"815100-B21",{"$f":"\"\"","v":""},{"$f":"\"\"","v":""},{"$f":"\"\"","v":""},{"$f":"\"\"","v":""},{"$f":"\"\"","v":""},{"$f":"\"\"","v":""},null,null,null,null,null,null,null,0,4,28,32]
[1280,"HPE 32GB (1x32GB) Dual Rank x4 DDR4-2666 CAS-19-19-19 Registered Smart Memory Kit",36,"TS1L2-32GB","TS1L2-32GB","815100-B21",12384,"HPE 32GB (1x32GB) Dual Rank x4 DDR4-2666 CAS-19-19-19 Registered Smart Memory Kit",4,"815100-B21",{"$f":"\"\"","v":""},{"$f":"\"\"","v":""},{"$f":"\"\"","v":""},{"$f":"\"\"","v":""},{"$f":"\"\"","v":""},{"$f":"\"\"","v":""},null,null,null,null,null,null,null,0,4,36,40]
[{"$f":"(32*I70)+(C70*32)","v":1536},"HPE 32GB (1x32GB) Dual Rank x4 DDR4-2666 CAS-19-19-19 Registered Smart Memory Kit",44,"TS1L2-32GB","TS1L2-32GB","815100-B21",{"$f":"$G$4*C70","v":15136},"HPE 32GB (1x32GB) Dual Rank x4 DDR4-2666 CAS-19-19-19 Registered Smart Memory Kit",4,"815100-B21",{"$f":"\"\"","v":""},{"$f":"\"\"","v":""},{"$f":"\"\"","v":""},{"$f":"\"\"","v":""},{"$f":"\"\"","v":""},{"$f":"\"\"","v":""},null,null,null,null,null,null,null,{"$f":"IF(L70=\"\",0,L70)","v":0},{"$f":"IF(I70=\"\",0,I70)","v":4},{"$f":"IF(C70=\"\",0,C70)","v":44},{"$f":"SUM(X70:Z70)","v":48}]
[{"$f":"(L71*64)","v":2048},{"$f":"\"\"","v":""},{"$f":"\"\"","v":""},{"$f":"\"\"","v":""},{"$f":"\"\"","v":""},{"$f":"\"\"","v":""},{"$f":"\"\"","v":""},{"$f":"\"\"","v":""},{"$f":"\"\"","v":""},{"$f":"\"\"","v":""},"HPE 64GB (1x64GB) Quad Rank x4 DDR4-2666 CAS-19-19-19 Load Reduced Smart Memory Kit",32,"TS1L2-64GB","TS1L2-64GB","815101-B21",{"$f":"$G$8*L71","v":24000},null,null,null,null,null,null,null,{"$f":"IF(L71=\"\",0,L71)","v":32},{"$f":"IF(I71=\"\",0,I71)","v":0},{"$f":"IF(C71=\"\",0,C71)","v":0},{"$f":"SUM(X71:Z71)","v":32}]
[{"$f":"(L72*64)","v":3072},{"$f":"\"\"","v":""},{"$f":"\"\"","v":""},{"$f":"\"\"","v":""},{"$f":"\"\"","v":""},{"$f":"\"\"","v":""},{"$f":"\"\"","v":""},{"$f":"\"\"","v":""},{"$f":"\"\"","v":""},{"$f":"\"\"","v":""},"HPE 64GB (1x64GB) Quad Rank x4 DDR4-2666 CAS-19-19-19 Load Reduced Smart Memory Kit",48,"TS1L2-64GB","TS1L2-64GB","815101-B21",{"$f":"$G$8*L72","v":36000},null,null,null,null,null,null,null,48,0,0,48]
[]
[]
[]
[]
[]
[]
[]
[null,null,null,null,null,null,null,null,null,null,null,null,"44GB8"]

{"sheet":"HDD","index":16,"n_rows":190,"n_cols":15,"rows_kept":190,"cut":false,"hidden":true,"merged":[]}
["Hard Drives"]
["DL560"]
["HP 300GB 12G SAS 15K 2.5in SC ENT HDD",null,"10L2-HDD300GB","S10L2-DL560-HDD300","759208-B21",140]
["HP 1TB 6G SAS 7.2K 2.5in SC MDL HDD",null,"10L2-HDD1TB","S10L2-DL560-HDD1000","652749-B21",278]
[null,"DL560","DL560 2","DL560 3"]
["HDD max",8,8,8]
["HDD 300GB Base",2,2,2,"Hot Spare for 300GB HDD",{"$f":"'Lotto2 DL560 Gen10 1'!$C$96","v":"No"},{"$f":"IF(F7=\"Yes\",1,0)","v":0},{"$f":"#REF!","v":{"$error":"#REF!"}},{"$f":"IF(H7=\"Yes\",1,0)","v":{"$error":"#REF!"}},{"$f":"#REF!","v":{"$error":"#REF!"}},{"$f":"IF(J7=\"Yes\",1,0)","v":{"$error":"#REF!"}}]
["HDD 300GB Selected",{"$f":"'Lotto2 DL560 Gen10 1'!#REF!","v":{"$error":"#REF!"}},{"$f":"#REF!","v":{"$error":"#REF!"}},{"$f":"#REF!","v":{"$error":"#REF!"}}]
["HP 300GB 12G SAS 15K 2.5in SC ENT HDD",0,0,0]
[null,1,1,1]
[null,2,2,2]
[null,3,3,3]
[null,4,4,4]
[null,5,5,5]
[null,6,6,6]
["HDD max",8,8,8]
["HDD 300GB",{"$f":"B7+B8","v":{"$error":"#REF!"}},{"$f":"C7+C8","v":{"$error":"#REF!"}},{"$f":"D7+D8","v":{"$error":"#REF!"}}]
["HDD 1TB Selected",{"$f":"'Lotto2 DL560 Gen10 1'!#REF!","v":{"$error":"#REF!"}},{"$f":"#REF!","v":{"$error":"#REF!"}},{"$f":"#REF!","v":{"$error":"#REF!"}},"Hot Spare for 1TB HDD",{"$f":"'Lotto2 DL560 Gen10 1'!$C$100","v":"No"},{"$f":"IF(F18=\"Yes\",1,0)","v":0},{"$f":"#REF!","v":{"$error":"#REF!"}},{"$f":"IF(H18=\"Yes\",1,0)","v":{"$error":"#REF!"}},{"$f":"#REF!","v":{"$error":"#REF!"}},{"$f":"IF(J18=\"Yes\",1,0)","v":{"$error":"#REF!"}}]
["HP 1TB 6G SAS 7.2K 2.5in SC MDL HDD",{"$f":"B$6-B$7-B$8","v":{"$error":"#REF!"}},{"$f":"C$6-C$7-C$8","v":{"$error":"#REF!"}},{"$f":"D$6-D$7-D$8","v":{"$error":"#REF!"}}]
[null,{"$f":"IF(B19-1<1,0,B19-1)","v":{"$error":"#REF!"}},{"$error":"#REF!"},{"$error":"#REF!"}]
[null,{"$error":"#REF!"},{"$error":"#REF!"},{"$error":"#REF!"}]
[null,{"$error":"#REF!"},{"$error":"#REF!"},{"$error":"#REF!"}]
[null,{"$error":"#REF!"},{"$error":"#REF!"},{"$error":"#REF!"}]
[null,{"$error":"#REF!"},{"$error":"#REF!"},{"$error":"#REF!"}]
[null,{"$error":"#REF!"},{"$error":"#REF!"},{"$error":"#REF!"}]
[null,{"$error":"#REF!"}]
[null,{"$error":"#REF!"}]
[]
["Hot Spare","Yes"]
[null,"No"]
[]
["RAID Configuration",null,null,"HDD 300GB DL560",null,"HDD 1TB DL560",null,"HDD 300GB DL560 2",null,"HDD 1TB DL560 2",null,"HDD 300GB DL560 3",null,"HDD 1TB DL560 3"]
["RAID Personalizzato",{"$f":"IF($B$109<=8,0,\"\")","v":0},{"$f":"\"\"","v":""},{"$f":"IF($G$7=0,A33,\"\")","v":"RAID Personalizzato"},{"$f":"IF($G$7=0,C33,\"\")","v":""},{"$f":"IF($G$18=0,A33,\"\")","v":"RAID Personalizzato"},{"$f":"IF($G$18=0,C33,\"\")","v":""},{"$f":"IF(I7=0,$A$33,\"\")","v":{"$error":"#REF!"}},{"$f":"IF(I7=0,$C$33,\"\")","v":{"$error":"#REF!"}},{"$f":"IF(I18=0,$A$33,\"\")","v":{"$error":"#REF!"}},{"$f":"IF(I18=0,$C$33,\"\")","v":{"$error":"#REF!"}},{"$f":"IF(K7=0,$A$33,\"\")","v":{"$error":"#REF!"}},{"$f":"IF(K7=0,$C$33,\"\")","v":{"$error":"#REF!"}},{"$f":"IF(K18=0,$A$33,\"\")","v":{"$error":"#REF!"}},{"$f":"IF(K18=0,$C$33,\"\")","v":{"$error":"#REF!"}}]
["RAID non Configurato (1-8 HDDs)",1,{"$f":"\"\"","v":""},{"$f":"IF($G$7=0,A34,\"\")","v":"RAID non Configurato (1-8 HDDs)"},{"$f":"IF($G$7=0,C34,\"\")","v":""},{"$f":"IF($G$18=0,A34,\"\")","v":"RAID non Configurato (1-8 HDDs)"},{"$f":"IF($G$18=0,C34,\"\")","v":""},{"$f":"IF(I7=0,$A$34,\"\")","v":{"$error":"#REF!"}},{"$f":"IF(I7=0,$C$34,\"\")","v":{"$error":"#REF!"}},{"$f":"IF(I18=0,$A$34,\"\")","v":{"$error":"#REF!"}},{"$f":"IF(I18=0,$C$34,\"\")","v":{"$error":"#REF!"}},{"$f":"IF(K7=0,$A$34,\"\")","v":{"$error":"#REF!"}},{"$f":"IF(K7=0,$C$34,\"\")","v":{"$error":"#REF!"}},{"$f":"IF(K18=0,$A$34,\"\")","v":{"$error":"#REF!"}},{"$f":"IF(K18=0,$C$34,\"\")","v":{"$error":"#REF!"}}]
["RAID 0 (1-8 HDDs)",1,{"$f":"\"\"","v":""},{"$f":"IF($G$7=0,A35,\"\")","v":"RAID 0 (1-8 HDDs)"},{"$f":"IF($G$7=0,C35,\"\")","v":""},{"$f":"IF($G$18=0,A35,\"\")","v":"RAID 0 (1-8 HDDs)"},{"$f":"IF($G$18=0,C35,\"\")","v":""},{"$f":"IF(I7=0,$A$35,\"\")","v":{"$error":"#REF!"}},{"$f":"IF(I7=0,$C$35,\"\")","v":{"$error":"#REF!"}},{"$f":"IF(I18=0,$A$35,\"\")","v":{"$error":"#REF!"}},{"$f":"IF(I18=0,$C$35,\"\")","v":{"$error":"#REF!"}},{"$f":"IF(K7=0,$A$35,\"\")","v":{"$error":"#REF!"}},{"$f":"IF(K7=0,$C$35,\"\")","v":{"$error":"#REF!"}},{"$f":"IF(K18=0,$A$35,\"\")","v":{"$error":"#REF!"}},{"$f":"IF(K18=0,$C$35,\"\")","v":{"$error":"#REF!"}}]
["RAID 1  (2 HDDs)",1,{"$f":"\"\"","v":""},{"$f":"IF($B$7+$B$8-$G$7=2,A36,\"\")","v":{"$error":"#REF!"}},{"$f":"IF($B$7+$B$8-$G$7=2,C36,\"\")","v":{"$error":"#REF!"}},{"$f":"IF($B$18-$G$18=2,A36,\"\")","v":{"$error":"#REF!"}},{"$f":"IF($B$18-$G$18=2,C36,\"\")","v":{"$error":"#REF!"}},{"$f":"IF($C$7+$C$8-I7=2,$A$36,\"\")","v":{"$error":"#REF!"}},{"$f":"IF($C$7+$C$8-I7=2,$C$36,\"\")","v":{"$error":"#REF!"}},{"$f":"IF($C$18-I18=2,A36,\"\")","v":{"$error":"#REF!"}},{"$f":"IF($C$18-I18=2,$C$36,\"\")","v":{"$error":"#REF!"}},{"$f":"IF($C$7+$C$8-K7=2,$A$36,\"\")","v":{"$error":"#REF!"}},{"$f":"IF($C$7+$C$8-K7=2,$C$36,\"\")","v":{"$error":"#REF!"}},{"$f":"IF($C$18-M18=2,E36,\"\")","v":{"$error":"#REF!"}},{"$f":"IF($D$18-K18=2,$C$36,\"\")","v":{"$error":"#REF!"}}]
["RAID 5 (da 3 a 10 HDDs)",1,{"$f":"\"\"","v":""},{"$f":"IF($B$7+$B$8-$G$7>=3,A37,\"\")","v":{"$error":"#REF!"}},{"$f":"IF($B$7+$B$8-$G$7>=3,C37,\"\")","v":{"$error":"#REF!"}},{"$f":"IF($B$18-$G$18>=3,A37,\"\")","v":{"$error":"#REF!"}},{"$f":"IF($B$18-$G$18>=3,C37,\"\")","v":{"$error":"#REF!"}},{"$f":"IF($C$7+$C$8-I7>=3,$A$37,\"\")","v":{"$error":"#REF!"}},{"$f":"IF($C$7+$C$8-I7>=3,$C$37,\"\")","v":{"$error":"#REF!"}},{"$f":"IF($C$18-I18>=3,$A$37,\"\")","v":{"$error":"#REF!"}},{"$f":"IF($C$18-I18>=3,$C$37,\"\")","v":{"$error":"#REF!"}},{"$f":"IF($D$7+$D$8-K7>=3,$A$37,\"\")","v":{"$error":"#REF!"}},{"$f":"IF($D$7+$D$8-K7>=3,$C$37,\"\")","v":{"$error":"#REF!"}},{"$f":"IF($D$18-K18>=3,$A$37,\"\")","v":{"$error":"#REF!"}},{"$f":"IF($D$18-K18>=3,$C$37,\"\")","v":{"$error":"#REF!"}}]
["RAID 10 (4-8 HDDs in pairs) ",1,{"$f":"\"\"","v":""},{"$f":"IF($B$7+$B$8-$G$7=4,A38,\"\")","v":{"$error":"#REF!"}},{"$f":"IF($B$7+$B$8-$G$7=4,C38,\"\")","v":{"$error":"#REF!"}},{"$f":"IF($B$18-$G$18=4,A38,\"\")","v":{"$error":"#REF!"}},{"$f":"IF($B$18-$G$18=4,C38,\"\")","v":{"$error":"#REF!"}},{"$f":"IF($C$7+$C$8-I7=4,$A$38,\"\")","v":{"$error":"#REF!"}},{"$f":"IF($C$7+$C$8-I7=4,$C$38,\"\")","v":{"$error":"#REF!"}},{"$f":"IF($C$18-I18=4,$A$38,\"\")","v":{"$error":"#REF!"}},{"$f":"IF($C$18-I18=4,$C$38,\"\")","v":{"$error":"#REF!"}},{"$f":"IF($D$7+$D$8-K7=4,$A$38,\"\")","v":{"$error":"#REF!"}},{"$f":"IF($D$7+$D$8-K7=4,$C$38,\"\")","v":{"$error":"#REF!"}},{"$f":"IF($D$18-K18=4,$A$38,\"\")","v":{"$error":"#REF!"}},{"$f":"IF($D$18-K18=4,$C$38,\"\")","v":{"$error":"#REF!"}}]
["RAID 1+RAID 1 (2 + 2 HDDs) ",1,{"$f":"\"\"","v":""},{"$f":"IF($B$7+$B$8-$G$7=4,A39,\"\")","v":{"$error":"#REF!"}},{"$f":"IF($B$7+$B$8-$G$7=4,C39,\"\")","v":{"$error":"#REF!"}},{"$f":"IF($B$18-$G$18=4,A39,\"\")","v":{"$error":"#REF!"}},{"$f":"IF($B$18-$G$18=4,C39,\"\")","v":{"$error":"#REF!"}},{"$f":"IF($C$7+$C$8-I7=4,$A$39,\"\")","v":{"$error":"#REF!"}},{"$f":"IF($C$7+$C$8-I7=4,$C$39,\"\")","v":{"$error":"#REF!"}},{"$f":"IF($C$18-I18=4,A39,\"\")","v":{"$error":"#REF!"}},{"$f":"IF($C$18-I18=4,$C$39,\"\")","v":{"$error":"#REF!"}},{"$f":"IF($D$7+$D$8-K7=4,$A$39,\"\")","v":{"$error":"#REF!"}},{"$f":"IF($D$7+$D$8-K7=4,$C$39,\"\")","v":{"$error":"#REF!"}},{"$f":"IF($D$18-K18=4,A39,\"\")","v":{"$error":"#REF!"}},{"$f":"IF($D$18-K18=4,$C$39,\"\")","v":{"$error":"#REF!"}}]
["RAID 1+RAID 5 (2 + 3-8 HDDs)",1,{"$f":"\"\"","v":""},{"$f":"IF($B$7+$B$8-$G$7>=5,A40,\"\")","v":{"$error":"#REF!"}},{"$f":"IF($B$7+$B$8-$G$7>=5,C40,\"\")","v":{"$error":"#REF!"}},{"$f":"IF($B$18-$G$18>=5,A40,\"\")","v":{"$error":"#REF!"}},{"$f":"IF($B$18-$G$18>=5,C40,\"\")","v":{"$error":"#REF!"}},{"$f":"IF($C$7+$C$8-I7>=5,$A$40,\"\")","v":{"$error":"#REF!"}},{"$f":"IF($C$7+$C$8-I7>=5,$C$40,\"\")","v":{"$error":"#REF!"}},{"$f":"IF($C$18-I18>=5,$A$40,\"\")","v":{"$error":"#REF!"}},{"$f":"IF($C$18-I18>=5,$C$40,\"\")","v":{"$error":"#REF!"}},{"$f":"IF($D$7+$D$8-K7>=5,$A$40,\"\")","v":{"$error":"#REF!"}},{"$f":"IF($D$7+$D$8-K7>=5,$C$40,\"\")","v":{"$error":"#REF!"}},{"$f":"IF($D$18-K18>=5,$A$40,\"\")","v":{"$error":"#REF!"}},{"$f":"IF($D$18-K18>=5,$C$40,\"\")","v":{"$error":"#REF!"}}]
["RAID 1 + RAID 10 (2 + 4 HDDs in pairs) ",1,{"$f":"\"\"","v":""},{"$f":"IF($B$7+$B$8-$G$7=6,A41,\"\")","v":{"$error":"#REF!"}},{"$f":"IF($B$7+$B$8-$G$7=6,C41,\"\")","v":{"$error":"#REF!"}},{"$f":"IF($B$18-$G$18=6,A41,\"\")","v":{"$error":"#REF!"}},{"$f":"IF($B$18-$G$18=6,C41,\"\")","v":{"$error":"#REF!"}},{"$f":"IF($C$7+$C$8-I7=6,$A$41,\"\")","v":{"$error":"#REF!"}},{"$f":"IF($C$7+$C$8-I7=6,$C$41,\"\")","v":{"$error":"#REF!"}},{"$f":"IF($C$18-I18=6,A41,\"\")","v":{"$error":"#REF!"}},{"$f":"IF($C$18-I18=6,$C$41,\"\")","v":{"$error":"#REF!"}},{"$f":"IF($D$7+$D$8-M7=6,$A$41,\"\")","v":{"$error":"#REF!"}},{"$f":"IF($D$7+$D$8-M7=6,$C$41,\"\")","v":{"$error":"#REF!"}},{"$f":"IF($D$18-K18=6,A41,\"\")","v":{"$error":"#REF!"}},{"$f":"IF($D$18-K18=6,$C$41,\"\")","v":{"$error":"#REF!"}}]
[]
["R730xd"]
["HP 300GB 12G SAS 15K 2.5in SC ENT HDD",null,"10L2-HDD300GB","S10L2-DL580-HDD300","759208-B21",140]
[]
[]
[]
["HP 1TB 6G SAS 7.2K 2.5in SC MDL HDD",null,"10L2-HDD1TB","S10L2-DL580-HDD1000","652749-B21",278]
[null,{"$f":"'Lotto2 DL580 1'!$C$83","v":"No"},{"$f":"'Lotto2 DL580 2'!$C$83","v":"No"},{"$f":"'Lotto2 DL580 3'!$C$83","v":"No"}]
["HDD max",10,10,10]
["HDD 300GB Base",2,2,2]
["Hot Spare for 300GB HDD",{"$f":"IF(B49=\"Yes\",1,0)","v":0},{"$f":"IF(C49=\"Yes\",1,0)","v":0},{"$f":"IF(D49=\"Yes\",1,0)","v":0}]
["HDD 300GB Selected",{"$f":"'Lotto2 DL580 1'!$C$68","v":0},{"$f":"'Lotto2 DL580 2'!#REF!","v":{"$error":"#REF!"}},{"$f":"'Lotto2 DL580 3'!$C$68","v":0}]
["HP 300GB 12G SAS 15K 2.5in SC ENT HDD",0,0,0]
[null,1,1,1]
[null,2,2,2]
[null,3,3,3]
[null,4,4,4]
[null,5,5,5]
[null,6,6,6]
[null,7,7,7]
[null,8,8,8]
[]
[]
[]
[]
[]
[]
[null,{"$f":"'Lotto2 DL580 1'!$C$87","v":"No"},{"$f":"'Lotto2 DL580 2'!$C$87","v":"No"},{"$f":"'Lotto2 DL580 3'!$C$87","v":"No"}]
["HDD max",10,10,10]
["HDD 300GB",{"$f":"B51+B53","v":2},{"$f":"C51+C53","v":{"$error":"#REF!"}},{"$f":"D51+D53","v":2}]
["Hot Spare for 1TB HDD",{"$f":"IF(B69=\"Yes\",1,0)","v":0},{"$f":"IF(C69=\"Yes\",1,0)","v":0},{"$f":"IF(D69=\"Yes\",1,0)","v":0}]
["HDD 1TB Selected",{"$f":"'Lotto2 DL580 1'!$C$70","v":0},{"$f":"'Lotto2 DL580 2'!#REF!","v":{"$error":"#REF!"}},{"$f":"'Lotto2 DL580 3'!$C$70","v":0}]
["HP 1TB 6G SAS 7.2K 2.5in SC MDL HDD",{"$f":"$B$70-$B$71-$B$73","v":8},{"$f":"$C$70-$C$71-$C$73","v":{"$error":"#REF!"}},{"$f":"$D$70-$D$71-$D$73","v":8}]
[null,{"$f":"IF(B74-1<1,0,B74-1)","v":7},{"$error":"#REF!"},{"$f":"IF(D74-1<1,0,D74-1)","v":7}]
[null,6,{"$error":"#REF!"},6]
[null,5,{"$error":"#REF!"},5]
[null,4,{"$error":"#REF!"},4]
[null,3,{"$error":"#REF!"},3]
[null,2,{"$error":"#REF!"},2]
[null,1,{"$error":"#REF!"},1]
[null,0,{"$error":"#REF!"},0]
[]
[]
[]
[]
[]
[]
[]
[]
[]
["RAID Configuration",null,null,"HDD 300GB R730xd",null,"HDD 1TB R730xd",null,"HDD 300GB R730xd 2",null,"HDD 1TB R730xd 2",null,"HDD 300GB R730xd 3",null,"HDD 1TB R730xd 3"]
["RAID Personalizzato",{"$f":"IF($B$109<=8,0,\"\")","v":0},"[780-BBJC]",{"$f":"IF($B$52=0,A93,\"\")","v":"RAID Personalizzato"},{"$f":"IF($B$52=0,C93,\"\")","v":"[780-BBJC]"},{"$f":"IF($B$72=0,A93,\"\")","v":"RAID Personalizzato"},{"$f":"IF($B$72=0,C93,\"\")","v":"[780-BBJC]"},{"$f":"IF($C$52=0,A93,\"\")","v":"RAID Personalizzato"},{"$f":"IF($C$52=0,C93,\"\")","v":"[780-BBJC]"},{"$f":"IF($C$72=0,A93,\"\")","v":"RAID Personalizzato"},{"$f":"IF($C$72=0,C93,\"\")","v":"[780-BBJC]"},{"$f":"IF($D$52=0,A93,\"\")","v":"RAID Personalizzato"},{"$f":"IF($D$52=0,C93,\"\")","v":"[780-BBJC]"},{"$f":"IF($D$72=0,A93,\"\")","v":"RAID Personalizzato"},{"$f":"IF($D$72=0,C93,\"\")","v":"[780-BBJC]"}]
["RAID non Configurato (1-8 HDDs)",1,"[780-BBJD] ",{"$f":"IF($B$52=0,A94,\"\")","v":"RAID non Configurato (1-8 HDDs)"},{"$f":"IF($B$52=0,C94,\"\")","v":"[780-BBJD] "},{"$f":"IF($B$72=0,A94,\"\")","v":"RAID non Configurato (1-8 HDDs)"},{"$f":"IF($B$72=0,C94,\"\")","v":"[780-BBJD] "},{"$f":"IF($C$52=0,A94,\"\")","v":"RAID non Configurato (1-8 HDDs)"},{"$f":"IF($C$52=0,C94,\"\")","v":"[780-BBJD] "},{"$f":"IF($C$72=0,A94,\"\")","v":"RAID non Configurato (1-8 HDDs)"},{"$f":"IF($C$72=0,C94,\"\")","v":"[780-BBJD] "},{"$f":"IF($D$52=0,A94,\"\")","v":"RAID non Configurato (1-8 HDDs)"},{"$f":"IF($D$52=0,C94,\"\")","v":"[780-BBJD] "},{"$f":"IF($D$72=0,A94,\"\")","v":"RAID non Configurato (1-8 HDDs)"},{"$f":"IF($D$72=0,C94,\"\")","v":"[780-BBJD] "}]
["RAID 0 (1-8 HDDs)",1,"[780-BBJF]",{"$f":"IF($B$52=0,A95,\"\")","v":"RAID 0 (1-8 HDDs)"},{"$f":"IF($B$52=0,C95,\"\")","v":"[780-BBJF]"},{"$f":"IF($B$72=0,A95,\"\")","v":"RAID 0 (1-8 HDDs)"},{"$f":"IF($B$72=0,C95,\"\")","v":"[780-BBJF]"},{"$f":"IF($C$52=0,A95,\"\")","v":"RAID 0 (1-8 HDDs)"},{"$f":"IF($C$52=0,C95,\"\")","v":"[780-BBJF]"},{"$f":"IF($C$72=0,A95,\"\")","v":"RAID 0 (1-8 HDDs)"},{"$f":"IF($C$72=0,C95,\"\")","v":"[780-BBJF]"},{"$f":"IF($D$52=0,A95,\"\")","v":"RAID 0 (1-8 HDDs)"},{"$f":"IF($D$52=0,C95,\"\")","v":"[780-BBJF]"},{"$f":"IF($D$72=0,A95,\"\")","v":"RAID 0 (1-8 HDDs)"},{"$f":"IF($D$72=0,C95,\"\")","v":"[780-BBJF]"}]
["RAID 1  (2 HDDs)",1,"[780-BBJK]",{"$f":"IF($B$51+$B$53-$B$52=2,A96,\"\")","v":"RAID 1  (2 HDDs)"},{"$f":"IF($B$51+$B$53-$B$52=2,C96,\"\")","v":"[780-BBJK]"},{"$f":"IF($B$73-$B$72=2,A96,\"\")","v":""},{"$f":"IF($B$73-$B$72=2,C96,\"\")","v":""},{"$f":"IF($C$51+$C$53-$C$52=2,A96,\"\")","v":{"$error":"#REF!"}},{"$f":"IF($C$51+$C$53-$C$52=2,C96,\"\")","v":{"$error":"#REF!"}},{"$f":"IF($C$73-$C$72=2,A96,\"\")","v":{"$error":"#REF!"}},{"$f":"IF($C$73-$C$72=2,C96,\"\")","v":{"$error":"#REF!"}},{"$f":"IF($D$51+$D$53-$D$52=2,A96,\"\")","v":"RAID 1  (2 HDDs)"},{"$f":"IF($D$51+$D$53-$D$52=2,C96,\"\")","v":"[780-BBJK]"},{"$f":"IF($D$73-$D$72=2,A96,\"\")","v":""},{"$f":"IF($D$73-$D$72=2,C96,\"\")","v":""}]
["RAID 5 (da 3 a 10 HDDs)",1,"[780-BBJL]",{"$f":"IF($B$51+$B$53-$B$52>=3,A97,\"\")","v":""},{"$f":"IF($B$51+$B$53-$B$52>=3,C97,\"\")","v":""},{"$f":"IF($B$73-$B$72>=3,A97,\"\")","v":""},{"$f":"IF($B$73-$B$72>=3,C97,\"\")","v":""},{"$f":"IF($C$51+$C$53-$C$52>=3,A97,\"\")","v":{"$error":"#REF!"}},{"$f":"IF($C$51+$C$53-$C$52>=3,C97,\"\")","v":{"$error":"#REF!"}},{"$f":"IF($C$73-$C$72>=3,A97,\"\")","v":{"$error":"#REF!"}},{"$f":"IF($C$73-$C$72>=3,C97,\"\")","v":{"$error":"#REF!"}},{"$f":"IF($D$51+$D$53-$D$52>=3,A97,\"\")","v":""},{"$f":"IF($D$51+$D$53-$D$52>=3,C97,\"\")","v":""},{"$f":"IF($D$73-$D$72>=3,A97,\"\")","v":""},{"$f":"IF($D$73-$D$72>=3,C97,\"\")","v":""}]
["RAID 10 (4-8 HDDs in pairs) ",1,"[780-BBJN]",{"$f":"IF($B$51+$B$53-$B$52=4,A98,\"\")","v":""},{"$f":"IF($B$51+$B$53-$B$52=4,C98,\"\")","v":""},{"$f":"IF($B$73-$B$72=4,A98,\"\")","v":""},{"$f":"IF($B$73-$B$72=4,C98,\"\")","v":""},{"$f":"IF($C$51+$C$53-$C$52=4,A98,\"\")","v":{"$error":"#REF!"}},{"$f":"IF($C$51+$C$53-$C$52=4,C98,\"\")","v":{"$error":"#REF!"}},{"$f":"IF($C$73-$C$72=4,A98,\"\")","v":{"$error":"#REF!"}},{"$f":"IF($C$73-$C$72=4,C98,\"\")","v":{"$error":"#REF!"}},{"$f":"IF($D$51+$D$53-$D$52=4,A98,\"\")","v":""},{"$f":"IF($D$51+$D$53-$D$52=4,C98,\"\")","v":""},{"$f":"IF($D$73-$D$72=4,A98,\"\")","v":""},{"$f":"IF($D$73-$D$72=4,C98,\"\")","v":""}]
["RAID 1+RAID 1 (2 + 2 HDDs) ",1,"[780-BBJO]",{"$f":"IF($B$51+$B$53-$B$52=4,A99,\"\")","v":""},{"$f":"IF($B$51+$B$53-$B$52=4,C99,\"\")","v":""},{"$f":"IF($B$73-$B$72=4,A99,\"\")","v":""},{"$f":"IF($B$73-$B$72=4,C99,\"\")","v":""},{"$f":"IF($C$51+$C$53-$C$52=4,A99,\"\")","v":{"$error":"#REF!"}},{"$f":"IF($C$51+$C$53-$C$52=4,C99,\"\")","v":{"$error":"#REF!"}},{"$f":"IF($C$73-$C$72=4,A99,\"\")","v":{"$error":"#REF!"}},{"$f":"IF($C$73-$C$72=4,C99,\"\")","v":{"$error":"#REF!"}},{"$f":"IF($D$51+$D$53-$D$52=4,A99,\"\")","v":""},{"$f":"IF($D$51+$D$53-$D$52=4,C99,\"\")","v":""},{"$f":"IF($D$73-$D$72=4,A99,\"\")","v":""},{"$f":"IF($D$73-$D$72=4,C99,\"\")","v":""}]
["RAID 1+RAID 5 (2 + 3-8 HDDs)",1,"[780-BBJP]",{"$f":"IF($B$51+$B$53-$B$52>=5,A100,\"\")","v":""},{"$f":"IF($B$51+$B$53-$B$52>=5,C100,\"\")","v":""},{"$f":"IF($B$73-$B$72>=5,A100,\"\")","v":""},{"$f":"IF($B$73-$B$72>=5,C100,\"\")","v":""},{"$f":"IF($C$51+$C$53-$C$52>=5,A100,\"\")","v":{"$error":"#REF!"}},{"$f":"IF($C$51+$C$53-$C$52>=5,C100,\"\")","v":{"$error":"#REF!"}},{"$f":"IF($C$73-$C$72>=5,A100,\"\")","v":{"$error":"#REF!"}},{"$f":"IF($C$73-$C$72>=5,C100,\"\")","v":{"$error":"#REF!"}},{"$f":"IF($D$51+$D$53-$D$52>=5,A100,\"\")","v":""},{"$f":"IF($D$51+$D$53-$D$52>=5,C100,\"\")","v":""},{"$f":"IF($D$73-$D$72>=5,A100,\"\")","v":""},{"$f":"IF($D$73-$D$72>=5,C100,\"\")","v":""}]
["RAID 1 + RAID 10 (2 + 4 HDDs in pairs) ",1,"[780-BBJQ] ",{"$f":"IF($B$51+$B$53-$B$52=6,A101,\"\")","v":""},{"$f":"IF($B$51+$B$53-$B$52=6,C101,\"\")","v":""},{"$f":"IF($B$73-$B$72=6,A101,\"\")","v":""},{"$f":"IF($B$73-$B$72=6,C101,\"\")","v":""},{"$f":"IF($C$51+$C$53-$C$52=6,A101,\"\")","v":{"$error":"#REF!"}},{"$f":"IF($C$51+$C$53-$C$52=6,C101,\"\")","v":{"$error":"#REF!"}},{"$f":"IF($C$73-$C$72=6,A101,\"\")","v":{"$error":"#REF!"}},{"$f":"IF($C$73-$C$72=6,C101,\"\")","v":{"$error":"#REF!"}},{"$f":"IF($D$51+$D$53-$D$52=6,A101,\"\")","v":""},{"$f":"IF($D$51+$D$53-$D$52=6,C101,\"\")","v":""},{"$f":"IF($D$73-$D$72=6,A101,\"\")","v":""},{"$f":"IF($D$73-$D$72=6,C101,\"\")","v":""}]
[]
[]
[]
[]
[]
[]
["T630"]
["300GB 10K RPM SAS 12Gbps 2.5in Hot-plug Hard Drive,CusKit",null,"10L1-HDD300GB-T","S10L1-T630-HDD300","[400-AJOQ]",91]
["1TB 7.2K RPM NLSAS 6Gbps 2.5in Hot-plug Hard Drive,13G,CusKit",null,"10L1-HDD1TB","S10L1-T630-HDD1000","[400-AEFF]",296]
[]
["HDD max",32]
["HDD 300GB Base",2]
["HDD 300GB Selected",{"$f":"#REF!","v":{"$error":"#REF!"}}]
["300GB 10K RPM SAS 12Gbps 2.5in Hot-plug Hard Drive,CusKit",0,null,"Hot Spare for 300GB HDD",{"$f":"#REF!","v":{"$error":"#REF!"}},{"$f":"IF(E115=\"Yes\",1,0)","v":{"$error":"#REF!"}}]
[null,1]
[null,2]
[null,3]
[null,4]
[null,5]
[null,6]
[null,7]
[null,8]
[null,9]
[null,10]
[null,11]
[null,12]
[null,13]
[null,14]
[null,15]
[null,16]
[null,17]
[null,18]
[null,19]
[null,20]
[null,21]
[null,22]
[null,23]
[null,24]
[null,25]
[null,26]
[null,27]
[null,28]
[null,29]
[null,30]
["HDD max",32]
["HDD 300GB",{"$f":"B113+B114","v":{"$error":"#REF!"}}]
["HDD 1TB Selected",{"$f":"#REF!","v":{"$error":"#REF!"}},null,"Hot Spare for 1TB HDD",{"$f":"#REF!","v":{"$error":"#REF!"}},{"$f":"IF(E148=\"Yes\",1,0)","v":{"$error":"#REF!"}}]
["1TB 7.2K RPM NLSAS 6Gbps 2.5in Hot-plug Hard Drive,13G,CusKit",{"$f":"$B$146-$B$147-$B$148","v":{"$error":"#REF!"}}]
[null,{"$f":"IF(B149-1<1,0,B149-1)","v":{"$error":"#REF!"}}]
[null,{"$error":"#REF!"}]
[null,{"$error":"#REF!"}]
[null,{"$error":"#REF!"}]
[null,{"$error":"#REF!"}]
[null,{"$error":"#REF!"}]
[null,{"$error":"#REF!"}]
[null,{"$error":"#REF!"}]
[null,{"$f":"IF(B157-1<1,0,B157-1)","v":{"$error":"#REF!"}}]
[null,{"$error":"#REF!"}]
[null,{"$error":"#REF!"}]
[null,{"$error":"#REF!"}]
[null,{"$error":"#REF!"}]
[null,{"$error":"#REF!"}]
[null,{"$error":"#REF!"}]
[null,{"$error":"#REF!"}]
[null,{"$error":"#REF!"}]
[null,{"$error":"#REF!"}]
[null,{"$error":"#REF!"}]
[null,{"$error":"#REF!"}]
[null,{"$error":"#REF!"}]
[null,{"$error":"#REF!"}]
[null,{"$error":"#REF!"}]
[null,{"$error":"#REF!"}]
[null,{"$error":"#REF!"}]
[null,{"$error":"#REF!"}]
[null,{"$error":"#REF!"}]
[null,{"$error":"#REF!"}]
[null,{"$error":"#REF!"}]
[null,{"$error":"#REF!"}]
[]
["RAID Configuration",null,null,"HDD 300GB",null,"HDD 1TB"]
["C1 - No RAID for H330 (1-8 HDDs)",{"$f":"IF($B$109<=8,0,\"\")","v":0},"[780-BBJC]",{"$f":"IF($F$115=0,A182,\"\")","v":{"$error":"#REF!"}},{"$f":"IF($F$115=0,C182,\"\")","v":{"$error":"#REF!"}},{"$f":"IF($F$148=0,A182,\"\")","v":{"$error":"#REF!"}},{"$f":"IF($F$148=0,C182,\"\")","v":{"$error":"#REF!"}}]
["C10 - Unconfigured RAID for H330 (1-8 HDDs)",1,"[780-BBJD] ",{"$f":"IF($F$115=0,A183,\"\")","v":{"$error":"#REF!"}},{"$f":"IF($F$115=0,C183,\"\")","v":{"$error":"#REF!"}},{"$f":"IF($F$148=0,A183,\"\")","v":{"$error":"#REF!"}},{"$f":"IF($F$148=0,C183,\"\")","v":{"$error":"#REF!"}}]
["C2 - RAID 0 for H330 (1-8 HDDs)",1,"[780-BBJF]",{"$f":"IF($F$115=0,A184,\"\")","v":{"$error":"#REF!"}},{"$f":"IF($F$115=0,C184,\"\")","v":{"$error":"#REF!"}},{"$f":"IF($F$148=0,A184,\"\")","v":{"$error":"#REF!"}},{"$f":"IF($F$148=0,C184,\"\")","v":{"$error":"#REF!"}}]
["C3 - RAID 1 for H330 (2 HDDs)",1,"[780-BBJK]",{"$f":"IF($B$113+$B$114-$F$115=2,A185,\"\")","v":{"$error":"#REF!"}},{"$f":"IF($B$113+$B$114-$F$115=2,C185,\"\")","v":{"$error":"#REF!"}},{"$f":"IF($B$148-$F$148=2,A185,\"\")","v":{"$error":"#REF!"}},{"$f":"IF($B$148-$F$148=2,C185,\"\")","v":{"$error":"#REF!"}}]
["C4 - RAID 5 for H330 (3-8 HDDs)",1,"[780-BBJL]",{"$f":"IF($B$113+$B$114-$F$115>=3,A186,\"\")","v":{"$error":"#REF!"}},{"$f":"IF($B$113+$B$114-$F$115>=3,C186,\"\")","v":{"$error":"#REF!"}},{"$f":"IF($B$148-$F$148>=3,A186,\"\")","v":{"$error":"#REF!"}},{"$f":"IF($B$148-$F$148>=3,C186,\"\")","v":{"$error":"#REF!"}}]
["C6 - RAID 10 forH330 (4-8 HDDs in pairs) ",1,"[780-BBJN]",{"$f":"IF($B$113+$B$114-$F$115=4,A187,\"\")","v":{"$error":"#REF!"}},{"$f":"IF($B$113+$B$114-$F$115=4,C187,\"\")","v":{"$error":"#REF!"}},{"$f":"IF($B$148-$F$148=4,A187,\"\")","v":{"$error":"#REF!"}},{"$f":"IF($B$148-$F$148=4,C187,\"\")","v":{"$error":"#REF!"}}]
["C7 - RAID 1+RAID 1 for H330 (2 + 2 HDDs) ",1,"[780-BBJO]",{"$f":"IF($B$113+$B$114-$F$115=4,A188,\"\")","v":{"$error":"#REF!"}},{"$f":"IF($B$113+$B$114-$F$115=4,C188,\"\")","v":{"$error":"#REF!"}},{"$f":"IF($B$148-$F$148=4,A188,\"\")","v":{"$error":"#REF!"}},{"$f":"IF($B$148-$F$148=4,C188,\"\")","v":{"$error":"#REF!"}}]
["C8 - RAID 1+RAID 5 for H330 (2 + 3-8 HDDs)",1,"[780-BBJP]",{"$f":"IF($B$113+$B$114-$F$115>=5,A189,\"\")","v":{"$error":"#REF!"}},{"$f":"IF($B$113+$B$114-$F$115>=5,C189,\"\")","v":{"$error":"#REF!"}},{"$f":"IF($B$148-$F$148>=5,A189,\"\")","v":{"$error":"#REF!"}},{"$f":"IF($B$148-$F$148>=5,C189,\"\")","v":{"$error":"#REF!"}}]
["C9 - RAID 1+RAID 10 for H330 (2 + 4 HDDs in pairs) ",1,"[780-BBJQ] ",{"$f":"IF($B$113+$B$114-$F$115=6,A190,\"\")","v":{"$error":"#REF!"}},{"$f":"IF($B$113+$B$114-$F$115=6,C190,\"\")","v":{"$error":"#REF!"}},{"$f":"IF($B$148-$F$148=6,A190,\"\")","v":{"$error":"#REF!"}},{"$f":"IF($B$148-$F$148=6,C190,\"\")","v":{"$error":"#REF!"}}]

{"sheet":"Servizi Opzionali","index":17,"n_rows":81,"n_cols":13,"rows_kept":81,"cut":false,"hidden":true,"merged":[]}
["Warranty Upgrades",null,null,null,null,null,"Protezione dei dati - Keep Your Hard Drive "]
["DL560"]
["None",{"$f":"\"\"","v":""},{"$f":"\"\"","v":""},{"$f":"\"\"","v":""},{"$f":"\"\"","v":""},{"$f":"\"\"","v":""},null,null,{"$f":"IF(($A$22=$A$12),\"\",IF($A$8=$A$3,I13,IF($A$8=$A$4,I14,IF($A$8=$A$5,I15))))","v":""},{"$f":"IF(($A$22=$A$12),\"\",IF($A$8=$A$3,J13,IF($A$8=$A$4,J14,IF($A$8=$A$5,J15))))","v":""},{"$f":"IF(($A$22=$A$12),\"\",IF($A$8=$A$3,K13,IF($A$8=$A$4,K14,IF($A$8=$A$5,K15))))","v":""},{"$f":"IF(($A$22=$A$12),\"\",IF($A$8=$A$3,L13,IF($A$8=$A$4,L14,IF($A$8=$A$5,L15))))","v":""},{"$f":"IF(($A$22=$A$12),\"\",IF($A$8=$A$3,M13,IF($A$8=$A$4,M14,IF($A$8=$A$5,M15))))","v":""}]
["4Yr Warranty upgrade ",1,"10L2-SO-12M","S10L2-DL560-S-12M",{"$f":"\"\"","v":""},350]
["5Yr Warranty upgrade ",1,"10L2-SO-24M","S10L2-DL560-S-24M",{"$f":"\"\"","v":""},700]
[]
["Estensione Garanzia Selezionata"]
[{"$f":"'Lotto2 DL560 Gen10 1'!$B$151","v":"None"},null,"DL560"]
[{"$f":"#REF!","v":{"$error":"#REF!"}},null,"DL560 2"]
[{"$f":"#REF!","v":{"$error":"#REF!"}},null,"DL560 3"]
[]
["None",{"$f":"\"\"","v":""},{"$f":"\"\"","v":""},{"$f":"\"\"","v":""},{"$f":"\"\"","v":""},{"$f":"\"\"","v":""},null,"None"]
[{"$f":"IF($A$8=$A$3,H13,IF($A$8=$A$4,H14,IF($A$8=$A$5,H15)))","v":"3Yr Data Protection - Keep Your Hard Drive"},1,"10L2-SO-HDD","S10L2-DL560-S-HDD",{"$f":"IF($A$8=$A$3,L13,IF($A$8=$A$4,L14,IF($A$8=$A$5,L15)))","v":""},300,null,"3Yr Data Protection - Keep Your Hard Drive",1,"10L2-SO-HDD","S10L2-DL560-S-HDD",{"$f":"\"\"","v":""},300]
["None",{"$f":"\"\"","v":""},{"$f":"\"\"","v":""},{"$f":"\"\"","v":""},{"$f":"\"\"","v":""},{"$f":"\"\"","v":""},null,"4Yr Data Protection - Keep Your Hard Drive",{"$f":"I13","v":1},{"$f":"J13","v":"10L2-SO-HDD"},{"$f":"K13","v":"S10L2-DL560-S-HDD"},{"$f":"\"\"","v":""},{"$f":"M13","v":300}]
[{"$f":"IF(A9=A3,H13,IF(A9=A4,H14,IF(A9=A5,H15)))","v":{"$error":"#REF!"}},1,"10L2-SO-HDD","S10L2-DL560-S-HDD",{"$f":"IF(A9=A3,L13,IF(A9=A4,L14,IF(A9=A5,L15)))","v":{"$error":"#REF!"}},300,null,"5Yr Data Protection - Keep Your Hard Drive",{"$f":"I13","v":1},{"$f":"J13","v":"10L2-SO-HDD"},{"$f":"K13","v":"S10L2-DL560-S-HDD"},{"$f":"\"\"","v":""},{"$f":"M13","v":300}]
["None",{"$f":"\"\"","v":""},{"$f":"\"\"","v":""},{"$f":"\"\"","v":""},{"$f":"\"\"","v":""},{"$f":"\"\"","v":""}]
[{"$f":"IF(A10=A3,H13,IF(A10=A4,H14,IF(A10=A5,H15)))","v":{"$error":"#REF!"}},1,"10L2-SO-HDD","S10L2-DL560-S-HDD",{"$f":"IF(A10=A3,L13,IF(A10=A4,L14,IF(A10=A5,L15)))","v":{"$error":"#REF!"}},300]
[]
[]
[]
["Protezione dei dati Selezionata"]
[{"$f":"'Lotto2 DL560 Gen10 1'!B154","v":"None"}]
[]
["Servizio Specialistico di System and Network Management per sistema opertivo Windows, erogato on site.",1,"10L2-SO-WIN","S10L1-R630-S-WIN",null,200]
["Servizio Specialistico di System and Network Management per sistema opertivo Linux, erogato on site.",1,"10L2-SO-LINUX","S10L1-R630-S-LINUX",null,200]
[]
["None",{"$f":"\"\"","v":""},{"$f":"\"\"","v":""},{"$f":"\"\"","v":""},{"$f":"\"\"","v":""},{"$f":"\"\"","v":""}]
[{"$f":"IF('Lotto2 DL560 Gen10 1'!$C$16>=5,H28,\"None\")","v":"None"},{"$f":"IF('Lotto2 DL560 Gen10 1'!$C$16>=5,I28,\"\")","v":""},{"$f":"IF('Lotto2 DL560 Gen10 1'!$C$16>=5,J28,\"\")","v":""},{"$f":"IF('Lotto2 DL560 Gen10 1'!$C$16>=5,K28,\"\")","v":""},{"$f":"IF('Lotto2 DL560 Gen10 1'!$C$16>=5,L28,\"\")","v":""},{"$f":"IF('Lotto2 DL560 Gen10 1'!$C$16>=5,M28,\"\")","v":""},null,"Servizi di manutenzione preventiva",1,"10L1-SO-PREV","S10L1-T630-S-PREV",null,200]
[]
["Warranty Upgrades",null,null,null,null,null,"Protezione dei dati - Keep Your Hard Drive "]
["DL580"]
["None",{"$f":"\"\"","v":""},{"$f":"\"\"","v":""},{"$f":"\"\"","v":""},{"$f":"\"\"","v":""},{"$f":"\"\"","v":""},null,null,{"$f":"IF(($A$22=$A$12),\"\",IF($A$8=$A$3,I42,IF($A$8=$A$4,I43,IF($A$8=$A$5,I44))))","v":""},{"$f":"IF(($A$22=$A$12),\"\",IF($A$8=$A$3,J42,IF($A$8=$A$4,J43,IF($A$8=$A$5,J44))))","v":""},{"$f":"IF(($A$22=$A$12),\"\",IF($A$8=$A$3,K42,IF($A$8=$A$4,K43,IF($A$8=$A$5,K44))))","v":""},{"$f":"IF(($A$22=$A$12),\"\",IF($A$8=$A$3,L42,IF($A$8=$A$4,L43,IF($A$8=$A$5,L44))))","v":""},{"$f":"IF(($A$22=$A$12),\"\",IF($A$8=$A$3,M42,IF($A$8=$A$4,M43,IF($A$8=$A$5,M44))))","v":""}]
["Estensione della manutenzione in garanzia per ulteriori 12 mesi",1,"TS1L2-4ANNI","TS1L2-4ANNI",{"$f":"\"\"","v":""},386]
["Estensione della manutenzione in garanzia per ulteriori 24 mesi",1,"TS1L2-5ANNI","TS1L2-5ANNI",{"$f":"\"\"","v":""},724]
[]
["Estensione Garanzia Selezionata"]
[{"$f":"'Lotto2 DL580 1'!$B$165","v":"None"},null,"DL580 "]
[{"$f":"'Lotto2 DL580 2'!$B$165","v":"None"},null,"DL580 2"]
[{"$f":"'Lotto2 DL580 3'!$B$165","v":"None"},null,"DL580 3"]
[]
["None",{"$f":"\"\"","v":""},{"$f":"\"\"","v":""},{"$f":"\"\"","v":""},{"$f":"\"\"","v":""},{"$f":"\"\"","v":""},null,"None"]
[{"$f":"IF($A$37=$A$32,H42,IF($A$37=$A$33,H43,IF($A$37=$A$34,H44)))","v":"3Yr Data Protection - Keep Your Hard Drive"},1,"10L2-SO-HDD","S10L2-DL580-S-HDD",{"$f":"IF($A$37=$A$32,L42,IF($A$37=$A$33,L43,IF($A$37=$A$34,L44)))","v":"[733-10057]"},300,null,"3Yr Data Protection - Keep Your Hard Drive",1,"10L2-SO-HDD","S10L2-DL580-S-HDD","[733-10057]",300]
["None",{"$f":"\"\"","v":""},{"$f":"\"\"","v":""},{"$f":"\"\"","v":""},{"$f":"\"\"","v":""},{"$f":"\"\"","v":""},null,"4Yr Data Protection - Keep Your Hard Drive",{"$f":"I42","v":1},{"$f":"J42","v":"10L2-SO-HDD"},{"$f":"K42","v":"S10L2-DL580-S-HDD"},"[733-10058]",{"$f":"M42","v":300}]
[{"$f":"IF(A38=A32,H42,IF(A38=A33,H43,IF(A38=A34,H44)))","v":"3Yr Data Protection - Keep Your Hard Drive"},1,"10L2-SO-HDD","S10L2-DL580-S-HDD",{"$f":"IF(A38=A32,L42,IF(A38=A33,L43,IF(A38=A34,L44)))","v":"[733-10057]"},300,null,"5Yr Data Protection - Keep Your Hard Drive",{"$f":"I42","v":1},{"$f":"J42","v":"10L2-SO-HDD"},{"$f":"K42","v":"S10L2-DL580-S-HDD"},"[733-10059]",{"$f":"M42","v":300}]
["None",{"$f":"\"\"","v":""},{"$f":"\"\"","v":""},{"$f":"\"\"","v":""},{"$f":"\"\"","v":""},{"$f":"\"\"","v":""}]
[{"$f":"IF(A39=A32,H42,IF(A39=A33,H43,IF(A39=A34,H44)))","v":"3Yr Data Protection - Keep Your Hard Drive"},1,"10L2-SO-HDD","S10L2-DL580-S-HDD",{"$f":"IF(A39=A32,L42,IF(A39=A33,L43,IF(A39=A34,L44)))","v":"[733-10057]"},300]
[]
[]
[]
["Protezione dei dati Selezionata"]
[{"$f":"'Lotto2 DL580 1'!B168","v":"None"}]
[]
["Servizio Specialistico di System and Network Management per sistema opertivo Windows, erogato on site.",1,"10L2-SO-WIN","S10L1-R730xd-S-WIN",null,200]
["Servizio Specialistico di System and Network Management per sistema opertivo Linux, erogato on site.",1,"10L2-SO-LINUX","S10L1-R730xd-S-LINUX",null,200]
[]
["None",{"$f":"\"\"","v":""},{"$f":"\"\"","v":""},{"$f":"\"\"","v":""},{"$f":"\"\"","v":""},{"$f":"\"\"","v":""}]
[{"$f":"IF('Lotto2 DL580 1'!$C$16>=5,H57,\"None\")","v":"None"},{"$f":"IF('Lotto2 DL580 1'!$C$16>=5,I57,\"\")","v":""},{"$f":"IF('Lotto2 DL580 1'!$C$16>=5,J57,\"\")","v":""},{"$f":"IF('Lotto2 DL580 1'!$C$16>=5,K57,\"\")","v":""},{"$f":"IF('Lotto2 DL580 1'!$C$16>=5,L57,\"\")","v":""},{"$f":"IF('Lotto2 DL580 1'!$C$16>=5,M57,\"\")","v":""},null,"Servizi di manutenzione preventiva",1,"10L2-SO-PREV","S10L2-DL580-S-PREV",null,200]
[]
[]
["Warranty Upgrades",null,null,null,null,null,"Protezione dei dati - Keep Your Hard Drive "]
["T630"]
["None",{"$f":"\"\"","v":""},{"$f":"\"\"","v":""},{"$f":"\"\"","v":""},{"$f":"\"\"","v":""},{"$f":"\"\"","v":""},null,null,{"$f":"IF(($A$22=$A$12),\"\",IF($A$8=$A$3,I70,IF($A$8=$A$4,I71,IF($A$8=$A$5,I72))))","v":""},{"$f":"IF(($A$22=$A$12),\"\",IF($A$8=$A$3,J70,IF($A$8=$A$4,J71,IF($A$8=$A$5,J72))))","v":""},{"$f":"IF(($A$22=$A$12),\"\",IF($A$8=$A$3,K70,IF($A$8=$A$4,K71,IF($A$8=$A$5,K72))))","v":""},{"$f":"IF(($A$22=$A$12),\"\",IF($A$8=$A$3,L70,IF($A$8=$A$4,L71,IF($A$8=$A$5,L72))))","v":""},{"$f":"IF(($A$22=$A$12),\"\",IF($A$8=$A$3,M70,IF($A$8=$A$4,M71,IF($A$8=$A$5,M72))))","v":""}]
["4Yr Warranty upgrade ",1,"10L1-SO-12M-T","S10L1-T630-S-12M",{"$f":"\"\"","v":""},175]
["5Yr Warranty upgrade ",1,"10L1-SO-24M-T","S10L1-T630-S-24M",{"$f":"\"\"","v":""},350]
[]
["Estensione Garanzia Selezionata"]
[{"$f":"#REF!","v":{"$error":"#REF!"}}]
[]
["None",{"$f":"\"\"","v":""},{"$f":"\"\"","v":""},{"$f":"\"\"","v":""},{"$f":"\"\"","v":""},{"$f":"\"\"","v":""},null,"None"]
[{"$f":"IF($A$67=$A$62,H70,IF($A$67=$A$63,H71,IF($A$67=$A$64,H72)))","v":{"$error":"#REF!"}},1,"10L1-SO-HDD","S10L1-T630-S-HDD",{"$f":"IF($A$67=$A$62,L70,IF($A$67=$A$63,L71,IF($A$67=$A$64,L72)))","v":{"$error":"#REF!"}},150,null,"3Yr Data Protection - Keep Your Hard Drive",1,"10L1-SO-HDD","S10L1-T630-S-HDD","[733-10057]",150]
[null,null,null,null,null,null,null,"4Yr Data Protection - Keep Your Hard Drive",{"$f":"I70","v":1},{"$f":"J70","v":"10L1-SO-HDD"},{"$f":"K70","v":"S10L1-T630-S-HDD"},"[733-10058]",{"$f":"M70","v":150}]
[null,null,null,null,null,null,null,"5Yr Data Protection - Keep Your Hard Drive",{"$f":"I70","v":1},{"$f":"J70","v":"10L1-SO-HDD"},{"$f":"K70","v":"S10L1-T630-S-HDD"},"[733-10059]",{"$f":"M70","v":150}]
[]
["Protezione dei dati Selezionata"]
[{"$f":"#REF!","v":{"$error":"#REF!"}}]
[]
["Servizio Specialistico di System and Network Management per sistema opertivo Windows, erogato on site.",1,"10L1-SO-WIN","S10L1-T630-S-WIN",null,193]
["Servizio Specialistico di System and Network Management per sistema opertivo Linux, erogato on site.",1,"10L1-SO-LINUX","S10L1-T630-S-LINUX",null,193]
[]
["None",{"$f":"\"\"","v":""},{"$f":"\"\"","v":""},{"$f":"\"\"","v":""},{"$f":"\"\"","v":""},{"$f":"\"\"","v":""}]
[{"$f":"IF(#REF!>=5,H81,\"None\")","v":{"$error":"#REF!"}},{"$f":"IF(#REF!>=5,I81,\"\")","v":{"$error":"#REF!"}},{"$f":"IF(#REF!>=5,J81,\"\")","v":{"$error":"#REF!"}},{"$f":"IF(#REF!>=5,K81,\"\")","v":{"$error":"#REF!"}},{"$f":"IF(#REF!>=5,L81,\"\")","v":{"$error":"#REF!"}},{"$f":"IF(#REF!>=5,M81,\"\")","v":{"$error":"#REF!"}},null,"Servizi di manutenzione preventiva",1,"10L1-SO-PREV","S10L1-T630-S-PREV",null,193]