{"text_format":"1","workbook":"xlsx","n_sheets":11,"sheets":["Lotto4 Blade 2P","Lotto4 Blade 4P","Chassis","Riepilogo","Codici","Processor","Memory","Operating System","HDD","PCI","Servizi Opzionali"],"not_rendered":{"charts":0,"images":8,"macros":1,"external_links":1,"defined_names":130,"comments":0,"pivot_tables":0},"unopened":[],"bounds":{"document_bytes":16777216,"sheet_cells":100000,"rows_first":2000,"rows_last":500,"rows_between":2000,"halvings":0,"cell_chars":16384,"cell_head_chars":4096},"cells_cut":0,"cells_raw":0,"read":"whole","date_system":"1900"}

{"sheet":"Lotto4 Blade 2P","index":0,"n_rows":66,"n_cols":8,"rows_kept":66,"cut":false,"hidden":false,"merged":[[53,1,53,4],[54,2,54,4],[64,2,64,4],[66,1,66,4],[56,1,56,4],[57,2,57,4],[60,1,60,4],[63,1,63,4],[39,2,39,4],[43,1,43,4],[44,2,44,4],[46,1,46,4],[47,2,47,4],[38,1,38,4],[23,1,23,4],[26,1,26,4],[27,2,27,4],[33,1,33,4],[34,2,34,4],[21,2,21,4],[1,0,4,5],[15,2,15,4],[17,1,17,4],[18,2,18,4],[20,1,20,4],[7,0,8,2],[5,0,5,1]]}
["IN ROSSO LE OPZIONI 20%"]
[]
[]
[]
[]
["Tecnologie Server1 Lotto4 BL460c Gen9",null,null,"Totale Server e Opzioni",null,2068,null,{"$f":"F9*SRV_A","v":0}]
[null,null,null,"Totale Ulteriori Opzioni ",null,null,null,{"$f":"SUM(G17:G67)*SRV_A","v":0}]
["Components: \nServer HPE Proliant BL460c Gen9 (1CPU Intel® Xeon® E5-2640 v4, 32GB , 2xHDD 300GB 10K RPM SAS 12Gbps 2.5in)",null,null,null,null,{"$f":"SUM(F17:F67)","v":0}]
[null,null,null,"TOTALE CONVENZIONE",null,{"$f":"SUM(F6:F8)","v":2068},null,{"$f":"H7+H6","v":0}]
[]
[]
["Proliant BL460c Gen9","Category: Server Blade"]
[null,"Quantity: "]
[]
[]
[null,"Base"]
[null,"HPE BL460c G9 E5v4 10/20Gb FLB CTO Blade",1,null,"813198-B21"]
[]
[null,"Processore"]
[null,"HPE BL460c Gen9 E5 -2640v4 FIO Kit",1,null,"819839-L21"]
[]
[null,"Processore aggiuntivo"]
[null,"Nessun Processore Aggiuntivo",{"$f":"VLOOKUP($B$23, CPU_A, 2, FALSE)","v":0},{"$f":"VLOOKUP($B$23, CPU_A, 3, FALSE)","v":""},{"$f":"VLOOKUP($B$23, CPU_A, 5, FALSE)","v":""},{"$f":"VLOOKUP(B23, CPU_A, 12, FALSE)","v":0}]
[]
[null,"Memoria Totale in GB",{"$f":"IF(F23=978,IF(B26=32,\"ATTENZIONE: AUMENTARE LA RAM\",\"\"),\"\")","v":""}]
[null,32]
[]
[null,"Capacità di memoria"]
[null,{"$f":"IF($B$23=\"Nessun Processore Aggiuntivo\",VLOOKUP($B$26, MEM_A1, 8, FALSE),VLOOKUP($B$26, MEM_A2, 8, FALSE))","v":"HPE 32GB 2Rx4 PC4-2400T-R Kit"},{"$f":"IF($B$23=\"Nessun Processore Aggiuntivo\",VLOOKUP($B$26, MEM_A1, 9, FALSE),VLOOKUP($B$26, MEM_A2, 9, FALSE))","v":1},null,{"$f":"IF($B$23=\"Nessun Processore Aggiuntivo\",VLOOKUP($B$26, MEM_A1, 10, FALSE),VLOOKUP($B$26, MEM_A2, 10, FALSE))","v":"805351-B21"}]
[]
[null,{"$f":"IF($B$23=\"Nessun Processore Aggiuntivo\",VLOOKUP($B$26, MEM_A1, 2, FALSE),VLOOKUP($B$26, MEM_A2, 2, FALSE))","v":""},{"$f":"IF($B$23=\"Nessun Processore Aggiuntivo\",VLOOKUP($B$26, MEM_A1, 3, FALSE),VLOOKUP($B$26, MEM_A2, 3, FALSE))","v":""},{"$f":"IF($B$23=\"Nessun Processore Aggiuntivo\",VLOOKUP($B$26, MEM_A1, 4, FALSE),VLOOKUP($B$26, MEM_A2, 4, FALSE))","v":""},{"$f":"IF($B$23=\"Nessun Processore Aggiuntivo\",VLOOKUP($B$26, MEM_A1, 6, FALSE),VLOOKUP($B$26, MEM_A2, 6, FALSE))","v":""},{"$f":"IF($B$23=\"Nessun Processore Aggiuntivo\",VLOOKUP($B$26, MEM_A1, 7, FALSE),VLOOKUP($B$26, MEM_A2, 7, FALSE))","v":""}]
[]
[null,{"$f":"IF($B$23=\"Nessun Processore Aggiuntivo\",VLOOKUP($B$26, MEM_A1, 11, FALSE),VLOOKUP($B$26, MEM_A2, 11, FALSE))","v":""},{"$f":"IF($B$23=\"Nessun Processore Aggiuntivo\",VLOOKUP($B$26, MEM_A1, 12, FALSE),VLOOKUP($B$26, MEM_A2, 12, FALSE))","v":""},{"$f":"IF($B$23=\"Nessun Processore Aggiuntivo\",VLOOKUP($B$26, MEM_A1, 13, FALSE),VLOOKUP($B$26, MEM_A2,13, FALSE))","v":""},{"$f":"IF($B$23=\"Nessun Processore Aggiuntivo\",VLOOKUP($B$26, MEM_A1, 15, FALSE),VLOOKUP($B$26, MEM_A2, 15, FALSE))","v":""},{"$f":"IF($B$23=\"Nessun Processore Aggiuntivo\",VLOOKUP($B$26, MEM_A1, 16, FALSE),VLOOKUP($B$26, MEM_A2, 16, FALSE))","v":""}]
[]
[null,"Sistema operativo preinstallato"]
[null,"Nessun Sistema Operativo",{"$f":"IF($B$23=\"Nessun Processore Aggiuntivo\",VLOOKUP($B$36, OS_A, 2, FALSE),VLOOKUP($B$36, OS_A2, 2, FALSE))","v":""},{"$f":"IF($B$23=\"Nessun Processore Aggiuntivo\",VLOOKUP($B$36, OS_A, 3, FALSE),VLOOKUP($B$36, OS_A2, 3, FALSE))","v":""},{"$f":"IF($B$23=\"Nessun Processore Aggiuntivo\",VLOOKUP($B$36, OS_A, 5, FALSE),VLOOKUP($B$36, OS_A2, 5, FALSE))","v":""},{"$f":"IF($B$23=\"Nessun Processore Aggiuntivo\",VLOOKUP($B$36, OS_A, 6, FALSE),VLOOKUP($B$36, OS_A2, 6, FALSE))","v":""}]
[null,{"$f":"IF($B$23=\"Nessun Processore Aggiuntivo\",VLOOKUP($B$36, OS_A, 19, FALSE),VLOOKUP($B$36, OS_A2, 19, FALSE))","v":""},{"$f":"IF($B$23=\"Nessun Processore Aggiuntivo\",VLOOKUP($B$36, OS_A, 20, FALSE),VLOOKUP($B$36, OS_A2, 20, FALSE))","v":""},{"$f":"IF($B$23=\"Nessun Processore Aggiuntivo\",VLOOKUP($B$36, OS_A, 21, FALSE),VLOOKUP($B$36, OS_A2, 21, FALSE))","v":""},{"$f":"IF($B$23=\"Nessun Processore Aggiuntivo\",VLOOKUP($B$36, OS_A, 23, FALSE),VLOOKUP($B$36, OS_A2, 23, FALSE))","v":""},{"$f":"IF($B$23=\"Nessun Processore Aggiuntivo\",VLOOKUP($B$36, OS_A, 24, FALSE),VLOOKUP($B$36, OS_A2, 24, FALSE))","v":""}]
[null,{"$f":"IF($B$23=\"Nessun Processore Aggiuntivo\",VLOOKUP($B$36, OS_A, 25, FALSE),VLOOKUP($B$36, OS_A2, 25, FALSE))","v":""},{"$f":"IF($B$23=\"Nessun Processore Aggiuntivo\",VLOOKUP($B$36, OS_A, 26, FALSE),VLOOKUP($B$36, OS_A2, 26, FALSE))","v":""},{"$f":"IF($B$23=\"Nessun Processore Aggiuntivo\",VLOOKUP($B$36, OS_A, 27, FALSE),VLOOKUP($B$36, OS_A2, 27, FALSE))","v":""},{"$f":"IF($B$23=\"Nessun Processore Aggiuntivo\",VLOOKUP($B$36, OS_A, 29, FALSE),VLOOKUP($B$36, OS_A2, 29, FALSE))","v":""},null,{"$f":"IF($B$23=\"Nessun Processore Aggiuntivo\",VLOOKUP($B$36, OS_A, 30, FALSE),VLOOKUP($B$36, OS_A2, 30, FALSE))","v":""}]
[]
[null,"Licenze Accesso Client (CAL)"]
[null,{"$f":"VLOOKUP($B$36, OS_A, 7, FALSE)","v":"None"},null,{"$f":"VLOOKUP($B$36, OS_A, 9, FALSE)","v":""},{"$f":"VLOOKUP($B$36, OS_A, 11, FALSE)","v":""},{"$f":"VLOOKUP($B$36, OS_A, 12, FALSE)*C41","v":0}]
[]
[null,{"$f":"VLOOKUP($B$36, OS_A, 13, FALSE)","v":"None"},null,{"$f":"VLOOKUP($B$36, OS_A, 15, FALSE)","v":""},{"$f":"VLOOKUP($B$36, OS_A, 17, FALSE)","v":""},{"$f":"VLOOKUP($B$36, OS_A, 18, FALSE)*C43","v":0}]
[]
[null,"Controller RAID"]
[null,"HP H244br FIO Smart HBA",1,null,"761878-B21"]
[]
[null,"Dischi rigidi"]
[null,{"$f":"IF(HD1000_A=\"no\",\"HPE 300GB SAS 10K SFF SC DS HDD\",\"\")","v":"HPE 300GB SAS 10K SFF SC DS HDD"},{"$f":"IF(HD1000_A=\"no\",\"2\",\"\")","v":"2"},null,{"$f":"IF(HD1000_A=\"no\",\"872475-B21\",\"\")","v":"872475-B21"}]
[]
[null,"Sostituzione dei 2 dischi da 300GB con 2 dischi da 1.2TB","No"]
[]
[null,{"$f":"IF(HD1000_A=\"Yes\",\"HPE 1.2TB SAS 12G Enterprise 10K SFF (2.5in) SC DS Firmware HDD\",\"\")","v":""},{"$f":"IF(HD1000_A=\"Yes\",\"2\",\"\")","v":""},{"$f":"IF(HD1000_A=\"Yes\",\"TS1L4-HD1200\",\"\")","v":""},{"$f":"IF(HD1000_A=\"Yes\",\"872479-B21\",\"\")","v":""},{"$f":"IF(HD1000_A=\"Yes\",398,\"\")","v":""}]
[]
[null,"Scheda FlexibleLOM"]
[null,"HPE FlexFabric 10Gb 2-port 536FLB FIO Adapter",1,null,"766491-B21"]
[]
[null,"Scheda Mezzanine Slot 1"]
[null,"None",{"$f":"VLOOKUP(B59,  PCI_A1, 2, FALSE)","v":""},{"$f":"VLOOKUP(B59,  PCI_A1, 3, FALSE)","v":""},{"$f":"VLOOKUP(B59,  PCI_A1, 5, FALSE)","v":""},null,{"$f":"VLOOKUP(B59,  PCI_A1, 6, FALSE)","v":""}]
[null,"Empty"]
[]
[null,"Scheda Mezzanine Slot 2",{"$f":"IF(F23=978,\"\",\"LA SCHEDA MEZZANINE NELLO SLOT 2 FUNIZIONA SOLO IN PRESENZA DEL SECONDO PROCESSORE\")","v":"LA SCHEDA MEZZANINE NELLO SLOT 2 FUNIZIONA SOLO IN PRESENZA DEL SECONDO PROCESSORE"}]
[null,"HPE QMH2572 8Gb Fibre Channel Host Bus Adapter dual port",1,null,"651281-B21"]
[]
[null,"Estensione di Garanzia"]
[null,"None",{"$f":"VLOOKUP($B$66,  SO_A1, 2, FALSE)","v":""},{"$f":"VLOOKUP($B$66,  SO_A1, 3, FALSE)","v":""},{"$f":"VLOOKUP($B$66,  SO_A1, 5, FALSE)","v":""},{"$f":"VLOOKUP($B$66,  SO_A1, 6, FALSE)","v":""}]

{"sheet":"Lotto4 Blade 4P","index":1,"n_rows":72,"n_cols":8,"rows_kept":72,"cut":false,"hidden":false,"merged":[[18,2,18,4],[59,2,59,4],[62,1,62,4],[67,2,67,4],[69,1,69,4],[46,1,46,4],[20,1,20,4],[21,2,21,4],[23,1,23,4],[26,1,26,4],[27,2,27,4],[33,1,33,4],[34,2,34,4],[38,1,38,4],[39,2,39,4],[43,1,43,4],[1,0,4,5],[5,0,5,1],[7,0,8,2],[15,2,15,4],[17,1,17,4],[44,2,44,4],[63,2,63,4],[66,1,66,4],[70,2,70,4],[72,1,72,4],[47,2,47,4],[53,1,53,4],[54,2,54,4],[58,1,58,4]]}
["IN ROSSO LE OPZIONI 20%"]
[]
[]
[]
[]
["Tecnologie Server1 Lotto4 BL660c Gen9",null,null,"Totale Server e Opzioni",null,4556,null,{"$f":"F9*SRV_B","v":0}]
[null,null,null,"Totale Ulteriori Opzioni ",null,null,null,{"$f":"SUM(G17:G73)*SRV_B","v":0}]
["Components: \nServer HPE Proliant BL660c Gen9 (2CPU Intel® Xeon® E5-4640 v4, 64GB , 2xHDD 300GB 10K RPM SAS 12Gbps 2.5in)",null,null,null,null,{"$f":"SUM(F17:F73)","v":0}]
[null,null,null,"TOTALE CONVENZIONE",null,{"$f":"SUM(F6:F8)","v":4556},null,{"$f":"H7+H6","v":0}]
[]
[]
["Proliant BL660c Gen9","Category: Server Blade"]
[null,"Quantity: "]
[]
[]
[null,"Base"]
[null,"HPE BL660c G9E5-v4 10/20GB FLB CTO Blade",1,null,"844352-B21"]
[]
[null,"Processore"]
[null,"HPE BL660c Gen9 E5-4640v4 2P FIO Kit",1,null,"844373-L21"]
[]
[null,"Processore aggiuntivo"]
[null,"Nessun Processore Aggiuntivo",{"$f":"VLOOKUP($B$23, CPU_B, 2, FALSE)","v":0},{"$f":"VLOOKUP($B$23, CPU_B, 3, FALSE)","v":""},{"$f":"VLOOKUP($B$23, CPU_B, 5, FALSE)","v":0},{"$f":"VLOOKUP(B23, CPU_B, 12, FALSE)","v":""}]
[]
[null,"Memoria Totale in GB"]
[null,64]
[]
[null,"Capacità di memoria"]
[null,{"$f":"IF($B$23=\"Nessun Processore Aggiuntivo\",VLOOKUP($B$26, MEM_B1, 8, FALSE),VLOOKUP($B$26, MEM_B2, 8, FALSE))","v":"HPE 32GB 2Rx4 PC4-2400T-R Kit"},{"$f":"IF($B$23=\"Nessun Processore Aggiuntivo\",VLOOKUP($B$26, MEM_B1, 9, FALSE),VLOOKUP($B$26, MEM_B2, 9, FALSE))","v":2},null,{"$f":"IF($B$23=\"Nessun Processore Aggiuntivo\",VLOOKUP($B$26, MEM_B1, 10, FALSE),VLOOKUP($B$26, MEM_B2, 10, FALSE))","v":"805351-B21"}]
[]
[null,{"$f":"IF($B$23=\"Nessun Processore Aggiuntivo\",VLOOKUP($B$26, MEM_B1, 2, FALSE),VLOOKUP($B$26, MEM_B2, 2, FALSE))","v":""},{"$f":"IF($B$23=\"Nessun Processore Aggiuntivo\",VLOOKUP($B$26, MEM_B1, 3, FALSE),VLOOKUP($B$26, MEM_B2, 3, FALSE))","v":""},{"$f":"IF($B$23=\"Nessun Processore Aggiuntivo\",VLOOKUP($B$26, MEM_B1, 4, FALSE),VLOOKUP($B$26, MEM_B2, 4, FALSE))","v":""},{"$f":"IF($B$23=\"Nessun Processore Aggiuntivo\",VLOOKUP($B$26, MEM_B1, 6, FALSE),VLOOKUP($B$26, MEM_B2, 6, FALSE))","v":""},{"$f":"IF($B$23=\"Nessun Processore Aggiuntivo\",VLOOKUP($B$26, MEM_B1, 7, FALSE),VLOOKUP($B$26, MEM_B2, 7, FALSE))","v":""}]
[]
[null,{"$f":"IF($B$23=\"Nessun Processore Aggiuntivo\",VLOOKUP($B$26, MEM_B1, 11, FALSE),VLOOKUP($B$26, MEM_B2, 11, FALSE))","v":""},{"$f":"IF($B$23=\"Nessun Processore Aggiuntivo\",VLOOKUP($B$26, MEM_B1, 12, FALSE),VLOOKUP($B$26, MEM_B2, 12, FALSE))","v":""},{"$f":"IF($B$23=\"Nessun Processore Aggiuntivo\",VLOOKUP($B$26, MEM_B1, 13, FALSE),VLOOKUP($B$26, MEM_B2,13, FALSE))","v":""},{"$f":"IF($B$23=\"Nessun Processore Aggiuntivo\",VLOOKUP($B$26, MEM_B1, 15, FALSE),VLOOKUP($B$26, MEM_B2, 15, FALSE))","v":""},{"$f":"IF($B$23=\"Nessun Processore Aggiuntivo\",VLOOKUP($B$26, MEM_B1, 16, FALSE),VLOOKUP($B$26, MEM_B2, 16, FALSE))","v":""}]
[]
[null,"Sistema operativo preinstallato"]
[null,"Nessun Sistema Operativo",{"$f":"IF($B$23=\"Nessun Processore Aggiuntivo\",VLOOKUP($B$36, OS_B, 2, FALSE),VLOOKUP($B$36, os_b2, 2, FALSE))","v":""},{"$f":"IF($B$23=\"Nessun Processore Aggiuntivo\",VLOOKUP($B$36, OS_B, 3, FALSE),VLOOKUP($B$36, os_b2, 3, FALSE))","v":""},{"$f":"IF($B$23=\"Nessun Processore Aggiuntivo\",VLOOKUP($B$36, OS_B, 5, FALSE),VLOOKUP($B$36, os_b2, 5, FALSE))","v":""},{"$f":"IF($B$23=\"Nessun Processore Aggiuntivo\",VLOOKUP($B$36, OS_B, 6, FALSE),VLOOKUP($B$36, os_b2, 6, FALSE))","v":""}]
[null,{"$f":"IF($B$23=\"Nessun Processore Aggiuntivo\",VLOOKUP($B$36, OS_B, 19, FALSE),VLOOKUP($B$36, os_b2, 19, FALSE))","v":""},{"$f":"IF($B$23=\"Nessun Processore Aggiuntivo\",VLOOKUP($B$36, OS_B, 20, FALSE),VLOOKUP($B$36, os_b2, 20, FALSE))","v":""},{"$f":"IF($B$23=\"Nessun Processore Aggiuntivo\",VLOOKUP($B$36, OS_B, 21, FALSE),VLOOKUP($B$36, os_b2, 21, FALSE))","v":""},{"$f":"IF($B$23=\"Nessun Processore Aggiuntivo\",VLOOKUP($B$36, OS_B, 23, FALSE),VLOOKUP($B$36, os_b2, 23, FALSE))","v":""},{"$f":"IF($B$23=\"Nessun Processore Aggiuntivo\",VLOOKUP($B$36, OS_B, 24, FALSE),VLOOKUP($B$36, os_b2, 24, FALSE))","v":""}]
[null,{"$f":"IF($B$23=\"Nessun Processore Aggiuntivo\",VLOOKUP($B$36, OS_B, 25, FALSE),VLOOKUP($B$36, os_b2, 25, FALSE))","v":""},{"$f":"IF($B$23=\"Nessun Processore Aggiuntivo\",VLOOKUP($B$36, OS_B, 26, FALSE),VLOOKUP($B$36, os_b2, 26, FALSE))","v":""},{"$f":"IF($B$23=\"Nessun Processore Aggiuntivo\",VLOOKUP($B$36, OS_B, 27, FALSE),VLOOKUP($B$36, os_b2, 27, FALSE))","v":""},{"$f":"IF($B$23=\"Nessun Processore Aggiuntivo\",VLOOKUP($B$36, OS_B, 29, FALSE),VLOOKUP($B$36, os_b2, 29, FALSE))","v":""},null,{"$f":"IF($B$23=\"Nessun Processore Aggiuntivo\",VLOOKUP($B$36, OS_B, 30, FALSE),VLOOKUP($B$36, os_b2, 30, FALSE))","v":""}]
[]
[null,"Licenze Accesso Client (CAL)"]
[null,{"$f":"VLOOKUP($B$36, OS_A, 7, FALSE)","v":"None"},null,{"$f":"VLOOKUP($B$36, OS_A, 9, FALSE)","v":""},{"$f":"VLOOKUP($B$36, OS_A, 11, FALSE)","v":""},{"$f":"VLOOKUP($B$36, OS_A, 12, FALSE)*C41","v":0}]
[]
[null,{"$f":"VLOOKUP($B$36, OS_A, 13, FALSE)","v":"None"},null,{"$f":"VLOOKUP($B$36, OS_A, 15, FALSE)","v":""},{"$f":"VLOOKUP($B$36, OS_A, 17, FALSE)","v":""},{"$f":"VLOOKUP($B$36, OS_A, 18, FALSE)*C43","v":0}]
[]
[null,"Controller RAID"]
[null,"HP H244br FIO Smart HBA",1,null,"761878-B21"]
[]
[null,"Dischi rigidi"]
[null,{"$f":"IF(HD1000_B=\"no\",\"HPE 300GB SAS 10K SFF SC DS HDD\",\"\")","v":"HPE 300GB SAS 10K SFF SC DS HDD"},{"$f":"IF(HD1000_B=\"no\",\"2\",\"\")","v":"2"},null,{"$f":"IF(HD1000_B=\"no\",\"872475-B21\",\"\")","v":"872475-B21"}]
[]
[null,"Sostituzione dei 2 dischi da 300GB con 2 dischi da 1.2TB","No"]
[]
[null,{"$f":"IF(HD1000_B=\"Yes\",\"HPE 1.2TB SAS 12G Enterprise 10K SFF (2.5in) SC DS Firmware HDD\",\"\")","v":""},{"$f":"IF(HD1000_B=\"Yes\",\"2\",\"\")","v":""},{"$f":"IF(HD1000_B=\"Yes\",\"TS1L4-HD1200\",\"\")","v":""},{"$f":"IF(HD1000_B=\"Yes\",\"872479-B21\",\"\")","v":""},{"$f":"IF(HD1000_B=\"Yes\",398,\"\")","v":""}]
[]
[null,"Scheda FlexibleLOM"]
[null,"HPE FlexFabric 10Gb 2-port 536FLB FIO Adapter",1,null,"766491-B21"]
[]
[null,"HPE FlexFabric 10Gb 2-port 536FLB Adapter",1,null,"766490-B21"]
[]
[null,"Scheda Mezzanine Slot 1"]
[null,"None",{"$f":"VLOOKUP(B61,  PCI_A1, 2, FALSE)","v":""},{"$f":"VLOOKUP(B61,  PCI_A1, 3, FALSE)","v":""},{"$f":"VLOOKUP(B61,  PCI_A1, 5, FALSE)","v":""},null,{"$f":"VLOOKUP(B61,  PCI_A1, 6, FALSE)","v":""}]
[null,"None",{"$f":"VLOOKUP(B62,  PCI_A1, 2, FALSE)","v":""},{"$f":"VLOOKUP(B62,  PCI_A1, 3, FALSE)","v":""},{"$f":"VLOOKUP(B62,  PCI_A1, 5, FALSE)","v":""},null,{"$f":"VLOOKUP(B62,  PCI_A1, 6, FALSE)","v":""}]
[]
[null,"Scheda Mezzanine Slot 2"]
[null,"None",{"$f":"VLOOKUP(B65,  PCI_A1, 2, FALSE)","v":""},{"$f":"VLOOKUP(B65,  PCI_A1, 3, FALSE)","v":""},{"$f":"VLOOKUP(B65,  PCI_A1, 5, FALSE)","v":""},null,{"$f":"VLOOKUP(B65,  PCI_A1, 6, FALSE)","v":""}]
[null,"None",{"$f":"VLOOKUP(B66,  PCI_A1, 2, FALSE)","v":""},{"$f":"VLOOKUP(B66,  PCI_A1, 3, FALSE)","v":""},{"$f":"VLOOKUP(B66,  PCI_A1, 5, FALSE)","v":""},null,{"$f":"VLOOKUP(B66,  PCI_A1, 6, FALSE)","v":""}]
[]
[null,"Scheda Mezzanine Slot 3"]
[null,"HPE QMH2572 8Gb Fibre Channel Host Bus Adapter dual port",1,null,"651281-B21"]
[]
[null,"Estensione di Garanzia"]
[null,"None",{"$f":"VLOOKUP($B$72,  SO_A1, 2, FALSE)","v":""},{"$f":"VLOOKUP($B$72,  SO_A1, 3, FALSE)","v":""},{"$f":"VLOOKUP($B$72,  SO_A1, 5, FALSE)","v":""},{"$f":"VLOOKUP($B$72,  SO_A1, 6, FALSE)","v":""}]

{"sheet":"Chassis","index":2,"n_rows":60,"n_cols":8,"rows_kept":60,"cut":false,"hidden":false,"merged":[[60,1,60,4],[11,0,12,1],[1,0,4,5],[5,0,5,4],[58,2,58,4],[22,2,22,4],[24,1,24,4],[50,2,50,4],[57,1,57,4],[19,2,19,4],[21,1,21,4],[31,2,31,4],[33,1,33,4],[44,2,44,4],[49,1,49,4],[38,2,38,4],[43,1,43,4],[34,2,34,4],[17,1,17,3],[37,1,37,4],[25,2,25,4],[27,1,27,4],[28,2,28,4],[30,1,30,4]]}
["IN ROSSO LE OPZIONI 20%"]
[]
[]
[]
[]
["Tecnologie Server1 Lotto4 Chassis"]
[]
[]
[]
[]
[null,null,null,"Totale Chassis",null,{"$f":"SUM(F17:F61)","v":3185},null,{"$f":"F11*SRV_c","v":0}]
["Components: \nHPE BladeSystem c3000 Enclosure",null,null,"Totale Ulteriori Opzioni ",null,null,null,{"$f":"SUM(G22:G82)*SRV_c","v":0}]
[]
[null,null,null,"TOTALE CONVENZIONE",null,null,null,{"$f":"H12+H11","v":0}]
[]
["BL3000c","Category: Blade Chassis"]
[null,"Quantity: ",null,null,null,3185]
[null,{"$f":"IF(SRV_c<=SRV_B+SRV_A,\"\",\"ATTENZIONE: IL NUMERO DEGLI CHASSIS DEVE ESSERE INFERIORE O UGUALE AL NUMERO DI BLADE\")","v":""}]
[]
[null,"Base"]
[null,"HPE BLc3000 Platinum Configure-to-order Enclosure",1,null,"696910-B21"]
[]
[null,"Alimentatore"]
[null,"HPE 1200W Common Slot Platinum Plus Hot Plug Power Supply Kit",6,null,"656364-B21"]
[]
[null,"Redundant Onboard Administrator"]
[null,"None",{"$f":"VLOOKUP($B$27, OAkit, 2, FALSE)","v":0},{"$f":"VLOOKUP($B$27, OAkit, 3, FALSE)","v":""},{"$f":"VLOOKUP($B$27, OAkit, 5, FALSE)","v":0},null,{"$f":"VLOOKUP(B27, OAkit, 12, FALSE)","v":""}]
[]
[null,"KVM Modules"]
[null,"None",{"$f":"VLOOKUP($B$30, KVMKit, 2, FALSE)","v":0},{"$f":"VLOOKUP($B$30, KVMKit, 3, FALSE)","v":""},{"$f":"VLOOKUP($B$30, KVMKit, 5, FALSE)","v":0},null,{"$f":"VLOOKUP(B30, KVMKit, 12, FALSE)","v":""}]
[]
[null,"Interconnect Bay 1"]
[null,"HPE 10GbE Ethernet Pass-Thru Module II for c-Class BladeSystem",{"$f":"VLOOKUP($B$33, IntBay1, 2, FALSE)","v":1},{"$f":"VLOOKUP($B$33, IntBay1, 3, FALSE)","v":""},{"$f":"VLOOKUP($B$33, IntBay1, 5, FALSE)","v":""},null,{"$f":"VLOOKUP(B33, IntBay1, 12, FALSE)","v":0}]
[]
[null,"Interconnect Bay 2"]
[null,"None",{"$f":"VLOOKUP($B$36, PassThru, 2, FALSE)","v":0},{"$f":"VLOOKUP($B$36, PassThru, 3, FALSE)","v":""},{"$f":"VLOOKUP($B$36, PassThru, 5, FALSE)","v":0},null,{"$f":"VLOOKUP(B36, PassThru, 12, FALSE)","v":""}]
[null,"Empty"]
[]
[null,"Interconnect Bay 3"]
[null,"Brocade 8/12c SAN Switch for BladeSystem c-Class",1,null,"684208-B21"]
[]
[null,"Upgrade Switch port License"]
[null,"Brocade 8/16Gb Embedded FC Switch 12-port Upgrade E-LTU","No",{"$f":"IF(C43=\"No\",\"\",\"S4-T5517AAE\")","v":""},{"$f":"IF(C43=\"No\",\"\",\"T5517AAE\")","v":""},null,{"$f":"IF(C43=\"No\",\"\",3328)","v":""}]
[]
[null,"Interconnect Bay 4"]
[null,"Brocade 8/12c SAN Switch for BladeSystem c-Class",1,null,"684208-B21"]
[]
[null,"Upgrade Switch port License"]
[null,"Brocade 8/16Gb Embedded FC Switch 12-port Upgrade E-LTU","No",{"$f":"IF(C49=\"No\",\"\",\"S4-T5517AAE\")","v":""},{"$f":"IF(C49=\"No\",\"\",\"T5517AAE\")","v":""},null,{"$f":"IF(C49=\"No\",\"\",3328)","v":""}]
[]
[null,"Additional Fiber Optic Modules"]
[null,"HPE BladeSystem c-Class 10Gb SFP+ SR Transceiver",{"$f":"IF(SRV_A*2+SRV_B*4>16,16,SRV_A*2+SRV_B*4)","v":0},null,"455883-B21"]
[null,"HPE BladeSystem c-Class Virtual Connect 1G SFP RJ-45 Transceiver",null,"S4-453154-B21","453154-B21",null,{"$f":"Processor!L38*Chassis!C53","v":0}]
[]
[null,"HPE BLc 10G SFP+ SR Transceiver",null,"S4-455883-B21","455883-B21",null,{"$f":"Processor!L39*Chassis!C55","v":0}]
[]
[null,"HPE 10GBase-T SFP+ Transceiver",null,"S4-813874-B21","813874-B21",null,{"$f":"Processor!L40*Chassis!C57","v":0}]
[]
[null,"Estensione di Garanzia"]
[null,"None",{"$f":"VLOOKUP($B$60,  SO_A1, 2, FALSE)","v":""},{"$f":"VLOOKUP($B$60,  SO_A1, 3, FALSE)","v":""},{"$f":"VLOOKUP($B$60,  SO_A1, 5, FALSE)","v":""},{"$f":"VLOOKUP($B$60,  SO_A1, 6, FALSE)","v":""}]

{"sheet":"Riepilogo","index":3,"n_rows":93,"n_cols":34,"rows_kept":93,"cut":false,"hidden":false,"merged":[[84,16,84,19],[47,2,47,5],[47,6,47,8],[47,9,47,16],[47,17,47,18],[47,19,47,20],[40,2,40,5],[40,6,40,8],[40,9,40,16],[40,17,40,18],[40,19,40,20],[41,2,41,5],[41,6,41,8],[41,9,41,16],[41,17,41,18],[41,19,41,20],[46,19,46,20],[44,2,44,5],[44,6,44,8],[44,9,44,16],[44,17,44,18],[44,19,44,20],[46,17,46,18],[68,9,68,12],[38,17,38,18],[38,19,38,20],[36,1,36,20],[12,1,12,20],[13,2,13,5],[13,6,13,8],[13,9,13,16],[34,17,34,18],[34,19,34,20],[13,19,13,20],[18,1,18,20],[14,2,14,5],[14,6,14,8],[14,9,14,16],[14,17,14,18],[23,2,23,5],[23,9,23,16],[23,17,23,18],[21,6,21,8],[25,19,25,20],[25,2,25,5],[25,6,25,8],[25,9,25,16],[25,17,25,18],[39,6,39,8],[39,9,39,16],[50,1,50,16],[51,17,51,20],[51,1,51,16],[50,17,50,20],[13,17,13,18],[23,19,23,20],[23,6,23,8],[22,19,22,20],[22,2,22,5],[22,6,22,8],[14,19,14,20],[15,17,15,18],[15,19,15,20],[39,17,39,18],[39,19,39,20],[29,2,29,5],[29,6,29,8],[30,2,30,5],[30,6,30,8],[38,2,38,5],[38,6,38,8],[38,9,38,16],[0,17,1,20],[0,1,0,5],[0,6,0,14],[1,1,1,5],[1,6,1,7],[1,8,5,16],[2,1,2,5],[2,6,2,7],[3,1,3,5],[3,6,3,7],[4,1,4,7],[5,1,5,5],[5,6,5,7],[19,6,19,8],[19,9,19,16],[19,17,19,18],[7,1,7,3],[7,4,7,8],[7,9,7,10],[7,11,7,14],[7,15,7,16],[7,17,7,20],[11,2,11,5],[11,6,11,8],[11,9,11,16],[11,17,11,18],[11,19,11,20],[9,1,9,3],[9,4,9,8],[9,9,9,10],[9,11,9,14],[9,15,9,16],[9,17,9,20],[69,9,69,12],[70,9,70,12],[39,2,39,5],[19,19,19,20],[20,2,20,5],[20,6,20,8],[20,9,20,16],[20,17,20,18],[20,19,20,20],[37,2,37,5],[37,6,37,8],[37,9,37,16],[37,17,37,18],[37,19,37,20],[30,9,30,16],[30,17,30,18],[30,19,30,20],[31,17,31,18],[31,2,31,5],[22,17,22,18],[22,9,22,16],[27,17,27,18],[19,2,19,5],[67,9,67,12],[67,16,67,19],[65,2,65,5],[21,2,21,5],[24,1,24,20],[52,1,52,16],[52,17,52,20],[74,9,74,12],[75,9,75,12],[56,3,57,18],[60,1,60,3],[60,8,60,10],[60,15,60,17],[62,2,62,5],[62,9,62,12],[62,16,62,19],[63,2,63,5],[63,9,63,12],[63,16,63,19],[64,2,64,5],[64,9,64,12],[64,16,64,19],[66,2,66,5],[65,9,65,12],[28,17,28,18],[78,16,78,19],[78,9,78,12],[73,9,73,12],[80,2,80,5],[82,2,82,3],[82,4,82,5],[82,6,82,7],[82,8,82,9],[82,10,82,11],[82,12,82,13],[78,2,78,5],[77,9,77,12],[76,9,76,12],[77,2,77,5],[76,2,76,5],[74,2,74,5],[75,2,75,5],[74,16,74,19],[75,16,75,19],[73,2,73,5],[80,9,80,12],[80,16,80,19],[79,2,79,5],[79,9,79,12],[88,2,88,7],[88,14,88,19],[82,14,82,15],[82,16,82,17],[82,18,82,19],[89,2,92,7],[89,14,92,19],[15,2,15,5],[15,6,15,8],[15,9,15,16],[26,2,26,5],[26,6,26,8],[26,9,26,16],[16,2,16,5],[16,6,16,8],[16,9,16,16],[16,17,16,18],[16,19,16,20],[17,2,17,5],[17,6,17,8],[17,9,17,16],[17,17,17,18],[17,19,17,20],[85,3,86,18],[28,19,28,20],[32,2,32,5],[27,2,27,5],[27,6,27,8],[27,9,27,16],[33,6,33,8],[33,9,33,16],[33,17,33,18],[29,9,29,16],[29,17,29,18],[21,9,21,16],[21,17,21,18],[21,19,21,20],[49,1,49,16],[49,17,49,20],[26,17,26,18],[26,19,26,20],[34,2,34,5],[34,6,34,8],[34,9,34,16],[29,19,29,20],[31,19,31,20],[27,19,27,20],[31,6,31,8],[31,9,31,16],[33,2,33,5],[32,6,32,8],[32,9,32,16],[32,17,32,18],[33,19,33,20],[32,19,32,20],[28,2,28,5],[28,6,28,8],[28,9,28,16],[77,16,77,19],[68,16,68,19],[69,16,69,19],[70,16,70,19],[71,16,71,19],[72,16,72,19],[73,16,73,19],[76,16,76,19],[35,2,35,5],[35,6,35,8],[35,9,35,16],[35,17,35,18],[35,19,35,20],[71,9,71,12],[72,9,72,12],[68,2,68,5],[69,2,69,5],[65,16,65,19],[70,2,70,5],[71,2,71,5],[72,2,72,5],[66,9,66,12],[66,16,66,19],[67,2,67,5],[79,16,79,19],[48,2,48,5],[48,6,48,8],[48,9,48,16],[48,17,48,18],[48,19,48,20],[42,2,42,5],[42,6,42,8],[42,9,42,16],[42,17,42,18],[42,19,42,20],[43,2,43,5],[43,6,43,8],[43,9,43,16],[43,17,43,18],[43,19,43,20],[45,2,45,5],[45,6,45,8],[45,9,45,16],[45,17,45,18],[45,19,45,20],[46,2,46,5],[46,6,46,8],[46,9,46,16]]}
[null,"Amministrazione ",null,null,null,null,null,null,null,null,null,null,null,null,null,null,null,"CONFIGURATORE ELETTRONICO CONVENZIONE CONSIP \nTECNOLOGIE SERVER 1 LOTTO 4",null,null,null,1]
[null,"N° Identificativo Ordine ",null,null,null,null,null,null,{"$f":"IF(G4=R53,\"Configurazione OK\",U4)","v":"Configurazione OK"},null,null,null,null,null,null,null,null,null,null,null,null,1]
[null,"Data Ordine",null,null,null,null,null,null,null,null,null,null,null,null,null,null,null,null,null,null,null,1]
[null,"Tot Ordine Portale CONSIP IVA incl.",null,null,null,null,{"$f":"R53","v":0},null,null,null,null,null,null,null,null,null,null,null,null,null,"Nel \"Tot Ordine Portale CONSIP\" deve essere inserito l'importo totale risultante dall'ordinativo del portale CONSIP.\nQualora l'importo inserito corrisponde al valore ricalcolato dal configuratore viene attivato il pulsante \"Salva in formato PDF\" che permette di generare il file pdf da allegare all'ordinativo.",1,"Il totale dei prodotti \"OPZIONALI ULTERIORI\" supera il 20 % consentito"]
[null,"LE CELLE IN GIALLO DEVO ESSERE COMPILATE OBBLIGATORIAMENTE",null,null,null,null,null,null,null,null,null,null,null,null,null,null,null,null,null,null,null,1]
[null,"Quantità Server Ordinati",null,null,null,null,{"$f":"IF(B20=\"\",0,B20)+IF(B14=\"\",0,B14)","v":0},null,null,null,null,null,null,null,null,null,null,null,null,"ver. 2.5",null,1,{"$f":"IF(I2=W4,1,0)","v":0}]
[null,null,null,null,null,null,null,null,null,null,null,null,null,null,null,null,null,null,null,null,null,1,{"$f":"IF(I2=\"Configurazione OK\",1,0)","v":1}]
[null,"Referente per la Consegna",null,null,null,null,null,null,null,"Telefono",null,null,null,null,null,"email",null,null,null,null,null,1,{"$f":"SUM(W6:W7)","v":1},{"$f":"IF(W8=1,\"OK\",\"NO\")","v":"OK"}]
[null,null,null,null,null,null,null,null,null,null,null,null,null,null,null,null,null,null,null,null,null,1]
[null,"Referente per l'installazione",null,null,null,null,null,null,null,"Telefono",null,null,null,null,null,"email",null,null,null,null,null,1]
[null,null,null,null,null,null,null,null,null,null,null,null,null,null,null,null,null,null,null,null,null,1]
[null,"Qtà Totale Ordinata","Oggetto di fornitura",null,null,null,"Codice Prodotto",null,null,"Descrizione Sintetica (si faccia riferimento alla guida alla convenzione per la descrizione estesa e per le regole di acquisto delle opzioni)",null,null,null,null,null,null,null,"Costo Unitario",null,"Costo Complessivo",null,1]
[null,"SERVER BLADE 2 PROCESSORI (HPE Proliant BL460c Gen9)",null,null,null,null,null,null,null,null,null,null,null,null,null,null,null,null,null,null,null,{"$f":"IF(B14>=\"\",0,1)","v":0},null,"Server1"]
[null,{"$f":"IF(AA14>=1,AA14,\"\")","v":""},{"$f":"IF(AA14>0,(VLOOKUP(G14,COD_A,2,FALSE)),\"\")","v":""},null,null,null,{"$f":"IF(AA14>=1,W14,\"\")","v":""},null,null,{"$f":"IF(AA14>0,(VLOOKUP(G14,COD_A,5,FALSE)),\"\")","v":""},null,null,null,null,null,null,null,{"$f":"IF(AA14>0,(VLOOKUP(G14,COD_A,3,FALSE)),\"\")","v":""},null,{"$f":"IF(B14=\"\",\"\",R14*B14)","v":""},null,{"$f":"IF(B14>=\"\",0,1)","v":0}," TS1L4-2P",{"$f":"SRV_A","v":0},null,null,{"$f":"SUM(X14:Z14)","v":0}]
[null,{"$f":"IF(AA15>=1,AA15,\"\")","v":""},{"$f":"IF(AA15>0,(VLOOKUP(G15,COD_A,2,FALSE)),\"\")","v":""},null,null,null,{"$f":"IF(AA15>=1,W15,\"\")","v":""},null,null,{"$f":"IF(AA15>0,(VLOOKUP(G15,COD_A,5,FALSE)),\"\")","v":""},null,null,null,null,null,null,null,{"$f":"IF(AA15>0,(VLOOKUP(G15,COD_A,3,FALSE)),\"\")","v":""},null,{"$f":"IF(B15=\"\",\"\",R15*B15)","v":""},null,{"$f":"IF(B15>=\"\",0,1)","v":0}," TS1L4-CPU-2P",{"$f":"'Lotto4 Blade 2P'!$C$23","v":0},null,{"$f":"X15*$X$14","v":0},{"$f":"SUM(Z15:Z15)","v":0}]
[null,{"$f":"IF(AA16>=1,AA16,\"\")","v":""},{"$f":"IF(AA16>0,(VLOOKUP(G16,COD_A,2,FALSE)),\"\")","v":""},null,null,null,{"$f":"IF(AA16>=1,W16,\"\")","v":""},null,null,{"$f":"IF(AA16>0,(VLOOKUP(G16,COD_A,5,FALSE)),\"\")","v":""},null,null,null,null,null,null,null,{"$f":"IF(AA16>0,(VLOOKUP(G16,COD_A,3,FALSE)),\"\")","v":""},null,{"$f":"IF(B16=\"\",\"\",R16*B16)","v":""},null,0," TS1L4-32GB",{"$f":"IF(MEM_A=\"\",0,MEM_A)","v":0},null,{"$f":"X16*$X$14","v":0},{"$f":"SUM(Z16:Z16)","v":0}]
[null,{"$f":"IF(AA17>=1,AA17,\"\")","v":""},{"$f":"IF(AA17>0,(VLOOKUP(G17,COD_A,2,FALSE)),\"\")","v":""},null,null,null,{"$f":"IF(AA17>=1,W17,\"\")","v":""},null,null,{"$f":"IF(AA17>0,(VLOOKUP(G17,COD_A,5,FALSE)),\"\")","v":""},null,null,null,null,null,null,null,{"$f":"IF(AA17>0,(VLOOKUP(G17,COD_A,3,FALSE)),\"\")","v":""},null,{"$f":"IF(B17=\"\",\"\",R17*B17)","v":""},null,0," TS1L4-64GB",{"$f":"IF('Lotto4 Blade 2P'!C33=\"\",0,'Lotto4 Blade 2P'!C33)","v":0},{"$f":"IF('Lotto4 Blade 2P'!F31>5880,MEM_A,0)","v":""},{"$f":"X17*$X$14","v":0},{"$f":"SUM(Z17:Z17)","v":0}]
[null,{"$f":"IF(AA18>=1,AA18,\"\")","v":""},{"$f":"IF(AA18>0,(VLOOKUP(G18,COD_A,2,FALSE)),\"\")","v":""},null,null,null,{"$f":"IF(AA18>=1,W18,\"\")","v":""},null,null,{"$f":"IF(AA18>0,(VLOOKUP(G18,COD_A,5,FALSE)),\"\")","v":""},null,null,null,null,null,null,null,{"$f":"IF(AA18>0,(VLOOKUP(G18,COD_A,3,FALSE)),\"\")","v":""},null,{"$f":"IF(B18=\"\",\"\",R18*B18)","v":""},null,0," TS1L4-HD1200",{"$f":"IF(HD1000_A=\"yes\",'Lotto4 Blade 2P'!$C$53/2,0)","v":0},null,{"$f":"X18*$X$14","v":0},{"$f":"SUM(Z18:Z18)","v":0}]
[null,"SERVER BLADE 4 PROCESSORI (HPE Proliant BL660c Gen9)",null,null,null,null,null,null,null,null,null,null,null,null,null,null,null,null,null,null,null,{"$f":"IF(B20>=\"\",0,1)","v":0},null,"Server1"]
[null,{"$f":"IF(AA20>=1,AA20,\"\")","v":""},{"$f":"IF(AA20>0,(VLOOKUP(G20,COD_A,2,FALSE)),\"\")","v":""},null,null,null,{"$f":"IF(AA20>=1,W20,\"\")","v":""},null,null,{"$f":"IF(AA20>0,(VLOOKUP(G20,COD_A,5,FALSE)),\"\")","v":""},null,null,null,null,null,null,null,{"$f":"IF(AA20>0,(VLOOKUP(G20,COD_A,3,FALSE)),\"\")","v":""},null,{"$f":"IF(B20=\"\",\"\",R20*B20)","v":""},null,0," TS1L4-4P",{"$f":"SRV_B","v":0},null,null,{"$f":"SUM(X20:Z20)","v":0}]
[null,{"$f":"IF(AA21>=1,AA21,\"\")","v":""},{"$f":"IF(AA21>0,(VLOOKUP(G21,COD_A,2,FALSE)),\"\")","v":""},null,null,null,{"$f":"IF(AA21>=1,W21,\"\")","v":""},null,null,{"$f":"IF(AA21>0,(VLOOKUP(G21,COD_A,5,FALSE)),\"\")","v":""},null,null,null,null,null,null,null,{"$f":"IF(AA21>0,(VLOOKUP(G21,COD_A,3,FALSE)),\"\")","v":""},null,{"$f":"IF(B21=\"\",\"\",R21*B21)","v":""},null,{"$f":"IF(B21>=\"\",0,1)","v":0}," TS1L4-CPU-4P",{"$f":"'Lotto4 Blade 4P'!C23/2","v":0},null,{"$f":"X21*$X$20","v":0},{"$f":"SUM(Z21:Z21)","v":0}]
[null,{"$f":"IF(AA22>=1,AA22,\"\")","v":""},{"$f":"IF(AA22>0,(VLOOKUP(G22,COD_A,2,FALSE)),\"\")","v":""},null,null,null,{"$f":"IF(AA22>=1,W22,\"\")","v":""},null,null,{"$f":"IF(AA22>0,(VLOOKUP(G22,COD_A,5,FALSE)),\"\")","v":""},null,null,null,null,null,null,null,{"$f":"IF(AA22>0,(VLOOKUP(G22,COD_A,3,FALSE)),\"\")","v":""},null,{"$f":"IF(B22=\"\",\"\",R22*B22)","v":""},null,0," TS1L4-32GB",{"$f":"IF(MEM_B=\"\",0,MEM_B)","v":0},null,{"$f":"X22*$X$20","v":0},{"$f":"SUM(Z22:Z22)","v":0},null,null,null,{"$f":"IF(AA22>0,(VLOOKUP(W22,COD_A,5,FALSE)),\"\")","v":""}]
[null,{"$f":"IF(AA23>=1,AA23,\"\")","v":""},{"$f":"IF(AA23>0,(VLOOKUP(G23,COD_A,2,FALSE)),\"\")","v":""},null,null,null,{"$f":"IF(AA23>=1,W23,\"\")","v":""},null,null,{"$f":"IF(AA23>0,(VLOOKUP(G23,COD_A,5,FALSE)),\"\")","v":""},null,null,null,null,null,null,null,{"$f":"IF(AA23>0,(VLOOKUP(G23,COD_A,3,FALSE)),\"\")","v":""},null,{"$f":"IF(B23=\"\",\"\",R23*B23)","v":""},null,0," TS1L4-64GB",{"$f":"IF('Lotto4 Blade 4P'!C33=\"\",0,'Lotto4 Blade 4P'!C33)","v":0},{"$f":"IF('Lotto4 Blade 4P'!G31=Riepilogo!W23,0,MEM_B)","v":""},{"$f":"X23*$X$20","v":0},{"$f":"SUM(Z23:Z23)","v":0}]
[null,{"$f":"IF(AA24>=1,AA24,\"\")","v":""},{"$f":"IF(AA24>0,(VLOOKUP(G24,COD_A,2,FALSE)),\"\")","v":""},null,null,null,{"$f":"IF(AA24>=1,W24,\"\")","v":""},null,null,{"$f":"IF(AA24>0,(VLOOKUP(G24,COD_A,5,FALSE)),\"\")","v":""},null,null,null,null,null,null,null,{"$f":"IF(AA24>0,(VLOOKUP(G24,COD_A,3,FALSE)),\"\")","v":""},null,{"$f":"IF(B24=\"\",\"\",R24*B24)","v":""},null,0," TS1L4-HD1200",{"$f":"IF(HD1000_B=\"yes\",'Lotto4 Blade 4P'!$C$53/2,0)","v":0},null,{"$f":"X24*$X$20","v":0},{"$f":"SUM(Z24:Z24)","v":0}]
[null,"OPZIONI COMUNI",null,null,null,null,null,null,null,null,null,null,null,null,null,null,null,null,null,null,null,{"$f":"IF(B25>=0,1,0)","v":1},null,"2P","4P"]
[null,{"$f":"IF(AA26>=1,AA26,\"\")","v":""},{"$f":"IF(AA26>0,(VLOOKUP(G26,COD_A,2,FALSE)),\"\")","v":""},null,null,null,{"$f":"IF(AA26>=1,W26,\"\")","v":""},null,null,{"$f":"IF(AA26>0,(VLOOKUP(G26,COD_A,5,FALSE)),\"\")","v":""},null,null,null,null,null,null,null,{"$f":"IF(AA26>0,(VLOOKUP(G26,COD_A,3,FALSE)),\"\")","v":""},null,{"$f":"IF(B26=\"\",\"\",R26*B26)","v":""},null,0," TS1L4-CHASSIS",{"$f":"Chassis!$C$17","v":0},null,null,{"$f":"X26","v":0},{"$f":"X26","v":0},{"$f":"Z26*$X$20","v":0},null,null,null,null,{"$f":"SUM(AB26:AD26)","v":0}]
[null,{"$f":"IF(AH27=0,\"\",AH27)","v":""},"",null,null,null,"",null,null,{"$f":"IF(AH27>0,(VLOOKUP(G27,COD_A,5,FALSE)),\"\")","v":""},null,null,null,null,null,null,null,{"$f":"IF(AH27>0,(VLOOKUP(G27,COD_A,3,FALSE)),\"\")","v":""},null,"",null,0," TS1L4-WIN1",{"$f":"IF('Lotto4 Blade 2P'!$F$36=543,1,0)","v":0},{"$f":"IF('Lotto4 Blade 4P'!$F$36=543,1,0)","v":0},null,{"$f":"SUM(X27:Z27)","v":0},{"$f":"X27*$X$14","v":0},{"$f":"Y27*$X$20","v":0},null,null,null,null,0]
[null,"","",null,null,null,"",null,null,"",null,null,null,null,null,null,null,"",null,"",null,0," TS1L4-WIN2",{"$f":"IF('Lotto4 Blade 2P'!$F$37=543,1,0)","v":0},{"$f":"IF('Lotto4 Blade 4P'!$F$37=1086,2,0)","v":0},null,{"$f":"SUM(X28:Z28)","v":0},0,0,null,null,null,null,0]
[null,"","",null,null,null,"",null,null,"",null,null,null,null,null,null,null,"",null,"",null,0," TS1L4-WIN2CORE",{"$f":"IF('Lotto4 Blade 2P'!$F$37=108,2,0)","v":0},{"$f":"IF('Lotto4 Blade 4P'!$F$37=216,4,0)","v":0},null,0,0,0,null,null,null,null,0]
[null,"","",null,null,null,"",null,null,"",null,null,null,null,null,null,null,"",null,"",null,0," TS1L4-WINDC1",{"$f":"IF('Lotto4 Blade 2P'!$F$36=2174,1,0)","v":0},{"$f":"IF('Lotto4 Blade 4P'!$F$36=2174,1,0)","v":0},null,0,0,0,null,null,null,null,0]
[null,"","",null,null,null,"",null,null,"",null,null,null,null,null,null,null,"",null,"",null,0," TS1L4-WINDC2",{"$f":"IF('Lotto4 Blade 2P'!$F$37=2174,2,0)","v":0},{"$f":"IF('Lotto4 Blade 4P'!$F$37=2174,1,(IF('Lotto4 Blade 4P'!$F$37=4348,2,0)))","v":0},null,0,0,0,null,null,null,null,0]
[null,"","",null,null,null,"",null,null,"",null,null,null,null,null,null,null,"",null,"",null,0," TS1L4-CALUSER",{"$f":"'Lotto4 Blade 2P'!C41","v":0},{"$f":"'Lotto4 Blade 4P'!C41","v":0},null,0,0,0,null,null,null,null,0]
[null,{"$f":"IF(AH33=0,\"\",AH33)","v":""},"",null,null,null,"",null,null,"",null,null,null,null,null,null,null,"",null,"",null,0," TS1L4-CALDEV",{"$f":"'Lotto4 Blade 2P'!C43","v":0},{"$f":"'Lotto4 Blade 4P'!C43","v":0},null,0,0,0,null,null,null,null,0]
[null,"","",null,null,null,"",null,null,"",null,null,null,null,null,null,null,"",null,"",null,0," TS1L4-LINUX",{"$f":"IF('Lotto4 Blade 2P'!$F$36=47,1,0)","v":0},{"$f":"IF('Lotto4 Blade 4P'!$F$36=47,1,0)","v":0},null,0,0,0,null,null,null,null,0]
[null,"","",null,null,null,"",null,null,"",null,null,null,null,null,null,null,"",null,"",null,0," TS1L4-4ANNI",{"$f":"IF('Lotto4 Blade 2P'!$F$66=327,1,0)","v":0},{"$f":"IF('Lotto4 Blade 4P'!$F$72=327,1,0)","v":0},{"$f":"IF(Chassis!F60=327,1,0)","v":0},0,{"$f":"X35*$X$14","v":0},{"$f":"Y35*$X$20","v":0},{"$f":"Z35*X26","v":0},null,null,null,{"$f":"SUM(AB35:AD35)","v":0}]
[null,"","",null,null,null,"",null,null,"",null,null,null,null,null,null,null,"",null,"",null,0," TS1L4-5ANNI",{"$f":"IF('Lotto4 Blade 2P'!$F$66=610,1,0)","v":0},{"$f":"IF('Lotto4 Blade 4P'!$F$72=610,1,0)","v":0},{"$f":"IF(Chassis!F60=610,1,0)","v":0},0,{"$f":"X36*$X$14","v":0},{"$f":"Y36*$X$20","v":0},{"$f":"Z36*X26","v":0},null,null,null,{"$f":"SUM(AB36:AD36)","v":0}]
[null,"ULTERIORI OPZIONI",null,null,null,null,null,null,null,null,null,null,null,null,null,null,null,null,null,null,null,{"$f":"IF(SUM(V38:V48)>=1,1,0)","v":0}]
[null,"",{"$f":"IF(AA38>0,(VLOOKUP(G38,COD_A,2,FALSE)),\"\")","v":""},null,null,null,{"$f":"IF(AA38>=1,W38,\"\")","v":""},null,null,{"$f":"IF(AH38>0,(VLOOKUP(G38,COD_A,5,FALSE)),\"\")","v":""},null,null,null,null,null,null,null,{"$f":"IF(AH38>0,(VLOOKUP(G38,COD_A,3,FALSE)),\"\")","v":""},null,{"$f":"IF(B38=\"\",\"\",R38*B38)","v":""},null,{"$f":"IF(B38>=\"\",0,1)","v":0},"S4-871168-A21",{"$f":"IF('Lotto4 Blade 2P'!$G$38=1060,2,0)","v":0},{"$f":"IF('Lotto4 Blade 4P'!$G$38=610,1,0)","v":0},null,{"$f":"SUM(X38:Z38)","v":0},{"$f":"X38*$X$14","v":0},{"$f":"Y38*$X$20","v":0},null,null,null,null,{"$f":"SUM(AB38:AD38)","v":0}]
[null,{"$f":"IF(AH39=0,\"\",AH39)","v":""},"",null,null,null,{"$f":"IF(AA39>=1,W39,\"\")","v":""},null,null,"",null,null,null,null,null,null,null,"",null,"",null,0,"S4-488100-B21",null,null,{"$f":"Chassis!C27","v":0},0,0,{"$f":"Y39*$X$14","v":0},{"$f":"Z39*$X$26","v":0},null,null,null,0]
[null,"","",null,null,null,{"$f":"IF(AA40>=1,W40,\"\")","v":""},null,null,"",null,null,null,null,null,null,null,"",null,"",null,0,"S4-437575-B21",null,null,{"$f":"Chassis!C30","v":0},0,0,0,0,null,null,null,0]
[null,"","",null,null,null,{"$f":"IF(AA41>=1,W41,\"\")","v":""},null,null,"",null,null,null,null,null,null,null,"",null,"",null,0,"S4-854194-B21",{"$f":"Chassis!D33","v":""},null,{"$f":"COUNTIF($X$41:$X$43,W41)","v":0},0,null,null,0,null,null,null,0]
[null,"","",null,null,null,{"$f":"IF(AA42>=1,W42,\"\")","v":""},null,null,{"$f":"IF(AH42>0,(VLOOKUP(G42,COD_A,5,FALSE)),\"\")","v":""},null,null,null,null,null,null,null,{"$f":"IF(AH42>0,(VLOOKUP(G42,COD_A,3,FALSE)),\"\")","v":""},null,"",null,0,"S4-641146",{"$f":"Chassis!D36","v":""},null,{"$f":"COUNTIF($X$41:$X$43,W42)","v":0},0,null,null,0,null,null,null,0]
[null,{"$f":"IF(AH43=0,\"\",AH43)","v":""},"",null,null,null,"",null,null,"",null,null,null,null,null,null,null,"",null,"",null,0,"S4-638526-B21",null,null,0,{"$f":"SUM(X43:Z43)","v":0},0,0,0,null,null,null,0]
[null,{"$f":"IF(AH44=0,\"\",AH44)","v":""},"",null,null,null,"",null,null,"",null,null,null,null,null,null,null,"",null,"",null,0,"S4-813874-B21",null,null,{"$f":"Chassis!C57","v":0},{"$f":"SUM(Y44:Z44)","v":0},{"$f":"X44*$X$26","v":0},0,0,null,null,null,0]
[null,{"$f":"IF(AH45=0,\"\",AH45)","v":""},"",null,null,null,"",null,null,"",null,null,null,null,null,null,null,"",null,"",null,0,"S4-455883-B21",null,null,{"$f":"Chassis!C55","v":0},{"$f":"SUM(Y45:Z45)","v":0},{"$f":"X45*$X$26","v":0},0,0,null,null,null,0]
[null,{"$f":"IF(AH46=0,\"\",AH46)","v":""},"",null,null,null,"",null,null,"",null,null,null,null,null,null,null,"",null,"",null,0,"S4-T5517AAE",null,{"$f":"IF(Chassis!$D$49=W46,1,0)","v":0},{"$f":"IF(Chassis!$D$43=W46,1,0)","v":0},{"$f":"SUM(Y46:Z46)","v":0},{"$f":"X46*$X$26","v":0},{"$f":"Y46*$X$26","v":0},0,null,null,null,0]
[null,{"$f":"IF(AH47=0,\"\",AH47)","v":""},"",null,null,null,"",null,null,"",null,null,null,null,null,null,null,"",null,"",null,0,"S4-453154-B21",null,null,{"$f":"Chassis!C53","v":0},{"$f":"SUM(Y47:Z47)","v":0},{"$f":"X47*$X$26","v":0},{"$f":"Y47*$X$14","v":0},0,null,null,null,0]
[null,"","",null,null,null,{"$f":"IF(AA48>=1,W48,\"\")","v":""},null,null,"",null,null,null,null,null,null,null,"",null,"",null,0,"S4-665246-B21",{"$f":"IF('Lotto4 Blade 2P'!$D$59=W48,1,0)","v":0},{"$f":"IF('Lotto4 Blade 4P'!$D$62=W48,1,0)+(IF('Lotto4 Blade 4P'!$D$66=W48,1,0))","v":0},null,0,{"$f":"X48*$X$14","v":0},{"$f":"Y48*$X$20","v":0},null,null,null,null,0]
[null,"","",null,null,null,{"$f":"IF(AA49>=1,W49,\"\")","v":""},null,null,"",null,null,null,null,null,null,null,"",null,"",null,0,"S4-700748-B21",{"$f":"IF('Lotto4 Blade 2P'!$D$59=W49,1,0)","v":0},{"$f":"IF('Lotto4 Blade 4P'!$D$62=W49,1,0)+(IF('Lotto4 Blade 4P'!$D$66=W49,1,0))","v":0},null,0,{"$f":"X49*$X$14","v":0},{"$f":"Y49*$X$20","v":0},null,null,null,null,0]
[null,"TOTALE ULTERIORI OPZIONI (I.V.A. Esclusa)",null,null,null,null,null,null,null,null,null,null,null,null,null,null,null,{"$f":"SUM(T38:U49)","v":0},null,null,null,{"$f":"IF(R50>0,1,0)","v":0}]
[null,"TOTALE COSTO (I.V.A. Esclusa)",null,null,null,null,null,null,null,null,null,null,null,null,null,null,null,{"$f":"SUM(T14:U36)","v":0},null,null,null,1]
[null,"I.V.A.",null,null,null,null,null,null,null,null,null,null,null,null,null,null,null,{"$f":"(R51+R50)*22%","v":0},null,null,null,1]
[null,"TOTALE ORDINE",null,null,null,null,null,null,null,null,null,null,null,null,null,null,null,{"$f":"SUM(R50:U52)","v":0},null,null,null,1]
[null,null,null,null,null,null,null,null,null,null,null,null,null,null,null,null,null,null,null,null,null,1]
[null,null,null,null,null,null,null,null,null,null,null,null,null,null,null,null,null,null,null,null,null,1]
[null,null,null,null,null,null,null,null,null,null,null,null,null,null,null,null,null,null,null,null,null,1]
[null,null,null,{"$f":"IF(G6>0,\"DETTAGLIO CONFIGURAZIONI SERVER LOTTO 4 \",\"\")","v":""},null,null,null,null,null,null,null,null,null,null,null,null,null,null,null,null,null,1]
[null,null,null,null,null,null,null,null,null,null,null,null,null,null,null,null,null,null,null,null,null,1]
[null,null,null,null,null,null,null,null,null,null,null,null,null,null,null,null,null,null,null,null,null,1]
[null,null,null,null,null,null,null,null,null,null,null,null,null,null,null,null,null,null,null,null,null,{"$f":"IF($B$14>=\"\",0,1)","v":0},null,"Gbic vuoti Chassies","gbic 4P","gbic 2P"]
[null,"Proliant BL460c Gen9",null,null,{"$f":"SRV_A","v":0},"Server",null,null,"Proliant BL660c Gen9",null,null,{"$f":"SRV_B","v":0},"Server",null,null,"Chassis",null,null,{"$f":"SRV_c","v":0},null,null,{"$f":"IF($B$14>=\"\",0,1)","v":0},null,{"$f":"S61*16","v":0},{"$f":"L61*4","v":0},{"$f":"E61*2","v":0},{"$f":"SUM(Y61:Z61)","v":0},{"$f":"IF(X61>AA61,AA61,X61)","v":0}]
[null,null,null,null,null,null,null,null,null,null,null,null,null,null,null,null,null,null,null,null,null,{"$f":"IF($B$14>=\"\",0,1)","v":0}]
[null,{"$f":"IF(SRV_A>0,\"1\",\"-\")","v":"-"},{"$f":"IF(B63=\"-\",\"-\",CONCATENATE(MID($C$14,1,21),\" - \",$G$14))","v":"-"},null,null,null,null,null,{"$f":"IF(SRV_B>0,\"1\",\"-\")","v":"-"},{"$f":"IF(I63=\"-\",\"-\",CONCATENATE(MID($C$20,1,21),\" - \",$G$20))","v":"-"},null,null,null,null,null,{"$f":"IF(SRV_c>0,\"1\",\"-\")","v":"-"},{"$f":"IF(P63=\"-\",\"-\",CONCATENATE(MID($C$26,1,21),\" - \",$G$26))","v":"-"},null,null,null,null,{"$f":"IF($B$14>=\"\",0,1)","v":0}]
[null,{"$f":"IF(X15=0,\"-\",X15)","v":"-"},{"$f":"IF(B64=\"-\",\"-\",CONCATENATE(MID($C$15,1,21),\" - \",$G$15))","v":"-"},null,null,null,null,null,{"$f":"IF(X21=0,\"-\",X21)","v":"-"},{"$f":"IF(I64=\"-\",\"-\",CONCATENATE(MID($C21,1,21),\" - \",$G21))","v":"-"},null,null,null,null,null,{"$f":"AB61","v":0},null,null,null,null,null,{"$f":"IF(Y64+X64+W64>0,1,0)","v":0},{"$f":"IF(B64=\"-\",0,1)","v":0},{"$f":"IF(I64=\"-\",0,1)","v":0},{"$f":"IF(P64=0,0,1)","v":0}]
[null,{"$f":"IF(X16=0,\"-\",X16)","v":"-"},{"$f":"IF(B65=\"-\",\"-\",CONCATENATE(MID($C$16,1,21),\" - \",$G$16))","v":"-"},null,null,null,null,null,{"$f":"IF(X22=0,\"-\",X22)","v":"-"},{"$f":"IF(I65=\"-\",\"-\",CONCATENATE(MID($C22,1,21),\" - \",$G22))","v":"-"},null,null,null,null,null,{"$f":"IF(Z41=0,\"-\",Z41)","v":"-"},{"$f":"IF(P65=\"-\",\"-\",CONCATENATE(MID($C41,1,21),\" - \",$G41))","v":"-"},null,null,null,null,{"$f":"IF(Y65+X65+W65>0,1,0)","v":1},{"$f":"IF(B65=\"-\",0,1)","v":0},{"$f":"IF(I65=\"-\",0,1)","v":0},{"$f":"IF(P65=0,0,1)","v":1}]
[null,{"$f":"IF(X17=0,\"-\",X17)","v":"-"},{"$f":"IF(B66=\"-\",\"-\",CONCATENATE(MID($C17,1,21),\" - \",$G17))","v":"-"},null,null,null,null,null,{"$f":"IF(X23=0,\"-\",X23)","v":"-"},{"$f":"IF(I66=\"-\",\"-\",CONCATENATE(MID($C23,1,21),\" - \",$G23))","v":"-"},null,null,null,null,null,"-","-",null,null,null,null,0,0,0,{"$f":"IF(P66=\"-\",0,1)","v":0}]
[null,{"$f":"IF(X18=0,\"-\",X18)","v":"-"},{"$f":"IF(B67=\"-\",\"-\",CONCATENATE(MID($C18,1,21),\" - \",$G18))","v":"-"},null,null,null,null,null,{"$f":"IF(X24=0,\"-\",X24)","v":"-"},{"$f":"IF(I67=\"-\",\"-\",CONCATENATE(MID($C24,1,21),\" - \",$G24))","v":"-"},null,null,null,null,null,"-","-",null,null,null,null,0,0,0,{"$f":"IF(P67=\"-\",0,1)","v":0}]
[null,{"$f":"IF(X27=0,\"-\",X27)","v":"-"},{"$f":"IF(B68=\"-\",\"-\",CONCATENATE(MID($C27,1,21),\" - \",$G27))","v":"-"},null,null,null,null,null,{"$f":"IF(Y27=0,\"-\",Y27)","v":"-"},{"$f":"IF(I68=\"-\",\"-\",CONCATENATE(MID($C27,1,21),\" - \",$G27))","v":"-"},null,null,null,null,null,"-","-",null,null,null,null,0,0,0,0]
[null,"-","-",null,null,null,null,null,"-","-",null,null,null,null,null,"-","-",null,null,null,null,0,0,0,0]
[null,"-","-",null,null,null,null,null,"-","-",null,null,null,null,null,"-","-",null,null,null,null,0,0,0,0]
[null,"-","-",null,null,null,null,null,"-","-",null,null,null,null,null,"-","-",null,null,null,null,0,0,0,0]
[null,"-","-",null,null,null,null,null,"-","-",null,null,null,null,null,"-","-",null,null,null,null,0,0,0,0]
[null,"-","-",null,null,null,null,null,"-","-",null,null,null,null,null,"-","-",null,null,null,null,0,0,0,0]
[null,"-","-",null,null,null,null,null,"-","-",null,null,null,null,null,"-","-",null,null,null,null,0,0,0,0]
[null,"-","-",null,null,null,null,null,"-","-",null,null,null,null,null,"-","-",null,null,null,null,0,0,0,0]
[null,"-","-",null,null,null,null,null,"-","-",null,null,null,null,null,{"$f":"IF(Z35=0,\"-\",Z35)","v":"-"},{"$f":"IF(P76=\"-\",\"-\",CONCATENATE(MID($C35,1,21),\" - \",$G35))","v":"-"},null,null,null,null,0,0,0,0]
[null,"-","-",null,null,null,null,null,"-","-",null,null,null,null,null,{"$f":"IF(Z36=0,\"-\",Z36)","v":"-"},{"$f":"IF(P77=\"-\",\"-\",CONCATENATE(MID($C36,1,21),\" - \",$G36))","v":"-"},null,null,null,null,0,0,0,0]
[null,"-","-",null,null,null,null,null,"-","-",null,null,null,null,null,null,null,null,null,null,null,1,0,0,1]
[null,"-","-",null,null,null,null,null,{"$f":"IF(Y38=0,\"-\",Y38)","v":"-"},{"$f":"IF(I79=\"-\",\"-\",CONCATENATE(MID($C38,1,21),\" - \",$G38))","v":"-"},null,null,null,null,null,{"$f":"IF(Z39=0,\"-\",Z39)","v":"-"},{"$f":"IF(P79=\"-\",\"-\",CONCATENATE(MID($C39,1,21),\" - \",$G39))","v":"-"},null,null,null,null,0,0,{"$f":"IF(I79=\"-\",0,1)","v":0},0]
[null,{"$f":"IF(X49=0,\"-\",X49)","v":"-"},{"$f":"IF(B80=\"-\",\"-\",CONCATENATE(MID($C49,1,21),\" - \",$G49))","v":"-"},null,null,null,null,null,{"$f":"IF(Y49=0,\"-\",Y49)","v":"-"},{"$f":"IF(I80=\"-\",\"-\",CONCATENATE(MID($C49,1,21),\" - \",$G49))","v":"-"},null,null,null,null,null,null,null,null,null,null,null,{"$f":"IF(Y80+X80+W80>0,1,0)","v":1},{"$f":"IF(B80=\"-\",0,1)","v":0},{"$f":"IF(I80=\"-\",0,1)","v":0},1]
[null,{"$f":"IF(X48=0,\"-\",X48)","v":"-"},{"$f":"IF(B81=\"-\",\"-\",CONCATENATE(MID($C48,1,21),\" - \",$G48))","v":"-"},null,null,null,null,null,{"$f":"IF(Y48=0,\"-\",Y48)","v":"-"},{"$f":"IF(I81=\"-\",\"-\",CONCATENATE(MID($C48,1,21),\" - \",$G48))","v":"-"},null,null,null,null,null,{"$f":"IF(Z40=0,\"-\",Z40)","v":"-"},{"$f":"IF(P81=\"-\",\"-\",CONCATENATE(MID($C40,1,21),\" - \",$G40))","v":"-"},null,null,null,null,0,0,0,0]
[null,null,null,null,null,null,null,null,null,null,null,null,null,null,null,null,null,null,null,null,null,{"$f":"IF($B$14>=\"\",0,1)","v":0}]
[null,null,null,null,null,null,null,null,null,null,null,null,null,null,null,null,null,null,null,null,null,1]
[null,null,null,null,null,null,null,null,null,null,null,null,null,null,null,null,null,null,null,null,null,1]
[null,null,null,{"$f":"MID(C83,13,5)","v":""},null,{"$f":"MID(E83,13,5)","v":""},null,"",null,"",null,"",null,"",null,null,null,null,null,null,null,1]
[null,null,null,"AREA RISERVATA AL FORNITORE",null,null,null,null,null,null,null,null,null,null,null,null,null,null,null,null,null,1]
[null,null,null,null,null,null,null,null,null,null,null,null,null,null,null,null,null,null,null,null,null,1]
[null,null,null,null,null,null,null,null,null,null,null,null,null,null,null,null,null,null,null,null,null,1]
[null,null,"VERIFICA STAGING",null,null,null,null,null,null,null,null,null,null,null,"VERIFICA INSTALLATORE",null,null,null,null,null,null,1]
[null,null,null,null,null,null,null,null,null,null,null,null,null,null,null,null,null,null,null,null,null,1]
[null,null,null,null,null,null,null,null,null,null,null,null,null,null,null,null,null,null,null,null,null,1]
[null,null,null,null,null,null,null,null,null,null,null,null,null,null,null,null,null,null,null,null,null,1]
[null,null,null,null,null,null,null,null,null,null,null,null,null,null,null,null,null,null,null,null,null,1]

{"sheet":"Codici","index":4,"n_rows":42,"n_cols":5,"rows_kept":42,"cut":false,"hidden":true,"merged":[]}
["Codici","LOTTO 4"]
[" TS1L4-2P","Server Blade Base 2p",2068,1,"Blade HPE ProLiant BL460c Gen9 (1 x CPU Intel® Xeon® E5-2640 v4, 32GB RDIMM, 2xHDD 300GB 10K RPM SAS 12Gbps 2.5in)"]
[" TS1L4-CPU-2P","Opz1P",978,1,"Processore Singolo Intel Xeon E5-2640 v4 2.4GHz, 25M Cache, 8 GT/s QPI, Turbo, HT, 10C/20T"]
[" TS1L4-32GB","OpzRam32",348,1,"Kit di espansione di memoria RAM da 32GB"]
[" TS1L4-64GB","OpzRam64",736,1,"Kit di espansione di memoria RAM da 64GB"]
[" TS1L4-HD1200","OpzStorage Double 1 TB",398,1,"Aggiornamento dei 2 dischi \"base\" con  2 HDD 1.2TB SAS 10k"]
[" TS1L4-WIN1","OpzWinServ1",543,1,"Kit Windows Server 2016, Standard Edition, 2CPU/16 core ROK, COA + Media"]
[" TS1L4-WIN2","OpzWinServ2",543,1,"Kit Windows Server 2016, Standard Edition, 2CPU/16 core ROK, COA + Media"]
[" TS1L4-WIN2CORE","OpzWinServ2core",54,1,"Windows Server 2016, Standard Edition Licenza Aggiuntiva 2 Core"]
[" TS1L4-WINDC1","OpzWinServDC1",2174,1,"Kit Windows Server 2016, Datacenter, 2CPU/16 core ROK, COA + Media"]
[" TS1L4-WINDC2","OpzWinServDC2",2174,1,"Kit Windows Server 2016, Datacenter, Licenza aggiuntiva 2CPU/16 core ROK, COA + Media"]
[" TS1L4-CALUSER","OpzUserCal",22,1,"1-pack of Windows Server 2016 R2 User CALs"]
[" TS1L4-CALDEV","OpzDeviceCal",22,1,"1-pack of Windows Server 2016 R2 Device CALs"]
[" TS1L4-LINUX","OpzOpenSource",47,1,"DVD Linux Centos 7.x"]
[" TS1L4-16GB","OpzRam16",174,1,"Kit di espansione di memoria RAM da 16GB"]
[" TS1L4-32GB","OpzRam32",348,1,"Kit di espansione di memoria RAM da 32GB"]
[" TS1L4-64GB","OpzRam64",736,1,"Kit di espansione di memoria RAM da 64GB"]
["S4-871168-A21","OpzWinServDC2core",530,1,"Microsoft Windows Server 2016 Datacenter Edition Additional License 2 Core"]
["S4-437575-B21","OpzKVMChassis",195,1,"HP BLc3000 KVM Option"]
["S4-488100-B21","OpzOAChassis",442,1,"HP BLc3000 Dual DDR2 Onboard Admin Kit"]
["S4-665246-B21","Opz10Gb",596,1,"HPE Ethernet 10Gb 2-port 560M Adapter"]
["S4-700748-B21","OpzFF10Gb",532,1,"HPE FlexFabric 10Gb 2-port 534M Adapter"]
["S4-638526-B21","OpzVirtualConnect",9800,1,"HPE Virtual Connect Flex-10/10D Module for c-Class BladeSystem"]
["S4-658250-B21","OpzBladeSwitch",4016,1,"HPE 6125G/XG Ethernet Blade Switch"]
["S4-854194-B21","OpzPassThru10Gb",4357,1,"HPE 10GbE Ethernet Pass-Thru Module II for c-Class BladeSystem"]
["S4-641146","OpzB22HP",5900,1,"HP Cisco B22HP Fabric Extender for BladeSystem c-Class"]
["S4-453154-B21","OpzTransceiver 1Gbase-T",180,1,"HPE BladeSystem c-Class Virtual Connect 1G SFP RJ-45 Transceiver"]
["S4-455883-B21","OpzTransceiver 10G SFP+",230,1,"HPE BLc 10G SFP+ SR Transceiver"]
["S4-813874-B21","OpzTransceiver 10Gbase-T",600,1,"HPE 10GBase-T SFP+ Transceiver"]
["S4-T5517AAE","OpzUpgradeSwitch",3328,1,"Brocade 8/16Gb Embedded FC Switch 12-port Upgrade E-LTU"]
[" TS1L4-CPU-4P","Opz2P",3804,1,"Coppia di Processori Intel Xeon E5-4640 v4 2.1GHz, 30M Cache, 8 GT/s QPI, Turbo, HT, 12C/24T"]
[" TS1L4-HD1200","OpzStorage Double 1 TB",398,1,"Aggiornamento dei 2 dischi \"base\" con  2 HDD 1.2TB SAS 10k"]
[" TS1L4-4P","Server Blade Base 4p",4556,1,"Blade HPE ProLiant BL660c Gen9 (2 x CPU Intel® Xeon® E5-4640 v4, 64GB RDIMM, 2xHDD 300GB 10K RPM SAS 12Gbps 2.5in)"]
[" TS1L4-CHASSIS","OpzChassis",3185,1,"Chassis server Blade, 2 x Switch Brocade 8/12 SAN, 1 x 10GbE Pass Thru, 6 x Power Supply Hot Plug"]
[" TS1L4-4ANNI","OpzEstensione12",327,1,"Estensione della manutenzione in garanzia per ulteriori 12 mesi"]
[" TS1L4-5ANNI","OpzEstensione24",610,1,"Estensione della manutenzione in garanzia per ulteriori 24 mesi"]
[]
[" TS1L4-4P","Server Blade Base 4p",4556,1,"Blade HPE ProLiant BL660c Gen9 (2 x CPU Intel® Xeon® E5-4640 v4, 64GB RDIMM, 2xHDD 300GB 10K RPM SAS 12Gbps 2.5in)"]
[" TS1L4-CPU-4P","Opz2P",3804,1,"Coppia di Processori Intel Xeon E5-4640 v4 2.1GHz, 30M Cache, 8 GT/s QPI, Turbo, HT, 12C/24T"]
[" TS1L4-32GB","OpzRam32",348,1,"Kit di espansione di memoria RAM da 32GB"]
[" TS1L4-64GB","OpzRam64",736,1,"Kit di espansione di memoria RAM da 64GB"]
[" TS1L4-HD1200","OpzStorage Double 1 TB",398,1,"Aggiornamento dei 2 dischi \"base\" con  2 HDD 1.2TB SAS 10k"]

{"sheet":"Processor","index":5,"n_rows":44,"n_cols":12,"rows_kept":44,"cut":false,"hidden":true,"merged":[]}
["Additional Processor"]
["Server BL460c Gen9",null,"CPU-A"]
["Nessun Processore Aggiuntivo",0,{"$f":"\"\"","v":""},null,{"$f":"\"\"","v":""},{"$f":"\"\"","v":""},{"$f":"\"\"","v":""},{"$f":"\"\"","v":""}]
["HPE BL460c Gen9 E5-2640v4 Kit",1,"TS1L4-CPU-2P","819839-B21\n","819839-B21\n",null,null,null,null,null,null,978]
[]
["Server BL660c Gen9",null,"CPU-B"]
["Nessun Processore Aggiuntivo",0,{"$f":"\"\"","v":""},null,null,{"$f":"\"\"","v":""},{"$f":"\"\"","v":""},{"$f":"\"\"","v":""},null,null,null,{"$f":"\"\"","v":""}]
["HPE BL660c Gen9 E5-4640v4 2P Kit",2,"TS1L4-CPU-4P","844373-B21","844373-B21",null,null,null,null,null,null,3804]
[]
["Server T630",null,"CPU-C"]
["Nessun Processore Aggiuntivo",0,{"$f":"\"\"","v":""},null,"[374-BBBX]",{"$f":"\"\"","v":""},{"$f":"\"\"","v":""},{"$f":"\"\"","v":""},null,null,null,{"$f":"\"\"","v":""}]
["Intel Xeon E5-2650 v3 2.3GHz,25M Cache,9.60GT/s QPI,Turbo,HT,10C/20T (105W) Max Mem 2133MHz,Customer Kit",1,"10L1-CPU-T","S10L1-T630-CPU","[338-BFCF]","Kit - 105W Heatsink for T630",1,"[412-AADU]",null,null,null,800]
[]
["OA Kit"]
["None",0,{"$f":"\"\"","v":""},null,null,{"$f":"\"\"","v":""},{"$f":"\"\"","v":""},{"$f":"\"\"","v":""},null,null,null,{"$f":"\"\"","v":""}]
["HP BLc3000 Dual DDR2 Onboard Admin Kit",1,"S4-488100-B21","TS1L4-488100-B21","488100-B21",null,null,null,null,null,null,442]
[]
["KVM Kit"]
["None",0,{"$f":"\"\"","v":""},null,null,{"$f":"\"\"","v":""},{"$f":"\"\"","v":""},{"$f":"\"\"","v":""},null,null,null,{"$f":"\"\"","v":""}]
["HP BLc3000 KVM Option",1,"S4-437575-B21","S4-437575-B21","437575-B21",null,null,null,null,null,null,195]
[]
[]
["Interconnect Bay 1"]
["HPE 10GbE Ethernet Pass-Thru Module II for c-Class BladeSystem",1,{"$f":"\"\"","v":""},{"$f":"\"\"","v":""},{"$f":"\"\"","v":""},{"$f":"\"\"","v":""},{"$f":"\"\"","v":""},{"$f":"\"\"","v":""},{"$f":"\"\"","v":""},{"$f":"\"\"","v":""},0,0]
["HPE Virtual Connect Flex-10/10D Module for c-Class BladeSystem",1,"S4-638526-B21","S4-638526-B21","638526-B21",null,null,null,null,null,null,9800]
["HP Cisco B22HP Fabric Extender for BladeSystem c-Class",1,"S4-641146","S4-641146","641146-B21",null,null,null,null,null,null,5900]
[]
["Inteconnect Bay 2"]
["None",0,{"$f":"\"\"","v":""},null,null,{"$f":"\"\"","v":""},{"$f":"\"\"","v":""},{"$f":"\"\"","v":""},null,null,null,{"$f":"\"\"","v":""}]
["HPE 10GbE Ethernet Pass-Thru Module II for c-Class BladeSystem",1,"S4-854194-B21","S4-854194-B21","854194-B21",null,null,null,null,null,null,4375]
["HPE Virtual Connect Flex-10/10D Module for c-Class BladeSystem",1,"S4-638526-B21","S4-638526-B21","638526-B21",null,null,null,null,null,null,9800]
["HP Cisco B22HP Fabric Extender for BladeSystem c-Class",1,"S4-641146","S4-641146","641146-B21",null,null,null,null,null,null,5900]
[]
[]
[]
["Transceiver "]
["None",0,{"$f":"\"\"","v":""},null,null,{"$f":"\"\"","v":""},{"$f":"\"\"","v":""},{"$f":"\"\"","v":""},null,null,null,{"$f":"\"\"","v":""}]
["HPE BladeSystem c-Class Virtual Connect 1G SFP RJ-45 Transceiver",1,"S4-453154-B21","S4-453154-B21","453154-B21",null,null,null,null,null,null,180]
["HPE BLc 10G SFP+ SR Transceiver",1,"S4-455883-B21","S4-455883-B21","455883-B21",null,null,null,null,null,null,230]
["HPE 10GBase-T SFP+ Transceiver",1,"S4-813874-B21","S4-813874-B21","813874-B21",null,null,null,null,null,null,600]
[]
[]
["No"]
["Yes"]

{"sheet":"Memory","index":6,"n_rows":96,"n_cols":27,"rows_kept":96,"cut":false,"hidden":true,"merged":[[33,7,33,9],[33,1,33,6],[33,10,33,15]]}
[null,"Total Memory"]
[]
[null,"HPE 16GB 2Rx4 PC4-2400T-R Kit",1,"TS1L4-16GB","TS1L4-16GB","836220-B21",174]
[null,"HPE 32GB 2Rx4 PC4-2400T-R Kit",1,"TS1L4-32GB","TS1L4-32GB","805351-B21",348]
[null,"HPE 64GB 4Rx4 PC4-2400T-L Kit",1,"TS1L4-64GB","TS1L4-64GB","805358-B21",736]
[]
[]
["1CPU","MEMORY A"]
[32,{"$f":"\"\"","v":""},{"$f":"\"\"","v":""},{"$f":"\"\"","v":""},{"$f":"\"\"","v":""},{"$f":"\"\"","v":""},{"$f":"\"\"","v":""},"HPE 32GB 2Rx4 PC4-2400T-R Kit",1,"805351-B21",{"$f":"\"\"","v":""},{"$f":"\"\"","v":""},{"$f":"\"\"","v":""},{"$f":"\"\"","v":""},{"$f":"\"\"","v":""},{"$f":"\"\"","v":""}]
[64,"HPE 32GB 2Rx4 PC4-2400T-R Kit",1,"TS1L4-32GB","TS1L4-32GB","805351-B21",{"$f":"$G$4*C10","v":348},"HPE 32GB 2Rx4 PC4-2400T-R Kit",1,"805351-B21",{"$f":"\"\"","v":""},{"$f":"\"\"","v":""},{"$f":"\"\"","v":""},{"$f":"\"\"","v":""},{"$f":"\"\"","v":""},{"$f":"\"\"","v":""}]
[128,"HPE 32GB 2Rx4 PC4-2400T-R Kit",3,"TS1L4-32GB","TS1L4-32GB","805351-B21",{"$f":"$G$4*C11","v":1044},"HPE 32GB 2Rx4 PC4-2400T-R Kit",1,"805351-B21",{"$f":"\"\"","v":""},{"$f":"\"\"","v":""},{"$f":"\"\"","v":""},{"$f":"\"\"","v":""},{"$f":"\"\"","v":""},{"$f":"\"\"","v":""}]
["128 (64 GB)",{"$f":"\"\"","v":""},{"$f":"\"\"","v":""},{"$f":"\"\"","v":""},{"$f":"\"\"","v":""},{"$f":"\"\"","v":""},{"$f":"\"\"","v":""},{"$f":"\"\"","v":""},{"$f":"\"\"","v":""},{"$f":"\"\"","v":""},"HPE 64GB 4Rx4 PC4-2400T-L Kit",2,"TS1L4-64GB","TS1L4-64GB","805358-B21",{"$f":"$G$5*L12","v":1472}]
[192,"HPE 32GB 2Rx4 PC4-2400T-R Kit",5,"TS1L4-32GB","TS1L4-32GB","805351-B21",{"$f":"$G$4*C13","v":1740},"HPE 32GB 2Rx4 PC4-2400T-R Kit",1,"805351-B21",{"$f":"\"\"","v":""},{"$f":"\"\"","v":""},{"$f":"\"\"","v":""},{"$f":"\"\"","v":""},{"$f":"\"\"","v":""},{"$f":"\"\"","v":""}]
[256,"HPE 32GB 2Rx4 PC4-2400T-R Kit",7,"TS1L4-32GB","TS1L4-32GB","805351-B21",{"$f":"$G$4*C14","v":2436},"HPE 32GB 2Rx4 PC4-2400T-R Kit",1,"805351-B21",{"$f":"\"\"","v":""},{"$f":"\"\"","v":""},{"$f":"\"\"","v":""},{"$f":"\"\"","v":""},{"$f":"\"\"","v":""},{"$f":"\"\"","v":""}]
["256 (64 GB)",{"$f":"\"\"","v":""},{"$f":"\"\"","v":""},{"$f":"\"\"","v":""},{"$f":"\"\"","v":""},{"$f":"\"\"","v":""},{"$f":"\"\"","v":""},{"$f":"\"\"","v":""},{"$f":"\"\"","v":""},{"$f":"\"\"","v":""},"HPE 64GB 4Rx4 PC4-2400T-L Kit",4,"TS1L4-64GB","TS1L4-64GB","805358-B21",{"$f":"$G$5*L15","v":2944}]
[512,{"$f":"\"\"","v":""},{"$f":"\"\"","v":""},{"$f":"\"\"","v":""},{"$f":"\"\"","v":""},{"$f":"\"\"","v":""},{"$f":"\"\"","v":""},{"$f":"\"\"","v":""},{"$f":"\"\"","v":""},{"$f":"\"\"","v":""},"HPE 64GB 4Rx4 PC4-2400T-L Kit",8,"TS1L4-64GB","TS1L4-64GB","805358-B21",{"$f":"$G$5*L16","v":5888}]
["2CPU"]
[64,"HPE 32GB 2Rx4 PC4-2400T-R Kit",1,"TS1L4-32GB","TS1L4-32GB","805351-B21",{"$f":"$G$4*C18","v":348},"HPE 32GB 2Rx4 PC4-2400T-R Kit",1,"805351-B21",{"$f":"\"\"","v":""},{"$f":"\"\"","v":""},{"$f":"\"\"","v":""},{"$f":"\"\"","v":""},{"$f":"\"\"","v":""},{"$f":"\"\"","v":""}]
[128,"HPE 32GB 2Rx4 PC4-2400T-R Kit",3,"TS1L4-32GB","TS1L4-32GB","805351-B21",{"$f":"$G$4*C19","v":1044},"HPE 32GB 2Rx4 PC4-2400T-R Kit",1,"805351-B21"]
["128 (64 GB)",{"$f":"\"\"","v":""},{"$f":"\"\"","v":""},{"$f":"\"\"","v":""},{"$f":"\"\"","v":""},{"$f":"\"\"","v":""},{"$f":"\"\"","v":""},{"$f":"\"\"","v":""},{"$f":"\"\"","v":""},null,"HPE 64GB 4Rx4 PC4-2400T-L Kit",2,"TS1L4-64GB","TS1L4-64GB","805358-B21",{"$f":"$G$5*L20","v":1472}]
[192,"HPE 32GB 2Rx4 PC4-2400T-R Kit",5,"TS1L4-32GB","TS1L4-32GB","805351-B21",1740,"HPE 32GB 2Rx4 PC4-2400T-R Kit",1,"805351-B21"]
[256,"HPE 32GB 2Rx4 PC4-2400T-R Kit",7,"TS1L4-32GB","TS1L4-32GB","805351-B21",2436,"HPE 32GB 2Rx4 PC4-2400T-R Kit",1,"805351-B21"]
["256 (64 GB)",{"$f":"\"\"","v":""},{"$f":"\"\"","v":""},{"$f":"\"\"","v":""},{"$f":"\"\"","v":""},{"$f":"\"\"","v":""},{"$f":"\"\"","v":""},{"$f":"\"\"","v":""},{"$f":"\"\"","v":""},null,"HPE 64GB 4Rx4 PC4-2400T-L Kit",4,"TS1L4-64GB","TS1L4-64GB","805358-B21",{"$f":"$G$5*L23","v":2944}]
[320,"HPE 32GB 2Rx4 PC4-2400T-R Kit",9,"TS1L4-32GB","TS1L4-32GB","805351-B21",3132,"HPE 32GB 2Rx4 PC4-2400T-R Kit",1,"805351-B21"]
[384,"HPE 32GB 2Rx4 PC4-2400T-R Kit",11,"TS1L4-32GB","TS1L4-32GB","805351-B21",3828,"HPE 32GB 2Rx4 PC4-2400T-R Kit",1,"805351-B21"]
["384 (64 GB)",{"$f":"\"\"","v":""},{"$f":"\"\"","v":""},{"$f":"\"\"","v":""},{"$f":"\"\"","v":""},{"$f":"\"\"","v":""},{"$f":"\"\"","v":""},{"$f":"\"\"","v":""},{"$f":"\"\"","v":""},null,"HPE 64GB 4Rx4 PC4-2400T-L Kit",6,"TS1L4-64GB","TS1L4-64GB","805358-B21",{"$f":"$G$5*L26","v":4416}]
[512,"HPE 32GB 2Rx4 PC4-2400T-R Kit",15,"TS1L4-32GB","TS1L4-32GB","805351-B21",5220,"HPE 32GB 2Rx4 PC4-2400T-R Kit",1,"805351-B21"]
["512 (64 GB)",{"$f":"\"\"","v":""},{"$f":"\"\"","v":""},{"$f":"\"\"","v":""},{"$f":"\"\"","v":""},{"$f":"\"\"","v":""},{"$f":"\"\"","v":""},{"$f":"\"\"","v":""},{"$f":"\"\"","v":""},null,"HPE 64GB 4Rx4 PC4-2400T-L Kit",8,"TS1L4-64GB","TS1L4-64GB","805358-B21",{"$f":"$G$5*L28","v":5888}]
["640 (64 GB)",{"$f":"\"\"","v":""},{"$f":"\"\"","v":""},{"$f":"\"\"","v":""},{"$f":"\"\"","v":""},{"$f":"\"\"","v":""},{"$f":"\"\"","v":""},{"$f":"\"\"","v":""},{"$f":"\"\"","v":""},{"$f":"\"\"","v":""},"HPE 64GB 4Rx4 PC4-2400T-L Kit",10,"TS1L4-64GB","TS1L4-64GB","805358-B21",{"$f":"$G$5*L29","v":7360}]
["768 (64 GB)",{"$f":"\"\"","v":""},{"$f":"\"\"","v":""},{"$f":"\"\"","v":""},{"$f":"\"\"","v":""},{"$f":"\"\"","v":""},{"$f":"\"\"","v":""},{"$f":"\"\"","v":""},{"$f":"\"\"","v":""},{"$f":"\"\"","v":""},"HPE 64GB 4Rx4 PC4-2400T-L Kit",12,"TS1L4-64GB","TS1L4-64GB","805358-B21",{"$f":"$G$5*L30","v":8832}]
["1024 (64 GB)",{"$f":"\"\"","v":""},{"$f":"\"\"","v":""},{"$f":"\"\"","v":""},{"$f":"\"\"","v":""},{"$f":"\"\"","v":""},{"$f":"\"\"","v":""},{"$f":"\"\"","v":""},{"$f":"\"\"","v":""},{"$f":"\"\"","v":""},"HPE 64GB 4Rx4 PC4-2400T-L Kit",16,"TS1L4-64GB","TS1L4-64GB","805358-B21",{"$f":"$G$5*L31","v":11776}]
[]
[null,"MEMORY B"]
["4CPU","UPGRADE 16GB",null,null,null,null,null,"MEMORIA BASE",null,null,"UPGRADE 32GB",null,null,null,null,null,null,null,null,"Memoria Totale","Prezzo Totale Memorie","Memory Cartridge Totali","DIMM Slot",32,16,16]
[64,{"$f":"\"\"","v":""},{"$f":"\"\"","v":""},{"$f":"\"\"","v":""},{"$f":"\"\"","v":""},{"$f":"\"\"","v":""},{"$f":"\"\"","v":""},"HPE 32GB 2Rx4 PC4-2400T-R Kit",2,"805351-B21",{"$f":"\"\"","v":""},{"$f":"\"\"","v":""},{"$f":"\"\"","v":""},{"$f":"\"\"","v":""},{"$f":"\"\"","v":""},{"$f":"\"\"","v":""},null,null,null,{"$f":"A35","v":64},null,{"$f":"S35","v":0},{"$f":"AA35","v":2},{"$f":"IF(L35=\"\",0,L35)","v":0},{"$f":"IF(I35=\"\",0,I35)","v":2},{"$f":"IF(C35=\"\",0,C35)","v":0},{"$f":"SUM(X35:Z35)","v":2}]
[128,"HPE 32GB 2Rx4 PC4-2400T-R Kit",2,"TS1L4-32GB","TS1L4-32GB","805351-B21",{"$f":"$G$4*C36","v":696},"HPE 32GB 2Rx4 PC4-2400T-R Kit",2,"805351-B21",{"$f":"\"\"","v":""},{"$f":"\"\"","v":""},{"$f":"\"\"","v":""},{"$f":"\"\"","v":""},{"$f":"\"\"","v":""},{"$f":"\"\"","v":""},null,null,null,128,null,{"$f":"S36","v":0},4,0,2,2,4]
["128 (64 GB)",{"$f":"\"\"","v":""},{"$f":"\"\"","v":""},{"$f":"\"\"","v":""},{"$f":"\"\"","v":""},{"$f":"\"\"","v":""},{"$f":"\"\"","v":""},{"$f":"\"\"","v":""},{"$f":"\"\"","v":""},null,"HPE 64GB 4Rx4 PC4-2400T-L Kit",2,"TS1L4-64GB","TS1L4-64GB","805358-B21",{"$f":"$G$5*L37","v":1472}]
[192,"HPE 32GB 2Rx4 PC4-2400T-R Kit",4,"TS1L4-32GB","TS1L4-32GB","805351-B21",1392,"HPE 32GB 2Rx4 PC4-2400T-R Kit",2,"805351-B21",{"$f":"\"\"","v":""},{"$f":"\"\"","v":""},{"$f":"\"\"","v":""},{"$f":"\"\"","v":""},{"$f":"\"\"","v":""},{"$f":"\"\"","v":""},null,null,null,192,null,0,6,0,2,4,6]
[256,"HPE 32GB 2Rx4 PC4-2400T-R Kit",6,"TS1L4-32GB","TS1L4-32GB","805351-B21",2088,"HPE 32GB 2Rx4 PC4-2400T-R Kit",2,"805351-B21",{"$f":"\"\"","v":""},{"$f":"\"\"","v":""},{"$f":"\"\"","v":""},{"$f":"\"\"","v":""},{"$f":"\"\"","v":""},{"$f":"\"\"","v":""},null,null,null,256,null,0,8,0,2,6,8]
["256 (64 GB)",{"$f":"\"\"","v":""},{"$f":"\"\"","v":""},{"$f":"\"\"","v":""},{"$f":"\"\"","v":""},{"$f":"\"\"","v":""},{"$f":"\"\"","v":""},{"$f":"\"\"","v":""},{"$f":"\"\"","v":""},null,"HPE 64GB 4Rx4 PC4-2400T-L Kit",4,"TS1L4-64GB","TS1L4-64GB","805358-B21",{"$f":"$G$5*L40","v":2944}]
[320,"HPE 32GB 2Rx4 PC4-2400T-R Kit",8,"TS1L4-32GB","TS1L4-32GB","805351-B21",2784,"HPE 32GB 2Rx4 PC4-2400T-R Kit",2,"805351-B21",{"$f":"\"\"","v":""},{"$f":"\"\"","v":""},{"$f":"\"\"","v":""},{"$f":"\"\"","v":""},{"$f":"\"\"","v":""},{"$f":"\"\"","v":""},null,null,null,320,null,0,10,0,2,8,10]
[384,"HPE 32GB 2Rx4 PC4-2400T-R Kit",10,"TS1L4-32GB","TS1L4-32GB","805351-B21",3480,"HPE 32GB 2Rx4 PC4-2400T-R Kit",2,"805351-B21",{"$f":"\"\"","v":""},{"$f":"\"\"","v":""},{"$f":"\"\"","v":""},{"$f":"\"\"","v":""},{"$f":"\"\"","v":""},{"$f":"\"\"","v":""},null,null,null,384,null,0,12,0,2,10,12]
["384 (64 GB)",{"$f":"\"\"","v":""},{"$f":"\"\"","v":""},{"$f":"\"\"","v":""},{"$f":"\"\"","v":""},{"$f":"\"\"","v":""},{"$f":"\"\"","v":""},{"$f":"\"\"","v":""},{"$f":"\"\"","v":""},null,"HPE 64GB 4Rx4 PC4-2400T-L Kit",6,"TS1L4-64GB","TS1L4-64GB","805358-B21",{"$f":"$G$5*L43","v":4416}]
[512,"HPE 32GB 2Rx4 PC4-2400T-R Kit",14,"TS1L4-32GB","TS1L4-32GB","805351-B21",4872,"HPE 32GB 2Rx4 PC4-2400T-R Kit",2,"805351-B21",{"$f":"\"\"","v":""},{"$f":"\"\"","v":""},{"$f":"\"\"","v":""},{"$f":"\"\"","v":""},{"$f":"\"\"","v":""},{"$f":"\"\"","v":""},null,null,null,512,null,0,16,0,2,14,16]
["512 (64 GB)",{"$f":"\"\"","v":""},{"$f":"\"\"","v":""},{"$f":"\"\"","v":""},{"$f":"\"\"","v":""},{"$f":"\"\"","v":""},{"$f":"\"\"","v":""},{"$f":"\"\"","v":""},{"$f":"\"\"","v":""},null,"HPE 64GB 4Rx4 PC4-2400T-L Kit",8,"TS1L4-64GB","TS1L4-64GB","805358-B21",{"$f":"$G$5*L45","v":5888}]
["640 (64 GB)",{"$f":"\"\"","v":""},{"$f":"\"\"","v":""},{"$f":"\"\"","v":""},{"$f":"\"\"","v":""},{"$f":"\"\"","v":""},{"$f":"\"\"","v":""},{"$f":"\"\"","v":""},{"$f":"\"\"","v":""},{"$f":"\"\"","v":""},"HPE 64GB 4Rx4 PC4-2400T-L Kit",10,"TS1L4-64GB","TS1L4-64GB","805358-B21",{"$f":"$G$5*L46","v":7360},null,null,null,"640 (64 GB)",null,0,{"$error":"#REF!"},{"$f":"IF(#REF!=\"\",0,#REF!)","v":{"$error":"#REF!"}},0,{"$f":"IF(L46=\"\",0,L46)","v":10},{"$error":"#REF!"}]
["768 (64 GB)",{"$f":"\"\"","v":""},{"$f":"\"\"","v":""},{"$f":"\"\"","v":""},{"$f":"\"\"","v":""},{"$f":"\"\"","v":""},{"$f":"\"\"","v":""},{"$f":"\"\"","v":""},{"$f":"\"\"","v":""},{"$f":"\"\"","v":""},"HPE 64GB 4Rx4 PC4-2400T-L Kit",12,"TS1L4-64GB","TS1L4-64GB","805358-B21",{"$f":"$G$5*L47","v":8832},null,null,null,"768 (64 GB)",null,0,{"$error":"#REF!"},{"$f":"IF(#REF!=\"\",0,#REF!)","v":{"$error":"#REF!"}},0,{"$f":"IF(L47=\"\",0,L47)","v":12},{"$error":"#REF!"}]
["1024 (64 GB)",{"$f":"\"\"","v":""},{"$f":"\"\"","v":""},{"$f":"\"\"","v":""},{"$f":"\"\"","v":""},{"$f":"\"\"","v":""},{"$f":"\"\"","v":""},{"$f":"\"\"","v":""},{"$f":"\"\"","v":""},{"$f":"\"\"","v":""},"HPE 64GB 4Rx4 PC4-2400T-L Kit",16,"TS1L4-64GB","TS1L4-64GB","805358-B21",{"$f":"$G$5*L48","v":11776},null,null,null,"1024 (64 GB)",null,0,{"$error":"#REF!"},{"$f":"IF(#REF!=\"\",0,#REF!)","v":{"$error":"#REF!"}},0,{"$f":"IF(L48=\"\",0,L48)","v":16},{"$error":"#REF!"}]
[]
["4CPU"]
[64,{"$f":"\"\"","v":""},{"$f":"\"\"","v":""},{"$f":"\"\"","v":""},{"$f":"\"\"","v":""},{"$f":"\"\"","v":""},{"$f":"\"\"","v":""},"HPE 32GB 2Rx4 PC4-2400T-R Kit",2,"805351-B21",{"$f":"\"\"","v":""},{"$f":"\"\"","v":""},{"$f":"\"\"","v":""},{"$f":"\"\"","v":""},{"$f":"\"\"","v":""},{"$f":"\"\"","v":""},null,null,null,{"$f":"A51","v":64},null,0,{"$f":"AA51","v":2},{"$f":"IF(L51=\"\",0,L51)","v":0},{"$f":"IF(I51=\"\",0,I51)","v":2},{"$f":"IF(C51=\"\",0,C51)","v":0},{"$f":"SUM(X51:Z51)","v":2}]
[128,"HPE 32GB 2Rx4 PC4-2400T-R Kit",2,"TS1L4-32GB","TS1L4-32GB","805351-B21",{"$f":"$G$4*C52","v":696},"HPE 32GB 2Rx4 PC4-2400T-R Kit",2,"805351-B21",{"$f":"\"\"","v":""},{"$f":"\"\"","v":""},{"$f":"\"\"","v":""},{"$f":"\"\"","v":""},{"$f":"\"\"","v":""},{"$f":"\"\"","v":""},null,null,null,128,null,0,4,0,2,2,4]
["128 (64 GB)",{"$f":"\"\"","v":""},{"$f":"\"\"","v":""},{"$f":"\"\"","v":""},{"$f":"\"\"","v":""},{"$f":"\"\"","v":""},{"$f":"\"\"","v":""},{"$f":"\"\"","v":""},{"$f":"\"\"","v":""},null,"HPE 64GB 4Rx4 PC4-2400T-L Kit",2,"TS1L4-64GB","TS1L4-64GB","805358-B21",{"$f":"$G$5*L53","v":1472}]
[192,"HPE 32GB 2Rx4 PC4-2400T-R Kit",4,"TS1L4-32GB","TS1L4-32GB","805351-B21",1392,"HPE 32GB 2Rx4 PC4-2400T-R Kit",2,"805351-B21",{"$f":"\"\"","v":""},{"$f":"\"\"","v":""},{"$f":"\"\"","v":""},{"$f":"\"\"","v":""},{"$f":"\"\"","v":""},{"$f":"\"\"","v":""},null,null,null,192,null,0,6,0,2,4,6]
[256,"HPE 32GB 2Rx4 PC4-2400T-R Kit",6,"TS1L4-32GB","TS1L4-32GB","805351-B21",2088,"HPE 32GB 2Rx4 PC4-2400T-R Kit",2,"805351-B21",{"$f":"\"\"","v":""},{"$f":"\"\"","v":""},{"$f":"\"\"","v":""},{"$f":"\"\"","v":""},{"$f":"\"\"","v":""},{"$f":"\"\"","v":""},null,null,null,256,null,0,8,0,2,6,8]
["256 (64 GB)",{"$f":"\"\"","v":""},{"$f":"\"\"","v":""},{"$f":"\"\"","v":""},{"$f":"\"\"","v":""},{"$f":"\"\"","v":""},{"$f":"\"\"","v":""},{"$f":"\"\"","v":""},{"$f":"\"\"","v":""},null,"HPE 64GB 4Rx4 PC4-2400T-L Kit",4,"TS1L4-64GB","TS1L4-64GB","805358-B21",{"$f":"$G$5*L56","v":2944}]
[320,"HPE 32GB 2Rx4 PC4-2400T-R Kit",8,"TS1L4-32GB","TS1L4-32GB","805351-B21",2784,"HPE 32GB 2Rx4 PC4-2400T-R Kit",2,"805351-B21",{"$f":"\"\"","v":""},{"$f":"\"\"","v":""},{"$f":"\"\"","v":""},{"$f":"\"\"","v":""},{"$f":"\"\"","v":""},{"$f":"\"\"","v":""},null,null,null,320,null,0,10,0,2,8,10]
[384,"HPE 32GB 2Rx4 PC4-2400T-R Kit",10,"TS1L4-32GB","TS1L4-32GB","805351-B21",3480,"HPE 32GB 2Rx4 PC4-2400T-R Kit",2,"805351-B21",{"$f":"\"\"","v":""},{"$f":"\"\"","v":""},{"$f":"\"\"","v":""},{"$f":"\"\"","v":""},{"$f":"\"\"","v":""},{"$f":"\"\"","v":""},null,null,null,384,null,0,12,0,2,10,12]
["384 (64 GB)",{"$f":"\"\"","v":""},{"$f":"\"\"","v":""},{"$f":"\"\"","v":""},{"$f":"\"\"","v":""},{"$f":"\"\"","v":""},{"$f":"\"\"","v":""},{"$f":"\"\"","v":""},{"$f":"\"\"","v":""},null,"HPE 64GB 4Rx4 PC4-2400T-L Kit",6,"TS1L4-64GB","TS1L4-64GB","805358-B21",{"$f":"$G$5*L59","v":4416}]
[512,"HPE 32GB 2Rx4 PC4-2400T-R Kit",14,"TS1L4-32GB","TS1L4-32GB","805351-B21",4872,"HPE 32GB 2Rx4 PC4-2400T-R Kit",2,"805351-B21",{"$f":"\"\"","v":""},{"$f":"\"\"","v":""},{"$f":"\"\"","v":""},{"$f":"\"\"","v":""},{"$f":"\"\"","v":""},{"$f":"\"\"","v":""},null,null,null,512,null,0,16,0,2,14,16]
["512 (64 GB)",{"$f":"\"\"","v":""},{"$f":"\"\"","v":""},{"$f":"\"\"","v":""},{"$f":"\"\"","v":""},{"$f":"\"\"","v":""},{"$f":"\"\"","v":""},{"$f":"\"\"","v":""},{"$f":"\"\"","v":""},null,"HPE 64GB 4Rx4 PC4-2400T-L Kit",8,"TS1L4-64GB","TS1L4-64GB","805358-B21",{"$f":"$G$5*L61","v":5888}]
[640,"HPE 32GB 2Rx4 PC4-2400T-R Kit",18,"TS1L4-32GB","TS1L4-32GB","805351-B21",6264,"HPE 32GB 2Rx4 PC4-2400T-R Kit",2,"805351-B21",{"$f":"\"\"","v":""},{"$f":"\"\"","v":""},{"$f":"\"\"","v":""},{"$f":"\"\"","v":""},{"$f":"\"\"","v":""},{"$f":"\"\"","v":""},null,null,null,640,null,0,20,0,2,18,20]
["640 (64 GB)",{"$f":"\"\"","v":""},{"$f":"\"\"","v":""},{"$f":"\"\"","v":""},{"$f":"\"\"","v":""},{"$f":"\"\"","v":""},{"$f":"\"\"","v":""},{"$f":"\"\"","v":""},{"$f":"\"\"","v":""},null,"HPE 64GB 4Rx4 PC4-2400T-L Kit",10,"TS1L4-64GB","TS1L4-64GB","805358-B21",{"$f":"$G$5*L63","v":7360}]
[768,"HPE 32GB 2Rx4 PC4-2400T-R Kit",22,"TS1L4-32GB","TS1L4-32GB","805351-B21",7656,"HPE 32GB 2Rx4 PC4-2400T-R Kit",2,"805351-B21",{"$f":"\"\"","v":""},{"$f":"\"\"","v":""},{"$f":"\"\"","v":""},{"$f":"\"\"","v":""},{"$f":"\"\"","v":""},{"$f":"\"\"","v":""},null,null,null,768,null,0,24,0,2,22,24]
["768 (64 GB)",{"$f":"\"\"","v":""},{"$f":"\"\"","v":""},{"$f":"\"\"","v":""},{"$f":"\"\"","v":""},{"$f":"\"\"","v":""},{"$f":"\"\"","v":""},{"$f":"\"\"","v":""},{"$f":"\"\"","v":""},null,"HPE 64GB 4Rx4 PC4-2400T-L Kit",12,"TS1L4-64GB","TS1L4-64GB","805358-B21",{"$f":"$G$5*L65","v":8832}]
[1024,"HPE 32GB 2Rx4 PC4-2400T-R Kit",16,"TS1L4-32GB","TS1L4-32GB","805351-B21",5568,"HPE 32GB 2Rx4 PC4-2400T-R Kit",2,"805351-B21",{"$f":"\"\"","v":""},{"$f":"\"\"","v":""},{"$f":"\"\"","v":""},{"$f":"\"\"","v":""},{"$f":"\"\"","v":""},{"$f":"\"\"","v":""},null,null,null,1024,null,0,18,0,2,16,18]
["1024 (64 GB)",{"$f":"\"\"","v":""},{"$f":"\"\"","v":""},{"$f":"\"\"","v":""},{"$f":"\"\"","v":""},{"$f":"\"\"","v":""},{"$f":"\"\"","v":""},{"$f":"\"\"","v":""},{"$f":"\"\"","v":""},null,"HPE 64GB 4Rx4 PC4-2400T-L Kit",16,"TS1L4-64GB","TS1L4-64GB","805358-B21",{"$f":"$G$5*L67","v":11776}]
["1536 (64 GB)",{"$f":"\"\"","v":""},{"$f":"\"\"","v":""},{"$f":"\"\"","v":""},{"$f":"\"\"","v":""},{"$f":"\"\"","v":""},{"$f":"\"\"","v":""},{"$f":"\"\"","v":""},{"$f":"\"\"","v":""},{"$f":"\"\"","v":""},"HPE 64GB 4Rx4 PC4-2400T-L Kit",24,"TS1L4-64GB","TS1L4-64GB","805358-B21",17664,null,null,null,"1536 (64 GB)",null,0,24,24,0,0,24]
["2048 (64 GB)",{"$f":"\"\"","v":""},{"$f":"\"\"","v":""},{"$f":"\"\"","v":""},{"$f":"\"\"","v":""},{"$f":"\"\"","v":""},{"$f":"\"\"","v":""},{"$f":"\"\"","v":""},{"$f":"\"\"","v":""},{"$f":"\"\"","v":""},"HPE 64GB 4Rx4 PC4-2400T-L Kit",32,"TS1L4-64GB","TS1L4-64GB","805358-B21",23552,null,null,null,{"$f":"A69","v":"2048 (64 GB)"},null,0,{"$f":"AA69","v":32},{"$f":"IF(L69=\"\",0,L69)","v":32},{"$f":"IF(I69=\"\",0,I69)","v":0},{"$f":"IF(C69=\"\",0,C69)","v":0},{"$f":"SUM(X69:Z69)","v":32}]
[]
[]
["1CPU","MEMORY C"]
[32]
[64]
[128]
[160]
[192]
[256]
["2CPU"]
[32]
[64]
[128]
[160]
[192]
[256]
[320]
[384]
[512]
[]
[]
[]
[]
[]
[]
[]
[null,null,null,null,null,null,null,null,null,null,null,null,"44GB8"]

{"sheet":"Operating System","index":7,"n_rows":54,"n_cols":30,"rows_kept":54,"cut":false,"hidden":true,"merged":[[0,1,0,2]]}
["Operating System"]
["BL460c Gen9 1 CPU"]
["Nessun Sistema Operativo",{"$f":"\"\"","v":""},{"$f":"\"\"","v":""},{"$f":"\"\"","v":""},{"$f":"\"\"","v":""},{"$f":"\"\"","v":""},"None",{"$f":"\"\"","v":""},{"$f":"\"\"","v":""},{"$f":"\"\"","v":""},{"$f":"\"\"","v":""},0,"None",{"$f":"\"\"","v":""},{"$f":"\"\"","v":""},{"$f":"\"\"","v":""},{"$f":"\"\"","v":""},0,{"$f":"\"\"","v":""},{"$f":"\"\"","v":""},{"$f":"\"\"","v":""},{"$f":"\"\"","v":""},{"$f":"\"\"","v":""},{"$f":"\"\"","v":""},{"$f":"\"\"","v":""},{"$f":"\"\"","v":""},{"$f":"\"\"","v":""},{"$f":"\"\"","v":""},{"$f":"\"\"","v":""},{"$f":"\"\"","v":""}]
["Microsoft Windows Server 2016 Standard Edition ROK 16 Core",1,"TS1L4-WIN1",null,"871148-B21",543,"1-pack of Windows Server 2016 User CALs (Standard or Datacenter)",1,"TS1L4-CALUSER",null,"701608-A21",22,"1-pack of Windows Server 20126 Device CALs (Standard or Datacenter)",1,"TS1L4-CALDEV",null,"701609-A21",22,{"$f":"\"\"","v":""},{"$f":"\"\"","v":""},{"$f":"\"\"","v":""},{"$f":"\"\"","v":""},{"$f":"\"\"","v":""},{"$f":"\"\"","v":""},{"$f":"\"\"","v":""},{"$f":"\"\"","v":""},{"$f":"\"\"","v":""},{"$f":"\"\"","v":""},{"$f":"\"\"","v":""},{"$f":"\"\"","v":""}]
["Microsoft Windows Server 2016 Datacenter Edition ROK 16 Core",1,"TS1L4-WINDC1",null,"871153-B21",2174,"1-pack of Windows Server 2016 User CALs (Standard or Datacenter)",1,"TS1L4-CALUSER",null,"701608-A21",22,"1-pack of Windows Server 2016 Device CALs (Standard or Datacenter)",1,"TS1L4-CALDEV",null,"701609-A21",22,{"$f":"\"\"","v":""},{"$f":"\"\"","v":""},{"$f":"\"\"","v":""},{"$f":"\"\"","v":""},{"$f":"\"\"","v":""},{"$f":"\"\"","v":""},{"$f":"\"\"","v":""},{"$f":"\"\"","v":""},{"$f":"\"\"","v":""},{"$f":"\"\"","v":""},{"$f":"\"\"","v":""},{"$f":"\"\"","v":""}]
["CentOS 7.0",1,"TS1L4-LINUX",null,{"$f":"\"\"","v":""},47,"None",{"$f":"\"\"","v":""},{"$f":"\"\"","v":""},{"$f":"\"\"","v":""},{"$f":"\"\"","v":""},null,"None",{"$f":"\"\"","v":""},{"$f":"\"\"","v":""},{"$f":"\"\"","v":""},{"$f":"\"\"","v":""},null,{"$f":"\"\"","v":""},{"$f":"\"\"","v":""},{"$f":"\"\"","v":""},{"$f":"\"\"","v":""},{"$f":"\"\"","v":""},{"$f":"\"\"","v":""},{"$f":"\"\"","v":""},{"$f":"\"\"","v":""},{"$f":"\"\"","v":""},{"$f":"\"\"","v":""},{"$f":"\"\"","v":""},{"$f":"\"\"","v":""}]
[]
[]
["BL460c Gen9 2 CPU"]
["Nessun Sistema Operativo",{"$f":"\"\"","v":""},{"$f":"\"\"","v":""},{"$f":"\"\"","v":""},{"$f":"\"\"","v":""},{"$f":"\"\"","v":""},"None",{"$f":"\"\"","v":""},{"$f":"\"\"","v":""},{"$f":"\"\"","v":""},{"$f":"\"\"","v":""},0,"None",{"$f":"\"\"","v":""},{"$f":"\"\"","v":""},{"$f":"\"\"","v":""},{"$f":"\"\"","v":""},0,{"$f":"\"\"","v":""},{"$f":"\"\"","v":""},{"$f":"\"\"","v":""},{"$f":"\"\"","v":""},{"$f":"\"\"","v":""},{"$f":"\"\"","v":""},{"$f":"\"\"","v":""},{"$f":"\"\"","v":""},{"$f":"\"\"","v":""},{"$f":"\"\"","v":""},{"$f":"\"\"","v":""},{"$f":"\"\"","v":""}]
["Microsoft Windows Server 2016 Standard Edition ROK 16 Core",1,"TS1L4-WIN1",null,"871148-B21",543,"1-pack of Windows Server 2016 User CALs (Standard or Datacenter)",1,"TS1L4-CALUSER",null,"701608-A21",22,"1-pack of Windows Server 20126 Device CALs (Standard or Datacenter)",1,"TS1L4-CALDEV",null,"701609-A21",22,"Microsoft Windows Server 2016 Standard Edition Additional License 2 Core",2,"TS1L4-WIN2CORE","TS1L4-WIN2CORE","871159-A21",108,{"$f":"\"\"","v":""},{"$f":"\"\"","v":""},{"$f":"\"\"","v":""},{"$f":"\"\"","v":""},{"$f":"\"\"","v":""},{"$f":"\"\"","v":""}]
["Microsoft Windows Server 2016 Datacenter Edition ROK 16 Core",1,"TS1L4-WINDC1",null,"871153-B21",2174,"1-pack of Windows Server 2016 User CALs (Standard or Datacenter)",1,"TS1L4-CALUSER",null,"701608-A21",22,"1-pack of Windows Server 2016 Device CALs (Standard or Datacenter)",1,"TS1L4-CALDEV",null,"701609-A21",22,{"$f":"\"\"","v":""},{"$f":"\"\"","v":""},{"$f":"\"\"","v":""},{"$f":"\"\"","v":""},{"$f":"\"\"","v":""},{"$f":"\"\"","v":""},"Microsoft Windows Server 2016 Datacenter Edition Additional License 2 Core",2,"S4-871168-A21","S4-871168-A21","871168-A21",1060]
["CentOS 7.0",1,"TS1L4-LINUX",null,{"$f":"\"\"","v":""},47,"None",{"$f":"\"\"","v":""},{"$f":"\"\"","v":""},null,{"$f":"\"\"","v":""},null,"None",{"$f":"\"\"","v":""},{"$f":"\"\"","v":""},null,{"$f":"\"\"","v":""},null,{"$f":"\"\"","v":""},{"$f":"\"\"","v":""},{"$f":"\"\"","v":""},{"$f":"\"\"","v":""},{"$f":"\"\"","v":""},{"$f":"\"\"","v":""},{"$f":"\"\"","v":""},{"$f":"\"\"","v":""},{"$f":"\"\"","v":""},{"$f":"\"\"","v":""},{"$f":"\"\"","v":""},{"$f":"\"\"","v":""}]
[]
["BL660c Gen9 2 CPU"]
["Nessun Sistema Operativo",{"$f":"\"\"","v":""},{"$f":"\"\"","v":""},{"$f":"\"\"","v":""},{"$f":"\"\"","v":""},{"$f":"\"\"","v":""},"None",{"$f":"\"\"","v":""},{"$f":"\"\"","v":""},null,{"$f":"\"\"","v":""},0,"None",{"$f":"\"\"","v":""},{"$f":"\"\"","v":""},null,{"$f":"\"\"","v":""},0,{"$f":"\"\"","v":""},{"$f":"\"\"","v":""},{"$f":"\"\"","v":""},{"$f":"\"\"","v":""},{"$f":"\"\"","v":""},{"$f":"\"\"","v":""},{"$f":"\"\"","v":""},{"$f":"\"\"","v":""},{"$f":"\"\"","v":""},{"$f":"\"\"","v":""},{"$f":"\"\"","v":""},{"$f":"\"\"","v":""}]
["Microsoft Windows Server 2016 Standard Edition ROK 16 Core",1,"TS1L4-WIN1",null,"871148-B21",543,"1-pack of Windows Server 2016 User CALs (Standard or Datacenter)",1,"TS1L4-CALUSER",null,"701608-A21",22,"1-pack of Windows Server 20126 Device CALs (Standard or Datacenter)",1,"TS1L4-CALDEV",null,"701609-A21",22,"Microsoft Windows Server 2016 Standard Edition Additional License 2 Core",4,"TS1L4-WIN2CORE","TS1L4-WIN2CORE","871159-A21",216,{"$f":"\"\"","v":""},{"$f":"\"\"","v":""},{"$f":"\"\"","v":""},{"$f":"\"\"","v":""},{"$f":"\"\"","v":""},{"$f":"\"\"","v":""}]
["Microsoft Windows Server 2016 Datacenter Edition ROK 16 Core",1,"TS1L4-WINDC1",null,"871153-B21",2174,"1-pack of Windows Server 2016 User CALs (Standard or Datacenter)",1,"TS1L4-CALUSER",null,"701608-A21",22,"1-pack of Windows Server 2016 Device CALs (Standard or Datacenter)",1,"TS1L4-CALDEV",null,"701609-A21",22,"Microsoft Windows Server 2016 Datacenter Edition Additional License 16 Core",1,"TS1L4-WINDC2","TS1L4-WINDC2","871166-A21",2174,{"$f":"\"\"","v":""},{"$f":"\"\"","v":""},{"$f":"\"\"","v":""},{"$f":"\"\"","v":""},{"$f":"\"\"","v":""},{"$f":"\"\"","v":""}]
["CentOS 7.0",1,"TS1L4-LINUX",null,{"$f":"\"\"","v":""},47,"None",{"$f":"\"\"","v":""},{"$f":"\"\"","v":""},null,{"$f":"\"\"","v":""},null,"None",{"$f":"\"\"","v":""},{"$f":"\"\"","v":""},null,{"$f":"\"\"","v":""},null,{"$f":"\"\"","v":""},{"$f":"\"\"","v":""},{"$f":"\"\"","v":""},{"$f":"\"\"","v":""},{"$f":"\"\"","v":""},{"$f":"\"\"","v":""},{"$f":"\"\"","v":""},{"$f":"\"\"","v":""},{"$f":"\"\"","v":""},{"$f":"\"\"","v":""},{"$f":"\"\"","v":""},{"$f":"\"\"","v":""}]
[]
["BL660c Gen9 4 CPU"]
["Nessun Sistema Operativo",{"$f":"\"\"","v":""},{"$f":"\"\"","v":""},{"$f":"\"\"","v":""},{"$f":"\"\"","v":""},{"$f":"\"\"","v":""},"None",{"$f":"\"\"","v":""},{"$f":"\"\"","v":""},null,{"$f":"\"\"","v":""},0,"None",{"$f":"\"\"","v":""},{"$f":"\"\"","v":""},null,{"$f":"\"\"","v":""},0,{"$f":"\"\"","v":""},{"$f":"\"\"","v":""},{"$f":"\"\"","v":""},{"$f":"\"\"","v":""},{"$f":"\"\"","v":""},{"$f":"\"\"","v":""},{"$f":"\"\"","v":""},{"$f":"\"\"","v":""},{"$f":"\"\"","v":""},{"$f":"\"\"","v":""},{"$f":"\"\"","v":""},{"$f":"\"\"","v":""}]
["Microsoft Windows Server 2016 Standard Edition ROK 16 Core",1,"TS1L4-WIN1",null,"871148-B21",543,"1-pack of Windows Server 2016 User CALs (Standard or Datacenter)",1,"TS1L4-CALUSER",null,"701608-A21",22,"1-pack of Windows Server 20126 Device CALs (Standard or Datacenter)",1,"TS1L4-CALDEV",null,"701609-A21",22,"Microsoft Windows Server 2016 Standard Edition Additional License 16 Core",2,"TS1L4-WIN2","TS1L4-WIN2","871157-A21",1086,{"$f":"\"\"","v":""},{"$f":"\"\"","v":""},{"$f":"\"\"","v":""},{"$f":"\"\"","v":""},{"$f":"\"\"","v":""},{"$f":"\"\"","v":""}]
["Microsoft Windows Server 2016 Datacenter Edition ROK 16 Core",1,"TS1L4-WINDC1",null,"871153-B21",2174,"1-pack of Windows Server 2016 User CALs (Standard or Datacenter)",1,"TS1L4-CALUSER",null,"701608-A21",22,"1-pack of Windows Server 2016 Device CALs (Standard or Datacenter)",1,"TS1L4-CALDEV",null,"701609-A21",22,"Microsoft Windows Server 2016 Datacenter Edition Additional License 16 Core",2,"TS1L4-WINDC2","TS1L4-WINDC2","871166-A21",4348,{"$f":"\"\"","v":""},{"$f":"\"\"","v":""},{"$f":"\"\"","v":""},{"$f":"\"\"","v":""},{"$f":"\"\"","v":""},{"$f":"\"\"","v":""}]
["CentOS 7.0",1,"TS1L4-LINUX",null,{"$f":"\"\"","v":""},47,"None",{"$f":"\"\"","v":""},{"$f":"\"\"","v":""},null,{"$f":"\"\"","v":""},null,"None",{"$f":"\"\"","v":""},{"$f":"\"\"","v":""},null,{"$f":"\"\"","v":""},null,{"$f":"\"\"","v":""},{"$f":"\"\"","v":""},{"$f":"\"\"","v":""},{"$f":"\"\"","v":""},{"$f":"\"\"","v":""},{"$f":"\"\"","v":""},{"$f":"\"\"","v":""},{"$f":"\"\"","v":""},{"$f":"\"\"","v":""},{"$f":"\"\"","v":""},{"$f":"\"\"","v":""},{"$f":"\"\"","v":""}]
["T630"]
["No Operating System",{"$f":"\"\"","v":""},{"$f":"\"\"","v":""},{"$f":"\"\"","v":""},"[611-BBBF]",{"$f":"\"\"","v":""},null,null,null,null,null,null,"None",{"$f":"\"\"","v":""},{"$f":"\"\"","v":""},null,{"$f":"\"\"","v":""},null,null,null,null,null,null,null,"None",{"$f":"\"\"","v":""},{"$f":"\"\"","v":""},{"$f":"\"\"","v":""},{"$f":"\"\"","v":""}]
["Kit Windows Server 2012, Standard Edition, 2 Socket, 2VM, ROK, COA + Media",1,"10L1-WIN","S10L1-T630-WIN","[638-BBBD]",543,null,null,null,null,null,null,"1-pack of Windows Server 2012 User CALs (Standard or Datacenter)",1,"10L1-CALUSER",null,"[618-10778]",22,null,null,null,null,null,null,"1-pack of Windows Server 2012 Device CALs (Standard or Datacenter)",1,"10L1-CALDEV","S10L1-T630-DEV","[618-10777]",22]
["CentOS 7.0",1,"TS1L4-LINUX","S10L1-T630-LINUX",{"$f":"\"\"","v":""},48,null,null,null,null,null,null,"None",{"$f":"\"\"","v":""},{"$f":"\"\"","v":""},{"$f":"\"\"","v":""},{"$f":"\"\"","v":""},null,null,null,null,null,null,null,"None",{"$f":"\"\"","v":""},{"$f":"\"\"","v":""},{"$f":"\"\"","v":""},{"$f":"\"\"","v":""}]
[]
[]
[]
[]
[]
[]
[]
[]
[]
[]
[]
[]
[]
[]
[]
["Microsoft Windows Server 2016 Standard Edition ROK 16 Core",1,"TS1L4-WIN1","TS1L4-WIN1","871148-B21",543]
["Microsoft Windows Server 2016 Standard Edition Additional License 16 Core",1,"TS1L4-WIN2","TS1L4-WIN2","871157-A21",543]
["Microsoft Windows Server 2016 Standard Edition Additional License 2 Core",1,"TS1L4-WIN2CORE","TS1L4-WIN2CORE","871159-A21",54]
["Microsoft Windows Server 2016 Datacenter Edition ROK 16 Core",1,"TS1L4-WINDC1","TS1L4-WINDC1","871153-B21",2174]
["Microsoft Windows Server 2016 Datacenter Edition Additional License 16 Core",1,"TS1L4-WINDC2","TS1L4-WINDC2","871166-A21",2174]
["MS WS16 CAL 1USR EMEA LTU",1,"TS1L4-CALUSER","TS1L4-CALUSER","871175-A21",22]
["MS WS16 CAL 1DEV EMEA LTU",1,"TS1L4-CALDEV","TS1L4-CALDEV","871176-A21",22]
[null,1,"TS1L4-LINUX","TS1L4-LINUX",null,47]
[]
["Microsoft Windows Server 2016 Datacenter Edition Additional License 2 Core",null,null,null,"871168-A21",530]

{"sheet":"HDD","index":8,"n_rows":187,"n_cols":15,"rows_kept":187,"cut":false,"hidden":true,"merged":[]}
["Hard Drives"]
["DL560"]
["HP 300GB 12G SAS 15K 2.5in SC ENT HDD",null,null,null,"759208-B21",140]
["HPE 1.2TB SAS 10K SFF SC DS HDD",null,null,null,"872479-B21",278]
[null,"DL560","DL560 2","DL560 3"]
["HDD max",8,8,8]
["HDD 300GB Base",2,2,2,"Hot Spare for 300GB HDD",{"$f":"'Lotto4 Blade 2P'!#REF!","v":{"$error":"#REF!"}},{"$f":"IF(F7=\"Yes\",1,0)","v":{"$error":"#REF!"}},{"$f":"#REF!","v":{"$error":"#REF!"}},{"$f":"IF(H7=\"Yes\",1,0)","v":{"$error":"#REF!"}},{"$f":"#REF!","v":{"$error":"#REF!"}},{"$f":"IF(J7=\"Yes\",1,0)","v":{"$error":"#REF!"}}]
["HDD 300GB Selected",{"$f":"'Lotto4 Blade 2P'!#REF!","v":{"$error":"#REF!"}},{"$f":"#REF!","v":{"$error":"#REF!"}},{"$f":"#REF!","v":{"$error":"#REF!"}}]
["HP 300GB 12G SAS 15K 2.5in SC ENT HDD",0,0,0]
[null,1,1,1]
[null,2,2,2]
[null,3,3,3]
[null,4,4,4]
[null,5,5,5]
[null,6,6,6]
["HDD max",8,8,8]
["HDD 300GB",{"$f":"B7+B8","v":{"$error":"#REF!"}},{"$f":"C7+C8","v":{"$error":"#REF!"}},{"$f":"D7+D8","v":{"$error":"#REF!"}}]
["HDD 1TB Selected",{"$f":"'Lotto4 Blade 2P'!$C$51","v":"No"},{"$f":"#REF!","v":{"$error":"#REF!"}},{"$f":"#REF!","v":{"$error":"#REF!"}},"Hot Spare for 1TB HDD",{"$f":"'Lotto4 Blade 2P'!#REF!","v":{"$error":"#REF!"}},{"$f":"IF(F18=\"Yes\",1,0)","v":{"$error":"#REF!"}},{"$f":"#REF!","v":{"$error":"#REF!"}},{"$f":"IF(H18=\"Yes\",1,0)","v":{"$error":"#REF!"}},{"$f":"#REF!","v":{"$error":"#REF!"}},{"$f":"IF(J18=\"Yes\",1,0)","v":{"$error":"#REF!"}}]
["HP 1TB 6G SAS 7.2K 2.5in SC MDL HDD",{"$f":"B$6-B$7-B$8","v":{"$error":"#REF!"}},{"$f":"C$6-C$7-C$8","v":{"$error":"#REF!"}},{"$f":"D$6-D$7-D$8","v":{"$error":"#REF!"}}]
[null,{"$f":"IF(B19-1<1,0,B19-1)","v":{"$error":"#REF!"}},{"$error":"#REF!"},{"$error":"#REF!"}]
[null,{"$error":"#REF!"},{"$error":"#REF!"},{"$error":"#REF!"}]
[null,{"$error":"#REF!"},{"$error":"#REF!"},{"$error":"#REF!"}]
[null,{"$error":"#REF!"},{"$error":"#REF!"},{"$error":"#REF!"}]
[null,{"$error":"#REF!"},{"$error":"#REF!"},{"$error":"#REF!"}]
[null,{"$error":"#REF!"},{"$error":"#REF!"},{"$error":"#REF!"}]
[null,{"$error":"#REF!"}]
[null,{"$error":"#REF!"}]
[]
["Hot Spare","Yes"]
[null,"No"]
[]
["RAID Configuration",null,null,"HDD 300GB DL560",null,"HDD 1TB DL560",null,"HDD 300GB DL560 2",null,"HDD 1TB DL560 2",null,"HDD 300GB DL560 3",null,"HDD 1TB DL560 3"]
["RAID Personalizzato",{"$f":"IF($B$106<=8,0,\"\")","v":0},{"$f":"\"\"","v":""},{"$f":"IF($G$7=0,A33,\"\")","v":{"$error":"#REF!"}},{"$f":"IF($G$7=0,C33,\"\")","v":{"$error":"#REF!"}},{"$f":"IF($G$18=0,A33,\"\")","v":{"$error":"#REF!"}},{"$f":"IF($G$18=0,C33,\"\")","v":{"$error":"#REF!"}},{"$f":"IF(I7=0,$A$33,\"\")","v":{"$error":"#REF!"}},{"$f":"IF(I7=0,$C$33,\"\")","v":{"$error":"#REF!"}},{"$f":"IF(I18=0,$A$33,\"\")","v":{"$error":"#REF!"}},{"$f":"IF(I18=0,$C$33,\"\")","v":{"$error":"#REF!"}},{"$f":"IF(K7=0,$A$33,\"\")","v":{"$error":"#REF!"}},{"$f":"IF(K7=0,$C$33,\"\")","v":{"$error":"#REF!"}},{"$f":"IF(K18=0,$A$33,\"\")","v":{"$error":"#REF!"}},{"$f":"IF(K18=0,$C$33,\"\")","v":{"$error":"#REF!"}}]
["RAID non Configurato (1-8 HDDs)",1,{"$f":"\"\"","v":""},{"$f":"IF($G$7=0,A34,\"\")","v":{"$error":"#REF!"}},{"$f":"IF($G$7=0,C34,\"\")","v":{"$error":"#REF!"}},{"$f":"IF($G$18=0,A34,\"\")","v":{"$error":"#REF!"}},{"$f":"IF($G$18=0,C34,\"\")","v":{"$error":"#REF!"}},{"$f":"IF(I7=0,$A$34,\"\")","v":{"$error":"#REF!"}},{"$f":"IF(I7=0,$C$34,\"\")","v":{"$error":"#REF!"}},{"$f":"IF(I18=0,$A$34,\"\")","v":{"$error":"#REF!"}},{"$f":"IF(I18=0,$C$34,\"\")","v":{"$error":"#REF!"}},{"$f":"IF(K7=0,$A$34,\"\")","v":{"$error":"#REF!"}},{"$f":"IF(K7=0,$C$34,\"\")","v":{"$error":"#REF!"}},{"$f":"IF(K18=0,$A$34,\"\")","v":{"$error":"#REF!"}},{"$f":"IF(K18=0,$C$34,\"\")","v":{"$error":"#REF!"}}]
["RAID 0 (1-8 HDDs)",1,{"$f":"\"\"","v":""},{"$f":"IF($G$7=0,A35,\"\")","v":{"$error":"#REF!"}},{"$f":"IF($G$7=0,C35,\"\")","v":{"$error":"#REF!"}},{"$f":"IF($G$18=0,A35,\"\")","v":{"$error":"#REF!"}},{"$f":"IF($G$18=0,C35,\"\")","v":{"$error":"#REF!"}},{"$f":"IF(I7=0,$A$35,\"\")","v":{"$error":"#REF!"}},{"$f":"IF(I7=0,$C$35,\"\")","v":{"$error":"#REF!"}},{"$f":"IF(I18=0,$A$35,\"\")","v":{"$error":"#REF!"}},{"$f":"IF(I18=0,$C$35,\"\")","v":{"$error":"#REF!"}},{"$f":"IF(K7=0,$A$35,\"\")","v":{"$error":"#REF!"}},{"$f":"IF(K7=0,$C$35,\"\")","v":{"$error":"#REF!"}},{"$f":"IF(K18=0,$A$35,\"\")","v":{"$error":"#REF!"}},{"$f":"IF(K18=0,$C$35,\"\")","v":{"$error":"#REF!"}}]
["RAID 1  (2 HDDs)",1,{"$f":"\"\"","v":""},{"$f":"IF($B$7+$B$8-$G$7=2,A36,\"\")","v":{"$error":"#REF!"}},{"$f":"IF($B$7+$B$8-$G$7=2,C36,\"\")","v":{"$error":"#REF!"}},{"$f":"IF($B$18-$G$18=2,A36,\"\")","v":{"$error":"#VALUE!"}},{"$f":"IF($B$18-$G$18=2,C36,\"\")","v":{"$error":"#VALUE!"}},{"$f":"IF($C$7+$C$8-I7=2,$A$36,\"\")","v":{"$error":"#REF!"}},{"$f":"IF($C$7+$C$8-I7=2,$C$36,\"\")","v":{"$error":"#REF!"}},{"$f":"IF($C$18-I18=2,A36,\"\")","v":{"$error":"#REF!"}},{"$f":"IF($C$18-I18=2,$C$36,\"\")","v":{"$error":"#REF!"}},{"$f":"IF($C$7+$C$8-K7=2,$A$36,\"\")","v":{"$error":"#REF!"}},{"$f":"IF($C$7+$C$8-K7=2,$C$36,\"\")","v":{"$error":"#REF!"}},{"$f":"IF($C$18-M18=2,E36,\"\")","v":{"$error":"#REF!"}},{"$f":"IF($D$18-K18=2,$C$36,\"\")","v":{"$error":"#REF!"}}]
["RAID 5 (da 3 a 10 HDDs)",1,{"$f":"\"\"","v":""},{"$f":"IF($B$7+$B$8-$G$7>=3,A37,\"\")","v":{"$error":"#REF!"}},{"$f":"IF($B$7+$B$8-$G$7>=3,C37,\"\")","v":{"$error":"#REF!"}},{"$f":"IF($B$18-$G$18>=3,A37,\"\")","v":{"$error":"#VALUE!"}},{"$f":"IF($B$18-$G$18>=3,C37,\"\")","v":{"$error":"#VALUE!"}},{"$f":"IF($C$7+$C$8-I7>=3,$A$37,\"\")","v":{"$error":"#REF!"}},{"$f":"IF($C$7+$C$8-I7>=3,$C$37,\"\")","v":{"$error":"#REF!"}},{"$f":"IF($C$18-I18>=3,$A$37,\"\")","v":{"$error":"#REF!"}},{"$f":"IF($C$18-I18>=3,$C$37,\"\")","v":{"$error":"#REF!"}},{"$f":"IF($D$7+$D$8-K7>=3,$A$37,\"\")","v":{"$error":"#REF!"}},{"$f":"IF($D$7+$D$8-K7>=3,$C$37,\"\")","v":{"$error":"#REF!"}},{"$f":"IF($D$18-K18>=3,$A$37,\"\")","v":{"$error":"#REF!"}},{"$f":"IF($D$18-K18>=3,$C$37,\"\")","v":{"$error":"#REF!"}}]
["RAID 10 (4-8 HDDs in pairs) ",1,{"$f":"\"\"","v":""},{"$f":"IF($B$7+$B$8-$G$7=4,A38,\"\")","v":{"$error":"#REF!"}},{"$f":"IF($B$7+$B$8-$G$7=4,C38,\"\")","v":{"$error":"#REF!"}},{"$f":"IF($B$18-$G$18=4,A38,\"\")","v":{"$error":"#VALUE!"}},{"$f":"IF($B$18-$G$18=4,C38,\"\")","v":{"$error":"#VALUE!"}},{"$f":"IF($C$7+$C$8-I7=4,$A$38,\"\")","v":{"$error":"#REF!"}},{"$f":"IF($C$7+$C$8-I7=4,$C$38,\"\")","v":{"$error":"#REF!"}},{"$f":"IF($C$18-I18=4,$A$38,\"\")","v":{"$error":"#REF!"}},{"$f":"IF($C$18-I18=4,$C$38,\"\")","v":{"$error":"#REF!"}},{"$f":"IF($D$7+$D$8-K7=4,$A$38,\"\")","v":{"$error":"#REF!"}},{"$f":"IF($D$7+$D$8-K7=4,$C$38,\"\")","v":{"$error":"#REF!"}},{"$f":"IF($D$18-K18=4,$A$38,\"\")","v":{"$error":"#REF!"}},{"$f":"IF($D$18-K18=4,$C$38,\"\")","v":{"$error":"#REF!"}}]
["RAID 1+RAID 1 (2 + 2 HDDs) ",1,{"$f":"\"\"","v":""},{"$f":"IF($B$7+$B$8-$G$7=4,A39,\"\")","v":{"$error":"#REF!"}},{"$f":"IF($B$7+$B$8-$G$7=4,C39,\"\")","v":{"$error":"#REF!"}},{"$f":"IF($B$18-$G$18=4,A39,\"\")","v":{"$error":"#VALUE!"}},{"$f":"IF($B$18-$G$18=4,C39,\"\")","v":{"$error":"#VALUE!"}},{"$f":"IF($C$7+$C$8-I7=4,$A$39,\"\")","v":{"$error":"#REF!"}},{"$f":"IF($C$7+$C$8-I7=4,$C$39,\"\")","v":{"$error":"#REF!"}},{"$f":"IF($C$18-I18=4,A39,\"\")","v":{"$error":"#REF!"}},{"$f":"IF($C$18-I18=4,$C$39,\"\")","v":{"$error":"#REF!"}},{"$f":"IF($D$7+$D$8-K7=4,$A$39,\"\")","v":{"$error":"#REF!"}},{"$f":"IF($D$7+$D$8-K7=4,$C$39,\"\")","v":{"$error":"#REF!"}},{"$f":"IF($D$18-K18=4,A39,\"\")","v":{"$error":"#REF!"}},{"$f":"IF($D$18-K18=4,$C$39,\"\")","v":{"$error":"#REF!"}}]
["RAID 1+RAID 5 (2 + 3-8 HDDs)",1,{"$f":"\"\"","v":""},{"$f":"IF($B$7+$B$8-$G$7>=5,A40,\"\")","v":{"$error":"#REF!"}},{"$f":"IF($B$7+$B$8-$G$7>=5,C40,\"\")","v":{"$error":"#REF!"}},{"$f":"IF($B$18-$G$18>=5,A40,\"\")","v":{"$error":"#VALUE!"}},{"$f":"IF($B$18-$G$18>=5,C40,\"\")","v":{"$error":"#VALUE!"}},{"$f":"IF($C$7+$C$8-I7>=5,$A$40,\"\")","v":{"$error":"#REF!"}},{"$f":"IF($C$7+$C$8-I7>=5,$C$40,\"\")","v":{"$error":"#REF!"}},{"$f":"IF($C$18-I18>=5,$A$40,\"\")","v":{"$error":"#REF!"}},{"$f":"IF($C$18-I18>=5,$C$40,\"\")","v":{"$error":"#REF!"}},{"$f":"IF($D$7+$D$8-K7>=5,$A$40,\"\")","v":{"$error":"#REF!"}},{"$f":"IF($D$7+$D$8-K7>=5,$C$40,\"\")","v":{"$error":"#REF!"}},{"$f":"IF($D$18-K18>=5,$A$40,\"\")","v":{"$error":"#REF!"}},{"$f":"IF($D$18-K18>=5,$C$40,\"\")","v":{"$error":"#REF!"}}]
["RAID 1 + RAID 10 (2 + 4 HDDs in pairs) ",1,{"$f":"\"\"","v":""},{"$f":"IF($B$7+$B$8-$G$7=6,A41,\"\")","v":{"$error":"#REF!"}},{"$f":"IF($B$7+$B$8-$G$7=6,C41,\"\")","v":{"$error":"#REF!"}},{"$f":"IF($B$18-$G$18=6,A41,\"\")","v":{"$error":"#VALUE!"}},{"$f":"IF($B$18-$G$18=6,C41,\"\")","v":{"$error":"#VALUE!"}},{"$f":"IF($C$7+$C$8-I7=6,$A$41,\"\")","v":{"$error":"#REF!"}},{"$f":"IF($C$7+$C$8-I7=6,$C$41,\"\")","v":{"$error":"#REF!"}},{"$f":"IF($C$18-I18=6,A41,\"\")","v":{"$error":"#REF!"}},{"$f":"IF($C$18-I18=6,$C$41,\"\")","v":{"$error":"#REF!"}},{"$f":"IF($D$7+$D$8-M7=6,$A$41,\"\")","v":{"$error":"#REF!"}},{"$f":"IF($D$7+$D$8-M7=6,$C$41,\"\")","v":{"$error":"#REF!"}},{"$f":"IF($D$18-K18=6,A41,\"\")","v":{"$error":"#REF!"}},{"$f":"IF($D$18-K18=6,$C$41,\"\")","v":{"$error":"#REF!"}}]
[]
["R730xd"]
["HP 300GB 12G SAS 15K 2.5in SC ENT HDD",null,"10L2-HDD300GB","S10L2-DL580-HDD300","759208-B21",140]
["HP 1TB 6G SAS 7.2K 2.5in SC MDL HDD",null,"10L2-HDD1TB","S10L2-DL580-HDD1000","652749-B21",278]
[null,{"$f":"Chassis!#REF!","v":{"$error":"#REF!"}},{"$f":"#REF!","v":{"$error":"#REF!"}},{"$f":"#REF!","v":{"$error":"#REF!"}}]
["HDD max",10,10,10]
["HDD 300GB Base",2,2,2]
["Hot Spare for 300GB HDD",{"$f":"IF(B46=\"Yes\",1,0)","v":{"$error":"#REF!"}},{"$f":"IF(C46=\"Yes\",1,0)","v":{"$error":"#REF!"}},{"$f":"IF(D46=\"Yes\",1,0)","v":{"$error":"#REF!"}}]
["HDD 300GB Selected",{"$f":"Chassis!#REF!","v":{"$error":"#REF!"}},{"$f":"#REF!","v":{"$error":"#REF!"}},{"$f":"#REF!","v":{"$error":"#REF!"}}]
["HP 300GB 12G SAS 15K 2.5in SC ENT HDD",0,0,0]
[null,1,1,1]
[null,2,2,2]
[null,3,3,3]
[null,4,4,4]
[null,5,5,5]
[null,6,6,6]
[null,7,7,7]
[null,8,8,8]
[]
[]
[]
[]
[]
[]
[null,{"$f":"Chassis!#REF!","v":{"$error":"#REF!"}},{"$f":"#REF!","v":{"$error":"#REF!"}},{"$f":"#REF!","v":{"$error":"#REF!"}}]
["HDD max",10,10,10]
["HDD 300GB",{"$f":"B48+B50","v":{"$error":"#REF!"}},{"$f":"C48+C50","v":{"$error":"#REF!"}},{"$f":"D48+D50","v":{"$error":"#REF!"}}]
["Hot Spare for 1TB HDD",{"$f":"IF(B66=\"Yes\",1,0)","v":{"$error":"#REF!"}},{"$f":"IF(C66=\"Yes\",1,0)","v":{"$error":"#REF!"}},{"$f":"IF(D66=\"Yes\",1,0)","v":{"$error":"#REF!"}}]
["HDD 1TB Selected",{"$f":"Chassis!#REF!","v":{"$error":"#REF!"}},{"$f":"#REF!","v":{"$error":"#REF!"}},{"$f":"#REF!","v":{"$error":"#REF!"}}]
["HP 1TB 6G SAS 7.2K 2.5in SC MDL HDD",{"$f":"$B$67-$B$68-$B$70","v":{"$error":"#REF!"}},{"$f":"$C$67-$C$68-$C$70","v":{"$error":"#REF!"}},{"$f":"$D$67-$D$68-$D$70","v":{"$error":"#REF!"}}]
[null,{"$f":"IF(B71-1<1,0,B71-1)","v":{"$error":"#REF!"}},{"$error":"#REF!"},{"$f":"IF(D71-1<1,0,D71-1)","v":{"$error":"#REF!"}}]
[null,{"$error":"#REF!"},{"$error":"#REF!"},{"$error":"#REF!"}]
[null,{"$error":"#REF!"},{"$error":"#REF!"},{"$error":"#REF!"}]
[null,{"$error":"#REF!"},{"$error":"#REF!"},{"$error":"#REF!"}]
[null,{"$error":"#REF!"},{"$error":"#REF!"},{"$error":"#REF!"}]
[null,{"$error":"#REF!"},{"$error":"#REF!"},{"$error":"#REF!"}]
[null,{"$error":"#REF!"},{"$error":"#REF!"},{"$error":"#REF!"}]
[null,{"$error":"#REF!"},{"$error":"#REF!"},{"$error":"#REF!"}]
[]
[]
[]
[]
[]
[]
[]
[]
[]
["RAID Configuration",null,null,"HDD 300GB R730xd",null,"HDD 1TB R730xd",null,"HDD 300GB R730xd 2",null,"HDD 1TB R730xd 2",null,"HDD 300GB R730xd 3",null,"HDD 1TB R730xd 3"]
["RAID Personalizzato",{"$f":"IF($B$106<=8,0,\"\")","v":0},"[780-BBJC]",{"$f":"IF($B$49=0,A90,\"\")","v":{"$error":"#REF!"}},{"$f":"IF($B$49=0,C90,\"\")","v":{"$error":"#REF!"}},{"$f":"IF($B$69=0,A90,\"\")","v":{"$error":"#REF!"}},{"$f":"IF($B$69=0,C90,\"\")","v":{"$error":"#REF!"}},{"$f":"IF($C$49=0,A90,\"\")","v":{"$error":"#REF!"}},{"$f":"IF($C$49=0,C90,\"\")","v":{"$error":"#REF!"}},{"$f":"IF($C$69=0,A90,\"\")","v":{"$error":"#REF!"}},{"$f":"IF($C$69=0,C90,\"\")","v":{"$error":"#REF!"}},{"$f":"IF($D$49=0,A90,\"\")","v":{"$error":"#REF!"}},{"$f":"IF($D$49=0,C90,\"\")","v":{"$error":"#REF!"}},{"$f":"IF($D$69=0,A90,\"\")","v":{"$error":"#REF!"}},{"$f":"IF($D$69=0,C90,\"\")","v":{"$error":"#REF!"}}]
["RAID non Configurato (1-8 HDDs)",1,"[780-BBJD] ",{"$f":"IF($B$49=0,A91,\"\")","v":{"$error":"#REF!"}},{"$f":"IF($B$49=0,C91,\"\")","v":{"$error":"#REF!"}},{"$f":"IF($B$69=0,A91,\"\")","v":{"$error":"#REF!"}},{"$f":"IF($B$69=0,C91,\"\")","v":{"$error":"#REF!"}},{"$f":"IF($C$49=0,A91,\"\")","v":{"$error":"#REF!"}},{"$f":"IF($C$49=0,C91,\"\")","v":{"$error":"#REF!"}},{"$f":"IF($C$69=0,A91,\"\")","v":{"$error":"#REF!"}},{"$f":"IF($C$69=0,C91,\"\")","v":{"$error":"#REF!"}},{"$f":"IF($D$49=0,A91,\"\")","v":{"$error":"#REF!"}},{"$f":"IF($D$49=0,C91,\"\")","v":{"$error":"#REF!"}},{"$f":"IF($D$69=0,A91,\"\")","v":{"$error":"#REF!"}},{"$f":"IF($D$69=0,C91,\"\")","v":{"$error":"#REF!"}}]
["RAID 0 (1-8 HDDs)",1,"[780-BBJF]",{"$f":"IF($B$49=0,A92,\"\")","v":{"$error":"#REF!"}},{"$f":"IF($B$49=0,C92,\"\")","v":{"$error":"#REF!"}},{"$f":"IF($B$69=0,A92,\"\")","v":{"$error":"#REF!"}},{"$f":"IF($B$69=0,C92,\"\")","v":{"$error":"#REF!"}},{"$f":"IF($C$49=0,A92,\"\")","v":{"$error":"#REF!"}},{"$f":"IF($C$49=0,C92,\"\")","v":{"$error":"#REF!"}},{"$f":"IF($C$69=0,A92,\"\")","v":{"$error":"#REF!"}},{"$f":"IF($C$69=0,C92,\"\")","v":{"$error":"#REF!"}},{"$f":"IF($D$49=0,A92,\"\")","v":{"$error":"#REF!"}},{"$f":"IF($D$49=0,C92,\"\")","v":{"$error":"#REF!"}},{"$f":"IF($D$69=0,A92,\"\")","v":{"$error":"#REF!"}},{"$f":"IF($D$69=0,C92,\"\")","v":{"$error":"#REF!"}}]
["RAID 1  (2 HDDs)",1,"[780-BBJK]",{"$f":"IF($B$48+$B$50-$B$49=2,A93,\"\")","v":{"$error":"#REF!"}},{"$f":"IF($B$48+$B$50-$B$49=2,C93,\"\")","v":{"$error":"#REF!"}},{"$f":"IF($B$70-$B$69=2,A93,\"\")","v":{"$error":"#REF!"}},{"$f":"IF($B$70-$B$69=2,C93,\"\")","v":{"$error":"#REF!"}},{"$f":"IF($C$48+$C$50-$C$49=2,A93,\"\")","v":{"$error":"#REF!"}},{"$f":"IF($C$48+$C$50-$C$49=2,C93,\"\")","v":{"$error":"#REF!"}},{"$f":"IF($C$70-$C$69=2,A93,\"\")","v":{"$error":"#REF!"}},{"$f":"IF($C$70-$C$69=2,C93,\"\")","v":{"$error":"#REF!"}},{"$f":"IF($D$48+$D$50-$D$49=2,A93,\"\")","v":{"$error":"#REF!"}},{"$f":"IF($D$48+$D$50-$D$49=2,C93,\"\")","v":{"$error":"#REF!"}},{"$f":"IF($D$70-$D$69=2,A93,\"\")","v":{"$error":"#REF!"}},{"$f":"IF($D$70-$D$69=2,C93,\"\")","v":{"$error":"#REF!"}}]
["RAID 5 (da 3 a 10 HDDs)",1,"[780-BBJL]",{"$f":"IF($B$48+$B$50-$B$49>=3,A94,\"\")","v":{"$error":"#REF!"}},{"$f":"IF($B$48+$B$50-$B$49>=3,C94,\"\")","v":{"$error":"#REF!"}},{"$f":"IF($B$70-$B$69>=3,A94,\"\")","v":{"$error":"#REF!"}},{"$f":"IF($B$70-$B$69>=3,C94,\"\")","v":{"$error":"#REF!"}},{"$f":"IF($C$48+$C$50-$C$49>=3,A94,\"\")","v":{"$error":"#REF!"}},{"$f":"IF($C$48+$C$50-$C$49>=3,C94,\"\")","v":{"$error":"#REF!"}},{"$f":"IF($C$70-$C$69>=3,A94,\"\")","v":{"$error":"#REF!"}},{"$f":"IF($C$70-$C$69>=3,C94,\"\")","v":{"$error":"#REF!"}},{"$f":"IF($D$48+$D$50-$D$49>=3,A94,\"\")","v":{"$error":"#REF!"}},{"$f":"IF($D$48+$D$50-$D$49>=3,C94,\"\")","v":{"$error":"#REF!"}},{"$f":"IF($D$70-$D$69>=3,A94,\"\")","v":{"$error":"#REF!"}},{"$f":"IF($D$70-$D$69>=3,C94,\"\")","v":{"$error":"#REF!"}}]
["RAID 10 (4-8 HDDs in pairs) ",1,"[780-BBJN]",{"$f":"IF($B$48+$B$50-$B$49=4,A95,\"\")","v":{"$error":"#REF!"}},{"$f":"IF($B$48+$B$50-$B$49=4,C95,\"\")","v":{"$error":"#REF!"}},{"$f":"IF($B$70-$B$69=4,A95,\"\")","v":{"$error":"#REF!"}},{"$f":"IF($B$70-$B$69=4,C95,\"\")","v":{"$error":"#REF!"}},{"$f":"IF($C$48+$C$50-$C$49=4,A95,\"\")","v":{"$error":"#REF!"}},{"$f":"IF($C$48+$C$50-$C$49=4,C95,\"\")","v":{"$error":"#REF!"}},{"$f":"IF($C$70-$C$69=4,A95,\"\")","v":{"$error":"#REF!"}},{"$f":"IF($C$70-$C$69=4,C95,\"\")","v":{"$error":"#REF!"}},{"$f":"IF($D$48+$D$50-$D$49=4,A95,\"\")","v":{"$error":"#REF!"}},{"$f":"IF($D$48+$D$50-$D$49=4,C95,\"\")","v":{"$error":"#REF!"}},{"$f":"IF($D$70-$D$69=4,A95,\"\")","v":{"$error":"#REF!"}},{"$f":"IF($D$70-$D$69=4,C95,\"\")","v":{"$error":"#REF!"}}]
["RAID 1+RAID 1 (2 + 2 HDDs) ",1,"[780-BBJO]",{"$f":"IF($B$48+$B$50-$B$49=4,A96,\"\")","v":{"$error":"#REF!"}},{"$f":"IF($B$48+$B$50-$B$49=4,C96,\"\")","v":{"$error":"#REF!"}},{"$f":"IF($B$70-$B$69=4,A96,\"\")","v":{"$error":"#REF!"}},{"$f":"IF($B$70-$B$69=4,C96,\"\")","v":{"$error":"#REF!"}},{"$f":"IF($C$48+$C$50-$C$49=4,A96,\"\")","v":{"$error":"#REF!"}},{"$f":"IF($C$48+$C$50-$C$49=4,C96,\"\")","v":{"$error":"#REF!"}},{"$f":"IF($C$70-$C$69=4,A96,\"\")","v":{"$error":"#REF!"}},{"$f":"IF($C$70-$C$69=4,C96,\"\")","v":{"$error":"#REF!"}},{"$f":"IF($D$48+$D$50-$D$49=4,A96,\"\")","v":{"$error":"#REF!"}},{"$f":"IF($D$48+$D$50-$D$49=4,C96,\"\")","v":{"$error":"#REF!"}},{"$f":"IF($D$70-$D$69=4,A96,\"\")","v":{"$error":"#REF!"}},{"$f":"IF($D$70-$D$69=4,C96,\"\")","v":{"$error":"#REF!"}}]
["RAID 1+RAID 5 (2 + 3-8 HDDs)",1,"[780-BBJP]",{"$f":"IF($B$48+$B$50-$B$49>=5,A97,\"\")","v":{"$error":"#REF!"}},{"$f":"IF($B$48+$B$50-$B$49>=5,C97,\"\")","v":{"$error":"#REF!"}},{"$f":"IF($B$70-$B$69>=5,A97,\"\")","v":{"$error":"#REF!"}},{"$f":"IF($B$70-$B$69>=5,C97,\"\")","v":{"$error":"#REF!"}},{"$f":"IF($C$48+$C$50-$C$49>=5,A97,\"\")","v":{"$error":"#REF!"}},{"$f":"IF($C$48+$C$50-$C$49>=5,C97,\"\")","v":{"$error":"#REF!"}},{"$f":"IF($C$70-$C$69>=5,A97,\"\")","v":{"$error":"#REF!"}},{"$f":"IF($C$70-$C$69>=5,C97,\"\")","v":{"$error":"#REF!"}},{"$f":"IF($D$48+$D$50-$D$49>=5,A97,\"\")","v":{"$error":"#REF!"}},{"$f":"IF($D$48+$D$50-$D$49>=5,C97,\"\")","v":{"$error":"#REF!"}},{"$f":"IF($D$70-$D$69>=5,A97,\"\")","v":{"$error":"#REF!"}},{"$f":"IF($D$70-$D$69>=5,C97,\"\")","v":{"$error":"#REF!"}}]
["RAID 1 + RAID 10 (2 + 4 HDDs in pairs) ",1,"[780-BBJQ] ",{"$f":"IF($B$48+$B$50-$B$49=6,A98,\"\")","v":{"$error":"#REF!"}},{"$f":"IF($B$48+$B$50-$B$49=6,C98,\"\")","v":{"$error":"#REF!"}},{"$f":"IF($B$70-$B$69=6,A98,\"\")","v":{"$error":"#REF!"}},{"$f":"IF($B$70-$B$69=6,C98,\"\")","v":{"$error":"#REF!"}},{"$f":"IF($C$48+$C$50-$C$49=6,A98,\"\")","v":{"$error":"#REF!"}},{"$f":"IF($C$48+$C$50-$C$49=6,C98,\"\")","v":{"$error":"#REF!"}},{"$f":"IF($C$70-$C$69=6,A98,\"\")","v":{"$error":"#REF!"}},{"$f":"IF($C$70-$C$69=6,C98,\"\")","v":{"$error":"#REF!"}},{"$f":"IF($D$48+$D$50-$D$49=6,A98,\"\")","v":{"$error":"#REF!"}},{"$f":"IF($D$48+$D$50-$D$49=6,C98,\"\")","v":{"$error":"#REF!"}},{"$f":"IF($D$70-$D$69=6,A98,\"\")","v":{"$error":"#REF!"}},{"$f":"IF($D$70-$D$69=6,C98,\"\")","v":{"$error":"#REF!"}}]
[]
[]
[]
[]
[]
[]
["T630"]
["300GB 10K RPM SAS 12Gbps 2.5in Hot-plug Hard Drive,CusKit",null,"10L1-HDD300GB-T","S10L1-T630-HDD300","[400-AJOQ]",91]
["1TB 7.2K RPM NLSAS 6Gbps 2.5in Hot-plug Hard Drive,13G,CusKit",null,"10L1-HDD1TB","S10L1-T630-HDD1000","[400-AEFF]",296]
[]
["HDD max",32]
["HDD 300GB Base",2]
["HDD 300GB Selected",{"$f":"#REF!","v":{"$error":"#REF!"}}]
["300GB 10K RPM SAS 12Gbps 2.5in Hot-plug Hard Drive,CusKit",0,null,"Hot Spare for 300GB HDD",{"$f":"#REF!","v":{"$error":"#REF!"}},{"$f":"IF(E112=\"Yes\",1,0)","v":{"$error":"#REF!"}}]
[null,1]
[null,2]
[null,3]
[null,4]
[null,5]
[null,6]
[null,7]
[null,8]
[null,9]
[null,10]
[null,11]
[null,12]
[null,13]
[null,14]
[null,15]
[null,16]
[null,17]
[null,18]
[null,19]
[null,20]
[null,21]
[null,22]
[null,23]
[null,24]
[null,25]
[null,26]
[null,27]
[null,28]
[null,29]
[null,30]
["HDD max",32]
["HDD 300GB",{"$f":"B110+B111","v":{"$error":"#REF!"}}]
["HDD 1TB Selected",{"$f":"#REF!","v":{"$error":"#REF!"}},null,"Hot Spare for 1TB HDD",{"$f":"#REF!","v":{"$error":"#REF!"}},{"$f":"IF(E145=\"Yes\",1,0)","v":{"$error":"#REF!"}}]
["1TB 7.2K RPM NLSAS 6Gbps 2.5in Hot-plug Hard Drive,13G,CusKit",{"$f":"$B$143-$B$144-$B$145","v":{"$error":"#REF!"}}]
[null,{"$f":"IF(B146-1<1,0,B146-1)","v":{"$error":"#REF!"}}]
[null,{"$error":"#REF!"}]
[null,{"$error":"#REF!"}]
[null,{"$error":"#REF!"}]
[null,{"$error":"#REF!"}]
[null,{"$error":"#REF!"}]
[null,{"$error":"#REF!"}]
[null,{"$error":"#REF!"}]
[null,{"$f":"IF(B154-1<1,0,B154-1)","v":{"$error":"#REF!"}}]
[null,{"$error":"#REF!"}]
[null,{"$error":"#REF!"}]
[null,{"$error":"#REF!"}]
[null,{"$error":"#REF!"}]
[null,{"$error":"#REF!"}]
[null,{"$error":"#REF!"}]
[null,{"$error":"#REF!"}]
[null,{"$error":"#REF!"}]
[null,{"$error":"#REF!"}]
[null,{"$error":"#REF!"}]
[null,{"$error":"#REF!"}]
[null,{"$error":"#REF!"}]
[null,{"$error":"#REF!"}]
[null,{"$error":"#REF!"}]
[null,{"$error":"#REF!"}]
[null,{"$error":"#REF!"}]
[null,{"$error":"#REF!"}]
[null,{"$error":"#REF!"}]
[null,{"$error":"#REF!"}]
[null,{"$error":"#REF!"}]
[null,{"$error":"#REF!"}]
[]
["RAID Configuration",null,null,"HDD 300GB",null,"HDD 1TB"]
["C1 - No RAID for H330 (1-8 HDDs)",{"$f":"IF($B$106<=8,0,\"\")","v":0},"[780-BBJC]",{"$f":"IF($F$112=0,A179,\"\")","v":{"$error":"#REF!"}},{"$f":"IF($F$112=0,C179,\"\")","v":{"$error":"#REF!"}},{"$f":"IF($F$145=0,A179,\"\")","v":{"$error":"#REF!"}},{"$f":"IF($F$145=0,C179,\"\")","v":{"$error":"#REF!"}}]
["C10 - Unconfigured RAID for H330 (1-8 HDDs)",1,"[780-BBJD] ",{"$f":"IF($F$112=0,A180,\"\")","v":{"$error":"#REF!"}},{"$f":"IF($F$112=0,C180,\"\")","v":{"$error":"#REF!"}},{"$f":"IF($F$145=0,A180,\"\")","v":{"$error":"#REF!"}},{"$f":"IF($F$145=0,C180,\"\")","v":{"$error":"#REF!"}}]
["C2 - RAID 0 for H330 (1-8 HDDs)",1,"[780-BBJF]",{"$f":"IF($F$112=0,A181,\"\")","v":{"$error":"#REF!"}},{"$f":"IF($F$112=0,C181,\"\")","v":{"$error":"#REF!"}},{"$f":"IF($F$145=0,A181,\"\")","v":{"$error":"#REF!"}},{"$f":"IF($F$145=0,C181,\"\")","v":{"$error":"#REF!"}}]
["C3 - RAID 1 for H330 (2 HDDs)",1,"[780-BBJK]",{"$f":"IF($B$110+$B$111-$F$112=2,A182,\"\")","v":{"$error":"#REF!"}},{"$f":"IF($B$110+$B$111-$F$112=2,C182,\"\")","v":{"$error":"#REF!"}},{"$f":"IF($B$145-$F$145=2,A182,\"\")","v":{"$error":"#REF!"}},{"$f":"IF($B$145-$F$145=2,C182,\"\")","v":{"$error":"#REF!"}}]
["C4 - RAID 5 for H330 (3-8 HDDs)",1,"[780-BBJL]",{"$f":"IF($B$110+$B$111-$F$112>=3,A183,\"\")","v":{"$error":"#REF!"}},{"$f":"IF($B$110+$B$111-$F$112>=3,C183,\"\")","v":{"$error":"#REF!"}},{"$f":"IF($B$145-$F$145>=3,A183,\"\")","v":{"$error":"#REF!"}},{"$f":"IF($B$145-$F$145>=3,C183,\"\")","v":{"$error":"#REF!"}}]
["C6 - RAID 10 forH330 (4-8 HDDs in pairs) ",1,"[780-BBJN]",{"$f":"IF($B$110+$B$111-$F$112=4,A184,\"\")","v":{"$error":"#REF!"}},{"$f":"IF($B$110+$B$111-$F$112=4,C184,\"\")","v":{"$error":"#REF!"}},{"$f":"IF($B$145-$F$145=4,A184,\"\")","v":{"$error":"#REF!"}},{"$f":"IF($B$145-$F$145=4,C184,\"\")","v":{"$error":"#REF!"}}]
["C7 - RAID 1+RAID 1 for H330 (2 + 2 HDDs) ",1,"[780-BBJO]",{"$f":"IF($B$110+$B$111-$F$112=4,A185,\"\")","v":{"$error":"#REF!"}},{"$f":"IF($B$110+$B$111-$F$112=4,C185,\"\")","v":{"$error":"#REF!"}},{"$f":"IF($B$145-$F$145=4,A185,\"\")","v":{"$error":"#REF!"}},{"$f":"IF($B$145-$F$145=4,C185,\"\")","v":{"$error":"#REF!"}}]
["C8 - RAID 1+RAID 5 for H330 (2 + 3-8 HDDs)",1,"[780-BBJP]",{"$f":"IF($B$110+$B$111-$F$112>=5,A186,\"\")","v":{"$error":"#REF!"}},{"$f":"IF($B$110+$B$111-$F$112>=5,C186,\"\")","v":{"$error":"#REF!"}},{"$f":"IF($B$145-$F$145>=5,A186,\"\")","v":{"$error":"#REF!"}},{"$f":"IF($B$145-$F$145>=5,C186,\"\")","v":{"$error":"#REF!"}}]
["C9 - RAID 1+RAID 10 for H330 (2 + 4 HDDs in pairs) ",1,"[780-BBJQ] ",{"$f":"IF($B$110+$B$111-$F$112=6,A187,\"\")","v":{"$error":"#REF!"}},{"$f":"IF($B$110+$B$111-$F$112=6,C187,\"\")","v":{"$error":"#REF!"}},{"$f":"IF($B$145-$F$145=6,A187,\"\")","v":{"$error":"#REF!"}},{"$f":"IF($B$145-$F$145=6,C187,\"\")","v":{"$error":"#REF!"}}]

{"sheet":"PCI","index":9,"n_rows":214,"n_cols":9,"rows_kept":214,"cut":false,"hidden":true,"merged":[]}
["Scheda Mezzanine Slot 2"]
["BL460c Gen9"]
["None",{"$f":"\"\"","v":""},{"$f":"\"\"","v":""},{"$f":"\"\"","v":""},{"$f":"\"\"","v":""},{"$f":"\"\"","v":""},{"$f":"\"\"","v":""},0,{"$f":"\"\"","v":""}]
["HPE FlexFabric 10Gb 2-port 534M Adapter",1,"S4-700748-B21","S4-700748-B21","700748-B21",532]
["HPE Ethernet 10Gb 2-port 560M Adapter",1,"S4-665246-B21","S4-665246-B21","665246-B21",596]
[]
["Altre Schede per  Mezzanine Slot 2"]
["HPE Ethernet 1Gb 4-port 366M Adapter",1,"TS1L4-615729-B21","TS1L4-615729-B21","615729-B21"]
["HPE FlexFabric 20Gb 2-port 630M Adapter",1,"TS1L4-700076-B21","TS1L4-700076-B21","700076-B21"]
["HPE FlexFabric 10Gb 2-port 534M Adapter",1,"TS1L4-700748-B21","TS1L4-700748-B21","700748-B21"]
["HPE FlexFabric 20Gb 2-port 650M Adapter",1,"TS1L4-700767-B21","TS1L4-700767-B21","700767-B21"]
["HPE QMH2572 8Gb Fibre Channel Host Bus Adapter for BladeSystem c-Class",1,"TS1L4-651281-B21","TS1L4-651281-B21","651281-B21"]
["HPE LPe1205A 8Gb Fibre Channel Host Bus Adapter for BladeSystem c-Class",1,"TS1L4-659818-B21","TS1L4-659818-B21","659818-B21"]
["HPE QMH2672 16Gb Fibre Channel Host Bus Adapter",1,"TS1L4-710608-B21","TS1L4-710608-B21","710608-B21"]
["HPE LPe1605 16Gb Fibre Channel HBA for BladeSystem c-Class",1,"TS1L4-718203-B21","TS1L4-718203-B21","718203-B21"]
["HP InfiniBand FDR 2-port 545M Adapter",1,"TS1L4-702213-B21","TS1L4-702213-B21","702213-B21"]
["HPE InfiniBand QDR/Ethernet 10Gb 2-port 544+M Adapter",1,"TS1L4-764282-B21","TS1L4-764282-B21","764282-B21"]
["HPE InfiniBand FDR/Ethernet 10Gb/40Gb 2-port 544+M Adapter",1,"TS1L4-764283-B21","TS1L4-764283-B21","764283-B21"]
["HPE Smart Array P741m/2GB FBWC 12Gb 4-ports Ext Mezzanine SAS Controller",1,"TS1L4-726782-B21","TS1L4-726782-B21","726782-B21"]
[]
["Additional Card for PCIe Slot 3"]
["DL560"]
["None","","","","","","",0,""]
["HPE Ethernet 1Gb 2P 332T Adptr",1,"10L2-LAN1GB","S10L1-DL560-LAN1","615732-B21",35,"",0,""]
["HPE Ethernet 10Gb 2P 530SFP+ Adptr",1,"10L2-LAN10GB","S10L1-DL560-LAN10","652503-B21",716,"HPE BLc 10G SFP+ SR Transceiver",2,"455883-B21"]
["HPE StoreFabric CN1200E 10Gb CNA",1,"10L2-CNA10","S10L1-DL560-CNA10","E7Y06A",778,"HPE BLc 10G SFP+ SR Transceiver",2,"455883-B21"]
["HPE 82Q 8Gb Dual Port PCI-e FC HBA",1,"10L2-FC","S10L1-DL560-FC","AJ764A",889,null,0,""]
[]
["Additional Card for PCIe Slot 4"]
["DL560"]
["None","","","","","","",0,""]
["HPE Ethernet 1Gb 2P 332T Adptr",1,"10L2-LAN1GB","S10L1-DL560-LAN1","615732-B21",35,"",0,""]
["HPE Ethernet 10Gb 2P 530SFP+ Adptr",1,"10L2-LAN10GB","S10L1-DL560-LAN10","652503-B21",716,"HPE BLc 10G SFP+ SR Transceiver",2,"455883-B21"]
["HPE StoreFabric CN1200E 10Gb CNA",1,"10L2-CNA10","S10L1-DL560-CNA10","E7Y06A",778,"HPE BLc 10G SFP+ SR Transceiver",2,"455883-B21"]
["HPE 82Q 8Gb Dual Port PCI-e FC HBA",1,"10L2-FC","S10L1-DL560-FC","AJ764A",889,null,0,""]
[]
["Additional Card for PCIe Slot 5"]
["DL560"]
["None","","","","","","",0,""]
["HPE Ethernet 1Gb 2P 332T Adptr",1,"10L2-LAN1GB","S10L1-DL560-LAN1","615732-B21",35,"",0,""]
["HPE Ethernet 10Gb 2P 530SFP+ Adptr",1,"10L2-LAN10GB","S10L1-DL560-LAN10","652503-B21",716,"HPE BLc 10G SFP+ SR Transceiver",2,"455883-B21"]
["HPE StoreFabric CN1200E 10Gb CNA",1,"10L2-CNA10","S10L1-DL560-CNA10","E7Y06A",778,"HPE BLc 10G SFP+ SR Transceiver",2,"455883-B21"]
["HPE 82Q 8Gb Dual Port PCI-e FC HBA",1,"10L2-FC","S10L1-DL560-FC","AJ764A",889,null,0,""]
[]
["Additional Card for PCIe Slot 6"]
["DL560"]
["None","","","","","","",0,""]
["HPE Ethernet 1Gb 2P 332T Adptr",1,"10L2-LAN1GB","S10L1-DL560-LAN1","615732-B21",35,"",0,""]
["HPE Ethernet 10Gb 2P 530SFP+ Adptr",1,"10L2-LAN10GB","S10L1-DL560-LAN10","652503-B21",716,"HPE BLc 10G SFP+ SR Transceiver",2,"455883-B21"]
["HPE StoreFabric CN1200E 10Gb CNA",1,"10L2-CNA10","S10L1-DL560-CNA10","E7Y06A",778,"HPE BLc 10G SFP+ SR Transceiver",2,"455883-B21"]
["HPE 82Q 8Gb Dual Port PCI-e FC HBA",1,"10L2-FC","S10L1-DL560-FC","AJ764A",889,null,0,""]
[]
["Additional Card for PCIe Slot 7"]
["DL560"]
["None","","","","","","",0,""]
["HPE Ethernet 1Gb 2P 332T Adptr",1,"10L2-LAN1GB","S10L1-DL560-LAN1","615732-B21",35,"",0,""]
["HPE Ethernet 10Gb 2P 530SFP+ Adptr",1,"10L2-LAN10GB","S10L1-DL560-LAN10","652503-B21",716,"HPE BLc 10G SFP+ SR Transceiver",2,"455883-B21"]
["HPE StoreFabric CN1200E 10Gb CNA",1,"10L2-CNA10","S10L1-DL560-CNA10","E7Y06A",778,"HPE BLc 10G SFP+ SR Transceiver",2,"455883-B21"]
["HPE 82Q 8Gb Dual Port PCI-e FC HBA",1,"10L2-FC","S10L1-DL560-FC","AJ764A",889,null,0,""]
[]
[]
["Additional Card for PCIe Slot 1"]
["DL580"]
["None","","","","","","",0,""]
["HPE Ethernet 1Gb 2P 332T Adptr",1,"10L2-LAN1GB","S10L1-DL560-LAN1","615732-B21",35,"",0,""]
["HPE Ethernet 10Gb 2P 530SFP+ Adptr",1,"10L2-LAN10GB","S10L1-DL560-LAN10","652503-B21",716,"HPE BLc 10G SFP+ SR Transceiver",2,"455883-B21"]
["HPE StoreFabric CN1200E 10Gb CNA",1,"10L2-CNA10","S10L1-DL560-CNA10","E7Y06A",778,"HPE BLc 10G SFP+ SR Transceiver",2,"455883-B21"]
["HPE 82Q 8Gb Dual Port PCI-e FC HBA",1,"10L2-FC","S10L1-DL560-FC","AJ764A",889,null,0,""]
[]
["Additional Card for PCIe Slot 2"]
["DL580"]
["None","","","","","","",0,""]
["HPE Ethernet 1Gb 2P 332T Adptr",1,"10L2-LAN1GB","S10L1-DL560-LAN1","615732-B21",35,"",0,""]
["HPE Ethernet 10Gb 2P 530SFP+ Adptr",1,"10L2-LAN10GB","S10L1-DL560-LAN10","652503-B21",716,"HPE BLc 10G SFP+ SR Transceiver",2,"455883-B21"]
["HPE StoreFabric CN1200E 10Gb CNA",1,"10L2-CNA10","S10L1-DL560-CNA10","E7Y06A",778,"HPE BLc 10G SFP+ SR Transceiver",2,"455883-B21"]
["HPE 82Q 8Gb Dual Port PCI-e FC HBA",1,"10L2-FC","S10L1-DL560-FC","AJ764A",889,null,0,""]
[]
["Additional Card for PCIe Slot 3"]
["DL580"]
["None","","","","","","",0,""]
["HPE Ethernet 1Gb 2P 332T Adptr",1,"10L2-LAN1GB","S10L1-DL560-LAN1","615732-B21",35,"",0,""]
["HPE Ethernet 10Gb 2P 530SFP+ Adptr",1,"10L2-LAN10GB","S10L1-DL560-LAN10","652503-B21",716,"HPE BLc 10G SFP+ SR Transceiver",2,"455883-B21"]
["HPE StoreFabric CN1200E 10Gb CNA",1,"10L2-CNA10","S10L1-DL560-CNA10","E7Y06A",778,"HPE BLc 10G SFP+ SR Transceiver",2,"455883-B21"]
["HPE 82Q 8Gb Dual Port PCI-e FC HBA",1,"10L2-FC","S10L1-DL560-FC","AJ764A",889,null,0,""]
[]
["Additional Card for PCIe Slot 4"]
["DL580"]
["None","","","","","","",0,""]
["HPE Ethernet 1Gb 2P 332T Adptr",1,"10L2-LAN1GB","S10L1-DL560-LAN1","615732-B21",35,"",0,""]
["HPE Ethernet 10Gb 2P 530SFP+ Adptr",1,"10L2-LAN10GB","S10L1-DL560-LAN10","652503-B21",716,"HPE BLc 10G SFP+ SR Transceiver",2,"455883-B21"]
["HPE StoreFabric CN1200E 10Gb CNA",1,"10L2-CNA10","S10L1-DL560-CNA10","E7Y06A",778,"HPE BLc 10G SFP+ SR Transceiver",2,"455883-B21"]
["HPE 82Q 8Gb Dual Port PCI-e FC HBA",1,"10L2-FC","S10L1-DL560-FC","AJ764A",889,null,0,""]
[]
["Additional Card for PCIe Slot 5"]
["DL580"]
["None","","","","","","",0,""]
["HPE Ethernet 1Gb 2P 332T Adptr",1,"10L2-LAN1GB","S10L1-DL560-LAN1","615732-B21",35,"",0,""]
["HPE Ethernet 10Gb 2P 530SFP+ Adptr",1,"10L2-LAN10GB","S10L1-DL560-LAN10","652503-B21",716,"HP BLc 10G SFP+ SR Transceiver",2,"455883-B21"]
["HPE StoreFabric CN1200E 10Gb CNA",1,"10L2-CNA10","S10L1-DL560-CNA10","E7Y06A",778,"HP BLc 10G SFP+ SR Transceiver",2,"455883-B21"]
["HPE 82Q 8Gb Dual Port PCI-e FC HBA",1,"10L2-FC","S10L1-DL560-FC","AJ764A",889,null,0,""]
[]
["Additional Card for PCIe Slot 6"]
["DL580"]
["None","","","","","","",0,""]
["HPE Ethernet 1Gb 2P 332T Adptr",1,"10L2-LAN1GB","S10L1-DL560-LAN1","615732-B21",35,"",0,""]
["HPE Ethernet 10Gb 2P 530SFP+ Adptr",1,"10L2-LAN10GB","S10L1-DL560-LAN10","652503-B21",716,"HPE BLc 10G SFP+ SR Transceiver",2,"455883-B21"]
["HPE StoreFabric CN1200E 10Gb CNA",1,"10L2-CNA10","S10L1-DL560-CNA10","E7Y06A",778,"HPE BLc 10G SFP+ SR Transceiver",2,"455883-B21"]
["HPE 82Q 8Gb Dual Port PCI-e FC HBA",1,"10L2-FC","S10L1-DL560-FC","AJ764A",889,null,0,""]
[]
["Additional Card for PCIe Slot 7"]
["DL580"]
["None","","","","","","",0,""]
["HPE Ethernet 1Gb 2P 332T Adptr",1,"10L2-LAN1GB","S10L1-DL560-LAN1","615732-B21",35,"",0,""]
["HPE Ethernet 10Gb 2P 530SFP+ Adptr",1,"10L2-LAN10GB","S10L1-DL560-LAN10","652503-B21",716,"HPE BLc 10G SFP+ SR Transceiver",2,"455883-B21"]
["HPE StoreFabric CN1200E 10Gb CNA",1,"10L2-CNA10","S10L1-DL560-CNA10","E7Y06A",778,"HPE BLc 10G SFP+ SR Transceiver",2,"455883-B21"]
["HPE 82Q 8Gb Dual Port PCI-e FC HBA",1,"10L2-FC","S10L1-DL560-FC","AJ764A",889,null,0,""]
[]
["Additional Card for PCIe Slot 8"]
["DL580"]
["None","","","","","","",0,""]
["HPE Ethernet 1Gb 2P 332T Adptr",1,"10L2-LAN1GB","S10L1-DL560-LAN1","615732-B21",35,"",0,""]
["HPE Ethernet 10Gb 2P 530SFP+ Adptr",1,"10L2-LAN10GB","S10L1-DL560-LAN10","652503-B21",716,"HPE BLc 10G SFP+ SR Transceiver",2,"455883-B21"]
["HPE StoreFabric CN1200E 10Gb CNA",1,"10L2-CNA10","S10L1-DL560-CNA10","E7Y06A",778,"HPE BLc 10G SFP+ SR Transceiver",2,"455883-B21"]
["HPE 82Q 8Gb Dual Port PCI-e FC HBA",1,"10L2-FC","S10L1-DL560-FC","AJ764A",889,null,0,""]
[]
["Additional Card for PCIe Slot 9"]
["DL580"]
["None","","","","","","",0,""]
["HPE Ethernet 1Gb 2P 332T Adptr",1,"10L2-LAN1GB","S10L1-DL560-LAN1","615732-B21",35,"",0,""]
["HPE Ethernet 10Gb 2P 530SFP+ Adptr",1,"10L2-LAN10GB","S10L1-DL560-LAN10","652503-B21",716,"HPE BLc 10G SFP+ SR Transceiver",2,"455883-B21"]
["HPE StoreFabric CN1200E 10Gb CNA",1,"10L2-CNA10","S10L1-DL560-CNA10","E7Y06A",778,"HPE BLc 10G SFP+ SR Transceiver",2,"455883-B21"]
["HPE 82Q 8Gb Dual Port PCI-e FC HBA",1,"10L2-FC","S10L1-DL560-FC","AJ764A",889,null,0,""]
[]
["Aggiungere Coppia di Processori"]
[]
[]
[]
[]
[]
[]
[]
[]
[]
[]
[]
[]
[]
[]
[]
[]
[]
[]
[]
[]
[]
[]
[]
[]
[]
[]
[]
[]
[]
[]
[]
[]
[]
["Additional Card for PCIe Slot 1 (Full height) (CPU1)"]
["T630"]
["None",{"$f":"\"\"","v":""},{"$f":"\"\"","v":""},{"$f":"\"\"","v":""},{"$f":"\"\"","v":""},{"$f":"\"\"","v":""},{"$f":"\"\"","v":""},0,{"$f":"\"\"","v":""}]
["Broadcom 5720 DP 1Gb Network Interface Card,Full Height,CusKit",1,"10L1-LAN1GB","S10L1-T630-LAN1","[540-BBGY]",35,"",0,""]
["Emulex LPE 12002, Dual Port 8Gb Fibre Channel HBA,Full Height,CusKit",1,"10L1-FC","S10L1-T630-FC","[406-BBGR]",940,null,0,""]
["QLogic 57810 Dual Port 10Gb Direct Attach/SFP+ Network Adapter,Full Height,CusKit",1,"10L1-LAN10GB","S10L1-T630-LAN10","[540-BBGS]",417,"PowerEdge SFP+, 10GbE SR/SX, Optical Tranceiver, LC Connector, for Intel and Broadcom,CusKit",2,"[407-BBOK]"]
[]
[]
["Additional Card for PCIe Slot 2 (Full height) (CPU1)"]
["T630"]
["None",{"$f":"\"\"","v":""},{"$f":"\"\"","v":""},{"$f":"\"\"","v":""},{"$f":"\"\"","v":""},{"$f":"\"\"","v":""},{"$f":"\"\"","v":""},0,{"$f":"\"\"","v":""}]
["Broadcom 5720 DP 1Gb Network Interface Card,Full Height,CusKit",1,"10L1-LAN1GB","S10L1-T630-LAN1","[540-BBGY]",35,"",0,""]
["Emulex LPE 12002, Dual Port 8Gb Fibre Channel HBA,Full Height,CusKit",1,"10L1-FC","S10L1-T630-FC","[406-BBGR]",940,null,0,""]
["QLogic 57810 Dual Port 10Gb Direct Attach/SFP+ Network Adapter,Full Height,CusKit",1,"10L1-LAN10GB","S10L1-T630-LAN10","[540-BBGS]",417,"PowerEdge SFP+, 10GbE SR/SX, Optical Tranceiver, LC Connector, for Intel and Broadcom,CusKit",2,"[407-BBOK]"]
[]
[]
["Additional Card for PCIe Slot 3 (Full height) (CPU2)"]
["T630"]
["None",{"$f":"\"\"","v":""},{"$f":"\"\"","v":""},{"$f":"\"\"","v":""},{"$f":"\"\"","v":""},{"$f":"\"\"","v":""},{"$f":"\"\"","v":""},0,{"$f":"\"\"","v":""}]
["Broadcom 5720 DP 1Gb Network Interface Card,Full Height,CusKit",1,"10L1-LAN1GB","S10L1-T630-LAN1","[540-BBGY]",35,"",0,""]
["Emulex LPE 12002, Dual Port 8Gb Fibre Channel HBA,Full Height,CusKit",1,"10L1-FC","S10L1-T630-FC","[406-BBGR]",940,null,0,""]
["QLogic 57810 Dual Port 10Gb Direct Attach/SFP+ Network Adapter,Full Height,CusKit",1,"10L1-LAN10GB","S10L1-T630-LAN10","[540-BBGS]",417,"PowerEdge SFP+, 10GbE SR/SX, Optical Tranceiver, LC Connector, for Intel and Broadcom,CusKit",2,"[407-BBOK]"]
[]
[]
["Additional Card for PCIe Slot 4 (Full height) (CPU2)"]
["T630"]
["None",{"$f":"\"\"","v":""},{"$f":"\"\"","v":""},{"$f":"\"\"","v":""},{"$f":"\"\"","v":""},{"$f":"\"\"","v":""},{"$f":"\"\"","v":""},0,{"$f":"\"\"","v":""}]
["Broadcom 5720 DP 1Gb Network Interface Card,Full Height,CusKit",1,"10L1-LAN1GB","S10L1-T630-LAN1","[540-BBGY]",35,"",0,""]
["Emulex LPE 12002, Dual Port 8Gb Fibre Channel HBA,Full Height,CusKit",1,"10L1-FC","S10L1-T630-FC","[406-BBGR]",940,null,0,""]
["QLogic 57810 Dual Port 10Gb Direct Attach/SFP+ Network Adapter,Full Height,CusKit",1,"10L1-LAN10GB","S10L1-T630-LAN10","[540-BBGS]",417,"PowerEdge SFP+, 10GbE SR/SX, Optical Tranceiver, LC Connector, for Intel and Broadcom,CusKit",2,"[407-BBOK]"]
[]
[]
[]
["Additional Card for PCIe Slot 5 (Full height) (CPU2)"]
["T630"]
["None",{"$f":"\"\"","v":""},{"$f":"\"\"","v":""},{"$f":"\"\"","v":""},{"$f":"\"\"","v":""},{"$f":"\"\"","v":""},{"$f":"\"\"","v":""},0,{"$f":"\"\"","v":""}]
["Broadcom 5720 DP 1Gb Network Interface Card,Full Height,CusKit",1,"10L1-LAN1GB","S10L1-T630-LAN1","[540-BBGY]",35,"",0,""]
["Emulex LPE 12002, Dual Port 8Gb Fibre Channel HBA,Full Height,CusKit",1,"10L1-FC","S10L1-T630-FC","[406-BBGR]",940,null,0,""]
["QLogic 57810 Dual Port 10Gb Direct Attach/SFP+ Network Adapter,Full Height,CusKit",1,"10L1-LAN10GB","S10L1-T630-LAN10","[540-BBGS]",417,"PowerEdge SFP+, 10GbE SR/SX, Optical Tranceiver, LC Connector, for Intel and Broadcom,CusKit",2,"[407-BBOK]"]
[]
[]
["Additional Card for PCIe Slot 6 (Full height) (CPU2)"]
["T630"]
["None",{"$f":"\"\"","v":""},{"$f":"\"\"","v":""},{"$f":"\"\"","v":""},{"$f":"\"\"","v":""},{"$f":"\"\"","v":""},{"$f":"\"\"","v":""},0,{"$f":"\"\"","v":""}]
["Broadcom 5720 DP 1Gb Network Interface Card,Full Height,CusKit",1,"10L1-LAN1GB","S10L1-T630-LAN1","[540-BBGY]",35,"",0,""]
["Emulex LPE 12002, Dual Port 8Gb Fibre Channel HBA,Full Height,CusKit",1,"10L1-FC","S10L1-T630-FC","[406-BBGR]",940,null,0,""]
["QLogic 57810 Dual Port 10Gb Direct Attach/SFP+ Network Adapter,Full Height,CusKit",1,"10L1-LAN10GB","S10L1-T630-LAN10","[540-BBGS]",417,"PowerEdge SFP+, 10GbE SR/SX, Optical Tranceiver, LC Connector, for Intel and Broadcom,CusKit",2,"[407-BBOK]"]

{"sheet":"Servizi Opzionali","index":10,"n_rows":81,"n_cols":13,"rows_kept":81,"cut":false,"hidden":true,"merged":[]}
["Warranty Upgrades",null,null,null,null,null,"Protezione dei dati - Keep Your Hard Drive "]
["DL560"]
["None",{"$f":"\"\"","v":""},{"$f":"\"\"","v":""},{"$f":"\"\"","v":""},{"$f":"\"\"","v":""},{"$f":"\"\"","v":""},null,null,{"$f":"IF(($A$22=$A$12),\"\",IF($A$8=$A$3,I13,IF($A$8=$A$4,I14,IF($A$8=$A$5,I15))))","v":{"$error":"#REF!"}},{"$f":"IF(($A$22=$A$12),\"\",IF($A$8=$A$3,J13,IF($A$8=$A$4,J14,IF($A$8=$A$5,J15))))","v":{"$error":"#REF!"}},{"$f":"IF(($A$22=$A$12),\"\",IF($A$8=$A$3,K13,IF($A$8=$A$4,K14,IF($A$8=$A$5,K15))))","v":{"$error":"#REF!"}},{"$f":"IF(($A$22=$A$12),\"\",IF($A$8=$A$3,L13,IF($A$8=$A$4,L14,IF($A$8=$A$5,L15))))","v":{"$error":"#REF!"}},{"$f":"IF(($A$22=$A$12),\"\",IF($A$8=$A$3,M13,IF($A$8=$A$4,M14,IF($A$8=$A$5,M15))))","v":{"$error":"#REF!"}}]
["Estensione della manutenzione in garanzia per ulteriori 12 mesi",1,"TS1L4-4ANNI","TS1L4-4ANNI",{"$f":"\"\"","v":""},327]
["Estensione della manutenzione in garanzia per ulteriori 24 mesi",1,"TS1L4-5ANNI","TS1L4-5ANNI",{"$f":"\"\"","v":""},610]
[]
["Estensione Garanzia Selezionata"]
[{"$f":"'Lotto4 Blade 2P'!$B$66","v":"None"},null,"DL560"]
[{"$f":"#REF!","v":{"$error":"#REF!"}},null,"DL560 2"]
[{"$f":"#REF!","v":{"$error":"#REF!"}},null,"DL560 3"]
[]
["None",{"$f":"\"\"","v":""},{"$f":"\"\"","v":""},{"$f":"\"\"","v":""},{"$f":"\"\"","v":""},{"$f":"\"\"","v":""},null,"None"]
[{"$f":"IF($A$8=$A$3,H13,IF($A$8=$A$4,H14,IF($A$8=$A$5,H15)))","v":"3Yr Data Protection - Keep Your Hard Drive"},1,"10L2-SO-HDD","S10L2-DL560-S-HDD",{"$f":"IF($A$8=$A$3,L13,IF($A$8=$A$4,L14,IF($A$8=$A$5,L15)))","v":""},300,null,"3Yr Data Protection - Keep Your Hard Drive",1,"10L2-SO-HDD","S10L2-DL560-S-HDD",{"$f":"\"\"","v":""},300]
["None",{"$f":"\"\"","v":""},{"$f":"\"\"","v":""},{"$f":"\"\"","v":""},{"$f":"\"\"","v":""},{"$f":"\"\"","v":""},null,"4Yr Data Protection - Keep Your Hard Drive",{"$f":"I13","v":1},{"$f":"J13","v":"10L2-SO-HDD"},{"$f":"K13","v":"S10L2-DL560-S-HDD"},{"$f":"\"\"","v":""},{"$f":"M13","v":300}]
[{"$f":"IF(A9=A3,H13,IF(A9=A4,H14,IF(A9=A5,H15)))","v":{"$error":"#REF!"}},1,"10L2-SO-HDD","S10L2-DL560-S-HDD",{"$f":"IF(A9=A3,L13,IF(A9=A4,L14,IF(A9=A5,L15)))","v":{"$error":"#REF!"}},300,null,"5Yr Data Protection - Keep Your Hard Drive",{"$f":"I13","v":1},{"$f":"J13","v":"10L2-SO-HDD"},{"$f":"K13","v":"S10L2-DL560-S-HDD"},{"$f":"\"\"","v":""},{"$f":"M13","v":300}]
["None",{"$f":"\"\"","v":""},{"$f":"\"\"","v":""},{"$f":"\"\"","v":""},{"$f":"\"\"","v":""},{"$f":"\"\"","v":""}]
[{"$f":"IF(A10=A3,H13,IF(A10=A4,H14,IF(A10=A5,H15)))","v":{"$error":"#REF!"}},1,"10L2-SO-HDD","S10L2-DL560-S-HDD",{"$f":"IF(A10=A3,L13,IF(A10=A4,L14,IF(A10=A5,L15)))","v":{"$error":"#REF!"}},300]
[]
[]
[]
["Protezione dei dati Selezionata"]
[{"$f":"'Lotto4 Blade 2P'!#REF!","v":{"$error":"#REF!"}}]
[]
["Servizio Specialistico di System and Network Management per sistema opertivo Windows, erogato on site.",1,"10L2-SO-WIN","S10L1-R630-S-WIN",null,200]
["Servizio Specialistico di System and Network Management per sistema opertivo Linux, erogato on site.",1,"10L2-SO-LINUX","S10L1-R630-S-LINUX",null,200]
[]
["None",{"$f":"\"\"","v":""},{"$f":"\"\"","v":""},{"$f":"\"\"","v":""},{"$f":"\"\"","v":""},{"$f":"\"\"","v":""}]
[{"$f":"IF('Lotto4 Blade 2P'!$C$13>=5,H28,\"None\")","v":"None"},{"$f":"IF('Lotto4 Blade 2P'!$C$13>=5,I28,\"\")","v":""},{"$f":"IF('Lotto4 Blade 2P'!$C$13>=5,J28,\"\")","v":""},{"$f":"IF('Lotto4 Blade 2P'!$C$13>=5,K28,\"\")","v":""},{"$f":"IF('Lotto4 Blade 2P'!$C$13>=5,L28,\"\")","v":""},{"$f":"IF('Lotto4 Blade 2P'!$C$13>=5,M28,\"\")","v":""},null,"Servizi di manutenzione preventiva",1,"10L1-SO-PREV","S10L1-T630-S-PREV",null,200]
[]
["Warranty Upgrades",null,null,null,null,null,"Protezione dei dati - Keep Your Hard Drive "]
["DL580"]
["None",{"$f":"\"\"","v":""},{"$f":"\"\"","v":""},{"$f":"\"\"","v":""},{"$f":"\"\"","v":""},{"$f":"\"\"","v":""},null,null,{"$f":"IF(($A$22=$A$12),\"\",IF($A$8=$A$3,I42,IF($A$8=$A$4,I43,IF($A$8=$A$5,I44))))","v":{"$error":"#REF!"}},{"$f":"IF(($A$22=$A$12),\"\",IF($A$8=$A$3,J42,IF($A$8=$A$4,J43,IF($A$8=$A$5,J44))))","v":{"$error":"#REF!"}},{"$f":"IF(($A$22=$A$12),\"\",IF($A$8=$A$3,K42,IF($A$8=$A$4,K43,IF($A$8=$A$5,K44))))","v":{"$error":"#REF!"}},{"$f":"IF(($A$22=$A$12),\"\",IF($A$8=$A$3,L42,IF($A$8=$A$4,L43,IF($A$8=$A$5,L44))))","v":{"$error":"#REF!"}},{"$f":"IF(($A$22=$A$12),\"\",IF($A$8=$A$3,M42,IF($A$8=$A$4,M43,IF($A$8=$A$5,M44))))","v":{"$error":"#REF!"}}]
["4Yr Warranty upgrade ",1,"10L2-SO-12M","S10L2-DL580-S-12M",{"$f":"\"\"","v":""},350]
["5Yr Warranty upgrade ",1,"10L2-SO-24M","S10L1-DL580-S-24M",{"$f":"\"\"","v":""},700]
[]
["Estensione Garanzia Selezionata"]
[{"$f":"Chassis!#REF!","v":{"$error":"#REF!"}},null,"DL580 "]
[{"$f":"#REF!","v":{"$error":"#REF!"}},null,"DL580 2"]
[{"$f":"#REF!","v":{"$error":"#REF!"}},null,"DL580 3"]
[]
["None",{"$f":"\"\"","v":""},{"$f":"\"\"","v":""},{"$f":"\"\"","v":""},{"$f":"\"\"","v":""},{"$f":"\"\"","v":""},null,"None"]
[{"$f":"IF($A$37=$A$32,H42,IF($A$37=$A$33,H43,IF($A$37=$A$34,H44)))","v":{"$error":"#REF!"}},1,"10L2-SO-HDD","S10L2-DL580-S-HDD",{"$f":"IF($A$37=$A$32,L42,IF($A$37=$A$33,L43,IF($A$37=$A$34,L44)))","v":{"$error":"#REF!"}},300,null,"3Yr Data Protection - Keep Your Hard Drive",1,"10L2-SO-HDD","S10L2-DL580-S-HDD","[733-10057]",300]
["None",{"$f":"\"\"","v":""},{"$f":"\"\"","v":""},{"$f":"\"\"","v":""},{"$f":"\"\"","v":""},{"$f":"\"\"","v":""},null,"4Yr Data Protection - Keep Your Hard Drive",{"$f":"I42","v":1},{"$f":"J42","v":"10L2-SO-HDD"},{"$f":"K42","v":"S10L2-DL580-S-HDD"},"[733-10058]",{"$f":"M42","v":300}]
[{"$f":"IF(A38=A32,H42,IF(A38=A33,H43,IF(A38=A34,H44)))","v":{"$error":"#REF!"}},1,"10L2-SO-HDD","S10L2-DL580-S-HDD",{"$f":"IF(A38=A32,L42,IF(A38=A33,L43,IF(A38=A34,L44)))","v":{"$error":"#REF!"}},300,null,"5Yr Data Protection - Keep Your Hard Drive",{"$f":"I42","v":1},{"$f":"J42","v":"10L2-SO-HDD"},{"$f":"K42","v":"S10L2-DL580-S-HDD"},"[733-10059]",{"$f":"M42","v":300}]
["None",{"$f":"\"\"","v":""},{"$f":"\"\"","v":""},{"$f":"\"\"","v":""},{"$f":"\"\"","v":""},{"$f":"\"\"","v":""}]
[{"$f":"IF(A39=A32,H42,IF(A39=A33,H43,IF(A39=A34,H44)))","v":{"$error":"#REF!"}},1,"10L2-SO-HDD","S10L2-DL580-S-HDD",{"$f":"IF(A39=A32,L42,IF(A39=A33,L43,IF(A39=A34,L44)))","v":{"$error":"#REF!"}},300]
[]
[]
[]
["Protezione dei dati Selezionata"]
[{"$f":"Chassis!#REF!","v":{"$error":"#REF!"}}]
[]
["Servizio Specialistico di System and Network Management per sistema opertivo Windows, erogato on site.",1,"10L2-SO-WIN","S10L1-R730xd-S-WIN",null,200]
["Servizio Specialistico di System and Network Management per sistema opertivo Linux, erogato on site.",1,"10L2-SO-LINUX","S10L1-R730xd-S-LINUX",null,200]
[]
["None",{"$f":"\"\"","v":""},{"$f":"\"\"","v":""},{"$f":"\"\"","v":""},{"$f":"\"\"","v":""},{"$f":"\"\"","v":""}]
[{"$f":"IF(Chassis!$C$17>=5,H57,\"None\")","v":"None"},{"$f":"IF(Chassis!$C$17>=5,I57,\"\")","v":""},{"$f":"IF(Chassis!$C$17>=5,J57,\"\")","v":""},{"$f":"IF(Chassis!$C$17>=5,K57,\"\")","v":""},{"$f":"IF(Chassis!$C$17>=5,L57,\"\")","v":""},{"$f":"IF(Chassis!$C$17>=5,M57,\"\")","v":""},null,"Servizi di manutenzione preventiva",1,"10L2-SO-PREV","S10L2-DL580-S-PREV",null,200]
[]
[]
["Warranty Upgrades",null,null,null,null,null,"Protezione dei dati - Keep Your Hard Drive "]
["T630"]
["None",{"$f":"\"\"","v":""},{"$f":"\"\"","v":""},{"$f":"\"\"","v":""},{"$f":"\"\"","v":""},{"$f":"\"\"","v":""},null,null,{"$f":"IF(($A$22=$A$12),\"\",IF($A$8=$A$3,I70,IF($A$8=$A$4,I71,IF($A$8=$A$5,I72))))","v":{"$error":"#REF!"}},{"$f":"IF(($A$22=$A$12),\"\",IF($A$8=$A$3,J70,IF($A$8=$A$4,J71,IF($A$8=$A$5,J72))))","v":{"$error":"#REF!"}},{"$f":"IF(($A$22=$A$12),\"\",IF($A$8=$A$3,K70,IF($A$8=$A$4,K71,IF($A$8=$A$5,K72))))","v":{"$error":"#REF!"}},{"$f":"IF(($A$22=$A$12),\"\",IF($A$8=$A$3,L70,IF($A$8=$A$4,L71,IF($A$8=$A$5,L72))))","v":{"$error":"#REF!"}},{"$f":"IF(($A$22=$A$12),\"\",IF($A$8=$A$3,M70,IF($A$8=$A$4,M71,IF($A$8=$A$5,M72))))","v":{"$error":"#REF!"}}]
["4Yr Warranty upgrade ",1,"10L1-SO-12M-T","S10L1-T630-S-12M",{"$f":"\"\"","v":""},175]
["5Yr Warranty upgrade ",1,"10L1-SO-24M-T","S10L1-T630-S-24M",{"$f":"\"\"","v":""},350]
[]
["Estensione Garanzia Selezionata"]
[{"$f":"#REF!","v":{"$error":"#REF!"}}]
[]
["None",{"$f":"\"\"","v":""},{"$f":"\"\"","v":""},{"$f":"\"\"","v":""},{"$f":"\"\"","v":""},{"$f":"\"\"","v":""},null,"None"]
[{"$f":"IF($A$67=$A$62,H70,IF($A$67=$A$63,H71,IF($A$67=$A$64,H72)))","v":{"$error":"#REF!"}},1,"10L1-SO-HDD","S10L1-T630-S-HDD",{"$f":"IF($A$67=$A$62,L70,IF($A$67=$A$63,L71,IF($A$67=$A$64,L72)))","v":{"$error":"#REF!"}},150,null,"3Yr Data Protection - Keep Your Hard Drive",1,"10L1-SO-HDD","S10L1-T630-S-HDD","[733-10057]",150]
[null,null,null,null,null,null,null,"4Yr Data Protection - Keep Your Hard Drive",{"$f":"I70","v":1},{"$f":"J70","v":"10L1-SO-HDD"},{"$f":"K70","v":"S10L1-T630-S-HDD"},"[733-10058]",{"$f":"M70","v":150}]
[null,null,null,null,null,null,null,"5Yr Data Protection - Keep Your Hard Drive",{"$f":"I70","v":1},{"$f":"J70","v":"10L1-SO-HDD"},{"$f":"K70","v":"S10L1-T630-S-HDD"},"[733-10059]",{"$f":"M70","v":150}]
[]
["Protezione dei dati Selezionata"]
[{"$f":"#REF!","v":{"$error":"#REF!"}}]
[]
["Servizio Specialistico di System and Network Management per sistema opertivo Windows, erogato on site.",1,"10L1-SO-WIN","S10L1-T630-S-WIN",null,193]
["Servizio Specialistico di System and Network Management per sistema opertivo Linux, erogato on site.",1,"10L1-SO-LINUX","S10L1-T630-S-LINUX",null,193]
[]
["None",{"$f":"\"\"","v":""},{"$f":"\"\"","v":""},{"$f":"\"\"","v":""},{"$f":"\"\"","v":""},{"$f":"\"\"","v":""}]
[{"$f":"IF(#REF!>=5,H81,\"None\")","v":{"$error":"#REF!"}},{"$f":"IF(#REF!>=5,I81,\"\")","v":{"$error":"#REF!"}},{"$f":"IF(#REF!>=5,J81,\"\")","v":{"$error":"#REF!"}},{"$f":"IF(#REF!>=5,K81,\"\")","v":{"$error":"#REF!"}},{"$f":"IF(#REF!>=5,L81,\"\")","v":{"$error":"#REF!"}},{"$f":"IF(#REF!>=5,M81,\"\")","v":{"$error":"#REF!"}},null,"Servizi di manutenzione preventiva",1,"10L1-SO-PREV","S10L1-T630-S-PREV",null,193]