{"text_format":"1","workbook":"xlsx","n_sheets":9,"sheets":["Lotto2_R7425-1","Lotto2_R7425-2","Lotto2_R7425-3","Lotto3_R7425(GPU)","Rack e Accessori","Riepilogo","Foglio1","Regole di configurazione","Codici&PrezzixRiepilogo"],"not_rendered":{"charts":0,"images":30,"macros":1,"external_links":0,"defined_names":34,"comments":0,"pivot_tables":0},"unopened":[],"bounds":{"document_bytes":16777216,"sheet_cells":100000,"rows_first":2000,"rows_last":500,"rows_between":2000,"halvings":0,"cell_chars":16384,"cell_head_chars":4096},"cells_cut":0,"cells_raw":0,"read":"whole","date_system":"1900"}

{"sheet":"Lotto2_R7425-1","index":0,"n_rows":147,"n_cols":9,"rows_kept":147,"cut":false,"hidden":false,"merged":[[76,1,76,2],[55,0,61,0],[4,0,4,4],[0,5,1,5],[36,0,40,0],[63,0,71,0]]}
[null,"TOTALE PRODOTTI CONVENZIONE",{"$f":"SUM(G13:G156)*$C$10","v":0},null,null,{"$f":"IF(I1+I2=0,(C1+C2),\"ERRORE VERIFICARE LA CONFIGURAZIONE\")","v":0},null,null,{"$f":"IF(A37=\"\",0,1)","v":0}]
[null,"TOTALE ARTICOLI 20%",{"$f":"SUM(H13:H156)*$C$10","v":0},null,null,null,null,null,{"$f":"IF(A77=\"\",0,1)","v":0}]
[null,"Indicare qui la quantità Server ----->",0,null,null,{"$f":"Riepilogo!T6","v":"ver. 3.0"}]
[]
["          POWEREDGE R7425"]
[]
[]
[]
[]
[null,"Quantità:",{"$f":"C3","v":0}]
[]
[null,"Modello Server"]
[null,"PowerEdge R7425 Server",1,"[210-APFK]",null,"TS2L2-SRV",1849]
[]
[null,"Configurazione dello chassis"]
{"$rows_left_out":133}
{"sheet":"Lotto2_R7425-2","index":1,"n_rows":147,"n_cols":9,"rows_kept":147,"cut":false,"hidden":false,"merged":[[76,1,76,2],[36,0,40,0],[0,5,1,5],[4,0,4,4],[55,0,61,0],[63,0,71,0]]}
[null,"TOTALE PRODOTTI CONVENZIONE",{"$f":"SUM(G13:G153)*$C$10","v":0},null,null,{"$f":"IF(I1+I2=0,(C1+C2),\"ERRORE VERIFICARE LA CONFIGURAZIONE\")","v":0},null,null,{"$f":"IF(A37=\"\",0,1)","v":0}]
[null,"TOTALE ARTICOLI 20%",{"$f":"SUM(H13:H153)*$C$10","v":0},null,null,null,null,null,{"$f":"IF(A77=\"\",0,1)","v":0}]
[null,"Indicare qui la quantità Server ----->",0,null,null,{"$f":"Riepilogo!T6","v":"ver. 3.0"}]
[]
["          POWEREDGE R7425"]
[]
[]
[]
[]
[null,"Quantità:",{"$f":"C3","v":0}]
[]
[null,"Modello Server"]
[null,"PowerEdge R7425 Server",1,"[210-APFK]",null,"TS2L2-SRV",1849]
[]
[null,"Configurazione dello chassis"]
{"$rows_left_out":133}
{"sheet":"Lotto2_R7425-3","index":2,"n_rows":147,"n_cols":9,"rows_kept":147,"cut":false,"hidden":false,"merged":[[76,1,76,2],[36,0,40,0],[0,5,1,5],[4,0,4,4],[55,0,61,0],[63,0,71,0]]}
[null,"TOTALE PRODOTTI CONVENZIONE",{"$f":"SUM(G13:G148)*$C$10","v":0},null,null,{"$f":"IF(I1+I2=0,(C1+C2),\"ERRORE VERIFICARE LA CONFIGURAZIONE\")","v":0},null,null,{"$f":"IF(A37=\"\",0,1)","v":0}]
[null,"TOTALE ARTICOLI 20%",{"$f":"SUM(H13:H148)*$C$10","v":0},null,null,null,null,null,{"$f":"IF(A77=\"\",0,1)","v":0}]
[null,"Indicare qui la quantità Server ----->",0,null,null,{"$f":"Riepilogo!T6","v":"ver. 3.0"}]
[]
["          POWEREDGE R7425"]
[]
[]
[]
[]
[null,"Quantità:",{"$f":"C3","v":0}]
[]
[null,"Modello Server"]
[null,"PowerEdge R7425 Server",1,"[210-APFK]",null,"TS2L2-SRV",1849]
[]
[null,"Configurazione dello chassis"]
{"$rows_left_out":133}
{"sheet":"Lotto3_R7425(GPU)","index":3,"n_rows":175,"n_cols":9,"rows_kept":175,"cut":false,"hidden":true,"merged":[[79,1,79,2],[0,5,1,5],[3,0,3,4],[45,0,49,0],[60,0,64,0],[66,0,68,0]]}
[null,"TOTALE PRODOTTI CONVENZIONE",{"$f":"SUM(G12:G185)*$C$9","v":0},null,null,{"$f":"IF(I1+I2=0,(C1+C2),\"ERRORE VERIFICARE LA CONFIGURAZIONE\")","v":{"$error":"#REF!"}},null,null,{"$f":"IF(A46=\"\",0,1)","v":0}]
[null,"TOTALE ARTICOLI 20%",{"$f":"SUM(H12:H185)*$C$9","v":{"$error":"#REF!"}},null,null,null,null,null,{"$f":"IF(A80=\"\",0,1)","v":0}]
[]
["POWEREDGE R7425 GPU Ready (3GPU max)"]
[]
[]
[]
[]
[null,"Quantità:",0]
[]
[null,"Modello Server"]
[null,"PowerEdge R7425 Server",1,"[210-APFK]",null,"TS2L3-SRV",2087]
[]
[null,"Configurazione dello chassis"]
[null,"Chassis w/ up to 24 x 2.5\" SAS/SATA Hard Drives for 2CPU Configuration with GPU capable, Risers 4,6",1,"[321-BDWP]",null,"TS2L3-KITGPU",null,{"$f":"'Codici&PrezzixRiepilogo'!#REF!","v":{"$error":"#REF!"}}]
{"$rows_left_out":161}
{"sheet":"Rack e Accessori","index":4,"n_rows":45,"n_cols":11,"rows_kept":45,"cut":false,"hidden":false,"merged":[[0,7,0,8],[1,7,1,8],[0,9,1,10],[44,2,44,7],[14,2,14,7],[5,2,5,7],[8,2,8,7],[11,2,11,7],[38,2,38,7],[41,2,41,7],[17,2,17,7],[20,2,20,7],[23,2,23,7],[26,2,26,7],[32,2,32,7],[35,2,35,7],[29,2,29,7]]}
[null,null,null,null,null,null,"TOTALE PRODOTTI CONVENZIONE",{"$f":"SUM(Riepilogo!T41:U44)","v":0},null,{"$f":"IF(H2=\"\",0,H1+H2)","v":0}]
[null,null,null,null,null,null,"TOTALE ARTICOLI 20%",{"$f":"IF(Riepilogo!$T$103=\"\",\"\",Riepilogo!$T$103)","v":""}]
[]
[]
[null,null,{"$f":"IF(Riepilogo!G6=\"\",\"\",\"Rack (OpzRack)\")","v":""}]
[null,null,{"$f":"IF(Riepilogo!G6=\"\",\"\",\"Tecnosteel: armadio Rack 19'' 42U\")","v":""},null,null,null,null,null,null,null,{"$f":"IF(J6>=1,\"TS2L2-RACK\",\"\")","v":""}]
[]
[null,null,{"$f":"IF(Riepilogo!$G$6=\"\",\"\",\"PDU (OpzPDU32A)\")","v":""}]
[null,null,{"$f":"IF(Riepilogo!$G$6=\"\",\"\",\"Coppia di PDU Vertical  1Ph-32A-18xC13-6xC19 - 0U Base + Kit di montaggio\")","v":""},null,null,null,null,null,null,null,{"$f":"IF(J9>=1,\"TS2L2-PDU32A\",\"\")","v":""}]
[]
[null,null,{"$f":"IF(Riepilogo!$G$6=\"\",\"\",\"PDU (OpzPDU16AMetered)\")","v":""}]
[null,null,{"$f":"IF(Riepilogo!$G$6=\"\",\"\",\"Coppia di PDU Vertical  1Ph-16A-36xC13+6xC19 -0U Metered + Kit di montaggio\")","v":""},null,null,null,null,null,null,null,{"$f":"IF(J12>=1,\"TS2L3-TM1613606\",\"\")","v":""}]
[]
[null,null,{"$f":"IF(Riepilogo!$G$6=\"\",\"\",\"PDU (OpzPDU32AMetered)\")","v":""}]
[null,null,{"$f":"IF(Riepilogo!$G$6=\"\",\"\",\"Coppia di PDU Vertical  1Ph-32A-36xC13+6xC19 -0U Metered + Kit di montaggio\")","v":""},null,null,null,null,null,null,null,{"$f":"IF(J15>=1,\"TS2L3-TM3213606\",\"\")","v":""}]
{"$rows_left_out":31}
{"sheet":"Riepilogo","index":5,"n_rows":282,"n_cols":37,"rows_kept":282,"cut":false,"hidden":false,"merged":[[98,2,98,5],[98,6,98,8],[98,9,98,16],[98,17,98,18],[98,19,98,20],[195,2,195,5],[195,9,195,12],[195,16,195,19],[101,2,101,5],[101,6,101,8],[101,9,101,16],[101,17,101,18],[101,19,101,20],[155,16,155,19],[156,2,156,5],[155,9,155,12],[107,1,107,16],[107,17,107,20],[103,1,103,16],[103,17,103,20],[111,3,112,18],[104,1,104,16],[104,17,104,20],[105,1,105,16],[46,2,46,5],[46,6,46,8],[46,9,46,16],[46,17,46,18],[46,19,46,20],[47,2,47,5],[47,6,47,8],[47,9,47,16],[47,17,47,18],[47,19,47,20],[48,2,48,5],[48,6,48,8],[48,9,48,16],[48,17,48,18],[48,19,48,20],[49,2,49,5],[49,6,49,8],[49,9,49,16],[49,17,49,18],[49,19,49,20],[250,8,250,10],[252,8,268,12],[152,2,152,5],[152,9,152,12],[152,16,152,19],[147,2,147,5],[147,9,147,12],[147,16,147,19],[148,2,148,5],[148,9,148,12],[148,16,148,19],[149,2,149,5],[149,9,149,12],[149,16,149,19],[150,2,150,5],[151,2,151,5],[150,16,150,19],[151,16,151,19],[198,2,198,5],[198,9,198,12],[198,16,198,19],[246,9,246,12],[247,9,247,12],[243,9,243,12],[244,9,244,12],[245,9,245,12],[240,9,240,12],[241,9,241,12],[242,9,242,12],[248,9,248,12],[237,9,237,12],[238,9,238,12],[239,9,239,12],[234,9,234,12],[235,9,235,12],[236,9,236,12],[231,9,231,12],[232,9,232,12],[233,9,233,12],[228,9,228,12],[155,2,155,5],[229,9,229,12],[170,2,170,5],[171,2,171,5],[172,2,172,5],[173,2,173,5],[174,2,174,5],[175,2,175,5],[176,2,176,5],[177,2,177,5],[178,2,178,5],[179,2,179,5],[180,2,180,5],[181,2,181,5],[182,2,182,5],[183,2,183,5],[184,2,184,5],[230,9,230,12],[156,16,156,19],[225,9,225,12],[226,9,226,12],[227,9,227,12],[221,8,221,10],[223,9,223,12],[224,9,224,12],[200,1,200,3],[200,8,200,10],[200,15,200,17],[202,1,218,5],[202,8,218,12],[202,15,218,19],[156,9,156,12],[164,2,164,5],[165,2,165,5],[166,2,166,5],[167,2,167,5],[168,2,168,5],[169,2,169,5],[185,2,185,5],[186,2,186,5],[187,2,187,5],[18,2,18,5],[18,6,18,8],[18,9,18,16],[18,17,18,18],[18,19,18,20],[17,2,17,5],[17,6,17,8],[17,9,17,16],[17,17,17,18],[17,19,17,20],[13,1,13,20],[14,2,14,5],[14,6,14,8],[14,9,14,16],[14,17,14,18],[14,19,14,20],[16,19,16,20],[15,2,15,5],[15,6,15,8],[15,9,15,16],[15,17,15,18],[15,19,15,20],[9,17,9,20],[7,9,7,10],[11,1,11,20],[12,2,12,5],[12,6,12,8],[0,1,0,5],[0,6,0,14],[0,17,1,20],[1,1,1,5],[1,6,1,7],[2,1,2,5],[2,6,2,7],[3,1,3,5],[3,6,3,7],[12,9,12,16],[12,17,12,18],[12,19,12,20],[19,2,19,5],[19,6,19,8],[19,9,19,16],[19,17,19,18],[19,19,19,20],[4,1,4,7],[5,1,5,5],[5,6,5,7],[1,8,3,16],[4,8,4,16],[16,2,16,5],[16,6,16,8],[16,9,16,16],[16,17,16,18],[7,1,7,3],[7,4,7,8],[7,11,7,14],[7,15,7,16],[7,17,7,20],[9,1,9,3],[9,4,9,8],[9,9,9,10],[9,11,9,14],[9,15,9,16],[21,2,21,5],[21,6,21,8],[21,9,21,16],[21,17,21,18],[21,19,21,20],[20,2,20,5],[20,6,20,8],[20,9,20,16],[20,17,20,18],[20,19,20,20],[23,2,23,5],[23,6,23,8],[23,9,23,16],[23,17,23,18],[23,19,23,20],[22,2,22,5],[22,6,22,8],[22,9,22,16],[22,17,22,18],[22,19,22,20],[25,2,25,5],[25,6,25,8],[25,9,25,16],[25,17,25,18],[25,19,25,20],[24,2,24,5],[24,6,24,8],[24,9,24,16],[24,17,24,18],[24,19,24,20],[27,2,27,5],[27,6,27,8],[27,9,27,16],[27,17,27,18],[27,19,27,20],[26,2,26,5],[26,6,26,8],[26,9,26,16],[26,17,26,18],[26,19,26,20],[29,2,29,5],[29,6,29,8],[29,9,29,16],[29,17,29,18],[29,19,29,20],[28,2,28,5],[28,6,28,8],[28,9,28,16],[28,17,28,18],[28,19,28,20],[31,2,31,5],[31,6,31,8],[31,9,31,16],[31,17,31,18],[31,19,31,20],[30,2,30,5],[30,6,30,8],[30,9,30,16],[30,17,30,18],[30,19,30,20],[33,2,33,5],[33,6,33,8],[33,9,33,16],[33,17,33,18],[33,19,33,20],[32,2,32,5],[32,6,32,8],[32,9,32,16],[32,17,32,18],[32,19,32,20],[35,2,35,5],[35,6,35,8],[35,9,35,16],[35,17,35,18],[35,19,35,20],[34,2,34,5],[34,6,34,8],[34,9,34,16],[34,17,34,18],[34,19,34,20],[37,2,37,5],[37,6,37,8],[37,9,37,16],[37,17,37,18],[37,19,37,20],[36,2,36,5],[36,6,36,8],[36,9,36,16],[36,17,36,18],[36,19,36,20],[40,2,40,5],[40,6,40,8],[40,9,40,16],[40,17,40,18],[40,19,40,20],[39,1,39,20],[38,2,38,5],[38,6,38,8],[38,9,38,16],[38,17,38,18],[38,19,38,20],[42,2,42,5],[42,6,42,8],[42,9,42,16],[42,17,42,18],[42,19,42,20],[41,2,41,5],[41,6,41,8],[41,9,41,16],[41,17,41,18],[41,19,41,20],[45,2,45,5],[45,6,45,8],[45,9,45,16],[45,17,45,18],[45,19,45,20],[44,1,44,20],[43,2,43,5],[43,6,43,8],[43,9,43,16],[43,17,43,18],[43,19,43,20],[105,17,105,20],[106,1,106,16],[106,17,106,20],[118,2,118,5],[118,9,118,12],[118,16,118,19],[119,2,119,5],[119,9,119,12],[119,16,119,19],[115,1,115,3],[115,8,115,10],[115,15,115,17],[117,2,117,5],[117,9,117,12],[117,16,117,19],[122,2,122,5],[122,9,122,12],[122,16,122,19],[123,2,123,5],[123,9,123,12],[123,16,123,19],[120,2,120,5],[120,9,120,12],[120,16,120,19],[121,2,121,5],[121,9,121,12],[121,16,121,19],[126,2,126,5],[126,9,126,12],[126,16,126,19],[127,2,127,5],[127,9,127,12],[127,16,127,19],[124,2,124,5],[124,9,124,12],[124,16,124,19],[125,2,125,5],[125,9,125,12],[125,16,125,19],[130,2,130,5],[130,9,130,12],[130,16,130,19],[131,2,131,5],[131,9,131,12],[131,16,131,19],[128,2,128,5],[128,9,128,12],[128,16,128,19],[129,2,129,5],[129,9,129,12],[129,16,129,19],[134,2,134,5],[134,9,134,12],[134,16,134,19],[135,2,135,5],[135,9,135,12],[135,16,135,19],[132,2,132,5],[132,9,132,12],[132,16,132,19],[133,2,133,5],[133,9,133,12],[133,16,133,19],[138,2,138,5],[138,9,138,12],[138,16,138,19],[139,2,139,5],[139,9,139,12],[139,16,139,19],[136,2,136,5],[136,9,136,12],[136,16,136,19],[137,2,137,5],[137,9,137,12],[137,16,137,19],[154,2,154,5],[154,9,154,12],[154,16,154,19],[140,2,140,5],[140,9,140,12],[140,16,140,19],[141,2,141,5],[141,9,141,12],[141,16,141,19],[145,2,145,5],[145,9,145,12],[145,16,145,19],[146,2,146,5],[146,9,146,12],[146,16,146,19],[153,2,153,5],[153,9,153,12],[153,16,153,19],[142,2,142,5],[142,9,142,12],[142,16,142,19],[143,2,143,5],[143,9,143,12],[143,16,143,19],[144,2,144,5],[144,9,144,12],[144,16,144,19],[276,2,276,7],[276,14,276,19],[277,2,280,7],[277,14,280,19],[270,12,270,13],[270,14,270,15],[270,16,270,17],[270,18,270,19],[273,3,274,18],[270,2,270,3],[270,4,270,5],[270,6,270,7],[270,8,270,9],[270,10,270,11],[157,2,157,5],[158,2,158,5],[159,2,159,5],[160,2,160,5],[161,2,161,5],[162,2,162,5],[163,2,163,5],[50,2,50,5],[50,6,50,8],[50,9,50,16],[50,17,50,18],[50,19,50,20],[51,2,51,5],[51,6,51,8],[51,9,51,16],[51,17,51,18],[51,19,51,20],[52,2,52,5],[52,6,52,8],[52,9,52,16],[52,17,52,18],[52,19,52,20],[53,2,53,5],[53,6,53,8],[53,9,53,16],[53,17,53,18],[53,19,53,20],[54,2,54,5],[54,6,54,8],[54,9,54,16],[54,17,54,18],[54,19,54,20],[55,2,55,5],[55,6,55,8],[55,9,55,16],[55,17,55,18],[55,19,55,20],[56,2,56,5],[56,6,56,8],[56,9,56,16],[56,17,56,18],[56,19,56,20],[57,2,57,5],[57,6,57,8],[57,9,57,16],[57,17,57,18],[57,19,57,20],[58,2,58,5],[58,6,58,8],[58,9,58,16],[58,17,58,18],[58,19,58,20],[59,2,59,5],[59,6,59,8],[59,9,59,16],[59,17,59,18],[59,19,59,20],[60,2,60,5],[60,6,60,8],[60,9,60,16],[60,17,60,18],[60,19,60,20],[61,2,61,5],[61,6,61,8],[61,9,61,16],[61,17,61,18],[61,19,61,20],[62,2,62,5],[62,6,62,8],[62,9,62,16],[62,17,62,18],[62,19,62,20],[63,2,63,5],[63,6,63,8],[63,9,63,16],[63,17,63,18],[63,19,63,20],[64,2,64,5],[64,6,64,8],[64,9,64,16],[64,17,64,18],[64,19,64,20],[65,2,65,5],[65,6,65,8],[65,9,65,16],[65,17,65,18],[65,19,65,20],[66,2,66,5],[66,6,66,8],[66,9,66,16],[66,17,66,18],[66,19,66,20],[67,2,67,5],[67,6,67,8],[67,9,67,16],[67,17,67,18],[67,19,67,20],[68,2,68,5],[68,6,68,8],[68,9,68,16],[68,17,68,18],[68,19,68,20],[69,2,69,5],[69,6,69,8],[69,9,69,16],[69,17,69,18],[69,19,69,20],[70,2,70,5],[70,6,70,8],[70,9,70,16],[70,17,70,18],[70,19,70,20],[71,2,71,5],[71,6,71,8],[71,9,71,16],[71,17,71,18],[71,19,71,20],[72,2,72,5],[72,6,72,8],[72,9,72,16],[72,17,72,18],[72,19,72,20],[73,2,73,5],[73,6,73,8],[73,9,73,16],[73,17,73,18],[73,19,73,20],[74,2,74,5],[74,6,74,8],[74,9,74,16],[74,17,74,18],[74,19,74,20],[75,2,75,5],[75,6,75,8],[75,9,75,16],[75,17,75,18],[75,19,75,20],[76,2,76,5],[76,6,76,8],[76,9,76,16],[76,17,76,18],[76,19,76,20],[77,2,77,5],[77,6,77,8],[77,9,77,16],[77,17,77,18],[77,19,77,20],[78,2,78,5],[78,6,78,8],[78,9,78,16],[78,17,78,18],[78,19,78,20],[79,2,79,5],[79,6,79,8],[79,9,79,16],[79,17,79,18],[79,19,79,20],[80,2,80,5],[80,6,80,8],[80,9,80,16],[80,17,80,18],[80,19,80,20],[81,2,81,5],[81,6,81,8],[81,9,81,16],[81,17,81,18],[81,19,81,20],[82,2,82,5],[82,6,82,8],[82,9,82,16],[82,17,82,18],[82,19,82,20],[83,2,83,5],[83,6,83,8],[83,9,83,16],[83,17,83,18],[83,19,83,20],[84,2,84,5],[84,6,84,8],[84,9,84,16],[84,17,84,18],[84,19,84,20],[85,2,85,5],[85,6,85,8],[85,9,85,16],[85,17,85,18],[85,19,85,20],[86,2,86,5],[86,6,86,8],[86,9,86,16],[86,17,86,18],[86,19,86,20],[87,2,87,5],[87,6,87,8],[87,9,87,16],[87,17,87,18],[87,19,87,20],[88,2,88,5],[88,6,88,8],[88,9,88,16],[88,17,88,18],[88,19,88,20],[89,2,89,5],[89,6,89,8],[89,9,89,16],[89,17,89,18],[89,19,89,20],[90,2,90,5],[90,6,90,8],[90,9,90,16],[90,17,90,18],[90,19,90,20],[91,2,91,5],[91,6,91,8],[91,9,91,16],[91,17,91,18],[91,19,91,20],[92,2,92,5],[92,6,92,8],[92,9,92,16],[92,17,92,18],[92,19,92,20],[93,2,93,5],[93,6,93,8],[93,9,93,16],[93,17,93,18],[93,19,93,20],[94,2,94,5],[94,6,94,8],[94,9,94,16],[94,17,94,18],[94,19,94,20],[95,2,95,5],[95,6,95,8],[95,9,95,16],[95,17,95,18],[95,19,95,20],[96,2,96,5],[96,6,96,8],[96,9,96,16],[96,17,96,18],[96,19,96,20],[97,2,97,5],[97,6,97,8],[97,9,97,16],[97,17,97,18],[97,19,97,20],[188,2,188,5],[189,2,189,5],[190,2,190,5],[191,2,191,5],[192,2,192,5],[193,2,193,5],[194,2,194,5],[150,9,150,12],[151,9,151,12],[157,9,157,12],[158,9,158,12],[159,9,159,12],[160,9,160,12],[161,9,161,12],[162,9,162,12],[163,9,163,12],[164,9,164,12],[165,9,165,12],[166,9,166,12],[167,9,167,12],[168,9,168,12],[169,9,169,12],[170,9,170,12],[171,9,171,12],[172,9,172,12],[173,9,173,12],[174,9,174,12],[175,9,175,12],[176,9,176,12],[177,9,177,12],[178,9,178,12],[179,9,179,12],[180,9,180,12],[194,9,194,12],[157,16,157,19],[158,16,158,19],[159,16,159,19],[160,16,160,19],[161,16,161,19],[162,16,162,19],[163,16,163,19],[164,16,164,19],[165,16,165,19],[166,16,166,19],[167,16,167,19],[168,16,168,19],[169,16,169,19],[170,16,170,19],[171,16,171,19],[172,16,172,19],[173,16,173,19],[174,16,174,19],[175,16,175,19],[181,9,181,12],[182,9,182,12],[183,9,183,12],[184,9,184,12],[179,16,179,19],[180,16,180,19],[181,16,181,19],[182,16,182,19],[183,16,183,19],[193,16,193,19],[190,9,190,12],[191,9,191,12],[192,9,192,12],[193,9,193,12],[185,9,185,12],[186,9,186,12],[187,9,187,12],[188,9,188,12],[189,9,189,12],[99,2,99,5],[99,6,99,8],[99,9,99,16],[99,17,99,18],[99,19,99,20],[100,2,100,5],[100,6,100,8],[100,9,100,16],[100,17,100,18],[100,19,100,20],[102,2,102,5],[102,6,102,8],[102,9,102,16],[102,17,102,18],[102,19,102,20],[196,2,196,5],[197,2,197,5],[196,9,196,12],[197,9,197,12],[196,16,196,19],[197,16,197,19],[194,16,194,19],[184,16,184,19],[185,16,185,19],[186,16,186,19],[187,16,187,19],[188,16,188,19],[189,16,189,19],[190,16,190,19],[191,16,191,19],[192,16,192,19],[176,16,176,19],[177,16,177,19],[178,16,178,19]]}
[null,"Amministrazione ",null,null,null,null,null,null,null,null,null,null,null,null,null,null,null,"CONFIGURATORE ELETTRONICO TECNOLOGIE SERVER 2 LOTTO 2",null,null,null,1,null,"Server1","Server2","Server3"]
[null,"N° Identificativo Ordine ",null,null,null,null,null,null,{"$f":"IF(AA2>0,\"ERRORE DI CONFIGURAZIONE\",IF(Y13>0,\"ERRORE DI MANCATA COMPILAZIONE DATI NECESSARI PER L'ORDINATIVO\",\"Configurazione OK\"))","v":"ERRORE DI MANCATA COMPILAZIONE DATI NECESSARI PER L'ORDINATIVO"},null,null,null,null,null,null,null,null,null,null,null,null,1,"Errore",{"$f":"IF('Lotto2_R7425-1'!$F$1=\"ERRORE VERIFICARE LA CONFIGURAZIONE\",1,0)","v":0},{"$f":"IF('Lotto2_R7425-2'!$F$1=\"ERRORE VERIFICARE LA CONFIGURAZIONE\",1,0)","v":0},{"$f":"IF('Lotto2_R7425-3'!$F$1=\"ERRORE VERIFICARE LA CONFIGURAZIONE\",1,0)","v":0},{"$f":"SUM(X2:Z2)","v":0}]
[null,"Data Ordine",null,null,null,null,null,null,null,null,null,null,null,null,null,null,null,null,null,null,null,1,"Dati non compilati","Amministrazione ",{"$f":"IF(G1>0,0,1)","v":1}]
[null,"Tot Ordine Portale CONSIP IVA incl.",null,null,null,null,{"$f":"R108","v":0},null,null,null,null,null,null,null,null,null,null,null,null,null,"Nel \"Tot Ordine Portale CONSIP\" deve essere inserito l'importo totale risultante dall'ordinativo del portale CONSIP.\nQualora l'importo inserito corrisponde al valore ricalcolato dal configuratore viene attivato il pulsante \"Salva in formato PDF\" che permette di generare il file pdf da allegare all'ordinativo.",1,null,"N° Identificativo Ordine ",{"$f":"IF(G2>0,0,1)","v":1}]
[null,"LE CELLE IN GIALLO DEVO ESSERE COMPILATE OBBLIGATORIAMENTE",null,null,null,null,null,null,{"$f":"IF(AA2>0,\"\",IF(Y13>0,\"\",\"Cliccare il pulsante --------------> \nper generare il PDF da allegare\"))","v":""},null,null,null,null,null,null,null,null,null,null,null,null,1,null,"Data Ordine",{"$f":"IF(G3>0,0,1)","v":1}]
[null,"Quantità Server Ordinati",null,null,null,null,{"$f":"B15","v":""},null,null,null,null,null,null,null,null,null,null,null,null,"ver. 3.0",null,1,null,"Tot Ordine Portale CONSIP IVA incl.",{"$f":"IF(G4>0,0,1)","v":1}]
[null,null,null,null,null,null,null,null,null,null,null,null,null,null,null,null,null,null,null,null,null,1,null,"Referente per la Consegna",{"$f":"IF(E8>0,0,1)","v":1}]
[null,"Referente per la Consegna",null,null,null,null,null,null,null,"Telefono",null,null,null,null,null,"email",null,null,null,null,null,1,null,"Telefono",{"$f":"IF(L8>0,0,1)","v":1}]
[null,null,null,null,null,null,null,null,null,null,null,null,null,null,null,null,null,null,null,null,null,1,null,"email",{"$f":"IF(R8>0,0,1)","v":1}]
[null,"Referente per l'installazione",null,null,null,null,null,null,null,"Telefono",null,null,null,null,null,"email",null,null,null,null,null,1,null,"Referente per l'installazione",{"$f":"IF(E10>0,0,1)","v":1}]
[null,null,null,null,null,null,null,null,null,null,null,null,null,null,null,null,null,null,null,null,null,1,null,"Telefono",{"$f":"IF(L10>0,0,1)","v":1}]
[null,"ATTENZIONE: I CODICI PRODOTTO DELL'ORDINE DEVONO ESSERE SPECULARI A QUELLI GENERATI DAL CONFIGURATORE.",null,null,null,null,null,null,null,null,null,null,null,null,null,null,null,null,null,null,null,1,null,"email",{"$f":"IF(R10>0,0,1)","v":1}]
[null,"Qtà Ordinata","CODICE ARTICOLO PRODUTTORE",null,null,null,"CODICE ARTICOLO CONVENZIONE",null,null,"Descrizione Sintetica \n(si faccia riferimento alla guida alla convenzione per la descrizione estesa e \nper le regole di acquisto delle opzioni)",null,null,null,null,null,null,null,"Costo Unitario",null,"Costo Complessivo",null,1,null,null,{"$f":"SUM(Y3:Y12)","v":10},null,{"$f":"Y13+AA2","v":10},{"$f":"IF(AA13=0,\"_SavePDFon\",\"_SavePDFoff\")","v":"_SavePDFoff"}]
[null,"DELL EMC POWEREDGE R7425",null,null,null,null,null,null,null,null,null,null,null,null,null,null,null,null,null,null,null,{"$f":"IF(B15>=\"\",0,1)","v":0},null,"Server1","Server2","Server3","ServerGPU",null,null,null,null,null,null,null,null,null,"Somma Server"]
[null,{"$f":"IF(AK15>=1,AK15,\"\")","v":""},{"$f":"IF(AK15>0,VLOOKUP($G15,'Codici&PrezzixRiepilogo'!B:E,4,FALSE),\"\")","v":""},null,null,null,{"$f":"IF(AK15>=1,W15,\"\")","v":""},null,null,{"$f":"IF(AK15>0,VLOOKUP($G15,'Codici&PrezzixRiepilogo'!B:C,2,FALSE),\"\")","v":""},null,null,null,null,null,null,null,{"$f":"IF(AK15>0,VLOOKUP($G15,'Codici&PrezzixRiepilogo'!B:E,3,FALSE),\"\")","v":""},null,{"$f":"IF(B15=\"\",\"\",R15*B15)","v":""},null,{"$f":"IF(B15>=\"\",0,1)","v":0},"TS2L2-SRV",{"$f":"'Lotto2_R7425-1'!$C$10","v":0},{"$f":"'Lotto2_R7425-2'!$C$10","v":0},{"$f":"'Lotto2_R7425-3'!$C$10","v":0},{"$f":"'Lotto3_R7425(GPU)'!$C$9","v":0},null,null,null,null,null,null,null,null,null,{"$f":"SUM(X15:AJ15)","v":0}]
{"$rows_left_out":268}
{"sheet":"Foglio1","index":6,"n_rows":87,"n_cols":4,"rows_kept":87,"cut":false,"hidden":true,"merged":[]}
[{"$f":"Riepilogo!E116","v":0}]
[{"$f":"Riepilogo!B118","v":"-"},{"$f":"Riepilogo!C118","v":"-"},null,{"$f":"IF(A2+A3=2,\"TS2L3-SRV2CPU\",B2)","v":{"$error":"#VALUE!"}}]
[{"$f":"Riepilogo!B119","v":"-"},{"$f":"Riepilogo!C119","v":"-"}]
[{"$f":"Riepilogo!B120","v":"-"},{"$f":"Riepilogo!C120","v":"-"}]
[{"$f":"Riepilogo!B121","v":"-"},{"$f":"Riepilogo!C121","v":"-"}]
[{"$f":"Riepilogo!B122","v":"-"},{"$f":"Riepilogo!C122","v":"-"}]
[{"$f":"Riepilogo!B123","v":"-"},{"$f":"Riepilogo!C123","v":"-"}]
[{"$f":"Riepilogo!B124","v":"-"},{"$f":"Riepilogo!C124","v":"-"}]
[{"$f":"Riepilogo!B125","v":"-"},{"$f":"Riepilogo!C125","v":"-"}]
[{"$f":"Riepilogo!B126","v":"-"},{"$f":"Riepilogo!C126","v":"-"}]
[{"$f":"Riepilogo!B127","v":"-"},{"$f":"Riepilogo!C127","v":"-"}]
[{"$f":"Riepilogo!B128","v":"-"},{"$f":"Riepilogo!C128","v":"-"}]
[{"$f":"Riepilogo!B129","v":"-"},{"$f":"Riepilogo!C129","v":"-"}]
[{"$f":"Riepilogo!B130","v":"-"},{"$f":"Riepilogo!C130","v":"-"}]
[{"$f":"Riepilogo!B131","v":"-"},{"$f":"Riepilogo!C131","v":"-"}]
{"$rows_left_out":73}
{"sheet":"Regole di configurazione","index":7,"n_rows":510,"n_cols":20,"rows_kept":510,"cut":false,"hidden":true,"merged":[]}
["Descrizione","Quantità","SKU","Customer Kit","Codice Convenzione","Convenzione",0.2,null,"SKU","Customer Kit",null,null,null,null,null,"SKU","Customer Kit"]
["Server DELL EMC PowerEdge R7425, 2U, 1 x AMD EPYC 7301; RAM 64GB, 2 x HDD 600GB 10K 2.5\"",1,"[210-APFK]",null,"TS2L2-SRV",1849]
["Server DELL EMC PowerEdge R7425, 2U, 2 x AMD EPYC 7301; RAM 64GB, 2 x HDD 600GB 10K 2.5\"",1,"[210-ANKP]",null,"TS2L2-SRV2CPU"]
["AMD EPYC™ 7301 2.2GHz/2.7GHz, 16C/32T, 64M Cache (155W/170W) DDR4-2400/2666",1,"[374-BBTR]","338-BNCI","TS2L2-CPU",491,{"$f":"\"\"","v":""},"Standard Heatsinks, below 180W CPU",2,"[412-AALN]","412-AALJ",{"$f":"\"\"","v":""},{"$f":"\"\"","v":""},{"$f":"\"\"","v":""},"Riser Config 5, 4 x8, 3 x16 slots",1,"[330-BBJD]","330-BBMK 330-BBLS",null,{"$f":"\"\"","v":""}]
["Windows Server 2019 Standard Ed,ROK,16CORE (for Distributor sale only)",null,null,"634-BRMW","TS2L2-WIN1",553]
["Windows Server 2019 Standard Ed,Additional Lic,ROK,2CORE,NoMedia",null,null,"634-BJQW","TS2L2-WIN2CORE",74]
["CentOS 7.0",null,null,null,"TS2L2-LINUX",49]
["1 Windows Server 2019 Device CALs (Standard or Datacenter),CUS",null,null,"623-BBBX","TS2L2-CALDEV",20]
["1 Windows Server 2019 User CALs (Standard or Datacenter),CUS",null,null,"623-BBCC","TS2L2-CALUSER",24]
["16GB RDIMM, 2666MT/s, Dual Rank",null,"[370-ADND]","AA138422","TS2L2-RAM16",103]
["32GB RDIMM, 2666MT/s, Dual Rank",null,"[370-ADNF]","A9781929","TS2L2-RAM32",347]
["64GB LRDIMM, 2666MT/s, Quad Rank",null,"[370-AECZ]","A9781930","TS2L2-RAM64",697]
["600GB 10K RPM SAS 12Gbps 512n 2.5in Hot-plug Hard Drive",null,"[400-ASGS]","400-AUNQ","TS2L2-10K600",68]
["1.2TB 10K RPM SAS 12Gbps 512n 2.5in Hot-plug Hard Drive",null,"[400-ASHI]","400-ATJL","TS2L2-10K1200",136]
["480GB SSD SAS Mixed Use 12Gbps 2.5in Hot-Plug Hard Drive",null,null,"400-BCOD","TS2L2-SSDM480",399]
{"$rows_left_out":496}
{"sheet":"Codici&PrezzixRiepilogo","index":8,"n_rows":91,"n_cols":5,"rows_kept":91,"cut":false,"hidden":true,"merged":[[30,0,31,0],[30,1,31,1],[86,0,87,0],[86,1,87,1],[39,0,40,0],[39,1,40,1],[3,0,4,0],[3,1,4,1],[17,0,18,0],[17,1,18,1],[19,0,20,0],[19,1,20,1],[21,0,22,0],[21,1,22,1],[23,0,24,0],[23,1,24,1],[28,0,29,0],[28,1,29,1],[21,4,22,4],[23,4,24,4],[17,4,18,4],[19,4,20,4],[3,3,4,3],[3,4,4,4],[17,3,18,3],[19,3,20,3],[21,3,22,3],[23,3,24,3],[86,3,87,3],[39,4,40,4],[86,4,87,4],[28,3,29,3],[30,3,31,3],[28,4,29,4],[30,4,31,4],[39,3,40,3]]}
["CODICE CONVERGE","CODICE CONVENZIONE","Description","Prezzo vendita da Converge a CONSIP tot.","CODICE CONVERGE"]
["TS2L2-SRV","TS2L2-SRV","Server DELL EMC PowerEdge R7425, 2U, 1 x AMD EPYC 7281",1849,"TS2L2-SRV"]
[]
["TS2L2-CPU","TS2L2-CPU","Processore AMD EPYC 7281",491,"TS2L2-CPU"]
[null,null,"Standard Heatsink, 180W CPU, R7425"]
[]
["TS2D-RAM16","TS2L2-RAM16","Upgrade KIT RAM 16GB",103,"TS2D-RAM16"]
["TS2D-RAM32","TS2L2-RAM32","Upgrade KIT RAM 32GB",347,"TS2D-RAM32"]
["TS2D-RAM64","TS2L2-RAM64","Upgrade KIT RAM 64GB",697,"TS2D-RAM64"]
[]
["TS2D-10K600","TS2L2-10K600","HDD 600GB 10K SAS 12Gbps  2.5in Hot-plug",68,"TS2D-10K600"]
["TS2D-10K1200","TS2L2-10K1200","HDD 1200GB 10K SAS 12Gbps  2.5in Hot-plug",136,"TS2D-10K1200"]
["TS2D-SSDM480","TS2L2-SSDM480","SSD 480GB SAS MU 12Gbps 2.5in Hot-Plug",399,"TS2D-SSDM480"]
["TS2D-SSDR960","TS2L2-SSDR960","SSD 960GB SAS RI 12Gbps 2.5in Hot-plug",664,"TS2D-SSDR960"]
[]
{"$rows_left_out":76}