{"text_format":"1","workbook":"xlsx","n_sheets":12,"sheets":["Lotto4 DL560 Gen10 1","Lotto4 DL560 Gen10 2","Lotto4 DL560 Gen10 3","RACK, Accessori e Servizi","Riepilogo","Codici","Operating System","PCI","Processor","Memory","HDD","Servizi Opzionali"],"not_rendered":{"charts":0,"images":31,"macros":1,"external_links":0,"defined_names":93,"comments":0,"pivot_tables":0},"unopened":[],"bounds":{"document_bytes":16777216,"sheet_cells":100000,"rows_first":2000,"rows_last":500,"rows_between":2000,"halvings":0,"cell_chars":16384,"cell_head_chars":4096},"cells_cut":0,"cells_raw":0,"read":"whole","date_system":"1900"}

{"sheet":"Lotto4 DL560 Gen10 1","index":0,"n_rows":204,"n_cols":82,"rows_kept":204,"cut":false,"hidden":false,"merged":[[82,2,82,4],[109,2,109,4],[112,1,112,4],[66,1,66,4],[106,1,106,4],[107,2,107,4],[108,1,108,3],[0,7,1,7],[49,2,49,4],[53,1,53,4],[75,2,75,4],[81,1,81,4],[43,1,43,4],[44,2,44,4],[34,2,34,3],[5,0,5,4],[3,0,4,4],[2,1,2,2],[48,1,48,4],[30,1,30,4],[31,2,31,4],[33,1,33,4],[36,1,36,4],[137,1,137,4],[140,1,140,4],[146,1,146,4],[138,2,138,4],[141,2,141,4],[144,2,144,4],[143,1,143,4],[135,2,135,4],[129,2,129,4],[116,1,116,4],[117,2,117,4],[119,1,119,4],[120,2,120,4],[128,1,128,4],[202,2,202,4],[204,1,204,4],[199,2,199,4],[162,2,162,4],[164,1,164,4],[179,1,179,4],[182,1,182,4],[184,1,184,4],[187,1,187,4],[189,1,189,4],[191,1,191,4],[194,1,194,4],[170,1,170,4],[172,1,172,4],[176,1,176,4],[196,1,196,4],[37,2,37,4],[10,0,11,2],[28,2,28,4],[18,2,18,4],[20,1,20,4],[24,2,24,4],[27,1,27,4],[174,1,174,4],[149,1,149,4],[147,2,147,4],[49,0,53,0],[113,2,113,4],[161,1,161,4],[150,2,150,4],[152,1,152,4],[153,2,153,4],[155,1,155,4],[159,2,159,4],[156,2,156,4],[158,1,158,4],[131,1,131,4],[132,2,132,4],[134,1,134,4]]}
[null,null,"TOTALE PRODOTTI CONVENZIONE",{"$f":"H10","v":0},null,null,{"$f":"IF(D106=\"      OK\",0,1)","v":0},{"$f":"IF(G1+G2=0,(D1+D2),\"ERRORE VERIFICARE LA CONFIGURAZIONE\")","v":0}]
[null,null,"TOTALE ARTICOLI 20%",{"$f":"H11","v":0}]
[null,"Indicare qui la quantità Server ----->",null,0,null,null,null,{"$f":"Riepilogo!T6","v":"ver. 3.5"},null,null,null,null,null,null,null,null,null,null,null,null,null,null,null,null,null,null,null,null,null,null,null,null,null,null,null,null,null,null,null,null,null,null,null,null,null,null,null,null,null,null,null,null,null,null,null,null,null,null,null,null,null,null,null,null,null,null,null,null,null,null,null,null,null,null,null,null,null,null,null,null,null,0]
["Tecnologie Server 2 Lotto 4 Base DL560 Gen10"]
[]
[]
[]
[]
[]
[null,null,null,"Totale Server e Opzioni",null,null,null,{"$f":"F17*SRV_A","v":0}]
["Components: \nServer HPE Proliant DL560 Gen10 (2CPU Intel® Xeon-Gold 5218)",null,null,"Totale Ulteriori Opzioni ",null,null,null,{"$f":"G17*SRV_A","v":0}]
[]
[null,null,null,"TOTALE CONVENZIONE",null,null,null,{"$f":"H11+H10","v":0}]
[]
[null,null,null,null,null,4628]
[null,"Quantity: ",{"$f":"SRV_A","v":0},null,null,{"$f":"SUM(F20:F205)","v":0}]
[null,null,null,null,null,{"$f":"SUM(F15:F16)","v":4628},{"$f":"SUM(G20:G205)","v":10}]
[]
[null,"Base"]
[null,"HPE DL560 Gen10 8SFF CTO Server",1,null,"841730-B21"]
[]
[null,"Configurazione dello chassis"]
[null,"HP DL560 Gen9 2SFF Media Bay Kit",1,null,"795090-B21"]
[]
[null,"Processore"]
[null,"Intel Xeon-Gold 5218 (2.3GHz/16-core/125W)",2,null,"840399-L21"]
[null,"HPE DL560 Gen10 Intel® Xeon-Gold 5118 (2.3GHz/12-core/105W) Processor",1,null,"840399-B21"]
[]
[null,"Processore aggiuntivo"]
[null,"No Additional Processor",{"$f":"VLOOKUP($B$30, CPU_A, 2, FALSE)","v":0},{"$f":"VLOOKUP($B$30, CPU_A, 3, FALSE)","v":""},"840399-L21",{"$f":"VLOOKUP(B30, CPU_A, 12, FALSE)","v":0}]
[]
[null,"Mezz Board Option"]
[null,{"$f":"VLOOKUP($B$30, CPU_A, 6, FALSE)","v":""},{"$f":"VLOOKUP($B$30, CPU_A, 7, FALSE)","v":""},null,{"$f":"VLOOKUP($B$30, CPU_A, 8, FALSE)","v":""}]
[]
[null,"Memoria Totale in GB",{"$f":"IF(F30=2584,IF(B36=64,\"ATTENZIONE: AUMENTARE LA RAM\",\"\"),\"\")","v":""}]
[null,"128        (DIMM 32GB)"]
[]
[null,"Capacità di memoria"]
[null,{"$f":"IF($B$30=\"No Additional Processor\",VLOOKUP($B$36, MEM_A1, 8, FALSE),VLOOKUP($B$36, MEM_A2, 8, FALSE))","v":"HPE 32GB 2Rx4 PC4-2933 Smart Kit"},{"$f":"IF($B$30=\"No Additional Processor\",VLOOKUP($B$36, MEM_A1, 9, FALSE),VLOOKUP($B$36, MEM_A2, 9, FALSE))","v":4},null,{"$f":"IF($B$30=\"No Additional Processor\",VLOOKUP($B$36, MEM_A1, 10, FALSE),VLOOKUP($B$36, MEM_A2, 10, FALSE))","v":"815100-B21"}]
[]
[null,{"$f":"IF($B$30=\"No Additional Processor\",VLOOKUP($B$36, MEM_A1, 2, FALSE),VLOOKUP($B$36, MEM_A2, 2, FALSE))","v":"HPE 32GB 2Rx4 PC4-2933 Smart Kit"},{"$f":"IF($B$30=\"No Additional Processor\",VLOOKUP($B$36, MEM_A1, 3, FALSE),VLOOKUP($B$36, MEM_A2, 3, FALSE))","v":4},{"$f":"IF($B$30=\"No Additional Processor\",VLOOKUP($B$36, MEM_A1, 4, FALSE),VLOOKUP($B$36, MEM_A2, 4, FALSE))","v":""},{"$f":"IF($B$30=\"No Additional Processor\",VLOOKUP($B$36, MEM_A1, 6, FALSE),VLOOKUP($B$36, MEM_A2, 6, FALSE))","v":"815100-B21"},{"$f":"IF($B$30=\"No Additional Processor\",VLOOKUP($B$36, MEM_A1, 7, FALSE),VLOOKUP($B$36, MEM_A2, 7, FALSE))","v":0}]
[null,{"$f":"IF($B$30=\"No Additional Processor\",VLOOKUP($B$36, MEM_A1, 11, FALSE),VLOOKUP($B$36, MEM_A2, 11, FALSE))","v":""},{"$f":"IF($B$30=\"No Additional Processor\",VLOOKUP($B$36, MEM_A1, 12, FALSE),VLOOKUP($B$36, MEM_A2, 12, FALSE))","v":""},{"$f":"IF($B$30=\"No Additional Processor\",VLOOKUP($B$36, MEM_A1, 13, FALSE),VLOOKUP($B$36, MEM_A2, 13, FALSE))","v":""},{"$f":"IF($B$30=\"No Additional Processor\",VLOOKUP($B$36, MEM_A1, 15, FALSE),VLOOKUP($B$36, MEM_A2, 15, FALSE))","v":""},{"$f":"IF($B$30=\"No Additional Processor\",VLOOKUP($B$36, MEM_A1, 16, FALSE),VLOOKUP($B$36, MEM_A2, 16, FALSE))","v":""}]
[]
[]
[null,"Sistema operativo preinstallato"]
[null,"No Operating System",{"$f":"VLOOKUP($B$46, OS_A, 2, FALSE)","v":""},{"$f":"VLOOKUP($B$46, OS_A, 3, FALSE)","v":""},{"$f":"VLOOKUP($B$46, OS_A, 5, FALSE)","v":""},{"$f":"VLOOKUP($B$46, OS_A, 6, FALSE)","v":""}]
[null,{"$f":"IF($B$30=\"No Additional Processor\",VLOOKUP($B$46, OS_A, 19, FALSE),VLOOKUP($B$46, OS_A2, 19, FALSE))","v":""},{"$f":"IF($B$30=\"No Additional Processor\",VLOOKUP($B$46, OS_A, 20, FALSE),VLOOKUP($B$46, OS_A2, 20, FALSE))","v":0},{"$f":"IF($B$30=\"No Additional Processor\",VLOOKUP($B$46, OS_A, 21, FALSE),VLOOKUP($B$46, OS_A2, 21, FALSE))","v":""},{"$f":"IF($B$30=\"No Additional Processor\",VLOOKUP($B$46, OS_A, 23, FALSE),VLOOKUP($B$46, OS_A2, 23, FALSE))","v":""},{"$f":"IF($B$30=\"No Additional Processor\",VLOOKUP($B$46, OS_A, 24, FALSE)*C47,VLOOKUP($B$46, OS_A2, 24, FALSE)*C47)","v":0}]
[null,{"$f":"IF($B$30=\"No Additional Processor\",VLOOKUP($B$46, OS_A, 25, FALSE),VLOOKUP($B$46, OS_A2, 25, FALSE))","v":""},{"$f":"IF($B$30=\"No Additional Processor\",VLOOKUP($B$46, OS_A, 26, FALSE),VLOOKUP($B$46, OS_A2, 26, FALSE))","v":0},{"$f":"IF($B$30=\"No Additional Processor\",VLOOKUP($B$46, OS_A, 27, FALSE),VLOOKUP($B$46, OS_A2, 27, FALSE))","v":""},{"$f":"IF($B$30=\"No Additional Processor\",VLOOKUP($B$46, OS_A, 29, FALSE),VLOOKUP($B$46, OS_A2, 29, FALSE))","v":""},{"$f":"IF($B$30=\"No Additional Processor\",VLOOKUP($B$46, OS_A, 30, FALSE)*C48,VLOOKUP($B$46, OS_A2, 30, FALSE)*C48)","v":0}]
[]
[null,"Client Access Licenses"]
[null,{"$f":"VLOOKUP($B$46, OS_A, 7, FALSE)","v":"None"},0,{"$f":"VLOOKUP($B$46, OS_A, 9, FALSE)","v":""},{"$f":"VLOOKUP($B$46, OS_A, 11, FALSE)","v":""},{"$f":"VLOOKUP($B$46, OS_A, 12, FALSE)*C51","v":0},null,null,null,null,null,null,null,null,null,null,null,null,null,null,null,null,null,null,null,null,null,null,null,null,null,null,null,null,null,null,null,null,null,null,null,null,null,null,null,{"$f":"SRV_A1=SUM(AJ51:AS51)","v":{"$error":"#NAME?"}}]
[]
[null,{"$f":"VLOOKUP($B$46, OS_A, 13, FALSE)","v":"None"},0,{"$f":"VLOOKUP($B$46, OS_A, 15, FALSE)","v":""},{"$f":"VLOOKUP($B$46, OS_A, 17, FALSE)","v":""},{"$f":"VLOOKUP($B$46, OS_A, 18, FALSE)*C53","v":0}]
[]
[null,"VMware vSphere"]
[null,"None",{"$f":"IF(D56=\"\",0,($C$26+$C$30))","v":0},{"$f":"VLOOKUP($B$56,vmware, 3, FALSE)","v":""},{"$f":"VLOOKUP($B$56,vmware, 5, FALSE)","v":""},null,{"$f":"VLOOKUP($B$56,vmware, 6, FALSE)*C56","v":0}]
[null,"VMware vSphere Essentials Plus"]
[null,"None",{"$f":"VLOOKUP($B$58,vmwareplus, 2, FALSE)","v":0},{"$f":"VLOOKUP($B$58,vmwareplus, 3, FALSE)","v":""},{"$f":"VLOOKUP($B$58,vmwareplus, 5, FALSE)","v":""},null,{"$f":"VLOOKUP($B$58,vmwareplus, 6, FALSE)*C58","v":0}]
[null,"VMware vCenter Server"]
[null,"None",{"$f":"VLOOKUP($B$60,vmwarevcenter, 2, FALSE)","v":0},{"$f":"VLOOKUP($B$60,vmwarevcenter, 3, FALSE)","v":""},{"$f":"VLOOKUP($B$60,vmwarevcenter, 5, FALSE)","v":""},null,{"$f":"VLOOKUP($B$60, vmwarevcenter, 6, FALSE)*C60","v":0}]
[null,"VMware vSAN"]
[null,"None",{"$f":"IF(D62=\"\",0,($C$26+$C$30))","v":0},{"$f":"VLOOKUP($B$62,wmvsan, 3, FALSE)","v":""},{"$f":"VLOOKUP($B$62,wmvsan, 5, FALSE)","v":""},null,{"$f":"VLOOKUP($B$62,wmvsan, 6, FALSE)*C62","v":0}]
[]
[]
[null,"HPE OneView Advanced (with HPE iLO Advanced)"]
[null,"None",{"$f":"VLOOKUP($B$66, OpzOVAdv, 2, FALSE)","v":0},{"$f":"VLOOKUP($B$66, OpzOVAdv, 3, FALSE)","v":""},{"$f":"VLOOKUP($B$66, OpzOVAdv, 5, FALSE)","v":""},null,{"$f":"VLOOKUP($B$66, OpzOVAdv, 6, FALSE)","v":0}]
[]
[null,"Configurazione dello chassis"]
[null,"HPE DL560 Gen10 8SFF HDD Bay3 Kit",1,null,"872237-B21"]
[]
[null,"HPE DL560 Gen10 8SFF HDD Bay2 Kit",0,{"$f":"VLOOKUP($C$71, HDD_Bay2, 2, FALSE)","v":""},{"$f":"VLOOKUP($C$71, HDD_Bay2, 3, FALSE)","v":""},{"$f":"VLOOKUP($C$71, HDD_Bay2, 4, FALSE)","v":""},{"$f":"IF(C74>=1,0,VLOOKUP($C$71,HDD_Bay2,5,FALSE))","v":0}]
[]
[]
[null,"HPE DL560 Gen10 8SFF HDD Bay1 Kit",0,{"$f":"VLOOKUP($C$74, HDD_BAY1, 2, FALSE)","v":""},{"$f":"VLOOKUP($C$74, HDD_BAY1, 3, FALSE)","v":""},{"$f":"VLOOKUP($C$74, HDD_BAY1, 4, FALSE)","v":""},{"$f":"VLOOKUP($C$74,HDD_BAY1,5,FALSE)","v":0}]
[]
[null,"Controller RAID"]
[null,"HPE Smart Array P408i-a SR Gen10 ",1,null,"869081-B21"]
[]
[null,"HPE 96W Smart Storage Battery with 145mm Cable Kit",1,null,"P01366-B21"]
[]
[null,{"$f":"IF(C74+C71=0,\"\",\"HPE DL5x0 Gen10 12Gb SAS Expander Card Kit with Cables\")","v":""},{"$f":"IF(C74+C71=0,\"\",1)","v":""},{"$f":"IF(C74+C71=0,\"\",\"TS2L4-SASBAY1\")","v":""},{"$f":"IF(C74=0,\"\",\"873444-B21\")","v":""}]
[]
[null,{"$f":"IF(C69+C71+C74=1,\"Dischi rigidi  (numero massimo totale 8)\",(IF(C69+C71+C74=2,\"Dischi rigidi  (numero massimo totale 16)\",\"Dischi rigidi  (numero massimo totale 24)\")))","v":"Dischi rigidi  (numero massimo totale 8)"}]
[null,"HPE 300GB SAS 15K SFF SC DS HDD",2,null,"870753-B21"]
[]
[null,"HPE 300GB SAS 15K SFF SC DS HDD",2,"TS2L4-15K300","870753-B21",{"$f":"IF(C86<=2,0,C86-2)*135","v":0}]
[]
[null,"HPE 1.2TB SAS 10K SFF SC DS HDD",0,"TS2L4-10K1200","872479-B21",{"$f":"C88*146","v":0}]
[]
["HDD SAS ","HPE 1.8TB SAS 10K SFF HDD",0,"TS2L4-10K1800","872481-B21",null,{"$f":"C90*190","v":0}]
[]
[null,"HPE 480GB SAS 12G SFF SC DS SSD",0,"TS2L4-SSD480","?????",{"$f":"C92*399","v":0}]
[]
[null,"HPE 960GB SAS 12G Read Intensive SFF SC DS SSD",0,"TS2L4-SSDR960","P06584-B21 ",{"$f":"C94*664","v":0}]
[]
[null,"HPE 400GB SAS 12G Mixed Use SFF (2.5in) SC DS SSD",0,"TS2L4-SSD400MU","P09088-B21",null,{"$f":"C96*622","v":0}]
[]
[null,"HPE 400GB SAS 12G Write Intensive SFF (2.5in) SC DS SSD",0,"TS2L4-SSD400WIB","P09098-B21",null,{"$f":"C98*959","v":0}]
["SSD SAS"]
[null,"HPE 800GB SAS 12G Mixed Use SFF (2.5in) SC DS SSD",0,"TS2L4-SSD800MU","P09090-B21",null,{"$f":"C100*980","v":0}]
[]
[null,"HPE 960GB SAS 12G Mixed Use SC 3yr Wty Value SAS DS SSD",0,"TS2L4-SSD960MU","P10448-B21",null,{"$f":"C102*864","v":0}]
[]
[null,"HPE 1.92TB SAS 12G RI SFF SSD",0,"TS2L4-SSDR1920","P04519-B21",null,{"$f":"C104*1313","v":0}]
[]
[null,"DISCHI TOTALI",{"$f":"SUM(C86:C104)","v":2},{"$f":"IF(C106<=((C69+C71+C74)*8),\"      OK\",\"     ERRORE:   Totale n° di dischi superiore al consentito\")","v":"      OK"}]
[]
[null,"NOTE sulla configurazione (CAMPO OBBLIGATORIO)"]
[{"$f":"IF(C106<=((C69+C71+C74)*8),\"\",\"ERRORE:   Totale n° di dischi superiore al consentito\")","v":""},"Specificare la configurazione RAID per l'installazione del Sistema Operativo, se richiesto.\ne/o\ninserire eventuali note.",null,null,"Specificare la configurazione RAID per l'installazione del Sistema Operativo, se richiesto.\ne/o\ninserire eventuali note.",null,null,{"$f":"IF(B109=E109,\"ERRORE:   Compilare il campo NOTE\",\"\")","v":"ERRORE:   Compilare il campo NOTE"}]
[null,"Configurazione RAID con HDD 300GB"]
[null,"RAID 1  (2 HDDs)",1,null,{"$f":"VLOOKUP($B$111,  RAID_A1, 2, FALSE)","v":{"$error":"#N/A"}}]
[null,"Hot Spare for 300GB HDD","No"]
[]
[null,"Micro SD (USB Flash Drive)",0]
[null,"None",{"$f":"VLOOKUP($B$115,microsd, 2, FALSE)","v":0},{"$f":"VLOOKUP($B$115,microsd, 3, FALSE)","v":""},{"$f":"VLOOKUP($B$115,microsd, 5, FALSE)","v":""},null,{"$f":"VLOOKUP($B$115, microsd, 6, FALSE)*C115","v":0}]
[null,null,0]
[]
[null,"Alimentatore"]
[null,"HPE 1600W Flex Slot Platinum Hot Plug Low Halogen Power Supply Kit",2,null,"830272-B21"]
[]
[null,"PCIe Riser"]
[null,"Primary & Secondary Riser",1,null,"870548-B21"]
[]
[null,"Secondary Riser",0,{"$f":"VLOOKUP($C$124, Riser2, 2, FALSE)","v":""},{"$f":"VLOOKUP($C$124, Riser2, 3, FALSE)","v":""},{"$f":"VLOOKUP($C$124, Riser2, 4, FALSE)","v":""},{"$f":"VLOOKUP($C$124, Riser2, 5, FALSE)","v":0},{"$f":"IF(C124+C126=2,\"ERRORE - SELEZIONARE SOLO UNA SECONDARY RISER\",\"\")","v":""}]
[]
[null,"Secondary Riser for GPU (abilita l'installazione della GPU P2000 su slot 5)",0,{"$f":"VLOOKUP($C$126, Riser2GPU, 2, FALSE)","v":""},{"$f":"VLOOKUP($C$126, Riser2GPU, 3, FALSE)","v":""},{"$f":"VLOOKUP($C$126, Riser2GPU, 4, FALSE)","v":""},{"$f":"VLOOKUP($C$126, Riser2GPU, 5, FALSE)","v":0}]
[]
[null,"Tertiary riser",0,{"$f":"VLOOKUP($C$128, Riser3, 2, FALSE)","v":""},{"$f":"VLOOKUP($C$128, Riser3, 3, FALSE)","v":""},{"$f":"VLOOKUP($C$128, Riser3, 4, FALSE)","v":""},{"$f":"VLOOKUP($C$128, Riser3, 5, FALSE)","v":0}]
[]
[null,"Scheda FlexibleLOM"]
[null,"HPE Ethernet 1Gb 4-port 331FLR Adapter",{"$f":"VLOOKUP(B131,  FLR_Slot, 2, FALSE)","v":1},{"$f":"VLOOKUP(B131,  FLR_Slot, 3, FALSE)","v":""},{"$f":"VLOOKUP(B131,  FLR_Slot, 5, FALSE)","v":""},{"$f":"VLOOKUP(B131,  FLR_Slot, 6, FALSE)","v":""},{"$f":"VLOOKUP(B131,  FLR_Slot, 9, FALSE)","v":0}]
[]
[null,"Additional Card for PCIe Slot 1 x8 CPU 1 "]
[null,"None",{"$f":"IF(B134=B81,\"\",VLOOKUP(B134,  PCI_A1, 2, FALSE))","v":""},{"$f":"IF(B134=B81,\"\",VLOOKUP(B134,  PCI_A1, 3, FALSE))","v":""},{"$f":"IF(B134=B81,\"\",VLOOKUP(B134,  PCI_A1, 5, FALSE))","v":""},{"$f":"IF(B134=B81,\"\",VLOOKUP(B134,  PCI_A1, 6, FALSE))","v":""},{"$f":"IF(B134=B81,\"\",VLOOKUP($B$134,PCI_A1,9,FALSE))","v":0}]
[]
[null,"Additional Card for PCIe Slot 2 x16 CPU 1 "]
[null,"None",{"$f":"VLOOKUP(B137,  PCI_A2, 2, FALSE)","v":""},{"$f":"VLOOKUP(B137,  PCI_A2, 3, FALSE)","v":""},{"$f":"VLOOKUP(B137,  PCI_A2, 5, FALSE)","v":""},{"$f":"VLOOKUP(B137,  PCI_A2, 6, FALSE)","v":""},{"$f":"VLOOKUP(B137,  PCI_A2, 9, FALSE)","v":0}]
[]
[null,"Additional Card for PCIe Slot 3 x8 CPU 1 "]
[null,"None",{"$f":"VLOOKUP(B140,  PCI_A2, 2, FALSE)","v":""},{"$f":"VLOOKUP(B140,  PCI_A2, 3, FALSE)","v":""},{"$f":"VLOOKUP(B140,  PCI_A2, 5, FALSE)","v":""},{"$f":"VLOOKUP(B140,  PCI_A2, 6, FALSE)","v":""},{"$f":"VLOOKUP(B140,  PCI_A2, 9, FALSE)","v":0}]
[]
[null,{"$f":"IF(C126=1,\"Additional Card for PCIe Slot 4 x8 CPU 2 \",\"Additional Card for PCIe Slot 4 x8 CPU 2 \")","v":"Additional Card for PCIe Slot 4 x8 CPU 2 "}]
[null,"None",{"$f":"VLOOKUP(B143,  PCI_A2, 2, FALSE)","v":""},{"$f":"VLOOKUP(B143,  PCI_A2, 3, FALSE)","v":""},{"$f":"VLOOKUP(B143,  PCI_A2, 5, FALSE)","v":""},{"$f":"VLOOKUP(B143,  PCI_A2, 6, FALSE)","v":""},{"$f":"VLOOKUP(B143,  PCI_A2, 9, FALSE)","v":0}]
[]
[null,"Additional Card for PCIe Slot 5 (GPU SLOT) x16 CPU 2"]
[null,"None",{"$f":"VLOOKUP(B146,  PCI_A5, 2, FALSE)","v":""},{"$f":"VLOOKUP(B146,  PCI_A5, 3, FALSE)","v":""},{"$f":"VLOOKUP(B146,  PCI_A5, 5, FALSE)","v":""},{"$f":"VLOOKUP(B146,  PCI_A5, 6, FALSE)","v":""},{"$f":"VLOOKUP(B146,  PCI_A5, 9, FALSE)","v":0}]
[]
[null,"Additional Card for PCIe Slot 6 x8 CPU 2"]
[null,"None",{"$f":"VLOOKUP(B149,  PCI_A2, 2, FALSE)","v":""},{"$f":"VLOOKUP(B149,  PCI_A2, 3, FALSE)","v":""},{"$f":"VLOOKUP(B149,  PCI_A2, 5, FALSE)","v":""},{"$f":"VLOOKUP(B149,  PCI_A2, 6, FALSE)","v":""},{"$f":"VLOOKUP(B149,  PCI_A2, 9, FALSE)","v":0}]
[]
[null,"Additional Card for PCIe Slot 7 x8 CPU 2"]
[null,"None",{"$f":"IF($B$152=\"Aggiungere Tertiary riser\",\"\",VLOOKUP(B152,PCI_A2,2,FALSE))","v":""},{"$f":"IF($B$152=\"Aggiungere Tertiary riser\",\"\",VLOOKUP(B152,PCI_A2,3,FALSE))","v":""},{"$f":"IF($B$152=\"Aggiungere Tertiary riser\",\"\",VLOOKUP(B152,PCI_A2,5,FALSE))","v":""},{"$f":"IF($B$152=\"Aggiungere Tertiary riser\",\"\",VLOOKUP(B152,PCI_A2,6,FALSE))","v":""},{"$f":"IF($B$152=\"Aggiungere Tertiary riser\",\"\",VLOOKUP(B152,PCI_A2,9,FALSE))","v":0}]
[]
[null,"Additional Card for PCIe Slot 8 x8 CPU 2"]
[null,"None",{"$f":"IF($B$155=\"Aggiungere Tertiary riser\",\"\",VLOOKUP(B155,PCI_A2,2,FALSE))","v":""},{"$f":"IF($B$155=\"Aggiungere Tertiary riser\",\"\",VLOOKUP(B155,PCI_A2,3,FALSE))","v":""},{"$f":"IF($B$155=\"Aggiungere Tertiary riser\",\"\",VLOOKUP(B155,PCI_A2,5,FALSE))","v":""},{"$f":"IF($B$155=\"Aggiungere Tertiary riser\",\"\",VLOOKUP(B155,PCI_A2,6,FALSE))","v":""},{"$f":"IF($B$155=\"Aggiungere Tertiary riser\",\"\",VLOOKUP(B155,PCI_A2,9,FALSE))","v":0}]
[]
[null,"Bezel"]
[null,"None",1]
[]
[null,"Unità ottica"]
[null,"HP Mobile USB DVDRW Drive",1,null,"701498-B21"]
[]
[null,"Accessori per Server"]
[null,"HP BLc 10G SFP+ SR Transceiver",null,null,"455883-B21"]
[]
[null,"Cavi rj45"]
[null,"Cavo Rete UTP cat. 5e 3 metri",5,{"$f":"IF(C167=0,\"\",\"TS2L4-3MRJ45\")","v":"TS2L4-3MRJ45"},"ROS1403/G",null,{"$f":"2*C167","v":10}]
[]
[null,"Direct Attach Cables"]
[null,"HPE X240 10G SFP+ SFP+ 3m DAC Cable",0,{"$f":"IF(C170=0,\"\",\"TS2L4-DACX240M3\")","v":""},"JD097C",null,{"$f":"C170*81","v":0}]
[]
[null,"HPE X240 10G SFP+ SFP+ 5m DAC Cable",0,{"$f":"IF(C172=0,\"\",\"TS2L4-DACX240M5\")","v":""},"JG081C",null,{"$f":"C172*95","v":0}]
[]
[null,"HPE X240 10G SFP+ SFP+ 7m DAC Cable",0,{"$f":"IF(C174=0,\"\",\"TS2L4-DACX240M7\")","v":""},"JC784C",null,{"$f":"C174*106","v":0}]
[]
[null,"HPE 25Gb SFP28 to SFP28 3m Direct Attach Cable",0,{"$f":"IF(C176=0,\"\",\"TS2L4-DAC3SFP28\")","v":""},null,null,{"$f":"C176*134","v":0}]
[]
[null,"InfiniBand Copper Cable"]
[null,"HPE 2M FDR Quad Small Form Factor Pluggable InfiniBand Copper Cable",0,{"$f":"IF(C179=0,\"\",\"TS2L4-DACQSFPM2\")","v":""},"670759-B24",null,{"$f":"C179*147","v":0}]
[]
[null,"Omni-Path Architecture Copper Cable"]
[null,"HPE 2M 100Gb QSFP28 Omni-Path Architecture Copper Cable",0,{"$f":"IF(C182=0,\"\",\"TS2L4-DAC100M2\")","v":""},"830024-B24",null,{"$f":"C182*117","v":0}]
[]
[null,"HPE 3M 100Gb QSFP28 Omni-Path Architecture Copper Cable",0,{"$f":"IF(C184=0,\"\",\"TS2L4-DAC100M3\")","v":""},"830024-B25",null,{"$f":"C184*147","v":0}]
[null,1]
[null,"Omni-Path Architecture Optical"]
[null,"HPE 3M 100Gb QSFP28 Omni-Path Architecture Optical Power Class 2 Cable",0,{"$f":"IF(C187=0,\"\",\"TS2L4-DACAOCM3\")","v":""},"881204-B21",null,{"$f":"C187*612","v":0}]
[]
[null,"HPE 5M 100Gb QSFP28 Omni-Path Architecture Optical Power Class 2 Cable",0,{"$f":"IF(C189=0,\"\",\"TS2L4-DACAOCM5\")","v":""},"881204-B22",null,{"$f":"C189*619","v":0}]
[]
[null,"HPE 7M 100Gb QSFP28 Omni-Path Architecture Optical Power Class 2 Cable",0,{"$f":"IF(C191=0,\"\",\"TS2L4-DACAOCM7\")","v":""},"881204-B23",null,{"$f":"C191*627","v":0}]
[]
[null,"Optical Transceiver"]
[null,"HPE 10Gb SFP+ SR Transceiver",0,{"$f":"IF(C194=0,\"\",\"TS2L4-10OTSR\")","v":""},"455883-B21",null,{"$f":"C194*230","v":0}]
[]
[null,"HPE 10G SFP+ LR Transceiver",0,{"$f":"IF(C196=0,\"\",\"TS2L4-10OTLR\")","v":""},"455886-B21",null,{"$f":"C196*481","v":0}]
[]
[null,"HPE 25Gb SFP28 SR 100m Transceiver",0,{"$f":"IF(C198=0,\"\",\"TS2L4-SFP28SR\")","v":""},null,null,{"$f":"C198*887","v":0}]
[]
[null,"Estensione di Garanzia"]
[null,"None",{"$f":"VLOOKUP($B$201,  SO_B1,2, FALSE)","v":""},{"$f":"VLOOKUP($B$201,  SO_B1, 3, FALSE)","v":""},{"$f":"VLOOKUP($B$201,  SO_B1, 5, FALSE)","v":""},{"$f":"VLOOKUP($B$201,  SO_B1, 6, FALSE)","v":""}]
[]
[]
[null,"None",{"$f":"VLOOKUP($B$204,  SO_A2, 2, FALSE)","v":""},{"$f":"VLOOKUP($B$204,  SO_A2, 3, FALSE)","v":""},{"$f":"VLOOKUP($B$204,  SO_A2,5, FALSE)","v":""},{"$f":"VLOOKUP($B$204,  SO_A2, 6, FALSE)","v":""}]

{"sheet":"Lotto4 DL560 Gen10 2","index":1,"n_rows":204,"n_cols":8,"rows_kept":204,"cut":false,"hidden":false,"merged":[[128,1,128,4],[113,2,113,4],[204,1,204,4],[202,2,202,4],[137,1,137,4],[138,2,138,4],[140,1,140,4],[141,2,141,4],[143,1,143,4],[147,2,147,4],[149,1,149,4],[150,2,150,4],[152,1,152,4],[153,2,153,4],[155,1,155,4],[201,1,201,4],[0,7,1,7],[135,2,135,4],[164,1,164,4],[199,2,199,4],[116,1,116,4],[117,2,117,4],[119,1,119,4],[34,2,34,3],[120,2,120,4],[112,1,112,4],[49,2,49,4],[53,1,53,4],[156,2,156,4],[158,1,158,4],[187,1,187,4],[189,1,189,4],[131,1,131,4],[132,2,132,4],[134,1,134,4],[161,1,161,4],[162,2,162,4],[146,1,146,4],[144,2,144,4],[159,2,159,4],[170,1,170,4],[172,1,172,4],[184,1,184,4],[182,1,182,4],[174,1,174,4],[179,1,179,4],[2,1,2,2],[191,1,191,4],[194,1,194,4],[109,2,109,4],[18,2,18,4],[82,2,82,4],[106,1,106,4],[107,2,107,4],[108,1,108,3],[66,1,66,4],[74,1,74,4],[75,2,75,4],[5,0,5,4],[10,0,11,2],[48,1,48,4],[20,1,20,4],[81,1,81,4],[49,0,53,0],[196,1,196,4],[129,2,129,4],[3,0,4,4],[24,2,24,4],[27,1,27,4],[28,2,28,4],[30,1,30,4],[31,2,31,4],[33,1,33,4],[36,1,36,4],[37,2,37,4],[43,1,43,4],[44,2,44,4],[176,1,176,4]]}
[null,null,"TOTALE PRODOTTI CONVENZIONE",{"$f":"H10","v":0},null,null,{"$f":"IF(D106=\"      OK\",0,1)","v":0},{"$f":"IF(G1+G2=0,(D1+D2),\"ERRORE VERIFICARE LA CONFIGURAZIONE\")","v":0}]
[null,null,"TOTALE ARTICOLI 20%",{"$f":"H11","v":0}]
[null,"Indicare qui la quantità Server ----->",null,0,null,null,null,{"$f":"Riepilogo!T6","v":"ver. 3.5"}]
["Tecnologie Server 2 Lotto 4 Base DL560 Gen10"]
[]
[]
[]
[]
[]
[null,null,null,"Totale Server e Opzioni",null,null,null,{"$f":"F17*SRV_AA","v":0}]
["Components: \nServer HPE Proliant DL560 Gen10 (2CPU Intel® Xeon-Gold 5218)",null,null,"Totale Ulteriori Opzioni ",null,null,null,{"$f":"G17*SRV_AA","v":0}]
[]
[null,null,null,"TOTALE CONVENZIONE",null,null,null,{"$f":"H11+H10","v":0}]
[]
[null,null,null,null,null,4628]
[null,"Quantity: ",{"$f":"SRV_AA","v":0},null,null,{"$f":"SUM(F20:F205)","v":0}]
[null,null,null,null,null,{"$f":"SUM(F15:F16)","v":4628},{"$f":"SUM(G20:G205)","v":10}]
[]
[null,"Base"]
[null,"HPE DL560 Gen10 8SFF CTO Server",1,null,"841730-B21"]
[]
[null,"Configurazione dello chassis"]
[null,"HP DL560 Gen9 2SFF Media Bay Kit",1,null,"795090-B21"]
[]
[null,"Processore"]
[null,"Intel Xeon-Gold 5218 (2.3GHz/16-core/125W)",2,null,"840399-L21"]
[null,"HPE DL560 Gen10 Intel® Xeon-Gold 5118 (2.3GHz/12-core/105W) Processor",1,null,"840399-B21"]
[]
[null,"Processore aggiuntivo"]
[null,"No Additional Processor",{"$f":"VLOOKUP($B$30, CPU_A, 2, FALSE)","v":0},{"$f":"VLOOKUP($B$30, CPU_A, 3, FALSE)","v":""},{"$f":"VLOOKUP($B$30, CPU_A, 5, FALSE)","v":""},{"$f":"VLOOKUP(B30, CPU_A, 12, FALSE)","v":0}]
[]
[null,"Mezz Board Option"]
[null,{"$f":"VLOOKUP($B$30, CPU_A, 6, FALSE)","v":""},{"$f":"VLOOKUP($B$30, CPU_A, 7, FALSE)","v":""},null,{"$f":"VLOOKUP($B$30, CPU_A, 8, FALSE)","v":""}]
[]
[null,"Memoria Totale in GB",{"$f":"IF(F30=2584,IF(B36=64,\"ATTENZIONE: AUMENTARE LA RAM\",\"\"),\"\")","v":""}]
[null,"128        (DIMM 32GB)"]
[]
[null,"Capacità di memoria"]
[null,{"$f":"IF($B$30=\"No Additional Processor\",VLOOKUP($B$36, MEM_A1, 8, FALSE),VLOOKUP($B$36, MEM_A2, 8, FALSE))","v":"HPE 32GB 2Rx4 PC4-2933 Smart Kit"},{"$f":"IF($B$30=\"No Additional Processor\",VLOOKUP($B$36, MEM_A1, 9, FALSE),VLOOKUP($B$36, MEM_A2, 9, FALSE))","v":4},null,{"$f":"IF($B$30=\"No Additional Processor\",VLOOKUP($B$36, MEM_A1, 10, FALSE),VLOOKUP($B$36, MEM_A2, 10, FALSE))","v":"815100-B21"}]
[]
[null,{"$f":"IF($B$30=\"No Additional Processor\",VLOOKUP($B$36, MEM_A1, 2, FALSE),VLOOKUP($B$36, MEM_A2, 2, FALSE))","v":"HPE 32GB 2Rx4 PC4-2933 Smart Kit"},{"$f":"IF($B$30=\"No Additional Processor\",VLOOKUP($B$36, MEM_A1, 3, FALSE),VLOOKUP($B$36, MEM_A2, 3, FALSE))","v":4},{"$f":"IF($B$30=\"No Additional Processor\",VLOOKUP($B$36, MEM_A1, 4, FALSE),VLOOKUP($B$36, MEM_A2, 4, FALSE))","v":""},{"$f":"IF($B$30=\"No Additional Processor\",VLOOKUP($B$36, MEM_A1, 6, FALSE),VLOOKUP($B$36, MEM_A2, 6, FALSE))","v":"815100-B21"},{"$f":"IF($B$30=\"No Additional Processor\",VLOOKUP($B$36, MEM_A1, 7, FALSE),VLOOKUP($B$36, MEM_A2, 7, FALSE))","v":0}]
[null,{"$f":"IF($B$30=\"No Additional Processor\",VLOOKUP($B$36, MEM_A1, 11, FALSE),VLOOKUP($B$36, MEM_A2, 11, FALSE))","v":""},{"$f":"IF($B$30=\"No Additional Processor\",VLOOKUP($B$36, MEM_A1, 12, FALSE),VLOOKUP($B$36, MEM_A2, 12, FALSE))","v":""},{"$f":"IF($B$30=\"No Additional Processor\",VLOOKUP($B$36, MEM_A1, 13, FALSE),VLOOKUP($B$36, MEM_A2, 13, FALSE))","v":""},{"$f":"IF($B$30=\"No Additional Processor\",VLOOKUP($B$36, MEM_A1, 15, FALSE),VLOOKUP($B$36, MEM_A2, 15, FALSE))","v":""},{"$f":"IF($B$30=\"No Additional Processor\",VLOOKUP($B$36, MEM_A1, 16, FALSE),VLOOKUP($B$36, MEM_A2, 16, FALSE))","v":""}]
[]
[]
[null,"Sistema operativo preinstallato"]
[null,"No Operating System",{"$f":"VLOOKUP($B$46, OS_A, 2, FALSE)","v":""},{"$f":"VLOOKUP($B$46, OS_A, 3, FALSE)","v":""},{"$f":"VLOOKUP($B$46, OS_A, 5, FALSE)","v":""},{"$f":"VLOOKUP($B$46, OS_A, 6, FALSE)","v":""}]
[null,{"$f":"IF($B$30=\"No Additional Processor\",VLOOKUP($B$46, OS_A, 19, FALSE),VLOOKUP($B$46, OS_A2, 19, FALSE))","v":""},{"$f":"IF($B$30=\"No Additional Processor\",VLOOKUP($B$46, OS_A, 20, FALSE),VLOOKUP($B$46, OS_A2, 20, FALSE))","v":0},{"$f":"IF($B$30=\"No Additional Processor\",VLOOKUP($B$46, OS_A, 21, FALSE),VLOOKUP($B$46, OS_A2, 21, FALSE))","v":""},{"$f":"IF($B$30=\"No Additional Processor\",VLOOKUP($B$46, OS_A, 23, FALSE),VLOOKUP($B$46, OS_A2, 23, FALSE))","v":""},{"$f":"IF($B$30=\"No Additional Processor\",VLOOKUP($B$46, OS_A, 24, FALSE)*C47,VLOOKUP($B$46, OS_A2, 24, FALSE)*C47)","v":0},null,{"$f":"IF(D46=\"TS1L2-WIN1\",3,IF(D46=\"TS1L2-WINDC1\",4,0))","v":0}]
[null,{"$f":"IF($B$30=\"No Additional Processor\",VLOOKUP($B$46, OS_A, 25, FALSE),VLOOKUP($B$46, OS_A2, 25, FALSE))","v":""},{"$f":"IF($B$30=\"No Additional Processor\",VLOOKUP($B$46, OS_A, 26, FALSE),VLOOKUP($B$46, OS_A2, 26, FALSE))","v":0},{"$f":"IF($B$30=\"No Additional Processor\",VLOOKUP($B$46, OS_A, 27, FALSE),VLOOKUP($B$46, OS_A2, 27, FALSE))","v":""},{"$f":"IF($B$30=\"No Additional Processor\",VLOOKUP($B$46, OS_A, 29, FALSE),VLOOKUP($B$46, OS_A2, 29, FALSE))","v":""},{"$f":"IF($B$30=\"No Additional Processor\",VLOOKUP($B$46, OS_A, 30, FALSE)*C48,VLOOKUP($B$46, OS_A2, 30, FALSE)*C48)","v":0}]
[]
[null,"Client Access Licenses"]
[null,{"$f":"VLOOKUP($B$46, OS_A, 7, FALSE)","v":"None"},0,{"$f":"VLOOKUP($B$46, OS_A, 9, FALSE)","v":""},{"$f":"VLOOKUP($B$46, OS_A, 11, FALSE)","v":""},{"$f":"VLOOKUP($B$46, OS_A, 12, FALSE)*C51","v":0}]
[]
[null,{"$f":"VLOOKUP($B$46, OS_A, 13, FALSE)","v":"None"},0,{"$f":"VLOOKUP($B$46, OS_A, 15, FALSE)","v":""},{"$f":"VLOOKUP($B$46, OS_A, 17, FALSE)","v":""},{"$f":"VLOOKUP($B$46, OS_A, 18, FALSE)*C53","v":0}]
[]
[null,"VMware vSphere"]
[null,"None",{"$f":"IF(D56=\"\",0,($C$26+$C$30))","v":0},{"$f":"VLOOKUP($B$56,vmware, 3, FALSE)","v":""},{"$f":"VLOOKUP($B$56,vmware, 5, FALSE)","v":""},null,{"$f":"VLOOKUP($B$56,vmware, 6, FALSE)*C56","v":0}]
[null,"VMware vCenter Server Standard"]
[null,"None",{"$f":"VLOOKUP($B$58,vmwareplus, 2, FALSE)","v":0},{"$f":"VLOOKUP($B$58,vmwareplus, 3, FALSE)","v":""},{"$f":"VLOOKUP($B$58,vmwareplus, 5, FALSE)","v":""},null,{"$f":"VLOOKUP($B$58,vmwareplus, 6, FALSE)*C58","v":0}]
[null,"Essentials Plus Kit"]
[null,"None",{"$f":"VLOOKUP($B$60,vmwarevcenter, 2, FALSE)","v":0},{"$f":"VLOOKUP($B$60,vmwarevcenter, 3, FALSE)","v":""},{"$f":"VLOOKUP($B$60,vmwarevcenter, 5, FALSE)","v":""},null,{"$f":"VLOOKUP($B$60, vmwarevcenter, 6, FALSE)*C60","v":0}]
[null,"VMware vSAN"]
[null,"None",{"$f":"IF(D62=\"\",0,($C$26+$C$30))","v":0},{"$f":"VLOOKUP($B$62,wmvsan, 3, FALSE)","v":""},{"$f":"VLOOKUP($B$62,wmvsan, 5, FALSE)","v":""},null,{"$f":"VLOOKUP($B$62,wmvsan, 6, FALSE)*C62","v":0}]
[]
[]
[null,"HPE OneView Advanced (with HPE iLO Advanced)"]
[null,"None",{"$f":"VLOOKUP($B$66, OpzOVAdv, 2, FALSE)","v":0},{"$f":"VLOOKUP($B$66, OpzOVAdv, 3, FALSE)","v":""},{"$f":"VLOOKUP($B$66, OpzOVAdv, 5, FALSE)","v":""},null,{"$f":"VLOOKUP($B$66, OpzOVAdv, 6, FALSE)","v":0}]
[]
[null,"Configurazione dello chassis"]
[null,"HPE DL560 Gen10 8SFF HDD Bay3 Kit",1,null,"872237-B21"]
[]
[null,"HPE DL560 Gen10 8SFF HDD Bay2 Kit",0,{"$f":"VLOOKUP($C$71, HDD_Bay2, 2, FALSE)","v":""},{"$f":"VLOOKUP($C$71, HDD_Bay2, 3, FALSE)","v":""},{"$f":"VLOOKUP($C$71, HDD_Bay2, 4, FALSE)","v":""},{"$f":"IF(C74>=1,0,VLOOKUP($C$71,HDD_Bay2,5,FALSE))","v":0}]
[]
[]
[null,"HPE DL560 Gen10 8SFF HDD Bay1 Kit",0,{"$f":"VLOOKUP($C$74, HDD_BAY1, 2, FALSE)","v":""},{"$f":"VLOOKUP($C$74, HDD_BAY1, 3, FALSE)","v":""},{"$f":"VLOOKUP($C$74, HDD_BAY1, 4, FALSE)","v":""},{"$f":"VLOOKUP($C$74,HDD_BAY1,5,FALSE)","v":0}]
[]
[null,"Controller RAID"]
[null,"HPE Smart Array P408i-a SR Gen10 ",1,null,"869081-B21"]
[]
[null,"HPE 96W Smart Storage Battery with 145mm Cable Kit",1,null,"P01366-B21"]
[]
[null,{"$f":"IF(C74+C71=0,\"\",\"HPE DL5x0 Gen10 12Gb SAS Expander Card Kit with Cables\")","v":""},{"$f":"IF(C74+C71=0,\"\",1)","v":""},{"$f":"IF(C74+C71=0,\"\",\"TS2L4-SASBAY1\")","v":""},{"$f":"IF(C74=0,\"\",\"873444-B21\")","v":""}]
[]
[null,{"$f":"IF(C65+C67+C69=1,\"Dischi rigidi  (numero massimo totale 8)\",(IF(C65+C67+C69=2,\"Dischi rigidi  (numero massimo totale 16)\",\"Dischi rigidi  (numero massimo totale 24)\")))","v":"Dischi rigidi  (numero massimo totale 8)"}]
[null,"HPE 300GB SAS 15K SFF SC DS HDD",2,null,"870753-B21"]
[]
[null,"HPE 300GB SAS 15K SFF SC DS HDD",2,"TS2L4-15K300","870753-B21",{"$f":"IF(C86<=2,0,C86-2)*135","v":0}]
[]
[null,"HPE 1.2TB SAS 10K SFF SC DS HDD",0,"TS2L4-10K1200","872479-B21",{"$f":"C88*146","v":0}]
[]
["HDD SAS ","HPE 1.8TB SAS 10K SFF HDD",0,"TS2L4-10K1800","872481-B21",null,{"$f":"C90*190","v":0}]
[]
[null,"HPE 480GB SAS 12G SFF SC DS SSD",0,"TS2L4-SSD480","?????",{"$f":"C92*399","v":0}]
[]
[null,"HPE 960GB SAS 12G Read Intensive SFF SC DS SSD",0,"TS2L4-SSDR960","P06584-B21 ",{"$f":"C94*664","v":0}]
[]
[null,"HPE 400GB SAS 12G Mixed Use SFF (2.5in) SC DS SSD",0,"TS2L4-SSD400MU","P09088-B21",null,{"$f":"C96*622","v":0}]
[]
[null,"HPE 400GB SAS 12G Write Intensive SFF (2.5in) SC DS SSD",0,"TS2L4-SSD400WIB","P09098-B21",null,{"$f":"C98*959","v":0}]
["SSD SAS"]
[null,"HPE 800GB SAS 12G Mixed Use SFF (2.5in) SC DS SSD",0,"TS2L4-SSD800MU","P09090-B21",null,{"$f":"C100*980","v":0}]
[]
[null,"HPE 960GB SAS 12G Mixed Use SC 3yr Wty Value SAS DS SSD",0,"TS2L4-SSD960MU","P10448-B21",null,{"$f":"C102*864","v":0}]
[]
[null,"HPE 1.92TB SAS 12G RI SFF SSD",0,"TS2L4-SSDR1920","P04519-B21",null,{"$f":"C104*1313","v":0}]
[]
[null,"DISCHI TOTALI",{"$f":"SUM(C86:C104)","v":2},{"$f":"IF(C106<=((C69+C71+C74)*8),\"      OK\",\"     ERRORE:   Totale n° di dischi superiore al consentito\")","v":"      OK"}]
[]
[null,"NOTE sulla configurazione (CAMPO OBBLIGATORIO)"]
[{"$f":"IF(C106<=((C69+C71+C74)*8),\"\",\"ERRORE:   Totale n° di dischi superiore al consentito\")","v":""},"Specificare la configurazione RAID per l'installazione del Sistema Operativo, se richiesto.\ne/o\ninserire eventuali note.",null,null,"Specificare la configurazione RAID per l'installazione del Sistema Operativo, se richiesto.\ne/o\ninserire eventuali note.",null,null,{"$f":"IF(B109=E109,\"ERRORE:   Compilare il campo NOTE\",\"\")","v":"ERRORE:   Compilare il campo NOTE"}]
[null,"Configurazione RAID con HDD 300GB"]
[null,"RAID 1  (2 HDDs)",1,null,{"$f":"VLOOKUP($B$111,  RAID_A1, 2, FALSE)","v":{"$error":"#N/A"}}]
[null,"Hot Spare for 300GB HDD","No"]
[]
[null,"Micro SD (USB Flash Drive)",0]
[null,"None",{"$f":"VLOOKUP($B$115,microsd, 2, FALSE)","v":0},{"$f":"VLOOKUP($B$115,microsd, 3, FALSE)","v":""},{"$f":"VLOOKUP($B$115,microsd, 5, FALSE)","v":""},null,{"$f":"VLOOKUP($B$115, microsd, 6, FALSE)*C115","v":0}]
[null,"Hot Spare for 1TB HDD",0]
[]
[null,"Alimentatore"]
[null,"HPE 1600W Flex Slot Platinum Hot Plug Low Halogen Power Supply Kit",2,null,"830272-B21"]
[]
[null,"PCIe Riser"]
[null,"Primary & Secondary Riser",1,null,"870548-B21"]
[]
[null,"Secondary Riser",0,{"$f":"VLOOKUP($C$124, Riser2, 2, FALSE)","v":""},{"$f":"VLOOKUP($C$124, Riser2, 3, FALSE)","v":""},{"$f":"VLOOKUP($C$124, Riser2, 4, FALSE)","v":""},{"$f":"VLOOKUP($C$124, Riser2, 5, FALSE)","v":0}]
[]
[null,"Secondary Riser for GPU (abilita l'installazione della GPU P2000 su slot 5)",0,{"$f":"VLOOKUP($C$126, Riser2GPU, 2, FALSE)","v":""},{"$f":"VLOOKUP($C$126, Riser2GPU, 3, FALSE)","v":""},{"$f":"VLOOKUP($C$126, Riser2GPU, 4, FALSE)","v":""},{"$f":"VLOOKUP($C$126, Riser2GPU, 5, FALSE)","v":0}]
[]
[null,"Tertiary riser",0,{"$f":"VLOOKUP($C$128, Riser3, 2, FALSE)","v":""},{"$f":"VLOOKUP($C$128, Riser3, 3, FALSE)","v":""},{"$f":"VLOOKUP($C$128, Riser3, 4, FALSE)","v":""},{"$f":"VLOOKUP($C$128, Riser3, 5, FALSE)","v":0}]
[]
[null,"Scheda FlexibleLOM"]
[null,"HPE Ethernet 1Gb 4-port 331FLR Adapter",{"$f":"VLOOKUP(B131,  FLR_Slot, 2, FALSE)","v":1},{"$f":"VLOOKUP(B131,  FLR_Slot, 3, FALSE)","v":""},{"$f":"VLOOKUP(B131,  FLR_Slot, 5, FALSE)","v":""},{"$f":"VLOOKUP(B131,  FLR_Slot, 6, FALSE)","v":""},{"$f":"VLOOKUP(B131,  FLR_Slot, 9, FALSE)","v":0}]
[]
[null,"Additional Card for PCIe Slot 1 x8 CPU 1 "]
[null,"None",{"$f":"IF(B134=B81,\"\",VLOOKUP(B134,  PCI_A1, 2, FALSE))","v":""},{"$f":"IF(B134=B81,\"\",VLOOKUP(B134,  PCI_A1, 3, FALSE))","v":""},{"$f":"IF(B134=B81,\"\",VLOOKUP(B134,  PCI_A1, 5, FALSE))","v":""},{"$f":"IF(B134=B81,\"\",VLOOKUP(B134,  PCI_A1, 6, FALSE))","v":""},{"$f":"IF(B134=B81,\"\",VLOOKUP($B$134,PCI_A1,9,FALSE))","v":0}]
[]
[null,"Additional Card for PCIe Slot 2 x16 CPU 1 "]
[null,"None",{"$f":"VLOOKUP(B137,  PCI_A2, 2, FALSE)","v":""},{"$f":"VLOOKUP(B137,  PCI_A2, 3, FALSE)","v":""},{"$f":"VLOOKUP(B137,  PCI_A2, 5, FALSE)","v":""},{"$f":"VLOOKUP(B137,  PCI_A2, 6, FALSE)","v":""},{"$f":"VLOOKUP(B137,  PCI_A2, 9, FALSE)","v":0}]
[]
[null,"Additional Card for PCIe Slot 3 x8 CPU 1 "]
[null,"None",{"$f":"VLOOKUP(B140,  PCI_A2, 2, FALSE)","v":""},{"$f":"VLOOKUP(B140,  PCI_A2, 3, FALSE)","v":""},{"$f":"VLOOKUP(B140,  PCI_A2, 5, FALSE)","v":""},{"$f":"VLOOKUP(B140,  PCI_A2, 6, FALSE)","v":""},{"$f":"VLOOKUP(B140,  PCI_A2, 9, FALSE)","v":0}]
[]
[null,{"$f":"IF(C126=1,\"Additional Card for PCIe Slot 4 x8 CPU 2 \",\"Additional Card for PCIe Slot 4 x8 CPU 2 \")","v":"Additional Card for PCIe Slot 4 x8 CPU 2 "}]
[null,"None",{"$f":"VLOOKUP(B143,  PCI_A2, 2, FALSE)","v":""},{"$f":"VLOOKUP(B143,  PCI_A2, 3, FALSE)","v":""},{"$f":"VLOOKUP(B143,  PCI_A2, 5, FALSE)","v":""},{"$f":"VLOOKUP(B143,  PCI_A2, 6, FALSE)","v":""},{"$f":"VLOOKUP(B143,  PCI_A2, 9, FALSE)","v":0}]
[]
[null,"Additional Card for PCIe Slot 5 (GPU SLOT) x16 CPU 2"]
[null,"None",{"$f":"VLOOKUP(B146,  PCI_A5, 2, FALSE)","v":""},{"$f":"VLOOKUP(B146,  PCI_A5, 3, FALSE)","v":""},{"$f":"VLOOKUP(B146,  PCI_A5, 5, FALSE)","v":""},{"$f":"VLOOKUP(B146,  PCI_A5, 6, FALSE)","v":""},{"$f":"VLOOKUP(B146,  PCI_A5, 9, FALSE)","v":0}]
[]
[null,"Additional Card for PCIe Slot 6 x8 CPU 2"]
[null,"None",{"$f":"VLOOKUP(B149,  PCI_A2, 2, FALSE)","v":""},{"$f":"VLOOKUP(B149,  PCI_A2, 3, FALSE)","v":""},{"$f":"VLOOKUP(B149,  PCI_A2, 5, FALSE)","v":""},{"$f":"VLOOKUP(B149,  PCI_A2, 6, FALSE)","v":""},{"$f":"VLOOKUP(B149,  PCI_A2, 9, FALSE)","v":0}]
[]
[null,"Additional Card for PCIe Slot 7 x8 CPU 2"]
[null,"None",{"$f":"IF($B$152=\"Aggiungere Tertiary riser\",\"\",VLOOKUP(B152,PCI_A2,2,FALSE))","v":""},{"$f":"IF($B$152=\"Aggiungere Tertiary riser\",\"\",VLOOKUP(B152,PCI_A2,3,FALSE))","v":""},{"$f":"IF($B$152=\"Aggiungere Tertiary riser\",\"\",VLOOKUP(B152,PCI_A2,5,FALSE))","v":""},{"$f":"IF($B$152=\"Aggiungere Tertiary riser\",\"\",VLOOKUP(B152,PCI_A2,6,FALSE))","v":""},{"$f":"IF($B$152=\"Aggiungere Tertiary riser\",\"\",VLOOKUP(B152,PCI_A2,9,FALSE))","v":0}]
[]
[null,"Additional Card for PCIe Slot 8 x8 CPU 2"]
[null,"None",{"$f":"IF($B$155=\"Aggiungere Tertiary riser\",\"\",VLOOKUP(B155,PCI_A2,2,FALSE))","v":""},{"$f":"IF($B$155=\"Aggiungere Tertiary riser\",\"\",VLOOKUP(B155,PCI_A2,3,FALSE))","v":""},{"$f":"IF($B$155=\"Aggiungere Tertiary riser\",\"\",VLOOKUP(B155,PCI_A2,5,FALSE))","v":""},{"$f":"IF($B$155=\"Aggiungere Tertiary riser\",\"\",VLOOKUP(B155,PCI_A2,6,FALSE))","v":""},{"$f":"IF($B$155=\"Aggiungere Tertiary riser\",\"\",VLOOKUP(B155,PCI_A2,9,FALSE))","v":0}]
[]
[null,"Bezel"]
[null,"None",1]
[]
[null,"Unità ottica"]
[null,"HP Mobile USB DVDRW Drive",1,null,"701498-B21"]
[]
[null,"Accessori per Server"]
[null,"HP BLc 10G SFP+ SR Transceiver",null,null,"455883-B21"]
[]
[null,"Cavi rj45"]
[null,"Cavo Rete UTP cat. 5e 3 metri",5,{"$f":"IF(C167=0,\"\",\"TS2L4-3MRJ45\")","v":"TS2L4-3MRJ45"},"ROS1403/G",null,{"$f":"2*C167","v":10}]
[]
[null,"Omni-Path Architecture Optical"]
[null,"HPE X240 10G SFP+ SFP+ 3m DAC Cable",0,{"$f":"IF(C170=0,\"\",\"TS2L4-DACX240M3\")","v":""},"JD097C",null,{"$f":"C170*81","v":0}]
[]
[null,"HPE X240 10G SFP+ SFP+ 5m DAC Cable",0,{"$f":"IF(C172=0,\"\",\"TS2L4-DACX240M5\")","v":""},"JG081C",null,{"$f":"C172*95","v":0}]
[]
[null,"HPE X240 10G SFP+ SFP+ 7m DAC Cable",0,{"$f":"IF(C174=0,\"\",\"TS2L4-DACX240M7\")","v":""},"JC784C",null,{"$f":"C174*106","v":0}]
[]
[null,"HPE 25Gb SFP28 to SFP28 3m Direct Attach Cable",0,{"$f":"IF(C176=0,\"\",\"TS2L4-DAC3SFP28\")","v":""},null,null,{"$f":"C176*134","v":0}]
[]
[null,"InfiniBand Copper Cable"]
[null,"HPE 2M FDR Quad Small Form Factor Pluggable InfiniBand Copper Cable",0,{"$f":"IF(C179=0,\"\",\"TS2L4-DACQSFPM2\")","v":""},"670759-B24",null,{"$f":"C179*147","v":0}]
[]
[null,"Omni-Path Architecture Copper Cable"]
[null,"HPE 2M 100Gb QSFP28 Omni-Path Architecture Copper Cable",0,{"$f":"IF(C182=0,\"\",\"TS2L4-DAC100M2\")","v":""},"830024-B24",null,{"$f":"C182*117","v":0}]
[]
[null,"HPE 3M 100Gb QSFP28 Omni-Path Architecture Copper Cable",0,{"$f":"IF(C184=0,\"\",\"TS2L4-DAC100M3\")","v":""},"830024-B25",null,{"$f":"C184*147","v":0}]
[]
[null,"Omni-Path Architecture Optical"]
[null,"HPE 3M 100Gb QSFP28 Omni-Path Architecture Optical Power Class 2 Cable",0,{"$f":"IF(C187=0,\"\",\"TS2L4-DACAOCM3\")","v":""},"881204-B21",null,{"$f":"C187*612","v":0}]
[]
[null,"HPE 5M 100Gb QSFP28 Omni-Path Architecture Optical Power Class 2 Cable",0,{"$f":"IF(C189=0,\"\",\"TS2L4-DACAOCM5\")","v":""},"881204-B22",null,{"$f":"C189*619","v":0}]
[]
[null,"HPE 7M 100Gb QSFP28 Omni-Path Architecture Optical Power Class 2 Cable",0,{"$f":"IF(C191=0,\"\",\"TS2L4-DACAOCM7\")","v":""},"881204-B23",null,{"$f":"C191*627","v":0}]
[]
[null,"Optical Transceiver"]
[null,"HPE 10Gb SFP+ SR Transceiver",0,{"$f":"IF(C194=0,\"\",\"TS2L4-10OTSR\")","v":""},"455883-B21",null,{"$f":"C194*230","v":0}]
[]
[null,"HPE 10G SFP+ LR Transceiver",0,{"$f":"IF(C196=0,\"\",\"TS2L4-10OTLR\")","v":""},"455886-B21",null,{"$f":"C196*481","v":0}]
[]
[null,"HPE 25Gb SFP28 SR 100m Transceiver",0,{"$f":"IF(C198=0,\"\",\"TS2L4-SFP28SR\")","v":""},null,null,{"$f":"C198*887","v":0}]
[]
[null,"Estensione di Garanzia"]
[null,"None",{"$f":"VLOOKUP($B$201,  SO_B1,2, FALSE)","v":""},{"$f":"VLOOKUP($B$201,  SO_B1, 3, FALSE)","v":""},{"$f":"VLOOKUP($B$201,  SO_B1, 5, FALSE)","v":""},{"$f":"VLOOKUP($B$201,  SO_B1, 6, FALSE)","v":""}]
[]
[]
[null,"None",{"$f":"VLOOKUP($B$204,  SO_A2, 2, FALSE)","v":""},{"$f":"VLOOKUP($B$204,  SO_A2, 3, FALSE)","v":""},{"$f":"VLOOKUP($B$204,  SO_A2,5, FALSE)","v":""},{"$f":"VLOOKUP($B$204,  SO_A2, 6, FALSE)","v":""}]

{"sheet":"Lotto4 DL560 Gen10 3","index":2,"n_rows":204,"n_cols":8,"rows_kept":204,"cut":false,"hidden":false,"merged":[[49,0,53,0],[0,7,1,7],[204,1,204,4],[135,2,135,4],[164,1,164,4],[199,2,199,4],[201,1,201,4],[202,2,202,4],[137,1,137,4],[138,2,138,4],[140,1,140,4],[141,2,141,4],[143,1,143,4],[128,1,128,4],[129,2,129,4],[132,2,132,4],[134,1,134,4],[116,1,116,4],[117,2,117,4],[119,1,119,4],[144,2,144,4],[120,2,120,4],[112,1,112,4],[107,2,107,4],[108,1,108,3],[109,2,109,4],[49,2,49,4],[53,1,53,4],[81,1,81,4],[82,2,82,4],[106,1,106,4],[5,0,5,4],[10,0,11,2],[48,1,48,4],[20,1,20,4],[24,2,24,4],[27,1,27,4],[28,2,28,4],[30,1,30,4],[31,2,31,4],[33,1,33,4],[36,1,36,4],[37,2,37,4],[43,1,43,4],[44,2,44,4],[34,2,34,3],[159,2,159,4],[18,2,18,4],[191,1,191,4],[194,1,194,4],[179,1,179,4],[182,1,182,4],[161,1,161,4],[162,2,162,4],[170,1,170,4],[172,1,172,4],[176,1,176,4],[113,2,113,4],[66,1,66,4],[74,1,74,4],[75,2,75,4],[131,1,131,4],[196,1,196,4],[174,1,174,4],[3,0,4,4],[2,1,2,2],[184,1,184,4],[187,1,187,4],[189,1,189,4],[146,1,146,4],[147,2,147,4],[149,1,149,4],[150,2,150,4],[152,1,152,4],[153,2,153,4],[155,1,155,4],[156,2,156,4],[158,1,158,4]]}
[null,null,"TOTALE PRODOTTI CONVENZIONE",{"$f":"H10","v":0},null,null,{"$f":"IF(D106=\"      OK\",0,1)","v":0},{"$f":"IF(G1+G2=0,(D1+D2),\"ERRORE VERIFICARE LA CONFIGURAZIONE\")","v":0}]
[null,null,"TOTALE ARTICOLI 20%",{"$f":"H11","v":0}]
[null,"Indicare qui la quantità Server ----->",null,0,null,null,null,{"$f":"Riepilogo!T6","v":"ver. 3.5"}]
["Tecnologie Server 2 Lotto 4 Base DL560 Gen10"]
[]
[]
[]
[]
[]
[null,null,null,"Totale Server e Opzioni",null,null,null,{"$f":"F17*SRV_AAA","v":0}]
["Components: \nServer HPE Proliant DL560 Gen10 (2CPU Intel® Xeon-Gold 5218)",null,null,"Totale Ulteriori Opzioni ",null,null,null,{"$f":"G17*SRV_AAA","v":0}]
[]
[null,null,null,"TOTALE CONVENZIONE",null,null,null,{"$f":"H11+H10","v":0}]
[]
[null,null,null,null,null,4628]
[null,"Quantity: ",{"$f":"SRV_AAA","v":0},null,null,{"$f":"SUM(F20:F205)","v":0}]
[null,null,null,null,null,{"$f":"SUM(F15:F16)","v":4628},{"$f":"SUM(G20:G205)","v":10}]
[]
[null,"Base"]
[null,"HPE DL560 Gen10 8SFF CTO Server",1,null,"841730-B21"]
[]
[null,"Configurazione dello chassis"]
[null,"HP DL560 Gen9 2SFF Media Bay Kit",1,null,"795090-B21"]
[]
[null,"Processore"]
[null,"Intel Xeon-Gold 5218 (2.3GHz/16-core/125W)",2,null,"840399-L21"]
[null,"HPE DL560 Gen10 Intel® Xeon-Gold 5118 (2.3GHz/12-core/105W) Processor",1,null,"840399-B21"]
[]
[null,"Processore aggiuntivo"]
[null,"No Additional Processor",{"$f":"VLOOKUP($B$30, CPU_A, 2, FALSE)","v":0},{"$f":"VLOOKUP($B$30, CPU_A, 3, FALSE)","v":""},{"$f":"VLOOKUP($B$30, CPU_A, 5, FALSE)","v":""},{"$f":"VLOOKUP(B30, CPU_A, 12, FALSE)","v":0}]
[]
[null,"Mezz Board Option"]
[null,{"$f":"VLOOKUP($B$30, CPU_A, 6, FALSE)","v":""},{"$f":"VLOOKUP($B$30, CPU_A, 7, FALSE)","v":""},null,{"$f":"VLOOKUP($B$30, CPU_A, 8, FALSE)","v":""}]
[]
[null,"Memoria Totale in GB",{"$f":"IF(F30=2584,IF(B36=64,\"ATTENZIONE: AUMENTARE LA RAM\",\"\"),\"\")","v":""}]
[null,"128        (DIMM 32GB)"]
[]
[null,"Capacità di memoria"]
[null,{"$f":"IF($B$30=\"No Additional Processor\",VLOOKUP($B$36, MEM_A1, 8, FALSE),VLOOKUP($B$36, MEM_A2, 8, FALSE))","v":"HPE 32GB 2Rx4 PC4-2933 Smart Kit"},{"$f":"IF($B$30=\"No Additional Processor\",VLOOKUP($B$36, MEM_A1, 9, FALSE),VLOOKUP($B$36, MEM_A2, 9, FALSE))","v":4},null,{"$f":"IF($B$30=\"No Additional Processor\",VLOOKUP($B$36, MEM_A1, 10, FALSE),VLOOKUP($B$36, MEM_A2, 10, FALSE))","v":"815100-B21"}]
[]
[null,{"$f":"IF($B$30=\"No Additional Processor\",VLOOKUP($B$36, MEM_A1, 2, FALSE),VLOOKUP($B$36, MEM_A2, 2, FALSE))","v":"HPE 32GB 2Rx4 PC4-2933 Smart Kit"},{"$f":"IF($B$30=\"No Additional Processor\",VLOOKUP($B$36, MEM_A1, 3, FALSE),VLOOKUP($B$36, MEM_A2, 3, FALSE))","v":4},{"$f":"IF($B$30=\"No Additional Processor\",VLOOKUP($B$36, MEM_A1, 4, FALSE),VLOOKUP($B$36, MEM_A2, 4, FALSE))","v":""},{"$f":"IF($B$30=\"No Additional Processor\",VLOOKUP($B$36, MEM_A1, 6, FALSE),VLOOKUP($B$36, MEM_A2, 6, FALSE))","v":"815100-B21"},{"$f":"IF($B$30=\"No Additional Processor\",VLOOKUP($B$36, MEM_A1, 7, FALSE),VLOOKUP($B$36, MEM_A2, 7, FALSE))","v":0}]
[null,{"$f":"IF($B$30=\"No Additional Processor\",VLOOKUP($B$36, MEM_A1, 11, FALSE),VLOOKUP($B$36, MEM_A2, 11, FALSE))","v":""},{"$f":"IF($B$30=\"No Additional Processor\",VLOOKUP($B$36, MEM_A1, 12, FALSE),VLOOKUP($B$36, MEM_A2, 12, FALSE))","v":""},{"$f":"IF($B$30=\"No Additional Processor\",VLOOKUP($B$36, MEM_A1, 13, FALSE),VLOOKUP($B$36, MEM_A2, 13, FALSE))","v":""},{"$f":"IF($B$30=\"No Additional Processor\",VLOOKUP($B$36, MEM_A1, 15, FALSE),VLOOKUP($B$36, MEM_A2, 15, FALSE))","v":""},{"$f":"IF($B$30=\"No Additional Processor\",VLOOKUP($B$36, MEM_A1, 16, FALSE),VLOOKUP($B$36, MEM_A2, 16, FALSE))","v":""}]
[]
[]
[null,"Sistema operativo preinstallato"]
[null,"No Operating System",{"$f":"VLOOKUP($B$46, OS_A, 2, FALSE)","v":""},{"$f":"VLOOKUP($B$46, OS_A, 3, FALSE)","v":""},{"$f":"VLOOKUP($B$46, OS_A, 5, FALSE)","v":""},{"$f":"VLOOKUP($B$46, OS_A, 6, FALSE)","v":""}]
[null,{"$f":"IF($B$30=\"No Additional Processor\",VLOOKUP($B$46, OS_A, 19, FALSE),VLOOKUP($B$46, OS_A2, 19, FALSE))","v":""},{"$f":"IF($B$30=\"No Additional Processor\",VLOOKUP($B$46, OS_A, 20, FALSE),VLOOKUP($B$46, OS_A2, 20, FALSE))","v":0},{"$f":"IF($B$30=\"No Additional Processor\",VLOOKUP($B$46, OS_A, 21, FALSE),VLOOKUP($B$46, OS_A2, 21, FALSE))","v":""},{"$f":"IF($B$30=\"No Additional Processor\",VLOOKUP($B$46, OS_A, 23, FALSE),VLOOKUP($B$46, OS_A2, 23, FALSE))","v":""},{"$f":"IF($B$30=\"No Additional Processor\",VLOOKUP($B$46, OS_A, 24, FALSE)*C47,VLOOKUP($B$46, OS_A2, 24, FALSE)*C47)","v":0},null,{"$f":"IF(D46=\"TS1L2-WIN1\",3,IF(D46=\"TS1L2-WINDC1\",4,0))","v":0}]
[null,{"$f":"IF($B$30=\"No Additional Processor\",VLOOKUP($B$46, OS_A, 25, FALSE),VLOOKUP($B$46, OS_A2, 25, FALSE))","v":""},{"$f":"IF($B$30=\"No Additional Processor\",VLOOKUP($B$46, OS_A, 26, FALSE),VLOOKUP($B$46, OS_A2, 26, FALSE))","v":0},{"$f":"IF($B$30=\"No Additional Processor\",VLOOKUP($B$46, OS_A, 27, FALSE),VLOOKUP($B$46, OS_A2, 27, FALSE))","v":""},{"$f":"IF($B$30=\"No Additional Processor\",VLOOKUP($B$46, OS_A, 29, FALSE),VLOOKUP($B$46, OS_A2, 29, FALSE))","v":""},{"$f":"IF($B$30=\"No Additional Processor\",VLOOKUP($B$46, OS_A, 30, FALSE)*C48,VLOOKUP($B$46, OS_A2, 30, FALSE)*C48)","v":0}]
[]
[null,"Client Access Licenses"]
[null,{"$f":"VLOOKUP($B$46, OS_A, 7, FALSE)","v":"None"},0,{"$f":"VLOOKUP($B$46, OS_A, 9, FALSE)","v":""},{"$f":"VLOOKUP($B$46, OS_A, 11, FALSE)","v":""},{"$f":"VLOOKUP($B$46, OS_A, 12, FALSE)*C51","v":0}]
[]
[null,{"$f":"VLOOKUP($B$46, OS_A, 13, FALSE)","v":"None"},0,{"$f":"VLOOKUP($B$46, OS_A, 15, FALSE)","v":""},{"$f":"VLOOKUP($B$46, OS_A, 17, FALSE)","v":""},{"$f":"VLOOKUP($B$46, OS_A, 18, FALSE)*C53","v":0}]
[]
[null,"VMware vSphere"]
[null,"None",{"$f":"IF(D56=\"\",0,($C$26+$C$30))","v":0},{"$f":"VLOOKUP($B$56,vmware, 3, FALSE)","v":""},{"$f":"VLOOKUP($B$56,vmware, 5, FALSE)","v":""},null,{"$f":"VLOOKUP($B$56,vmware, 6, FALSE)*C56","v":0}]
[null,"VMware vCenter Server Standard"]
[null,"None",{"$f":"VLOOKUP($B$58,vmwareplus, 2, FALSE)","v":0},{"$f":"VLOOKUP($B$58,vmwareplus, 3, FALSE)","v":""},{"$f":"VLOOKUP($B$58,vmwareplus, 5, FALSE)","v":""},null,{"$f":"VLOOKUP($B$58,vmwareplus, 6, FALSE)*C58","v":0}]
[null,"Essentials Plus Kit"]
[null,"None",{"$f":"VLOOKUP($B$60,vmwarevcenter, 2, FALSE)","v":0},{"$f":"VLOOKUP($B$60,vmwarevcenter, 3, FALSE)","v":""},{"$f":"VLOOKUP($B$60,vmwarevcenter, 5, FALSE)","v":""},null,{"$f":"VLOOKUP($B$60, vmwarevcenter, 6, FALSE)*C60","v":0}]
[null,"VMware vSAN"]
[null,"None",{"$f":"IF(D62=\"\",0,($C$26+$C$30))","v":0},{"$f":"VLOOKUP($B$62,wmvsan, 3, FALSE)","v":""},{"$f":"VLOOKUP($B$62,wmvsan, 5, FALSE)","v":""},null,{"$f":"VLOOKUP($B$62,wmvsan, 6, FALSE)*C62","v":0}]
[]
[]
[null,"HPE OneView Advanced (with HPE iLO Advanced)"]
[null,"None",{"$f":"VLOOKUP($B$66, OpzOVAdv, 2, FALSE)","v":0},{"$f":"VLOOKUP($B$66, OpzOVAdv, 3, FALSE)","v":""},{"$f":"VLOOKUP($B$66, OpzOVAdv, 5, FALSE)","v":""},null,{"$f":"VLOOKUP($B$66, OpzOVAdv, 6, FALSE)","v":0}]
[]
[null,"Configurazione dello chassis"]
[null,"HPE DL560 Gen10 8SFF HDD Bay3 Kit",1,null,"872237-B21"]
[]
[null,"HPE DL560 Gen10 8SFF HDD Bay2 Kit",0,{"$f":"VLOOKUP($C$71, HDD_Bay2, 2, FALSE)","v":""},{"$f":"VLOOKUP($C$71, HDD_Bay2, 3, FALSE)","v":""},{"$f":"VLOOKUP($C$71, HDD_Bay2, 4, FALSE)","v":""},{"$f":"IF(C74>=1,0,VLOOKUP($C$71,HDD_Bay2,5,FALSE))","v":0}]
[]
[]
[null,"HPE DL560 Gen10 8SFF HDD Bay1 Kit",0,{"$f":"VLOOKUP($C$74, HDD_BAY1, 2, FALSE)","v":""},{"$f":"VLOOKUP($C$74, HDD_BAY1, 3, FALSE)","v":""},{"$f":"VLOOKUP($C$74, HDD_BAY1, 4, FALSE)","v":""},{"$f":"VLOOKUP($C$74,HDD_BAY1,5,FALSE)","v":0}]
[]
[null,"Controller RAID"]
[null,"HPE Smart Array P408i-a SR Gen10 ",1,null,"869081-B21"]
[]
[null,"HPE 96W Smart Storage Battery with 145mm Cable Kit",1,null,"P01366-B21"]
[]
[null,{"$f":"IF(C74+C71=0,\"\",\"HPE DL5x0 Gen10 12Gb SAS Expander Card Kit with Cables\")","v":""},{"$f":"IF(C74+C71=0,\"\",1)","v":""},{"$f":"IF(C74+C71=0,\"\",\"TS2L4-SASBAY1\")","v":""},{"$f":"IF(C74=0,\"\",\"873444-B21\")","v":""}]
[]
[null,{"$f":"IF(C65+C67+C69=1,\"Dischi rigidi  (numero massimo totale 8)\",(IF(C65+C67+C69=2,\"Dischi rigidi  (numero massimo totale 16)\",\"Dischi rigidi  (numero massimo totale 24)\")))","v":"Dischi rigidi  (numero massimo totale 8)"}]
[null,"HPE 300GB SAS 15K SFF SC DS HDD",2,null,"870753-B21"]
[]
[null,"HPE 300GB SAS 15K SFF SC DS HDD",2,"TS2L4-15K300","870753-B21",{"$f":"IF(C86<=2,0,C86-2)*135","v":0}]
[]
[null,"HPE 1.2TB SAS 10K SFF SC DS HDD",0,"TS2L4-10K1200","872479-B21",{"$f":"C88*146","v":0}]
[]
["HDD SAS ","HPE 1.8TB SAS 10K SFF HDD",0,"TS2L4-10K1800","872481-B21",null,{"$f":"C90*190","v":0}]
[]
[null,"HPE 480GB SAS 12G SFF SC DS SSD",0,"TS2L4-SSD480","?????",{"$f":"C92*399","v":0}]
[]
[null,"HPE 960GB SAS 12G Read Intensive SFF SC DS SSD",0,"TS2L4-SSDR960","P06584-B21 ",{"$f":"C94*664","v":0}]
[]
[null,"HPE 400GB SAS 12G Mixed Use SFF (2.5in) SC DS SSD",0,"TS2L4-SSD400MU","P09088-B21",null,{"$f":"C96*622","v":0}]
[]
[null,"HPE 400GB SAS 12G Write Intensive SFF (2.5in) SC DS SSD",0,"TS2L4-SSD400WIB","P09098-B21",null,{"$f":"C98*959","v":0}]
["SSD SAS"]
[null,"HPE 800GB SAS 12G Mixed Use SFF (2.5in) SC DS SSD",0,"TS2L4-SSD800MU","P09090-B21",null,{"$f":"C100*980","v":0}]
[]
[null,"HPE 960GB SAS 12G Mixed Use SC 3yr Wty Value SAS DS SSD",0,"TS2L4-SSD960MU","P10448-B21",null,{"$f":"C102*864","v":0}]
[]
[null,"HPE 1.92TB SAS 12G RI SFF SSD",0,"TS2L4-SSDR1920","P04519-B21",null,{"$f":"C104*1313","v":0}]
[]
[null,"DISCHI TOTALI",{"$f":"SUM(C86:C104)","v":2},{"$f":"IF(C106<=((C69+C71+C74)*8),\"      OK\",\"     ERRORE:   Totale n° di dischi superiore al consentito\")","v":"      OK"}]
[]
[null,"NOTE sulla configurazione (CAMPO OBBLIGATORIO)"]
[{"$f":"IF(C106<=((C69+C71+C74)*8),\"\",\"ERRORE:   Totale n° di dischi superiore al consentito\")","v":""},"Specificare la configurazione RAID per l'installazione del Sistema Operativo, se richiesto.\ne/o\ninserire eventuali note.",null,null,"Specificare la configurazione RAID per l'installazione del Sistema Operativo, se richiesto.\ne/o\ninserire eventuali note.",null,null,{"$f":"IF(B109=E109,\"ERRORE:   Compilare il campo NOTE\",\"\")","v":"ERRORE:   Compilare il campo NOTE"}]
[null,"Configurazione RAID con HDD 300GB"]
[null,"RAID 1  (2 HDDs)",1,null,{"$f":"VLOOKUP($B$111,  RAID_A1, 2, FALSE)","v":{"$error":"#N/A"}}]
[null,"Hot Spare for 300GB HDD","No"]
[]
[null,"Micro SD (USB Flash Drive)",0]
[null,"None",{"$f":"VLOOKUP($B$115,microsd, 2, FALSE)","v":0},{"$f":"VLOOKUP($B$115,microsd, 3, FALSE)","v":""},{"$f":"VLOOKUP($B$115,microsd, 5, FALSE)","v":""},null,{"$f":"VLOOKUP($B$115, microsd, 6, FALSE)*C115","v":0}]
[null,"Hot Spare for 1TB HDD",0]
[]
[null,"Alimentatore"]
[null,"HPE 1600W Flex Slot Platinum Hot Plug Low Halogen Power Supply Kit",2,null,"830272-B21"]
[]
[null,"PCIe Riser"]
[null,"Primary & Secondary Riser",1,null,"870548-B21"]
[]
[null,"Secondary Riser",0,{"$f":"VLOOKUP($C$124, Riser2, 2, FALSE)","v":""},{"$f":"VLOOKUP($C$124, Riser2, 3, FALSE)","v":""},{"$f":"VLOOKUP($C$124, Riser2, 4, FALSE)","v":""},{"$f":"VLOOKUP($C$124, Riser2, 5, FALSE)","v":0}]
[]
[null,"Secondary Riser for GPU (abilita l'installazione della GPU P2000 su slot 5)",0,{"$f":"VLOOKUP($C$126, Riser2GPU, 2, FALSE)","v":""},{"$f":"VLOOKUP($C$126, Riser2GPU, 3, FALSE)","v":""},{"$f":"VLOOKUP($C$126, Riser2GPU, 4, FALSE)","v":""},{"$f":"VLOOKUP($C$126, Riser2GPU, 5, FALSE)","v":0}]
[]
[null,"Tertiary riser",0,{"$f":"VLOOKUP($C$128, Riser3, 2, FALSE)","v":""},{"$f":"VLOOKUP($C$128, Riser3, 3, FALSE)","v":""},{"$f":"VLOOKUP($C$128, Riser3, 4, FALSE)","v":""},{"$f":"VLOOKUP($C$128, Riser3, 5, FALSE)","v":0}]
[]
[null,"Scheda FlexibleLOM"]
[null,"HPE Ethernet 1Gb 4-port 331FLR Adapter",{"$f":"VLOOKUP(B131,  FLR_Slot, 2, FALSE)","v":1},{"$f":"VLOOKUP(B131,  FLR_Slot, 3, FALSE)","v":""},{"$f":"VLOOKUP(B131,  FLR_Slot, 5, FALSE)","v":""},{"$f":"VLOOKUP(B131,  FLR_Slot, 6, FALSE)","v":""},{"$f":"VLOOKUP(B131,  FLR_Slot, 9, FALSE)","v":0}]
[]
[null,"Additional Card for PCIe Slot 1 x8 CPU 1 "]
[null,"None",{"$f":"IF(B134=B81,\"\",VLOOKUP(B134,  PCI_A1, 2, FALSE))","v":""},{"$f":"IF(B134=B81,\"\",VLOOKUP(B134,  PCI_A1, 3, FALSE))","v":""},{"$f":"IF(B134=B81,\"\",VLOOKUP(B134,  PCI_A1, 5, FALSE))","v":""},{"$f":"IF(B134=B81,\"\",VLOOKUP(B134,  PCI_A1, 6, FALSE))","v":""},{"$f":"IF(B134=B81,\"\",VLOOKUP($B$134,PCI_A1,9,FALSE))","v":0}]
[]
[null,"Additional Card for PCIe Slot 2 x16 CPU 1 "]
[null,"None",{"$f":"VLOOKUP(B137,  PCI_A2, 2, FALSE)","v":""},{"$f":"VLOOKUP(B137,  PCI_A2, 3, FALSE)","v":""},{"$f":"VLOOKUP(B137,  PCI_A2, 5, FALSE)","v":""},{"$f":"VLOOKUP(B137,  PCI_A2, 6, FALSE)","v":""},{"$f":"VLOOKUP(B137,  PCI_A2, 9, FALSE)","v":0}]
[]
[null,"Additional Card for PCIe Slot 3 x8 CPU 1 "]
[null,"None",{"$f":"VLOOKUP(B140,  PCI_A2, 2, FALSE)","v":""},{"$f":"VLOOKUP(B140,  PCI_A2, 3, FALSE)","v":""},{"$f":"VLOOKUP(B140,  PCI_A2, 5, FALSE)","v":""},{"$f":"VLOOKUP(B140,  PCI_A2, 6, FALSE)","v":""},{"$f":"VLOOKUP(B140,  PCI_A2, 9, FALSE)","v":0}]
[]
[null,{"$f":"IF(C126=1,\"Additional Card for PCIe Slot 4 x8 CPU 2 \",\"Additional Card for PCIe Slot 4 x8 CPU 2 \")","v":"Additional Card for PCIe Slot 4 x8 CPU 2 "}]
[null,"None",{"$f":"VLOOKUP(B143,  PCI_A2, 2, FALSE)","v":""},{"$f":"VLOOKUP(B143,  PCI_A2, 3, FALSE)","v":""},{"$f":"VLOOKUP(B143,  PCI_A2, 5, FALSE)","v":""},{"$f":"VLOOKUP(B143,  PCI_A2, 6, FALSE)","v":""},{"$f":"VLOOKUP(B143,  PCI_A2, 9, FALSE)","v":0}]
[]
[null,"Additional Card for PCIe Slot 5 (GPU SLOT) x16 CPU 2"]
[null,"None",{"$f":"VLOOKUP(B146,  PCI_A5, 2, FALSE)","v":""},{"$f":"VLOOKUP(B146,  PCI_A5, 3, FALSE)","v":""},{"$f":"VLOOKUP(B146,  PCI_A5, 5, FALSE)","v":""},{"$f":"VLOOKUP(B146,  PCI_A5, 6, FALSE)","v":""},{"$f":"VLOOKUP(B146,  PCI_A5, 9, FALSE)","v":0}]
[]
[null,"Additional Card for PCIe Slot 6 x8 CPU 2"]
[null,"None",{"$f":"VLOOKUP(B149,  PCI_A2, 2, FALSE)","v":""},{"$f":"VLOOKUP(B149,  PCI_A2, 3, FALSE)","v":""},{"$f":"VLOOKUP(B149,  PCI_A2, 5, FALSE)","v":""},{"$f":"VLOOKUP(B149,  PCI_A2, 6, FALSE)","v":""},{"$f":"VLOOKUP(B149,  PCI_A2, 9, FALSE)","v":0}]
[]
[null,"Additional Card for PCIe Slot 7 x8 CPU 2"]
[null,"None",{"$f":"IF($B$152=\"Aggiungere Tertiary riser\",\"\",VLOOKUP(B152,PCI_A2,2,FALSE))","v":""},{"$f":"IF($B$152=\"Aggiungere Tertiary riser\",\"\",VLOOKUP(B152,PCI_A2,3,FALSE))","v":""},{"$f":"IF($B$152=\"Aggiungere Tertiary riser\",\"\",VLOOKUP(B152,PCI_A2,5,FALSE))","v":""},{"$f":"IF($B$152=\"Aggiungere Tertiary riser\",\"\",VLOOKUP(B152,PCI_A2,6,FALSE))","v":""},{"$f":"IF($B$152=\"Aggiungere Tertiary riser\",\"\",VLOOKUP(B152,PCI_A2,9,FALSE))","v":0}]
[]
[null,"Additional Card for PCIe Slot 8 x8 CPU 2"]
[null,"None",{"$f":"IF($B$155=\"Aggiungere Tertiary riser\",\"\",VLOOKUP(B155,PCI_A2,2,FALSE))","v":""},{"$f":"IF($B$155=\"Aggiungere Tertiary riser\",\"\",VLOOKUP(B155,PCI_A2,3,FALSE))","v":""},{"$f":"IF($B$155=\"Aggiungere Tertiary riser\",\"\",VLOOKUP(B155,PCI_A2,5,FALSE))","v":""},{"$f":"IF($B$155=\"Aggiungere Tertiary riser\",\"\",VLOOKUP(B155,PCI_A2,6,FALSE))","v":""},{"$f":"IF($B$155=\"Aggiungere Tertiary riser\",\"\",VLOOKUP(B155,PCI_A2,9,FALSE))","v":0}]
[]
[null,"Bezel"]
[null,"None",1]
[]
[null,"Unità ottica"]
[null,"HP Mobile USB DVDRW Drive",1,null,"701498-B21"]
[]
[null,"Accessori per Server"]
[null,"HP BLc 10G SFP+ SR Transceiver",null,null,"455883-B21"]
[]
[null,"Cavi rj45"]
[null,"Cavo Rete UTP cat. 5e 3 metri",5,{"$f":"IF(C167=0,\"\",\"TS2L4-3MRJ45\")","v":"TS2L4-3MRJ45"},"ROS1403/G",null,{"$f":"2*C167","v":10}]
[]
[null,"Omni-Path Architecture Optical"]
[null,"HPE X240 10G SFP+ SFP+ 3m DAC Cable",0,{"$f":"IF(C170=0,\"\",\"TS2L4-DACX240M3\")","v":""},"JD097C",null,{"$f":"C170*81","v":0}]
[]
[null,"HPE X240 10G SFP+ SFP+ 5m DAC Cable",0,{"$f":"IF(C172=0,\"\",\"TS2L4-DACX240M5\")","v":""},"JG081C",null,{"$f":"C172*95","v":0}]
[]
[null,"HPE X240 10G SFP+ SFP+ 7m DAC Cable",0,{"$f":"IF(C174=0,\"\",\"TS2L4-DACX240M7\")","v":""},"JC784C",null,{"$f":"C174*106","v":0}]
[]
[null,"HPE 25Gb SFP28 to SFP28 3m Direct Attach Cable",0,{"$f":"IF(C176=0,\"\",\"TS2L4-DAC3SFP28\")","v":""},null,null,{"$f":"C176*134","v":0}]
[]
[null,"InfiniBand Copper Cable"]
[null,"HPE 2M FDR Quad Small Form Factor Pluggable InfiniBand Copper Cable",0,{"$f":"IF(C179=0,\"\",\"TS2L4-DACQSFPM2\")","v":""},"670759-B24",null,{"$f":"C179*147","v":0}]
[]
[null,"Omni-Path Architecture Copper Cable"]
[null,"HPE 2M 100Gb QSFP28 Omni-Path Architecture Copper Cable",0,{"$f":"IF(C182=0,\"\",\"TS2L4-DAC100M2\")","v":""},"830024-B24",null,{"$f":"C182*117","v":0}]
[]
[null,"HPE 3M 100Gb QSFP28 Omni-Path Architecture Copper Cable",0,{"$f":"IF(C184=0,\"\",\"TS2L4-DAC100M3\")","v":""},"830024-B25",null,{"$f":"C184*147","v":0}]
[]
[null,"Omni-Path Architecture Optical"]
[null,"HPE 3M 100Gb QSFP28 Omni-Path Architecture Optical Power Class 2 Cable",0,{"$f":"IF(C187=0,\"\",\"TS2L4-DACAOCM3\")","v":""},"881204-B21",null,{"$f":"C187*612","v":0}]
[]
[null,"HPE 5M 100Gb QSFP28 Omni-Path Architecture Optical Power Class 2 Cable",0,{"$f":"IF(C189=0,\"\",\"TS2L4-DACAOCM5\")","v":""},"881204-B22",null,{"$f":"C189*619","v":0}]
[]
[null,"HPE 7M 100Gb QSFP28 Omni-Path Architecture Optical Power Class 2 Cable",0,{"$f":"IF(C191=0,\"\",\"TS2L4-DACAOCM7\")","v":""},"881204-B23",null,{"$f":"C191*627","v":0}]
[]
[null,"Optical Transceiver"]
[null,"HPE 10Gb SFP+ SR Transceiver",0,{"$f":"IF(C194=0,\"\",\"TS2L4-10OTSR\")","v":""},"455883-B21",null,{"$f":"C194*230","v":0}]
[]
[null,"HPE 10G SFP+ LR Transceiver",0,{"$f":"IF(C196=0,\"\",\"TS2L4-10OTLR\")","v":""},"455886-B21",null,{"$f":"C196*481","v":0}]
[]
[null,"HPE 25Gb SFP28 SR 100m Transceiver",0,{"$f":"IF(C198=0,\"\",\"TS2L4-SFP28SR\")","v":""},null,null,{"$f":"C198*887","v":0}]
[]
[null,"Estensione di Garanzia"]
[null,"None",{"$f":"VLOOKUP($B$201,  SO_B1,2, FALSE)","v":""},{"$f":"VLOOKUP($B$201,  SO_B1, 3, FALSE)","v":""},{"$f":"VLOOKUP($B$201,  SO_B1, 5, FALSE)","v":""},{"$f":"VLOOKUP($B$201,  SO_B1, 6, FALSE)","v":""}]
[]
[]
[null,"None",{"$f":"VLOOKUP($B$204,  SO_A2, 2, FALSE)","v":""},{"$f":"VLOOKUP($B$204,  SO_A2, 3, FALSE)","v":""},{"$f":"VLOOKUP($B$204,  SO_A2,5, FALSE)","v":""},{"$f":"VLOOKUP($B$204,  SO_A2, 6, FALSE)","v":""}]

{"sheet":"RACK, Accessori e Servizi","index":3,"n_rows":76,"n_cols":13,"rows_kept":76,"cut":false,"hidden":false,"merged":[[60,2,60,6],[5,2,5,7],[7,2,7,7],[9,2,9,7],[14,2,14,7],[23,2,23,7],[26,2,26,7],[35,2,35,7],[17,2,17,7],[3,12,10,12],[12,12,36,12],[36,4,36,7],[20,2,20,7],[0,11,1,11],[32,2,32,7],[29,2,29,7]]}
[null,null,null,null,null,null,null,null,null,"TOTALE PRODOTTI CONVENZIONE",{"$f":"SUM(Riepilogo!T44:U47)","v":0},{"$f":"K1+K2","v":0}]
[null,null,null,null,null,null,null,null,null,"TOTALE ARTICOLI 20%",{"$f":"L33+L36","v":0}]
[]
[null,null,null,null,null,null,null,null,null,null,null,null,"SERVIZI"]
[null,null,{"$f":"IF(SRV_A+SRV_B>=1,\"Servizi Specialistici\",\"\")","v":{"$error":"#NAME?"}}]
[null,null,{"$f":"IF(SRV_A+SRV_B>=1,\"Servizio Specialistico di System and Network Management per sistema opertivo Windows, erogato on site. (GG/Uomo)\",\"\")","v":{"$error":"#NAME?"}},null,null,null,null,null,null,null,{"$f":"IF(J6>=1,\"10L2-SO-WIN\",\"\")","v":""}]
[]
[null,null,{"$f":"IF(SRV_A+SRV_B>=1,\"Servizio Specialistico di System and Network Management per sistema opertivo Linux, erogato on site. (GG/Uomo)\",\"\")","v":{"$error":"#NAME?"}},null,null,null,null,null,null,null,{"$f":"IF(J8>=1,\"10L2-SO-LINUX\",\"\")","v":""}]
[]
[null,null,{"$f":"IF((SRV_A+SRV_AA+SRV_AAA+SRV_B+SRV_BB+SRV_BBB)>=5,\"Servizi specialistici sistemistici per aggiornare e prevenire malfunzionamenti. \n(Minimo 5 Server)\",\"\")","v":{"$error":"#NAME?"}},null,null,null,null,null,null,null,{"$f":"IF(J10>=1,\"10L2-SO-PREV\",\"\")","v":""}]
[]
[]
[null,null,null,null,null,null,null,null,null,null,null,null,"SERVER RACK"]
[null,null,{"$f":"IF(Riepilogo!G6>\"\",\"\",\"Rack (OpzRack)\")","v":"Rack (OpzRack)"}]
[null,null,{"$f":"IF((SRV_A+SRV_AA+SRV_AAA)>=1,\"Tecnosteel: armadio Rack 19'' 42U\",\"\")","v":""},null,null,null,null,null,null,0,{"$f":"IF(J15>=1,\"TS2L4-RACK\",\"\")","v":""}]
[]
[null,null,"PDU (OpzPDU32A)"]
[null,null,{"$f":"IF((SRV_A+SRV_AA+SRV_AAA)>=1,\"PDU Vertical 20+4 outlets C13 with MCB - IEC60309 input\",\"\")","v":""},null,null,null,null,null,null,null,{"$f":"IF(J18>=1,\"TS1-646861\",\"\")","v":""}]
[]
[null,null,"OpzPDU_TRIFASE"]
[null,null,{"$f":"IF((SRV_A+SRV_AA+SRV_AAA)>=1,\"PDU Vertical  18+6 outlets (C13+C19)  with MCB and ammeter - IEC60309 input - 3 phase\",\"\")","v":""},null,null,null,null,null,null,null,{"$f":"IF(J21>=1,\"TS1-646875\",\"\")","v":""}]
[]
[null,null,"KVM (OpzGUIRack)"]
[null,null,{"$f":"IF((SRV_A+SRV_AA+SRV_AAA)>=1,\"Tecnosteel: 1U Rackmount Console 17'' with Italian Keyboard\",\"\")","v":""},null,null,null,null,null,null,0,{"$f":"IF(J24>=1,\"TS2L4-GUI\",\"\")","v":""}]
[]
[null,null,"KVM Option (OpzSWGUIRack)"]
[null,null,{"$f":"IF((SRV_A+SRV_AA+SRV_AAA)>=1,\"Tecnosteel: 16-port remote KVM switch with one remote user\",\"\")","v":""},null,null,null,null,null,null,0,{"$f":"IF(J27>=1,\"TS2L4-KVMIP\",\"\")","v":""}]
[]
[null,null,"Uninterrupted Power Supply (OpzUPS 3000VA)"]
[null,null,{"$f":"IF((SRV_A+SRV_AA+SRV_AAA)>=1,\"Riello - UPS MSR3000EVO 3000VA 2U Rackmount (SNMP+USB+RS232)\",\"\")","v":""},null,null,null,null,null,null,0,{"$f":"IF(J30>=1,\"TS2L4-UPS\",\"\")","v":""}]
[]
[null,null,"PDU da Rack"]
[null,null,{"$f":"IF((SRV_A+SRV_AA+SRV_AAA)>=1,\"Coppia di PDU Vertical  1Ph-32A-18xC13-6xC19 - 0U Base + Kit di montaggio)\",\"\")","v":""},null,null,null,null,null,null,0,{"$f":"IF(J33>=1,\"TS2L4-PDU32A\",\"\")","v":""},{"$f":"IF(J33>=1,\"436\",\"0\")","v":"0"}]
[]
[null,null,"Armadio Rack 42U"]
[null,null,{"$f":"IF((SRV_A+SRV_AA+SRV_AAA)>=1,\"Armadio Rack 42U profonità 120cm con coppia di PDU 32A monofase\",\"\")","v":""},null,null,null,null,null,null,0,{"$f":"IF(J36>=1,\"TS2L4-RACKPDU32\",\"\")","v":""},{"$f":"IF(J36>=1,\"2200\",\"0\")","v":"0"}]
[]
[]
[null,null,null,"Totale-"]
[null,null,null,"RACK A","RACK B","RACK C","RACK D","RACK E","RACK F","RACK G","RACK H","RACK I","RACK J"]
[null,null,{"$f":"J15","v":0},{"$f":"IF(H61>0,IF(C41-H61=0,0,C41-H61),0)","v":0},{"$f":"IF(I61>0,IF(D41-I61=0,0,D41-I61),0)","v":0},0,0,0,0,{"$f":"IF(#REF!>0,IF(I41-#REF!=0,0,I41-#REF!),0)","v":{"$error":"#REF!"}},{"$f":"IF(#REF!>0,IF(J41-#REF!=0,0,J41-#REF!),0)","v":{"$error":"#REF!"}},{"$f":"IF(#REF!>0,IF(K41-#REF!=0,0,K41-#REF!),0)","v":{"$error":"#REF!"}},{"$f":"IF(#REF!>0,IF(L41-#REF!=0,0,L41-#REF!),0)","v":{"$error":"#REF!"}}]
[]
[]
[null,null,null,"Server Modello 1",null,null,{"$f":"SRV_A","v":0}]
[null,null,null,"Server Modello 2",null,null,{"$f":"SRV_AA","v":0}]
[null,null,null,"Server Modello 3",null,null,{"$f":"SRV_AAA","v":0}]
[null,null,null,"Server Modello 4",null,null,{"$f":"SRV_B","v":{"$error":"#NAME?"}}]
[null,null,null,"Server Modello 5",null,null,{"$f":"SRV_BB","v":{"$error":"#NAME?"}}]
[null,null,null,"Server Modello 6",null,null,{"$f":"SRV_BBB","v":{"$error":"#NAME?"}}]
[]
[null,null,null,null,null,null,null,{"$f":"SUM(H5:H10)+H12+H93*2+H95*2","v":0},0,0,0,0,0]
[]
[]
[]
[]
[]
[]
[]
[null,null,"Rack ancora da configurare",null,null,{"$f":"J15-H61-I61-J61-K61-L61-M61-#REF!-#REF!-#REF!-#REF!","v":{"$error":"#REF!"}}]
[]
[null,null,"Indicare il numero di rack per questa configurazione"]
[]
[null,null,null,null,"Totali","da inserire",null,{"$f":"IF(C41>0,\"RACK A\",\"\")","v":""},{"$f":"IF(D41>0,\"RACK B\",\"\")","v":""},{"$f":"IF(E41>0,\"RACK C\",\"\")","v":""},{"$f":"IF(F41>0,\"RACK D\",\"\")","v":""},{"$f":"IF(G41>0,\"RACK E\",\"\")","v":""},{"$f":"IF(H41>0,\"RACK F\",\"\")","v":""}]
[]
[null,null,{"$f":"IF(G44*$J$15>0,\"Server Lotto2 DL560 Conf.1\",\"\")","v":""},null,{"$f":"G44","v":0},{"$f":"(E65-(H65*$H$61)-(I65*$I$61)-(J65*$J$61)-(K65*$K$61)-(L65*$L$61)-(M65*$M$61)-(#REF!*#REF!)-(#REF!*#REF!)-(#REF!*#REF!)-(#REF!*#REF!))","v":{"$error":"#REF!"}}]
[null,null,{"$f":"IF(G45*$J$15>0,\"Server Lotto2 DL560 Conf.2\",\"\")","v":""},null,0,{"$f":"(E66-(H66*$H$61)-(I66*$I$61)-(J66*$J$61)-(K66*$K$61)-(L66*$L$61)-(M66*$M$61)-(#REF!*#REF!)-(#REF!*#REF!)-(#REF!*#REF!)-(#REF!*#REF!))","v":{"$error":"#REF!"}}]
[null,null,{"$f":"IF(G46*$J$15>0,\"Server Lotto2 DL560 Conf.3\",\"\")","v":""},null,0,{"$f":"(E67-(H67*$H$61)-(I67*$I$61)-(J67*$J$61)-(K67*$K$61)-(L67*$L$61)-(M67*$M$61)-(#REF!*#REF!)-(#REF!*#REF!)-(#REF!*#REF!)-(#REF!*#REF!))","v":{"$error":"#REF!"}}]
[null,null,{"$f":"IF(G47*$J$15>0,\"Server Lotto2 DL580 Conf.1\",\"\")","v":{"$error":"#NAME?"}},null,{"$error":"#NAME?"},{"$f":"(E68-(H68*$H$61)-(I68*$I$61)-(J68*$J$61)-(K68*$K$61)-(L68*$L$61)-(M68*$M$61)-(#REF!*#REF!)-(#REF!*#REF!)-(#REF!*#REF!)-(#REF!*#REF!))","v":{"$error":"#NAME?"}}]
[null,null,{"$f":"IF(G48*$J$15>0,\"Server Lotto2 DL580 Conf.2\",\"\")","v":{"$error":"#NAME?"}},null,{"$error":"#NAME?"},{"$f":"(E69-(H69*$H$61)-(I69*$I$61)-(J69*$J$61)-(K69*$K$61)-(L69*$L$61)-(M69*$M$61)-(#REF!*#REF!)-(#REF!*#REF!)-(#REF!*#REF!)-(#REF!*#REF!))","v":{"$error":"#NAME?"}}]
[null,null,{"$f":"IF(G49*$J$15>0,\"Server Lotto2 DL580 Conf.3\",\"\")","v":{"$error":"#NAME?"}},null,{"$error":"#NAME?"},{"$f":"(E70-(H70*$H$61)-(I70*$I$61)-(J70*$J$61)-(K70*$K$61)-(L70*$L$61)-(M70*$M$61)-(#REF!*#REF!)-(#REF!*#REF!)-(#REF!*#REF!)-(#REF!*#REF!))","v":{"$error":"#NAME?"}}]
[]
[null,null,{"$f":"IF(J24>0,\"OpzGUIRack Disponibili\",\" \")","v":" "},null,{"$f":"J24","v":0},{"$f":"J24-H72*H61-I72*I61-J72*J61-K72*K61-L72*L61-M72*M61-#REF!*#REF!-#REF!*#REF!-#REF!*#REF!-#REF!*#REF!","v":{"$error":"#REF!"}}]
[]
[null,null,{"$f":"IF(J27>0,\"OpzSWGUIRack Disponibili\",\" \")","v":" "},null,{"$f":"J27","v":0},{"$f":"J27-H74*H61-I74*I61-J74*J61-K74*K61-L74*L61-M74*M61-#REF!*#REF!-#REF!*#REF!-#REF!*#REF!-#REF!*#REF!","v":{"$error":"#REF!"}}]
[]
[null,null,{"$f":"IF(J36>0,\"OpzUPS 3000VA Disponibili\",\" \")","v":" "},null,{"$f":"J36","v":0},{"$f":"J36-H76*H61-I76*I61-J76*J61-K76*K61-L76*L61-M76*M61-#REF!*#REF!-#REF!*#REF!-#REF!*#REF!-#REF!*#REF!","v":{"$error":"#REF!"}}]

{"sheet":"Riepilogo","index":4,"n_rows":218,"n_cols":46,"rows_kept":218,"cut":false,"hidden":false,"merged":[[177,2,177,5],[177,9,177,12],[177,16,177,19],[178,2,178,5],[178,9,178,12],[178,16,178,19],[182,2,182,5],[182,9,182,12],[182,16,182,19],[181,2,181,5],[181,9,181,12],[181,16,181,19],[174,2,174,5],[174,9,174,12],[174,16,174,19],[175,2,175,5],[175,9,175,12],[175,16,175,19],[176,2,176,5],[176,9,176,12],[176,16,176,19],[156,16,156,19],[157,16,157,19],[158,16,158,19],[159,16,159,19],[160,16,160,19],[161,16,161,19],[162,16,162,19],[163,16,163,19],[164,16,164,19],[172,2,172,5],[172,9,172,12],[172,16,172,19],[173,2,173,5],[173,9,173,12],[173,16,173,19],[165,16,165,19],[170,9,170,12],[170,16,170,19],[90,2,90,5],[90,6,90,8],[90,9,90,16],[90,17,90,18],[90,19,90,20],[91,2,91,5],[91,6,91,8],[91,9,91,16],[91,17,91,18],[91,19,91,20],[88,2,88,5],[88,6,88,8],[88,9,88,16],[88,17,88,18],[88,19,88,20],[89,2,89,5],[89,6,89,8],[89,9,89,16],[89,17,89,18],[89,19,89,20],[85,9,85,16],[85,17,85,18],[85,19,85,20],[86,2,86,5],[86,6,86,8],[86,9,86,16],[86,17,86,18],[86,19,86,20],[87,2,87,5],[87,6,87,8],[87,9,87,16],[87,17,87,18],[87,19,87,20],[160,2,160,5],[161,2,161,5],[162,2,162,5],[163,2,163,5],[164,2,164,5],[165,2,165,5],[170,2,170,5],[156,9,156,12],[157,9,157,12],[158,9,158,12],[159,9,159,12],[160,9,160,12],[161,9,161,12],[162,9,162,12],[163,9,163,12],[164,9,164,12],[165,9,165,12],[156,2,156,5],[157,2,157,5],[158,2,158,5],[168,9,168,12],[159,2,159,5],[48,35,48,37],[146,16,146,19],[146,9,146,12],[145,16,145,19],[145,9,145,12],[145,2,145,5],[144,16,144,19],[144,9,144,12],[144,2,144,5],[143,16,143,19],[143,9,143,12],[143,2,143,5],[142,16,142,19],[142,9,142,12],[142,2,142,5],[141,16,141,19],[141,9,141,12],[141,2,141,5],[140,2,140,5],[97,17,97,18],[97,19,97,20],[72,2,72,5],[72,6,72,8],[72,9,72,16],[99,1,99,16],[99,17,99,20],[115,2,115,5],[115,9,115,12],[115,16,115,19],[29,9,29,16],[29,17,29,18],[29,19,29,20],[53,2,53,5],[53,6,53,8],[53,9,53,16],[53,17,53,18],[53,19,53,20],[84,6,84,8],[84,9,84,16],[98,17,98,20],[78,19,78,20],[97,2,97,5],[97,6,97,8],[79,9,79,16],[79,17,79,18],[97,9,97,16],[85,2,85,5],[85,6,85,8],[74,2,74,5],[74,6,74,8],[74,9,74,16],[74,17,74,18],[74,19,74,20],[76,2,76,5],[76,6,76,8],[76,9,76,16],[73,6,73,8],[73,9,73,16],[76,17,76,18],[76,19,76,20],[73,19,73,20],[77,2,77,5],[77,6,77,8],[77,9,77,16],[77,17,77,18],[77,19,77,20],[75,2,75,5],[75,6,75,8],[75,9,75,16],[75,17,75,18],[75,19,75,20],[150,2,150,5],[150,9,150,12],[150,16,150,19],[151,2,151,5],[151,9,151,12],[151,16,151,19],[152,2,152,5],[153,2,153,5],[154,2,154,5],[152,9,152,12],[106,3,107,18],[110,1,110,3],[129,16,129,19],[137,2,137,5],[137,9,137,12],[138,2,138,5],[138,9,138,12],[138,16,138,19],[139,2,139,5],[139,9,139,12],[139,16,139,19],[137,16,137,19],[132,2,132,5],[130,9,130,12],[114,9,114,12],[114,16,114,19],[114,2,114,5],[122,9,122,12],[119,16,119,19],[123,9,123,12],[134,9,134,12],[131,2,131,5],[110,15,110,17],[112,2,112,5],[82,9,82,16],[82,17,82,18],[82,19,82,20],[80,17,80,18],[83,2,83,5],[83,6,83,8],[83,9,83,16],[83,17,83,18],[83,19,83,20],[81,17,81,18],[81,19,81,20],[80,2,80,5],[80,6,80,8],[80,9,80,16],[78,9,78,16],[78,17,78,18],[148,16,148,19],[149,2,149,5],[149,9,149,12],[149,16,149,19],[96,6,96,8],[96,9,96,16],[96,17,96,18],[96,19,96,20],[112,9,112,12],[112,16,112,19],[113,2,113,5],[113,9,113,12],[113,16,113,19],[131,9,131,12],[132,9,132,12],[116,9,116,12],[80,19,80,20],[84,2,84,5],[81,6,81,8],[81,9,81,16],[81,2,81,5],[82,6,82,8],[136,9,136,12],[136,16,136,19],[132,16,132,19],[133,2,133,5],[130,2,130,5],[120,9,120,12],[121,9,121,12],[126,16,126,19],[128,2,128,5],[126,9,126,12],[123,2,123,5],[124,2,124,5],[124,9,124,12],[125,9,125,12],[120,16,120,19],[121,16,121,19],[122,16,122,19],[123,16,123,19],[127,2,127,5],[127,9,127,12],[125,2,125,5],[121,2,121,5],[122,2,122,5],[0,17,1,20],[0,1,0,5],[1,1,1,5],[1,6,1,7],[2,1,2,5],[2,6,2,7],[3,1,3,5],[3,6,3,7],[4,1,4,7],[1,8,3,16],[0,6,0,16],[4,8,4,16],[9,16,9,20],[14,6,14,8],[14,9,14,16],[22,6,22,8],[18,2,18,5],[14,2,14,5],[18,9,18,16],[18,17,18,18],[18,19,18,20],[19,2,19,5],[19,17,19,18],[19,19,19,20],[21,6,21,8],[21,9,21,16],[21,17,21,18],[21,19,21,20],[21,2,21,5],[19,9,19,16],[12,6,12,8],[12,9,12,16],[12,17,12,18],[13,1,13,20],[12,19,12,20],[15,19,15,20],[5,1,5,5],[5,6,5,7],[7,1,7,3],[7,4,7,8],[7,9,7,10],[7,11,7,14],[9,4,9,8],[9,9,9,10],[9,11,9,14],[11,1,11,20],[16,2,16,5],[16,6,16,8],[16,9,16,16],[9,1,9,3],[12,2,12,5],[7,16,7,20],[20,19,20,20],[17,2,17,5],[17,6,17,8],[17,9,17,16],[19,6,19,8],[18,6,18,8],[20,2,20,5],[20,6,20,8],[20,9,20,16],[20,17,20,18],[16,17,16,18],[17,17,17,18],[16,19,16,20],[14,17,14,18],[14,19,14,20],[15,2,15,5],[15,6,15,8],[15,9,15,16],[15,17,15,18],[17,19,17,20],[23,9,23,16],[23,17,23,18],[23,19,23,20],[24,19,24,20],[25,2,25,5],[25,6,25,8],[25,9,25,16],[25,17,25,18],[22,19,22,20],[25,19,25,20],[24,17,24,18],[22,9,22,16],[22,17,22,18],[24,2,24,5],[24,6,24,8],[24,9,24,16],[22,2,22,5],[23,2,23,5],[23,6,23,8],[31,2,31,5],[31,6,31,8],[31,9,31,16],[32,2,32,5],[32,6,32,8],[31,17,31,18],[30,19,30,20],[26,19,26,20],[31,19,31,20],[32,19,32,20],[27,19,27,20],[32,17,32,18],[30,2,30,5],[30,6,30,8],[30,9,30,16],[30,17,30,18],[26,6,26,8],[26,9,26,16],[26,17,26,18],[26,2,26,5],[32,9,32,16],[27,2,27,5],[27,6,27,8],[27,9,27,16],[33,1,33,20],[38,2,38,5],[37,9,37,16],[37,17,37,18],[38,6,38,8],[38,9,38,16],[38,17,38,18],[36,17,36,18],[40,17,40,18],[40,2,40,5],[40,6,40,8],[27,17,27,18],[28,2,28,5],[28,6,28,8],[28,9,28,16],[28,17,28,18],[28,19,28,20],[29,2,29,5],[29,6,29,8],[39,2,39,5],[39,6,39,8],[39,9,39,16],[39,17,39,18],[39,19,39,20],[34,2,34,5],[34,6,34,8],[34,9,34,16],[34,17,34,18],[36,19,36,20],[35,17,35,18],[35,19,35,20],[36,2,36,5],[36,6,36,8],[37,2,37,5],[37,6,37,8],[34,19,34,20],[59,9,59,16],[43,6,43,8],[37,19,37,20],[45,6,45,8],[45,9,45,16],[45,17,45,18],[57,6,57,8],[57,9,57,16],[40,9,40,16],[36,9,36,16],[46,19,46,20],[59,17,59,18],[56,17,56,18],[56,19,56,20],[46,17,46,18],[52,17,52,18],[187,8,187,10],[187,1,187,3],[187,15,187,17],[116,2,116,5],[116,16,116,19],[79,2,79,5],[79,6,79,8],[79,19,79,20],[78,2,78,5],[78,6,78,8],[117,9,117,12],[119,9,119,12],[128,9,128,12],[128,16,128,19],[120,2,120,5],[129,2,129,5],[155,9,155,12],[146,2,146,5],[140,9,140,12],[140,16,140,19],[126,2,126,5],[125,16,125,19],[133,16,133,19],[129,9,129,12],[189,1,205,5],[189,8,205,12],[189,15,205,19],[166,9,166,12],[147,2,147,5],[147,9,147,12],[147,16,147,19],[148,2,148,5],[148,9,148,12],[169,2,169,5],[171,2,171,5],[169,9,169,12],[171,9,171,12],[169,16,169,19],[171,16,171,19],[153,9,153,12],[154,9,154,12],[152,16,152,19],[167,16,167,19],[168,16,168,19],[155,2,155,5],[167,9,167,12],[166,16,166,19],[168,2,168,5],[207,14,207,15],[207,16,207,17],[207,18,207,19],[207,2,207,3],[207,4,207,5],[207,6,207,7],[207,8,207,9],[207,10,207,11],[207,12,207,13],[214,2,217,7],[214,14,217,19],[35,2,35,5],[35,6,35,8],[35,9,35,16],[38,19,38,20],[44,19,44,20],[40,19,40,20],[42,2,42,5],[42,6,42,8],[42,9,42,16],[42,17,42,18],[42,19,42,20],[118,2,118,5],[118,9,118,12],[118,16,118,19],[47,19,47,20],[48,17,48,18],[48,19,48,20],[100,17,100,20],[73,2,73,5],[210,3,211,18],[213,2,213,7],[213,14,213,19],[71,19,71,20],[67,6,67,8],[67,9,67,16],[71,2,71,5],[71,6,71,8],[71,9,71,16],[67,19,67,20],[68,2,68,5],[68,6,68,8],[68,9,68,16],[68,17,68,18],[68,19,68,20],[67,2,67,5],[71,17,71,18],[70,17,70,18],[70,19,70,20],[67,17,67,18],[72,17,72,18],[72,19,72,20],[69,2,69,5],[69,6,69,8],[69,9,69,16],[69,17,69,18],[69,19,69,20],[43,2,43,5],[43,9,43,16],[43,17,43,18],[57,17,57,18],[57,19,57,20],[58,2,58,5],[58,6,58,8],[58,9,58,16],[58,17,58,18],[43,19,43,20],[45,19,45,20],[44,2,44,5],[44,6,44,8],[44,9,44,16],[44,17,44,18],[46,2,46,5],[46,6,46,8],[47,2,47,5],[47,6,47,8],[47,9,47,16],[52,2,52,5],[52,6,52,8],[52,9,52,16],[48,2,48,5],[45,2,45,5],[184,2,184,5],[59,2,59,5],[59,6,59,8],[46,9,46,16],[70,2,70,5],[70,6,70,8],[70,9,70,16],[66,2,66,5],[66,6,66,8],[66,9,66,16],[93,6,93,8],[93,9,93,16],[54,6,54,8],[56,9,56,16],[135,16,135,19],[134,2,134,5],[185,2,185,5],[184,9,184,12],[185,9,185,12],[184,16,184,19],[185,16,185,19],[95,2,95,5],[95,6,95,8],[95,9,95,16],[95,17,95,18],[95,19,95,20],[124,16,124,19],[127,16,127,19],[102,1,102,16],[110,8,110,10],[166,2,166,5],[167,2,167,5],[102,17,102,20],[133,9,133,12],[135,9,135,12],[135,2,135,5],[134,16,134,19],[130,16,130,19],[131,16,131,19],[136,2,136,5],[65,19,65,20],[61,2,61,5],[61,6,61,8],[61,9,61,16],[48,6,48,8],[48,9,48,16],[64,19,64,20],[63,19,63,20],[63,2,63,5],[65,2,65,5],[65,6,65,8],[65,9,65,16],[65,17,65,18],[64,9,64,16],[61,17,61,18],[61,19,61,20],[62,17,62,18],[62,19,62,20],[55,19,55,20],[49,1,49,20],[58,19,58,20],[59,19,59,20],[57,2,57,5],[60,17,60,18],[60,6,60,8],[60,2,60,5],[55,17,55,18],[52,19,52,20],[56,2,56,5],[56,6,56,8],[54,2,54,5],[66,17,66,18],[66,19,66,20],[60,9,60,16],[63,17,63,18],[60,19,60,20],[41,2,41,5],[41,6,41,8],[41,9,41,16],[41,17,41,18],[41,19,41,20],[50,2,50,5],[50,6,50,8],[50,9,50,16],[50,17,50,18],[50,19,50,20],[51,2,51,5],[51,6,51,8],[51,9,51,16],[51,17,51,18],[51,19,51,20],[47,17,47,18],[62,2,62,5],[62,6,62,8],[62,9,62,16],[84,17,84,18],[84,19,84,20],[101,1,101,16],[98,1,98,16],[54,9,54,16],[54,17,54,18],[54,19,54,20],[55,2,55,5],[55,6,55,8],[55,9,55,16],[64,17,64,18],[63,6,63,8],[63,9,63,16],[64,2,64,5],[64,6,64,8],[73,17,73,18],[96,2,96,5],[82,2,82,5],[92,2,92,5],[92,6,92,8],[92,9,92,16],[92,17,92,18],[92,19,92,20],[93,2,93,5],[93,17,93,18],[93,19,93,20],[183,2,183,5],[183,9,183,12],[183,16,183,19],[94,2,94,5],[94,6,94,8],[94,9,94,16],[94,17,94,18],[94,19,94,20],[179,2,179,5],[179,9,179,12],[179,16,179,19],[180,2,180,5],[180,9,180,12],[180,16,180,19],[155,16,155,19],[153,16,153,19],[154,16,154,19],[117,16,117,19],[119,2,119,5],[117,2,117,5],[101,17,101,20],[100,1,100,16]]}
[null,"Amministrazione ",null,null,null,null,null,null,null,null,null,null,null,null,null,null,null,"CONFIGURATORE ELETTRONICO TECNOLOGIE SERVER 2 LOTTO 4",null,null,null,1,null,"Server1","Server2","Server3"]
[null,"N° Identificativo Ordine ",null,null,null,null,null,null,{"$f":"IF(AA2>0,\"ERRORE DI CONFIGURAZIONE\",IF(Y13>0,\"ERRORE DI MANCATA COMPILAZIONE DATI NECESSARI PER L'ORDINATIVO\",\"Configurazione OK\"))","v":"ERRORE DI MANCATA COMPILAZIONE DATI NECESSARI PER L'ORDINATIVO"},null,null,null,null,null,null,null,null,null,null,null,null,1,"Errore",{"$f":"IF('Lotto4 DL560 Gen10 1'!H1=\"ERRORE VERIFICARE LA CONFIGURAZIONE\",1,0)","v":0},{"$f":"IF('Lotto4 DL560 Gen10 2'!I1=\"ERRORE VERIFICARE LA CONFIGURAZIONE\",1,0)","v":0},{"$f":"IF('Lotto4 DL560 Gen10 3'!J1=\"ERRORE VERIFICARE LA CONFIGURAZIONE\",1,0)","v":0},{"$f":"SUM(X2:Z2)","v":0}]
[null,"Data Ordine",null,null,null,null,null,null,null,null,null,null,null,null,null,null,null,null,null,null,null,1,"Dati non compilati","Amministrazione ",{"$f":"IF(G1>0,0,1)","v":1}]
[null,"Tot Ordine Portale CONSIP IVA incl.",null,null,null,null,{"$f":"R103","v":0},null,null,null,null,null,null,null,null,null,null,null,null,null,"Nel \"Tot Ordine Portale CONSIP\" deve essere inserito l'importo totale risultante dall'ordinativo del portale CONSIP.\nQualora l'importo inserito corrisponde al valore ricalcolato dal configuratore viene attivato il pulsante \"Salva in formato PDF\" che permette di generare il file pdf da allegare all'ordinativo.",1,null,"N° Identificativo Ordine ",{"$f":"IF(G2>0,0,1)","v":1}]
[null,"LE CELLE IN GIALLO DEVO ESSERE COMPILATE OBBLIGATORIAMENTE",null,null,null,null,null,null,{"$f":"IF(AA2>0,\"\",IF(Y13>0,\"\",\"Cliccare il pulsante --------------> \nper generare il PDF da allegare\"))","v":""},null,null,null,null,null,null,null,null,null,null,null,null,1,null,"Data Ordine",{"$f":"IF(G3>0,0,1)","v":1}]
[null,"Quantità Server Ordinati",null,null,null,null,{"$f":"IF(B15=\"\",0,B15)","v":0},null,null,null,null,null,null,null,null,null,null,null,null,"ver. 3.5",null,1,null,"Tot Ordine Portale CONSIP IVA incl.",{"$f":"IF(G4>0,0,1)","v":1}]
[null,null,null,null,null,null,null,null,null,null,null,null,null,null,null,null,null,null,null,null,null,1,null,"Referente per la Consegna",{"$f":"IF(E8>0,0,1)","v":1}]
[null,"Referente per la Consegna",null,null,null,null,null,null,null,"Telefono",null,null,null,null,null,"email",null,null,null,null,null,1,null,"Telefono",{"$f":"IF(L8>0,0,1)","v":1}]
[null,null,null,null,null,null,null,null,null,null,null,null,null,null,null,null,null,null,null,null,null,1,null,"email",{"$f":"IF(Q8>0,0,1)","v":1}]
[null,"Referente per l'installazione",null,null,null,null,null,null,null,"Telefono",null,null,null,null,null,"email",null,null,null,null,null,1,null,"Referente per l'installazione",{"$f":"IF(E10>0,0,1)","v":1}]
[null,null,null,null,null,null,null,null,null,null,null,null,null,null,null,null,null,null,null,null,null,1,null,"Telefono",{"$f":"IF(L10>0,0,1)","v":1}]
[null,"ATTENZIONE: I CODICI PRODOTTO DELL'ORDINE DEVONO ESSERE SPECULARI A QUELLI GENERATI DAL CONFIGURATORE.",null,null,null,null,null,null,null,null,null,null,null,null,null,null,null,null,null,null,null,1,null,"email",{"$f":"IF(Q10>0,0,1)","v":1}]
[null,"Qtà Ordinata","CODICE ARTICOLO PRODUTTORE",null,null,null,"CODICE ARTICOLO CONVENZIONE",null,null,"Descrizione Sintetica \n(si faccia riferimento alla guida alla convenzione per la descrizione estesa e \nper le regole di acquisto delle opzioni)",null,null,null,null,null,null,null,"Costo Unitario",null,"Costo Complessivo",null,1,null,null,{"$f":"SUM(Y3:Y12)","v":10},null,{"$f":"Y13+AA2","v":10},{"$f":"IF(AA13=0,\"_SavePDFon\",\"_SavePDFoff\")","v":"_SavePDFoff"}]
[null,"SERVER BASE (HPE PROLIANT DL560 Gen10)",null,null,null,null,null,null,null,null,null,null,null,null,null,null,null,null,null,null,null,{"$f":"IF(B15>=\"\",0,1)","v":0},"DL560","Server1","Server2","Server3"]
[null,{"$f":"IF(AE15>=1,AE15,\"\")","v":""},{"$f":"IF(AE15>0,(VLOOKUP(G15,COD_A,2,FALSE)),\"\")","v":""},null,null,null,{"$f":"IF(AE15>=1,W15,\"\")","v":""},null,null,{"$f":"IF(AE15>0,(VLOOKUP(G15,COD_A,5,FALSE)),\"\")","v":""},null,null,null,null,null,null,null,{"$f":"IF(AE15>0,(VLOOKUP(G15,COD_A,3,FALSE)),\"\")","v":""},null,{"$f":"IF(B15=\"\",\"\",R15*B15)","v":""},null,{"$f":"IF(B15>=\"\",0,1)","v":0},"TS2L4-SRV-U",{"$f":"SRV_A","v":0},{"$f":"SRV_AA","v":0},{"$f":"SRV_AAA","v":0},null,null,null,null,{"$f":"SUM(X15:AD15)","v":0}]
[null,{"$f":"IF(AE16>=1,AE16,\"\")","v":""},"",null,null,null,{"$f":"IF(AE16>=1,W16,\"\")","v":""},null,null,"",null,null,null,null,null,null,null,"",null,{"$f":"IF(B16=\"\",\"\",R16*B16)","v":""},null,{"$f":"IF(B16>=\"\",0,1)","v":0},"TS2L4-CPU-U",{"$f":"'Lotto4 DL560 Gen10 1'!$C$30/2*$X$15","v":0},{"$f":"'Lotto4 DL560 Gen10 2'!$C$30/2*$Y$15","v":0},{"$f":"'Lotto4 DL560 Gen10 3'!$C$30/2*$Z$15","v":0},null,null,null,null,{"$f":"SUM(X16:AD16)","v":0}]
[null,{"$f":"IF(AE17>=1,AE17,\"\")","v":""},{"$f":"IF(AE17=0,\"\",(VLOOKUP(G17,Codici!B:F,5,FALSE)))","v":""},null,null,null,{"$f":"IF(AE17>=1,W17,\"\")","v":""},null,null,{"$f":"IF(AE17>0,(VLOOKUP(G17,Codici!B:F,4,FALSE)),\"\")","v":""},null,null,null,null,null,null,null,{"$f":"IF(AE17>0,(VLOOKUP(G17,Codici!B:F,2,FALSE)),\"\")","v":""},null,{"$f":"IF(B17=\"\",\"\",R17*B17)","v":""},null,0,"TS2L4-RAM32-U",{"$f":"IF(MEM_A=\"\",0,(MEM_A-4)*$X$15)","v":0},{"$f":"IF(MEM_AA=\"\",0,(MEM_AA-4)*$Y$15)","v":0},{"$f":"IF(MEM_AAA=\"\",0,(MEM_AAA-4)*$Z$15)","v":0},null,null,null,null,0]
[null,"",{"$f":"IF(AE18=0,\"\",(VLOOKUP(G18,Codici!B:F,5,FALSE)))","v":""},null,null,null,{"$f":"IF(AE18>=1,W18,\"\")","v":""},null,null,{"$f":"IF(AE18>0,(VLOOKUP(G18,Codici!B:F,4,FALSE)),\"\")","v":""},null,null,null,null,null,null,null,{"$f":"IF(AE18>0,(VLOOKUP(G18,Codici!B:F,2,FALSE)),\"\")","v":""},null,{"$f":"IF(B18=\"\",\"\",R18*B18)","v":""},null,0,"TS2L4-RAM64-U",{"$f":"IF(MEM_A32=\"\",0,MEM_A32*$X$15)","v":0},{"$f":"IF(MEM_AA32=\"\",0,MEM_AA32*$Y$15)","v":0},{"$f":"IF(MEM_AAA32=\"\",0,MEM_AAA32*$Z$15)","v":0},null,null,null,null,0]
[null,"",{"$f":"IF(AE19=0,\"\",(VLOOKUP(G19,Codici!B:F,5,FALSE)))","v":""},null,null,null,"",null,null,{"$f":"IF(AE19>0,(VLOOKUP(G19,Codici!B:F,4,FALSE)),\"\")","v":""},null,null,null,null,null,null,null,{"$f":"IF(AE19>0,(VLOOKUP(G19,Codici!B:F,2,FALSE)),\"\")","v":""},null,"",null,0,null,null,null,null,null,null,null,null,0,null,null,"slot1",{"$f":"'Lotto4 DL560 Gen10 1'!$D$134","v":""},{"$f":"'Lotto4 DL560 Gen10 2'!$D$134","v":""},{"$f":"'Lotto4 DL560 Gen10 3'!$D$134","v":""}]
[null,"",{"$f":"IF(AE20=0,\"\",(VLOOKUP(G20,Codici!B:F,5,FALSE)))","v":""},null,null,null,"",null,null,{"$f":"IF(AE20>0,(VLOOKUP(G20,Codici!B:F,4,FALSE)),\"\")","v":""},null,null,null,null,null,null,null,{"$f":"IF(AE20>0,(VLOOKUP(G20,Codici!B:F,2,FALSE)),\"\")","v":""},null,"",null,0,"TS2L4-LAN1",{"$f":"COUNTIF($AI$19:$AI$26,W20)*$X$15","v":0},{"$f":"COUNTIF($AJ$19:$AJ$26,W20)*$Y$15","v":0},{"$f":"COUNTIF($AK$19:$AK$26,W20)*$Z$15","v":0},null,null,null,null,0,null,null,"slot2",{"$f":"'Lotto4 DL560 Gen10 1'!$D$137","v":""},{"$f":"'Lotto4 DL560 Gen10 2'!$D$137","v":""},{"$f":"'Lotto4 DL560 Gen10 3'!$D$137","v":""}]
[null,"",{"$f":"IF(AE21=0,\"\",(VLOOKUP(G21,Codici!B:F,5,FALSE)))","v":""},null,null,null,"",null,null,{"$f":"IF(AE21>0,(VLOOKUP(G21,Codici!B:F,4,FALSE)),\"\")","v":""},null,null,null,null,null,null,null,{"$f":"IF(AE21>0,(VLOOKUP(G21,Codici!B:F,2,FALSE)),\"\")","v":""},null,"",null,0,null,{"$f":"COUNTIF($AI$19:$AI$26,W21)*$X$15","v":0},{"$f":"COUNTIF($AJ$19:$AJ$26,W21)*$Y$15","v":0},{"$f":"COUNTIF($AK$19:$AK$26,W21)*$Z$15","v":0},null,null,null,null,0,null,null,"slot3",{"$f":"'Lotto4 DL560 Gen10 1'!$D$140","v":""},{"$f":"'Lotto4 DL560 Gen10 2'!$D$140","v":""},{"$f":"'Lotto4 DL560 Gen10 3'!$D$140","v":""}]
[null,"",{"$f":"IF(AE22=0,\"\",(VLOOKUP(G22,Codici!B:F,5,FALSE)))","v":""},null,null,null,"",null,null,{"$f":"IF(AE22>0,(VLOOKUP(G22,Codici!B:F,4,FALSE)),\"\")","v":""},null,null,null,null,null,null,null,{"$f":"IF(AE22>0,(VLOOKUP(G22,Codici!B:F,2,FALSE)),\"\")","v":""},null,"",null,0,"TS2L4-LAN10",0,0,0,null,null,null,null,0,null,null,"slot4",{"$f":"'Lotto4 DL560 Gen10 1'!$D$143","v":""},{"$f":"'Lotto4 DL560 Gen10 2'!$D$143","v":""},{"$f":"'Lotto4 DL560 Gen10 3'!$D$143","v":""}]
[null,"",{"$f":"IF(AE23=0,\"\",(VLOOKUP(G23,Codici!B:F,5,FALSE)))","v":""},null,null,null,"",null,null,{"$f":"IF(AE23>0,(VLOOKUP(G23,Codici!B:F,4,FALSE)),\"\")","v":""},null,null,null,null,null,null,null,{"$f":"IF(AE23>0,(VLOOKUP(G23,Codici!B:F,2,FALSE)),\"\")","v":""},null,"",null,0,null,0,0,0,null,null,null,null,0,null,null,"slot5",{"$f":"'Lotto4 DL560 Gen10 1'!$D$146","v":""},{"$f":"'Lotto4 DL560 Gen10 2'!$D$146","v":""},{"$f":"'Lotto4 DL560 Gen10 3'!$D$146","v":""}]
[null,"",{"$f":"IF(AE24=0,\"\",(VLOOKUP(G24,Codici!B:F,5,FALSE)))","v":""},null,null,null,"",null,null,{"$f":"IF(AE24>0,(VLOOKUP(G24,Codici!B:F,4,FALSE)),\"\")","v":""},null,null,null,null,null,null,null,{"$f":"IF(AE24>0,(VLOOKUP(G24,Codici!B:F,2,FALSE)),\"\")","v":""},null,"",null,0,"TS2L4-CNA10",0,0,0,null,null,null,null,0,null,null,"slot6",{"$f":"'Lotto4 DL560 Gen10 1'!$D$149","v":""},{"$f":"'Lotto4 DL560 Gen10 2'!$D$149","v":""},{"$f":"'Lotto4 DL560 Gen10 3'!$D$149","v":""}]
[null,"",{"$f":"IF(AE25=0,\"\",(VLOOKUP(G25,Codici!B:F,5,FALSE)))","v":""},null,null,null,"",null,null,{"$f":"IF(AE25>0,(VLOOKUP(G25,Codici!B:F,4,FALSE)),\"\")","v":""},null,null,null,null,null,null,null,{"$f":"IF(AE25>0,(VLOOKUP(G25,Codici!B:F,2,FALSE)),\"\")","v":""},null,"",null,0,null,0,0,0,null,null,null,null,0,null,null,"slot7",{"$f":"'Lotto4 DL560 Gen10 1'!$D$152","v":""},{"$f":"'Lotto4 DL560 Gen10 2'!$D$152","v":""},{"$f":"'Lotto4 DL560 Gen10 3'!$D$152","v":""}]
[null,"",{"$f":"IF(AE26=0,\"\",(VLOOKUP(G26,Codici!B:F,5,FALSE)))","v":""},null,null,null,"",null,null,{"$f":"IF(AE26>0,(VLOOKUP(G26,Codici!B:F,4,FALSE)),\"\")","v":""},null,null,null,null,null,null,null,{"$f":"IF(AE26>0,(VLOOKUP(G26,Codici!B:F,2,FALSE)),\"\")","v":""},null,"",null,0,"TS2L4-FC16",0,0,0,null,null,null,null,0,null,null,"slot8",{"$f":"'Lotto4 DL560 Gen10 1'!$D$155","v":""},{"$f":"'Lotto4 DL560 Gen10 2'!$D$155","v":""},{"$f":"'Lotto4 DL560 Gen10 3'!$D$155","v":""}]
[null,"",{"$f":"IF(AE27=0,\"\",(VLOOKUP(G27,Codici!B:F,5,FALSE)))","v":""},null,null,null,"",null,null,{"$f":"IF(AE27>0,(VLOOKUP(G27,Codici!B:F,4,FALSE)),\"\")","v":""},null,null,null,null,null,null,null,{"$f":"IF(AE27>0,(VLOOKUP(G27,Codici!B:F,2,FALSE)),\"\")","v":""},null,"",null,0,"TS2L4-15K300",{"$f":"IF('Lotto4 DL560 Gen10 1'!$C$86>=1,('Lotto4 DL560 Gen10 1'!$C$86-2))*$X$15","v":0},{"$f":"IF('Lotto4 DL560 Gen10 2'!$C$86>=1,('Lotto4 DL560 Gen10 2'!$C$86-2))*$Y$15","v":0},{"$f":"IF('Lotto4 DL560 Gen10 3'!$C$86>=1,('Lotto4 DL560 Gen10 3'!$C$86-2))*$Z$15","v":0},null,null,null,null,0]
[null,"",{"$f":"IF(AE28=0,\"\",(VLOOKUP(G28,Codici!B:F,5,FALSE)))","v":""},null,null,null,"",null,null,{"$f":"IF(AE28>0,(VLOOKUP(G28,Codici!B:F,4,FALSE)),\"\")","v":""},null,null,null,null,null,null,null,{"$f":"IF(AE28>0,(VLOOKUP(G28,Codici!B:F,2,FALSE)),\"\")","v":""},null,"",null,0,"TS2L4-10K1200",{"$f":"'Lotto4 DL560 Gen10 1'!$C$88*$X$15","v":0},{"$f":"'Lotto4 DL560 Gen10 2'!$C$88*$Y$15","v":0},{"$f":"'Lotto4 DL560 Gen10 3'!$C$88*$Z$15","v":0},null,null,null,null,0]
[null,"",{"$f":"IF(AE29=0,\"\",(VLOOKUP(G29,Codici!B:F,5,FALSE)))","v":""},null,null,null,"",null,null,{"$f":"IF(AE29>0,(VLOOKUP(G29,Codici!B:F,4,FALSE)),\"\")","v":""},null,null,null,null,null,null,null,{"$f":"IF(AE29>0,(VLOOKUP(G29,Codici!B:F,2,FALSE)),\"\")","v":""},null,"",null,0,"TS2L4-SSD480",{"$f":"'Lotto4 DL560 Gen10 1'!$C$92*$X$15","v":0},{"$f":"'Lotto4 DL560 Gen10 2'!$C$92*$Y$15","v":0},{"$f":"'Lotto4 DL560 Gen10 3'!$C$92*$Z$15","v":0},null,null,null,null,0,null,{"$f":"SUM(X29:Z29)","v":0},{"$f":"SUM(AA29:AC29)","v":0},{"$f":"SUM(AD29:AF29)","v":0},{"$f":"X29*$X$15","v":0},{"$f":"Y29*$Y$15","v":0},{"$f":"Z29*$Z$15","v":0},{"$f":"AA29*$X$35","v":0},{"$f":"AB29*$Y$35","v":0},{"$f":"AC29*$Z$35","v":0},{"$f":"AD29*$X$75","v":0},{"$f":"AE29*$Y$75","v":0},{"$f":"AF29*$Z$75","v":0},null,{"$f":"SUM(AJ29:AS29)","v":0}]
[null,"",{"$f":"IF(AE30=0,\"\",(VLOOKUP(G30,Codici!B:F,5,FALSE)))","v":""},null,null,null,"",null,null,{"$f":"IF(AE30>0,(VLOOKUP(G30,Codici!B:F,4,FALSE)),\"\")","v":""},null,null,null,null,null,null,null,{"$f":"IF(AE30>0,(VLOOKUP(G30,Codici!B:F,2,FALSE)),\"\")","v":""},null,"",null,0,"TS2L4-SSDR960",{"$f":"'Lotto4 DL560 Gen10 1'!$C$94*$X$15","v":0},{"$f":"'Lotto4 DL560 Gen10 2'!$C$94*$Y$15","v":0},{"$f":"'Lotto4 DL560 Gen10 3'!$C$94*$Z$15","v":0},null,null,null,null,0,null,0,0,{"$f":"SUM(AD30:AF30)","v":0},0,0,0,0,0,0,{"$f":"AD30*$X$75","v":0},{"$f":"AE30*$Y$75","v":0},{"$f":"AF30*$Z$75","v":0},null,{"$f":"SUM(AJ30:AS30)","v":0}]
[null,"",{"$f":"IF(AE31=0,\"\",(VLOOKUP(G31,Codici!B:F,5,FALSE)))","v":""},null,null,null,"",null,null,{"$f":"IF(AE31>0,(VLOOKUP(G31,Codici!B:F,4,FALSE)),\"\")","v":""},null,null,null,null,null,null,null,{"$f":"IF(AE31>0,(VLOOKUP(G31,Codici!B:F,2,FALSE)),\"\")","v":""},null,"",null,0,"TS2L4-4Y",{"$f":"IF('Lotto4 DL560 Gen10 1'!$D$201=W31,('Lotto4 DL560 Gen10 1'!$C$201)*$X$15,0)","v":0},{"$f":"IF('Lotto4 DL560 Gen10 2'!$D$201=W31,('Lotto4 DL560 Gen10 2'!$C$201)*$Y$15,0)","v":0},{"$f":"IF('Lotto4 DL560 Gen10 3'!$D$201=W31,('Lotto4 DL560 Gen10 3'!$C$201)*$Z$15,0)","v":0},null,null,null,null,0]
[null,"",{"$f":"IF(AE32=0,\"\",(VLOOKUP(G32,Codici!B:F,5,FALSE)))","v":""},null,null,null,"",null,null,{"$f":"IF(AE32>0,(VLOOKUP(G32,Codici!B:F,4,FALSE)),\"\")","v":""},null,null,null,null,null,null,null,{"$f":"IF(AE32>0,(VLOOKUP(G32,Codici!B:F,2,FALSE)),\"\")","v":""},null,"",null,0,"TS2L4-5Y",{"$f":"IF('Lotto4 DL560 Gen10 1'!$D$201=W32,('Lotto4 DL560 Gen10 1'!$C$201)*$X$15,0)","v":0},{"$f":"IF('Lotto4 DL560 Gen10 2'!$D$201=W32,('Lotto4 DL560 Gen10 2'!$C$201)*$Y$15,0)","v":0},{"$f":"IF('Lotto4 DL560 Gen10 3'!$D$201=W32,('Lotto4 DL560 Gen10 3'!$C$201)*$Z$15,0)","v":0},null,null,null,null,0]
[null,"",{"$f":"IF(AE33=0,\"\",(VLOOKUP(G33,Codici!B:F,5,FALSE)))","v":""},null,null,null,"",null,null,{"$f":"IF(AE33>0,(VLOOKUP(G33,Codici!B:F,4,FALSE)),\"\")","v":""},null,null,null,null,null,null,null,{"$f":"IF(AE33>0,(VLOOKUP(G33,Codici!B:F,2,FALSE)),\"\")","v":""},null,"",null,0,"10L2-SO-HDD",null,null,null,null,null,null,null,0]
[null,"OPZIONI COMUNI",null,null,null,null,null,null,null,null,null,null,null,null,null,null,null,null,null,null,null,{"$f":"IF(SUM(V35:V49)=0,0,1)","v":0},"Comuni","DL560","DL560 2","DL560 3"]
[null,{"$f":"IF(AT35=0,\"\",AT35)","v":""},{"$f":"IF(AG35=0,\"\",(VLOOKUP(G35,Codici!B:F,5,FALSE)))","v":""},null,null,null,{"$f":"IF(AT35>0,W35,\"\")","v":""},null,null,{"$f":"IF(AG35>0,(VLOOKUP(G35,Codici!B:F,4,FALSE)),\"\")","v":""},null,null,null,null,null,null,null,{"$f":"IF(AG35>0,(VLOOKUP(G35,Codici!B:F,2,FALSE)),\"\")","v":""},null,{"$f":"IF(B35=\"\",\"\",R35*B35)","v":""},null,{"$f":"IF(B35>=\"\",0,1)","v":0},"TS2L4-WIN1",{"$f":"IF('Lotto4 DL560 Gen10 1'!$D$46=W35,1*$X$15,0)","v":0},{"$f":"IF('Lotto4 DL560 Gen10 2'!$D$46=W35,1*$Y$15,0)","v":0},{"$f":"IF('Lotto4 DL560 Gen10 3'!$D$46=W35,1*$Z$15,0)","v":0},null,null,null,null,null,null,{"$f":"SUM(X35:Z35)","v":0},{"$f":"SUM(AA35:AC35)","v":0},{"$f":"SUM(AD35:AF35)","v":0},null,null,null,null,null,null,null,null,null,null,{"$f":"SUM(AG35:AR35)","v":0}]
[null,"",{"$f":"IF(AG36=0,\"\",(VLOOKUP(G36,Codici!B:F,5,FALSE)))","v":""},null,null,null,"",null,null,{"$f":"IF(AG36>0,(VLOOKUP(G36,Codici!B:F,4,FALSE)),\"\")","v":""},null,null,null,null,null,null,null,{"$f":"IF(AG36>0,(VLOOKUP(G36,Codici!B:F,2,FALSE)),\"\")","v":""},null,"",null,0,"TS2L4-WIN2",{"$f":"IF('Lotto4 DL560 Gen10 1'!$D$47=$W$36,'Lotto4 DL560 Gen10 1'!$C$47*$X$15,0)","v":0},{"$f":"IF('Lotto4 DL560 Gen10 2'!$D$47=$W$36,'Lotto4 DL560 Gen10 2'!$C$47*$Y$15,0)","v":0},{"$f":"IF('Lotto4 DL560 Gen10 3'!$D$47=$W$36,'Lotto4 DL560 Gen10 3'!$C$47*$Z$15,0)","v":0},null,null,null,null,null,null,0,0,{"$f":"SUM(AD36:AF36)","v":0},null,null,null,null,null,null,null,null,null,null,{"$f":"SUM(AG36:AR36)","v":0}]
[null,"",{"$f":"IF(AG37=0,\"\",(VLOOKUP(G37,Codici!B:F,5,FALSE)))","v":""},null,null,null,"",null,null,{"$f":"IF(AG37>0,(VLOOKUP(G37,Codici!B:F,4,FALSE)),\"\")","v":""},null,null,null,null,null,null,null,{"$f":"IF(AG37>0,(VLOOKUP(G37,Codici!B:F,2,FALSE)),\"\")","v":""},null,"",null,0,"TS2L4-WINDC1",{"$f":"IF('Lotto4 DL560 Gen10 1'!$D$46=W37,1*$X$15,0)","v":0},{"$f":"IF('Lotto4 DL560 Gen10 2'!$D$46=W37,1*$Y$15,0)","v":0},{"$f":"IF('Lotto4 DL560 Gen10 3'!$D$46=W37,1*$Z$15,0)","v":0},null,null,null,null,null,null,0,0,0,null,null,null,null,null,null,null,null,null,null,0]
[null,"",{"$f":"IF(AG38=0,\"\",(VLOOKUP(G38,Codici!B:F,5,FALSE)))","v":""},null,null,null,"",null,null,{"$f":"IF(AG38>0,(VLOOKUP(G38,Codici!B:F,4,FALSE)),\"\")","v":""},null,null,null,null,null,null,null,{"$f":"IF(AG38>0,(VLOOKUP(G38,Codici!B:F,2,FALSE)),\"\")","v":""},null,"",null,0,"TS2L4-WINDC2",{"$f":"IF('Lotto4 DL560 Gen10 1'!$D$47=$W$38,'Lotto4 DL560 Gen10 1'!$C$47*$X$15,0)","v":0},{"$f":"IF('Lotto4 DL560 Gen10 2'!$D$47=$W$38,'Lotto4 DL560 Gen10 2'!$C$47*$Y$15,0)","v":0},{"$f":"IF('Lotto4 DL560 Gen10 3'!$D$47=$W$38,'Lotto4 DL560 Gen10 3'!$C$47*$Z$15,0)","v":0},null,null,null,null,null,null,0,0,0,null,null,null,null,null,null,null,null,null,null,0]
[null,"",{"$f":"IF(AG39=0,\"\",(VLOOKUP(G39,Codici!B:F,5,FALSE)))","v":""},null,null,null,"",null,null,{"$f":"IF(AG39>0,(VLOOKUP(G39,Codici!B:F,4,FALSE)),\"\")","v":""},null,null,null,null,null,null,null,{"$f":"IF(AG39>0,(VLOOKUP(G39,Codici!B:F,2,FALSE)),\"\")","v":""},null,"",null,0,"TS2L4-LINUX",{"$f":"IF('Lotto4 DL560 Gen10 1'!$D$46=$W$39,1*$X$15,0)","v":0},{"$f":"IF('Lotto4 DL560 Gen10 2'!$D$46=$W$39,1*$Y$15,0)","v":0},{"$f":"IF('Lotto4 DL560 Gen10 3'!$D$46=$W$39,1*$Z$15,0)","v":0},null,null,null,null,null,null,0,0,0,null,null,null,null,null,null,null,null,null,null,0]
[null,"",{"$f":"IF(AG40=0,\"\",(VLOOKUP(G40,Codici!B:F,5,FALSE)))","v":""},null,null,null,"",null,null,{"$f":"IF(AG40>0,(VLOOKUP(G40,Codici!B:F,4,FALSE)),\"\")","v":""},null,null,null,null,null,null,null,{"$f":"IF(AG40>0,(VLOOKUP(G40,Codici!B:F,2,FALSE)),\"\")","v":""},null,"",null,0,"TS2L4-CALUSER",{"$f":"IF(($X$35+$X$37)>0,'Lotto4 DL560 Gen10 1'!$C$51*$X$15,0)","v":0},{"$f":"IF(($Y$35+$Y$37)>0,'Lotto4 DL560 Gen10 2'!$C$51*$Y$15,0)","v":0},{"$f":"IF(($Z$35+$Z$37)>0,'Lotto4 DL560 Gen10 3'!$C$51*$Z$15,0)","v":0},null,null,null,null,null,null,0,0,0,null,null,null,null,null,null,null,null,null,null,0]
[null,"",{"$f":"IF(AG41=0,\"\",(VLOOKUP(G41,Codici!B:F,5,FALSE)))","v":""},null,null,null,"",null,null,{"$f":"IF(AG41>0,(VLOOKUP(G41,Codici!B:F,4,FALSE)),\"\")","v":""},null,null,null,null,null,null,null,{"$f":"IF(AG41>0,(VLOOKUP(G41,Codici!B:F,2,FALSE)),\"\")","v":""},null,"",null,0,"TS2L4-CALDEV",{"$f":"IF(($X$35+$X$37)>0,'Lotto4 DL560 Gen10 1'!$C$53*$X$15,0)","v":0},{"$f":"IF(($Y$35+$Y$37)>0,'Lotto4 DL560 Gen10 2'!$C$53*$Y$15,0)","v":0},{"$f":"IF(($Z$35+$Z$37)>0,'Lotto4 DL560 Gen10 3'!$C$53*$Z$15,0)","v":0},null,null,null,null,null,null,0,0,0,null,null,null,null,null,null,null,null,null,null,0]
[null,"",{"$f":"IF(AG42=0,\"\",(VLOOKUP(G42,Codici!B:F,5,FALSE)))","v":""},null,null,null,{"$f":"IF(AT42>0,W42,\"\")","v":""},null,null,{"$f":"IF(AG42>0,(VLOOKUP(G42,Codici!B:F,4,FALSE)),\"\")","v":""},null,null,null,null,null,null,null,{"$f":"IF(AG42>0,(VLOOKUP(G42,Codici!B:F,2,FALSE)),\"\")","v":""},null,{"$f":"IF(B42=\"\",\"\",R42*B42)","v":""},null,0,"TS2L4-WINDC2COR",{"$f":"IF('Lotto4 DL560 Gen10 1'!$D$47=$W$42,'Lotto4 DL560 Gen10 1'!$C$47*$X$15,0)","v":0},{"$f":"IF('Lotto4 DL560 Gen10 2'!$D$47=$W$42,'Lotto4 DL560 Gen10 2'!$C$47*$Y$15,0)","v":0},{"$f":"IF('Lotto4 DL560 Gen10 3'!$D$47=$W$42,'Lotto4 DL560 Gen10 3'!$C$47*$Z$15,0)","v":0},null,null,null,null,null,null,0,null,null,null,null,null,null,null,null,null,null,null,null,0]
[null,"",{"$f":"IF(AG43=0,\"\",(VLOOKUP(G43,Codici!B:F,5,FALSE)))","v":""},null,null,null,"",null,null,{"$f":"IF(AG43>0,(VLOOKUP(G43,Codici!B:F,4,FALSE)),\"\")","v":""},null,null,null,null,null,null,null,{"$f":"IF(AG43>0,(VLOOKUP(G43,Codici!B:F,2,FALSE)),\"\")","v":""},null,"",null,0,"TS2L4-WIN2CORE",{"$f":"IF('Lotto4 DL560 Gen10 1'!$D$47=Riepilogo!$W$43,'Lotto4 DL560 Gen10 1'!$C$47*$X$15,0)","v":0},{"$f":"IF('Lotto4 DL560 Gen10 2'!$D$47=Riepilogo!$W$43,'Lotto4 DL560 Gen10 2'!$C$47*$Y$15,0)","v":0},{"$f":"IF('Lotto4 DL560 Gen10 3'!$D$47=Riepilogo!$W$43,'Lotto4 DL560 Gen10 3'!$C$47*$Z$15,0)","v":0},null,null,null,null,null,null,0,0,0,null,null,null,null,null,null,null,null,null,null,0]
[null,{"$f":"IF('RACK, Accessori e Servizi'!J15=0,\"\",'RACK, Accessori e Servizi'!J15)","v":""},{"$f":"IF(AG44=0,\"\",(VLOOKUP(G44,Codici!B:F,5,FALSE)))","v":""},null,null,null,{"$f":"IF('RACK, Accessori e Servizi'!J15>0,'RACK, Accessori e Servizi'!K15,\"\")","v":""},null,null,{"$f":"IF(AG44>0,(VLOOKUP(G44,Codici!B:F,4,FALSE)),\"\")","v":""},null,null,null,null,null,null,null,{"$f":"IF(AG44>0,(VLOOKUP(G44,Codici!B:F,2,FALSE)),\"\")","v":""},null,{"$f":"IF(B44=\"\",\"\",R44*B44)","v":""},null,0,"TS2L4-RACK",null,null,null,null,null,null,null,null,null,{"$f":"'RACK, Accessori e Servizi'!J15","v":0}]
[null,{"$f":"IF('RACK, Accessori e Servizi'!J24=0,\"\",'RACK, Accessori e Servizi'!J24)","v":""},{"$f":"IF(AG45=0,\"\",(VLOOKUP(G45,Codici!B:F,5,FALSE)))","v":""},null,null,null,{"$f":"IF('RACK, Accessori e Servizi'!J24>0,'RACK, Accessori e Servizi'!K24,\"\")","v":""},null,null,{"$f":"IF(AG45>0,(VLOOKUP(G45,Codici!B:F,4,FALSE)),\"\")","v":""},null,null,null,null,null,null,null,{"$f":"IF(AG45>0,(VLOOKUP(G45,Codici!B:F,2,FALSE)),\"\")","v":""},null,"",null,0,"TS2L4-GUI",null,null,null,null,null,null,null,null,null,{"$f":"'RACK, Accessori e Servizi'!J24","v":0}]
[null,{"$f":"IF('RACK, Accessori e Servizi'!J27=0,\"\",'RACK, Accessori e Servizi'!J27)","v":""},{"$f":"IF(AG46=0,\"\",(VLOOKUP(G46,Codici!B:F,5,FALSE)))","v":""},null,null,null,{"$f":"IF('RACK, Accessori e Servizi'!J27>0,'RACK, Accessori e Servizi'!K27,\"\")","v":""},null,null,{"$f":"IF(AG46>0,(VLOOKUP(G46,Codici!B:F,4,FALSE)),\"\")","v":""},null,null,null,null,null,null,null,{"$f":"IF(AG46>0,(VLOOKUP(G46,Codici!B:F,2,FALSE)),\"\")","v":""},null,"",null,0,"TS2L4-KVMIP",null,null,null,null,null,null,null,null,null,{"$f":"'RACK, Accessori e Servizi'!J27","v":0}]
[null,{"$f":"IF('RACK, Accessori e Servizi'!J30=0,\"\",'RACK, Accessori e Servizi'!J30)","v":""},{"$f":"IF(AG47=0,\"\",(VLOOKUP(G47,Codici!B:F,5,FALSE)))","v":""},null,null,null,{"$f":"IF('RACK, Accessori e Servizi'!J30>0,'RACK, Accessori e Servizi'!K30,\"\")","v":""},null,null,{"$f":"IF(AG47>0,(VLOOKUP(G47,Codici!B:F,4,FALSE)),\"\")","v":""},null,null,null,null,null,null,null,{"$f":"IF(AG47>0,(VLOOKUP(G47,Codici!B:F,2,FALSE)),\"\")","v":""},null,"",null,0,"TS2L4-UPS",null,null,null,null,null,null,null,null,null,{"$f":"'RACK, Accessori e Servizi'!J30","v":0}]
[null,null,{"$f":"IF(AG48=0,\"\",(VLOOKUP(G48,Codici!B:F,5,FALSE)))","v":""},null,null,null,null,null,null,null,null,null,null,null,null,null,null,null,null,null,null,0]
[null,null,{"$f":"IF(AG49=0,\"\",(VLOOKUP(G49,Codici!B:F,5,FALSE)))","v":""},null,null,null,null,null,null,null,null,null,null,null,null,null,null,null,null,null,null,0,null,null,null,null,null,null,null,null,null,null,null,null,null,"Moltiplica x il num server"]
[null,"ULTERIORI OPZIONI 20%",null,null,null,null,null,null,null,null,null,null,null,null,null,null,null,null,null,null,null,{"$f":"IF(SUM(V53:V98)=0,0,1)","v":0},null,"DL560","DL560 2","DL560 3",null,null,null,null,null,null,null,null,null,"DL560","DL560 2","DL560 3",null,null,null,null,null,null,null,"SOMMA"]
[null,{"$f":"IF('RACK, Accessori e Servizi'!J33=0,\"\",'RACK, Accessori e Servizi'!J33)","v":""},{"$f":"IF(AG51=0,\"\",(VLOOKUP(G51,Codici!B:F,5,FALSE)))","v":""},null,null,null,{"$f":"IF('RACK, Accessori e Servizi'!J33>0,'RACK, Accessori e Servizi'!K33,\"\")","v":""},null,null,{"$f":"IF(AG51>0,(VLOOKUP(G51,Codici!B:F,4,FALSE)),\"\")","v":""},null,null,null,null,null,null,null,{"$f":"IF(AG51>0,(VLOOKUP(G51,Codici!B:F,2,FALSE)),\"\")","v":""},null,{"$f":"IF(B51=\"\",\"\",R51*B51)","v":""},null,0,"TS2L4-PDU32A",null,null,null,null,null,null,null,null,null,{"$f":"'RACK, Accessori e Servizi'!J33","v":0}]
[null,{"$f":"IF('RACK, Accessori e Servizi'!J36=0,\"\",'RACK, Accessori e Servizi'!J36)","v":""},{"$f":"IF(AG52=0,\"\",(VLOOKUP(G52,Codici!B:F,5,FALSE)))","v":""},null,null,null,{"$f":"IF('RACK, Accessori e Servizi'!J36>0,'RACK, Accessori e Servizi'!K36,\"\")","v":""},null,null,{"$f":"IF(AG52>0,(VLOOKUP(G52,Codici!B:F,4,FALSE)),\"\")","v":""},null,null,null,null,null,null,null,{"$f":"IF(AG52>0,(VLOOKUP(G52,Codici!B:F,2,FALSE)),\"\")","v":""},null,{"$f":"IF(B52=\"\",\"\",R52*B52)","v":""},null,0,"TS2L4-RACKPDU32",null,null,null,null,null,null,null,null,null,{"$f":"'RACK, Accessori e Servizi'!J36","v":0}]
[null,{"$f":"IF(AT53=0,\"\",AT53)","v":""},{"$f":"IF(AT53=0,\"\",(VLOOKUP(G53,Codici!B:F,5,FALSE)))","v":""},null,null,null,{"$f":"IF(AT53>0,W53,\"\")","v":""},null,null,{"$f":"IF(AT53>0,(VLOOKUP(G53,Codici!B:F,4,FALSE)),\"\")","v":""},null,null,null,null,null,null,null,{"$f":"IF(AT53>0,(VLOOKUP(G53,Codici!B:F,2,FALSE)),\"\")","v":""},null,{"$f":"IF(B53=\"\",\"\",R53*B53)","v":""},null,0,"TS2L4-3MRJ45",{"$f":"IF(X15>=1,'Lotto4 DL560 Gen10 1'!$C$167,0)","v":0},{"$f":"IF(Y15>=1,'Lotto4 DL560 Gen10 2'!$C$167,0)","v":0},{"$f":"IF(Z15>=1,'Lotto4 DL560 Gen10 3'!$C$167,0)","v":0},null,null,null,null,{"$f":"SUM(X53:AD53)","v":0},null,null,{"$f":"SUM(AA53:AC53)","v":0},{"$f":"SUM(AD53:AF53)","v":0},{"$f":"X53*$X$15","v":0},{"$f":"Y53*$Y$15","v":0},{"$f":"Z53*$Z$15","v":0},{"$f":"AA53*$X$35","v":0},{"$f":"AB53*$Y$35","v":0},{"$f":"AC53*$Z$35","v":0},{"$f":"AD53*$X$75","v":0},{"$f":"AE53*$Y$75","v":0},{"$f":"AF53*$Z$75","v":0},null,{"$f":"SUM(AJ53:AL53)","v":0}]
[null,"",{"$f":"IF(AT54=0,\"\",(VLOOKUP(G54,Codici!B:F,5,FALSE)))","v":""},null,null,null,"",null,null,{"$f":"IF(AT54>0,(VLOOKUP(G54,Codici!B:F,4,FALSE)),\"\")","v":""},null,null,null,null,null,null,null,{"$f":"IF(AT54>0,(VLOOKUP(G54,Codici!B:F,2,FALSE)),\"\")","v":""},null,{"$f":"IF(B54=\"\",\"\",R54*B54)","v":""},null,0,"TS2L4-10K1800",{"$f":"'Lotto4 DL560 Gen10 1'!$C$90","v":0},{"$f":"'Lotto4 DL560 Gen10 2'!$C$90","v":0},{"$f":"'Lotto4 DL560 Gen10 3'!$C$90","v":0},null,null,null,null,{"$f":"SUM(X54:AD54)","v":0},null,{"$f":"SUM(X54:Z54)","v":0},{"$f":"SUM(AA54:AC54)","v":0},{"$f":"SUM(AD54:AF54)","v":0},{"$f":"X54*$X$15","v":0},{"$f":"Y54*$Y$15","v":0},{"$f":"Z54*$Z$15","v":0},{"$f":"AA54*$X$35","v":0},{"$f":"AB54*$Y$35","v":0},{"$f":"AC54*$Z$35","v":0},0,0,0,null,{"$f":"SUM(AJ54:AL54)","v":0}]
[null,"",{"$f":"IF(AT55=0,\"\",(VLOOKUP(G55,Codici!B:F,5,FALSE)))","v":""},null,null,null,"",null,null,{"$f":"IF(AT55>0,(VLOOKUP(G55,Codici!B:F,4,FALSE)),\"\")","v":""},null,null,null,null,null,null,null,{"$f":"IF(AT55>0,(VLOOKUP(G55,Codici!B:F,2,FALSE)),\"\")","v":""},null,{"$f":"IF(B55=\"\",\"\",R55*B55)","v":""},null,0,"TS2L4-SSDR1920",{"$f":"'Lotto4 DL560 Gen10 1'!$C$104","v":0},{"$f":"'Lotto4 DL560 Gen10 2'!$C$104","v":0},{"$f":"'Lotto4 DL560 Gen10 3'!$C$104","v":0},null,null,null,null,0,null,{"$f":"SUM(X55:Z55)","v":0},{"$f":"SUM(AA55:AC55)","v":0},{"$f":"SUM(AD55:AF55)","v":0},0,0,0,{"$f":"AA55*$X$35","v":0},{"$f":"AB55*$Y$35","v":0},{"$f":"AC55*$Z$35","v":0},0,0,0,null,0]
[null,"",{"$f":"IF(AT56=0,\"\",(VLOOKUP(G56,Codici!B:F,5,FALSE)))","v":""},null,null,null,"",null,null,{"$f":"IF(AT56>0,(VLOOKUP(G56,Codici!B:F,4,FALSE)),\"\")","v":""},null,null,null,null,null,null,null,{"$f":"IF(AT56>0,(VLOOKUP(G56,Codici!B:F,2,FALSE)),\"\")","v":""},null,{"$f":"IF(B56=\"\",\"\",R56*B56)","v":""},null,0,"TS2L4-3RISER",{"$f":"'Lotto4 DL560 Gen10 1'!$C$128","v":0},{"$f":"'Lotto4 DL560 Gen10 2'!$C$128","v":0},{"$f":"'Lotto4 DL560 Gen10 3'!$C$128","v":0},null,null,null,null,0,null,{"$f":"SUM(X56:Z56)","v":0},{"$f":"SUM(AA56:AC56)","v":0},{"$f":"SUM(AD56:AF56)","v":0},0,0,0,{"$f":"AA56*$X$35","v":0},{"$f":"AB56*$Y$35","v":0},{"$f":"AC56*$Z$35","v":0},0,0,0,null,0]
[null,"",{"$f":"IF(AT57=0,\"\",(VLOOKUP(G57,Codici!B:F,5,FALSE)))","v":""},null,null,null,"",null,null,{"$f":"IF(AT57>0,(VLOOKUP(G57,Codici!B:F,4,FALSE)),\"\")","v":""},null,null,null,null,null,null,null,{"$f":"IF(AT57>0,(VLOOKUP(G57,Codici!B:F,2,FALSE)),\"\")","v":""},null,"",null,0,"TS2L4-SASBAY2",{"$f":"IF($X$58=1,0,IF('Lotto4 DL560 Gen10 1'!$C$71>=1,1,0))","v":0},{"$f":"IF($Y$58=1,0,IF('Lotto4 DL560 Gen10 2'!$C$71>=1,1,0))","v":0},{"$f":"IF($Z$58=1,0,IF('Lotto4 DL560 Gen10 3'!$C$71>=1,1,0))","v":0},null,null,null,null,0,null,0,0,0,0,0,0,0,0,0,0,0,0,null,0]
[null,"",{"$f":"IF(AT58=0,\"\",(VLOOKUP(G58,Codici!B:F,5,FALSE)))","v":""},null,null,null,"",null,null,{"$f":"IF(AT58>0,(VLOOKUP(G58,Codici!B:F,4,FALSE)),\"\")","v":""},null,null,null,null,null,null,null,{"$f":"IF(AT58>0,(VLOOKUP(G58,Codici!B:F,2,FALSE)),\"\")","v":""},null,"",null,0,"TS2L4-SASBAY12",{"$f":"IF('Lotto4 DL560 Gen10 1'!$C$74>=1,1,0)","v":0},{"$f":"IF('Lotto4 DL560 Gen10 2'!$C$74>=1,1,0)","v":0},{"$f":"IF('Lotto4 DL560 Gen10 3'!$C$74>=1,1,0)","v":0},null,null,null,null,0,null,0,0,0,0,0,0,0,0,0,0,0,0,null,0]
[null,"",{"$f":"IF(AT59=0,\"\",(VLOOKUP(G59,Codici!B:F,5,FALSE)))","v":""},null,null,null,"",null,null,{"$f":"IF(AT59>0,(VLOOKUP(G59,Codici!B:F,4,FALSE)),\"\")","v":""},null,null,null,null,null,null,null,{"$f":"IF(AT59>0,(VLOOKUP(G59,Codici!B:F,2,FALSE)),\"\")","v":""},null,"",null,0,"TS2L4-530T",{"$f":"COUNTIF($AI$19:$AI$26,W59)","v":0},{"$f":"COUNTIF($AJ$19:$AJ$26,W59)","v":0},{"$f":"COUNTIF($AK$19:$AK$26,W59)","v":0},null,null,null,null,0,null,0,0,0,0,0,0,0,0,0,0,0,0,null,0]
[null,"",{"$f":"IF(AT60=0,\"\",(VLOOKUP(G60,Codici!B:F,5,FALSE)))","v":""},null,null,null,"",null,null,{"$f":"IF(AT60>0,(VLOOKUP(G60,Codici!B:F,4,FALSE)),\"\")","v":""},null,null,null,null,null,null,null,{"$f":"IF(AT60>0,(VLOOKUP(G60,Codici!B:F,2,FALSE)),\"\")","v":""},null,"",null,0,"TS2L4-521T",{"$f":"COUNTIF($AI$19:$AI$26,W60)","v":0},{"$f":"COUNTIF($AJ$19:$AJ$26,W60)","v":0},{"$f":"COUNTIF($AK$19:$AK$26,W60)","v":0},null,null,null,null,0,null,0,0,0,0,0,0,0,0,0,0,0,0,null,0]
[null,"",{"$f":"IF(AT61=0,\"\",(VLOOKUP(G61,Codici!B:F,5,FALSE)))","v":""},null,null,null,"",null,null,{"$f":"IF(AT61>0,(VLOOKUP(G61,Codici!B:F,4,FALSE)),\"\")","v":""},null,null,null,null,null,null,null,{"$f":"IF(AT61>0,(VLOOKUP(G61,Codici!B:F,2,FALSE)),\"\")","v":""},null,{"$f":"IF(B61=\"\",\"\",R61*B61)","v":""},null,0,"TS2L4-536FLR",{"$f":"IF('Lotto4 DL560 Gen10 1'!$B$131=\"[TS2L4-536FLR] HPE FlexFabric 10Gb 4-port 536FLR-T Adapter\",1,0)","v":0},{"$f":"IF('Lotto4 DL560 Gen10 2'!$B$131=\"[TS2L4-536FLR] HPE FlexFabric 10Gb 4-port 536FLR-T Adapter\",1,0)","v":0},{"$f":"IF('Lotto4 DL560 Gen10 3'!$B$131=\"[TS2L4-536FLR] HPE FlexFabric 10Gb 4-port 536FLR-T Adapter\",1,0)","v":0},null,null,null,null,0,null,0,0,0,0,0,0,0,0,0,0,0,0,null,0]
[null,"",{"$f":"IF(AT62=0,\"\",(VLOOKUP(G62,Codici!B:F,5,FALSE)))","v":""},null,null,null,"",null,null,{"$f":"IF(AT62>0,(VLOOKUP(G62,Codici!B:F,4,FALSE)),\"\")","v":""},null,null,null,null,null,null,null,{"$f":"IF(AT62>0,(VLOOKUP(G62,Codici!B:F,2,FALSE)),\"\")","v":""},null,{"$f":"IF(B62=\"\",\"\",R62*B62)","v":""},null,0,"TS2L4-562SFP",0,0,0,null,null,null,null,0,null,0,0,0,0,0,0,0,0,0,0,0,0,null,0]
[null,"",{"$f":"IF(AT63=0,\"\",(VLOOKUP(G63,Codici!B:F,5,FALSE)))","v":""},null,null,null,"",null,null,{"$f":"IF(AT63>0,(VLOOKUP(G63,Codici!B:F,4,FALSE)),\"\")","v":""},null,null,null,null,null,null,null,{"$f":"IF(AT63>0,(VLOOKUP(G63,Codici!B:F,2,FALSE)),\"\")","v":""},null,{"$f":"IF(B63=\"\",\"\",R63*B63)","v":""},null,0,"TS2L4-10OTSR",{"$f":"IF('Lotto4 DL560 Gen10 1'!$C$194>=1,'Lotto4 DL560 Gen10 1'!$C$194,0)*Riepilogo!$X$15","v":0},{"$f":"IF('Lotto4 DL560 Gen10 2'!$C$194>=1,'Lotto4 DL560 Gen10 2'!$C$194,0)*Riepilogo!$Y$15","v":0},{"$f":"IF('Lotto4 DL560 Gen10 3'!$C$194>=1,'Lotto4 DL560 Gen10 3'!$C$194,0)*Riepilogo!$Z$15","v":0},null,null,null,null,0,null,0,0,0,{"$f":"X63","v":0},0,0,0,0,0,0,0,0,null,0]
[null,"",{"$f":"IF(AT64=0,\"\",(VLOOKUP(G64,Codici!B:F,5,FALSE)))","v":""},null,null,null,"",null,null,{"$f":"IF(AT64>0,(VLOOKUP(G64,Codici!B:F,4,FALSE)),\"\")","v":""},null,null,null,null,null,null,null,{"$f":"IF(AT64>0,(VLOOKUP(G64,Codici!B:F,2,FALSE)),\"\")","v":""},null,{"$f":"IF(B64=\"\",\"\",R64*B64)","v":""},null,0,"TS2L4-10OTLR",{"$f":"IF('Lotto4 DL560 Gen10 1'!$C$196>=1,'Lotto4 DL560 Gen10 1'!$C$196,0)*Riepilogo!$X$15","v":0},{"$f":"IF('Lotto4 DL560 Gen10 2'!$C$196>=1,'Lotto4 DL560 Gen10 2'!$C$196,0)*Riepilogo!$Y$15","v":0},{"$f":"IF('Lotto4 DL560 Gen10 3'!$C$196>=1,'Lotto4 DL560 Gen10 3'!$C$196,0)*Riepilogo!$Z$15","v":0},null,null,null,null,0,null,0,0,0,{"$f":"X64","v":0},0,0,0,0,0,0,0,0,null,0]
[null,"",{"$f":"IF(AT65=0,\"\",(VLOOKUP(G65,Codici!B:F,5,FALSE)))","v":""},null,null,null,"",null,null,{"$f":"IF(AT65>0,(VLOOKUP(G65,Codici!B:F,4,FALSE)),\"\")","v":""},null,null,null,null,null,null,null,{"$f":"IF(AT65>0,(VLOOKUP(G65,Codici!B:F,2,FALSE)),\"\")","v":""},null,{"$f":"IF(B65=\"\",\"\",R65*B65)","v":""},null,0,"TS2L4-GPURSRKIT",{"$f":"'Lotto4 DL560 Gen10 1'!$C$126","v":0},{"$f":"'Lotto4 DL560 Gen10 2'!$C$126","v":0},{"$f":"'Lotto4 DL560 Gen10 3'!$C$126","v":0},null,null,null,null,0,null,0,0,0,0,0,0,0,0,0,0,0,0,null,0]
[null,"",{"$f":"IF(AT66=0,\"\",(VLOOKUP(G66,Codici!B:F,5,FALSE)))","v":""},null,null,null,"",null,null,{"$f":"IF(AT66>0,(VLOOKUP(G66,Codici!B:F,4,FALSE)),\"\")","v":""},null,null,null,null,null,null,null,{"$f":"IF(AT66>0,(VLOOKUP(G66,Codici!B:F,2,FALSE)),\"\")","v":""},null,{"$f":"IF(B66=\"\",\"\",R66*B66)","v":""},null,0,"TS2L4-P2000GPU",{"$f":"COUNTIF($AI$19:$AI$26,W66)","v":0},{"$f":"COUNTIF($AJ$19:$AJ$26,W66)","v":0},{"$f":"COUNTIF($AK$19:$AK$26,W66)","v":0},null,null,null,null,0,null,0,0,0,0,0,0,0,0,0,0,0,0,null,0]
[null,"",{"$f":"IF(AT67=0,\"\",(VLOOKUP(G67,Codici!B:F,5,FALSE)))","v":""},null,null,null,"",null,null,{"$f":"IF(AT67>0,(VLOOKUP(G67,Codici!B:F,4,FALSE)),\"\")","v":""},null,null,null,null,null,null,null,{"$f":"IF(AT67>0,(VLOOKUP(G67,Codici!B:F,2,FALSE)),\"\")","v":""},null,"",null,0,"TS2L4-841QSFP28",0,{"$f":"COUNTIF($AJ$19:$AJ$26,W67)","v":0},{"$f":"COUNTIF($AK$19:$AK$26,W67)","v":0},null,null,null,null,0,null,0,0,0,0,0,0,0,0,0,0,0,0,null,0]
[null,"",{"$f":"IF(AT68=0,\"\",(VLOOKUP(G68,Codici!B:F,5,FALSE)))","v":""},null,null,null,"",null,null,{"$f":"IF(AT68>0,(VLOOKUP(G68,Codici!B:F,4,FALSE)),\"\")","v":""},null,null,null,null,null,null,null,{"$f":"IF(AT68>0,(VLOOKUP(G68,Codici!B:F,2,FALSE)),\"\")","v":""},null,"",null,0,"TS2L4-OP101",0,0,0,null,null,null,null,0,null,0,0,0,0,0,0,0,0,0,0,0,0,null,0]
[null,"",{"$f":"IF(AT69=0,\"\",(VLOOKUP(G69,Codici!B:F,5,FALSE)))","v":""},null,null,null,"",null,null,{"$f":"IF(AT69>0,(VLOOKUP(G69,Codici!B:F,4,FALSE)),\"\")","v":""},null,null,null,null,null,null,null,{"$f":"IF(AT69>0,(VLOOKUP(G69,Codici!B:F,2,FALSE)),\"\")","v":""},null,"",null,0,"TS2L4-547FLR",{"$f":"IF('Lotto4 DL560 Gen10 1'!$B$131=\"[TS2L4-547FLR] HPE InfiniBand FDR/Ethernet 40/50Gb 2-port 547FLR-QSFP Adapter\",1,0)","v":0},{"$f":"IF('Lotto4 DL560 Gen10 2'!$B$131=\"[TS2L4-547FLR] HPE InfiniBand FDR/Ethernet 40/50Gb 2-port 547FLR-QSFP Adapter\",1,0)","v":0},{"$f":"IF('Lotto4 DL560 Gen10 3'!$B$131=\"[TS2L4-547FLR] HPE InfiniBand FDR/Ethernet 40/50Gb 2-port 547FLR-QSFP Adapter\",1,0)","v":0},null,null,null,null,0,null,0,0,0,0,0,0,0,0,0,0,0,0,null,0]
[null,{"$f":"IF(AT70=0,\"\",AT70)","v":""},{"$f":"IF(AT70=0,\"\",(VLOOKUP(G70,Codici!B:F,5,FALSE)))","v":""},null,null,null,{"$f":"IF(AT70>0,W70,\"\")","v":""},null,null,{"$f":"IF(AT70>0,(VLOOKUP(G70,Codici!B:F,4,FALSE)),\"\")","v":""},null,null,null,null,null,null,null,{"$f":"IF(AT70>0,(VLOOKUP(G70,Codici!B:F,2,FALSE)),\"\")","v":""},null,{"$f":"IF(B70=\"\",\"\",R70*B70)","v":""},null,0,"TS2L4-E208EP",{"$f":"COUNTIF($AI$19:$AI$26,W70)","v":0},{"$f":"COUNTIF($AJ$19:$AJ$26,W70)","v":0},{"$f":"COUNTIF($AK$19:$AK$26,W70)","v":0},null,null,null,null,{"$f":"SUM(X70:AD70)","v":0},null,{"$f":"SUM(X70:Z70)","v":0},{"$f":"SUM(AA70:AC70)","v":0},{"$f":"SUM(AD70:AF70)","v":0},{"$f":"X70*$X$15","v":0},{"$f":"Y70*$Y$15","v":0},{"$f":"Z70*$Z$15","v":0},{"$f":"AA70*$X$35","v":0},{"$f":"AB70*$Y$35","v":0},{"$f":"AC70*$Z$35","v":0},0,0,0,null,{"$f":"SUM(AJ70:AL70)","v":0}]
[null,"",{"$f":"IF(AT71=0,\"\",(VLOOKUP(G71,Codici!B:F,5,FALSE)))","v":""},null,null,null,"",null,null,{"$f":"IF(AT71>0,(VLOOKUP(G71,Codici!B:F,4,FALSE)),\"\")","v":""},null,null,null,null,null,null,null,{"$f":"IF(AT71>0,(VLOOKUP(G71,Codici!B:F,2,FALSE)),\"\")","v":""},null,"",null,0,"TS2L4-VMWSTD1P5Y",{"$f":"IF('Lotto4 DL560 Gen10 1'!$D$56=Riepilogo!$W$71,'Lotto4 DL560 Gen10 1'!$C$56,0)","v":0},{"$f":"IF('Lotto4 DL560 Gen10 2'!$D$56=Riepilogo!$W$71,'Lotto4 DL560 Gen10 2'!$C$56,0)","v":0},{"$f":"IF('Lotto4 DL560 Gen10 3'!$D$56=Riepilogo!$W$71,'Lotto4 DL560 Gen10 3'!$C$56,0)","v":0},null,null,null,null,0,null,0,0,0,0,0,0,0,0,0,0,0,0,null,0]
[null,"",{"$f":"IF(AT72=0,\"\",(VLOOKUP(G72,Codici!B:F,5,FALSE)))","v":""},null,null,null,"",null,null,{"$f":"IF(AT72>0,(VLOOKUP(G72,Codici!B:F,4,FALSE)),\"\")","v":""},null,null,null,null,null,null,null,{"$f":"IF(AT72>0,(VLOOKUP(G72,Codici!B:F,2,FALSE)),\"\")","v":""},null,"",null,0,"TS2L4-VMWEP1P5Y",{"$f":"IF('Lotto4 DL560 Gen10 1'!$D$56=Riepilogo!$W$72,'Lotto4 DL560 Gen10 1'!$C$56,0)","v":0},{"$f":"IF('Lotto4 DL560 Gen10 2'!$D$56=Riepilogo!$W$72,'Lotto4 DL560 Gen10 2'!$C$56,0)","v":0},{"$f":"IF('Lotto4 DL560 Gen10 3'!$D$56=Riepilogo!$W$72,'Lotto4 DL560 Gen10 3'!$C$56,0)","v":0},null,null,null,null,0,null,0,0,0,0,0,0,0,0,0,0,0,0,null,0]
[null,"",{"$f":"IF(AT73=0,\"\",(VLOOKUP(G73,Codici!B:F,5,FALSE)))","v":""},null,null,null,"",null,null,{"$f":"IF(AT73>0,(VLOOKUP(G73,Codici!B:F,4,FALSE)),\"\")","v":""},null,null,null,null,null,null,null,{"$f":"IF(AT73>0,(VLOOKUP(G73,Codici!B:F,2,FALSE)),\"\")","v":""},null,"",null,0,"TS2L4-VMWSTD1P3Y",{"$f":"IF('Lotto4 DL560 Gen10 1'!$D$56=Riepilogo!$W$73,'Lotto4 DL560 Gen10 1'!$C$56,0)","v":0},{"$f":"IF('Lotto4 DL560 Gen10 2'!$D$56=Riepilogo!$W$73,'Lotto4 DL560 Gen10 2'!$C$56,0)","v":0},{"$f":"IF('Lotto4 DL560 Gen10 3'!$D$56=Riepilogo!$W$73,'Lotto4 DL560 Gen10 3'!$C$56,0)","v":0},null,null,null,null,0,null,null,0,0,0,0,0,0,0,0,0,0,0,null,0]
[null,"",{"$f":"IF(AT74=0,\"\",(VLOOKUP(G74,Codici!B:F,5,FALSE)))","v":""},null,null,null,{"$f":"IF(AT74>0,W74,\"\")","v":""},null,null,{"$f":"IF(AT74>0,(VLOOKUP(G74,Codici!B:F,4,FALSE)),\"\")","v":""},null,null,null,null,null,null,null,{"$f":"IF(AT74>0,(VLOOKUP(G74,Codici!B:F,2,FALSE)),\"\")","v":""},null,{"$f":"IF(B74=\"\",\"\",R74*B74)","v":""},null,0,"TS2L4-VMWEP1P3Y",{"$f":"IF('Lotto4 DL560 Gen10 1'!$D$56=Riepilogo!$W$74,'Lotto4 DL560 Gen10 1'!$C$56,0)","v":0},{"$f":"IF('Lotto4 DL560 Gen10 2'!$D$56=Riepilogo!$W$74,'Lotto4 DL560 Gen10 2'!$C$56,0)","v":0},{"$f":"IF('Lotto4 DL560 Gen10 3'!$D$56=Riepilogo!$W$74,'Lotto4 DL560 Gen10 3'!$C$56,0)","v":0},null,null,null,null,0,null,{"$f":"SUM(X74:Z74)","v":0},{"$f":"SUM(AA74:AC74)","v":0},{"$f":"SUM(AD74:AF74)","v":0},0,0,{"$f":"Z74*$Z$15","v":0},{"$f":"AA74*$X$35","v":0},{"$f":"AB74*$Y$35","v":0},{"$f":"AC74*$Z$35","v":0},0,0,0,null,0]
[null,"",{"$f":"IF(AT75=0,\"\",(VLOOKUP(G75,Codici!B:F,5,FALSE)))","v":""},null,null,null,{"$f":"IF(AT75>0,W75,\"\")","v":""},null,null,{"$f":"IF(AT75>0,(VLOOKUP(G75,Codici!B:F,4,FALSE)),\"\")","v":""},null,null,null,null,null,null,null,{"$f":"IF(AT75>0,(VLOOKUP(G75,Codici!B:F,2,FALSE)),\"\")","v":""},null,{"$f":"IF(B75=\"\",\"\",R75*B75)","v":""},null,0,"TS2L4-VMWKIT6P3Y",{"$f":"IF('Lotto4 DL560 Gen10 1'!$D$58=Riepilogo!$W$75,'Lotto4 DL560 Gen10 1'!$C$58,0)","v":0},null,null,null,null,null,null,0,null,0,0,0,0,0,{"$f":"Z75*$Z$15","v":0},0,0,0,0,0,0,null,0]
[null,"",{"$f":"IF(AT76=0,\"\",(VLOOKUP(G76,Codici!B:F,5,FALSE)))","v":""},null,null,null,"",null,null,{"$f":"IF(AT76>0,(VLOOKUP(G76,Codici!B:F,4,FALSE)),\"\")","v":""},null,null,null,null,null,null,null,{"$f":"IF(AT76>0,(VLOOKUP(G76,Codici!B:F,2,FALSE)),\"\")","v":""},null,"",null,0,"TS2L4-VMWKIT6P5Y",{"$f":"IF('Lotto4 DL560 Gen10 1'!$D$58=Riepilogo!$W$76,'Lotto4 DL560 Gen10 1'!$C$58,0)","v":0},null,null,null,null,null,null,0,null,0,0,0,0,0,0,0,0,0,{"$f":"AD76*$X$75","v":0},{"$f":"AE76*$Y$75","v":0},0,null,0]
[null,"",{"$f":"IF(AT77=0,\"\",(VLOOKUP(G77,Codici!B:F,5,FALSE)))","v":""},null,null,null,"",null,null,{"$f":"IF(AT77>0,(VLOOKUP(G77,Codici!B:F,4,FALSE)),\"\")","v":""},null,null,null,null,null,null,null,{"$f":"IF(AT77>0,(VLOOKUP(G77,Codici!B:F,2,FALSE)),\"\")","v":""},null,{"$f":"IF(B77=\"\",\"\",R77*B77)","v":""},null,0,"TS2L4-VMWVCSTD3Y",{"$f":"IF('Lotto4 DL560 Gen10 1'!$D$60=Riepilogo!$W$77,'Lotto4 DL560 Gen10 1'!$C$60,0)","v":0},null,null,null,null,null,null,0,null,0,0,0,0,0,0,0,0,0,0,0,0,null,0]
[null,"",{"$f":"IF(AT78=0,\"\",(VLOOKUP(G78,Codici!B:F,5,FALSE)))","v":""},null,null,null,"",null,null,{"$f":"IF(AT78>0,(VLOOKUP(G78,Codici!B:F,4,FALSE)),\"\")","v":""},null,null,null,null,null,null,null,{"$f":"IF(AT78>0,(VLOOKUP(G78,Codici!B:F,2,FALSE)),\"\")","v":""},null,{"$f":"IF(B78=\"\",\"\",R78*B78)","v":""},null,0,"TS2L4-VMWVCSTD5Y",{"$f":"IF('Lotto4 DL560 Gen10 1'!$D$60=Riepilogo!$W$78,'Lotto4 DL560 Gen10 1'!$C$60,0)","v":0},null,null,null,null,null,null,0,null,0,0,0,0,0,0,0,0,0,0,0,0,null,0]
[null,"",{"$f":"IF(AT79=0,\"\",(VLOOKUP(G79,Codici!B:F,5,FALSE)))","v":""},null,null,null,"",null,null,{"$f":"IF(AT79>0,(VLOOKUP(G79,Codici!B:F,4,FALSE)),\"\")","v":""},null,null,null,null,null,null,null,{"$f":"IF(AT79>0,(VLOOKUP(G79,Codici!B:F,2,FALSE)),\"\")","v":""},null,{"$f":"IF(B79=\"\",\"\",R79*B79)","v":""},null,0,"TS2L4-OV3YILO",{"$f":"IF('Lotto4 DL560 Gen10 1'!$C$66=0,0,1)","v":0},{"$f":"IF('Lotto4 DL560 Gen10 2'!$C$66=0,0,1)","v":0},{"$f":"IF('Lotto4 DL560 Gen10 3'!$C$66=0,0,1)","v":0},null,null,null,null,0,null,0,0,0,0,0,0,0,0,0,{"$f":"AD79*$X$75","v":0},{"$f":"AE79*$Y$75","v":0},0,null,0]
[null,"",{"$f":"IF(AT80=0,\"\",(VLOOKUP(G80,Codici!B:F,5,FALSE)))","v":""},null,null,null,"",null,null,{"$f":"IF(AT80>0,(VLOOKUP(G80,Codici!B:F,4,FALSE)),\"\")","v":""},null,null,null,null,null,null,null,{"$f":"IF(AT80>0,(VLOOKUP(G80,Codici!B:F,2,FALSE)),\"\")","v":""},null,{"$f":"IF(B80=\"\",\"\",R80*B80)","v":""},null,0,"TS2L4-DACQSFPM2",{"$f":"IF('Lotto4 DL560 Gen10 1'!$C$179>=1,'Lotto4 DL560 Gen10 1'!$C$179,0)*Riepilogo!$X$15","v":0},{"$f":"IF('Lotto4 DL560 Gen10 2'!$C$179>=1,'Lotto4 DL560 Gen10 2'!$C$179,0)*Riepilogo!$Y$15","v":0},{"$f":"IF('Lotto4 DL560 Gen10 3'!$C$179>=1,'Lotto4 DL560 Gen10 3'!$C$179,0)*Riepilogo!$Z$15","v":0},null,null,null,null,0,null,0,null,null,{"$f":"X80","v":0},0,0,null,null,null,null,null,null,null,0]
[null,"",{"$f":"IF(AT81=0,\"\",(VLOOKUP(G81,Codici!B:F,5,FALSE)))","v":""},null,null,null,"",null,null,{"$f":"IF(AT81>0,(VLOOKUP(G81,Codici!B:F,4,FALSE)),\"\")","v":""},null,null,null,null,null,null,null,{"$f":"IF(AT81>0,(VLOOKUP(G81,Codici!B:F,2,FALSE)),\"\")","v":""},null,{"$f":"IF(B81=\"\",\"\",R81*B81)","v":""},null,0,"TS2L4-DAC100M2",{"$f":"IF('Lotto4 DL560 Gen10 1'!$C$182>=1,'Lotto4 DL560 Gen10 1'!$C$182,0)*Riepilogo!$X$15","v":0},{"$f":"IF('Lotto4 DL560 Gen10 2'!$C$182>=1,'Lotto4 DL560 Gen10 2'!$C$182,0)*Riepilogo!$Y$15","v":0},{"$f":"IF('Lotto4 DL560 Gen10 3'!$C$182>=1,'Lotto4 DL560 Gen10 3'!$C$182,0)*Riepilogo!$Z$15","v":0},null,null,null,null,0,null,{"$f":"SUM(X81:Z81)","v":0},null,null,0,0,0,null,null,null,null,null,null,null,0]
[null,"",{"$f":"IF(AT82=0,\"\",(VLOOKUP(G82,Codici!B:F,5,FALSE)))","v":""},null,null,null,"",null,null,{"$f":"IF(AT82>0,(VLOOKUP(G82,Codici!B:F,4,FALSE)),\"\")","v":""},null,null,null,null,null,null,null,{"$f":"IF(AT82>0,(VLOOKUP(G82,Codici!B:F,2,FALSE)),\"\")","v":""},null,"",null,0,"TS2L4-DAC100M3",{"$f":"IF('Lotto4 DL560 Gen10 1'!$C$184>=1,'Lotto4 DL560 Gen10 1'!$C$184,0)*Riepilogo!$X$15","v":0},{"$f":"IF('Lotto4 DL560 Gen10 2'!$C$184>=1,'Lotto4 DL560 Gen10 2'!$C$184,0)*Riepilogo!$Y$15","v":0},{"$f":"IF('Lotto4 DL560 Gen10 3'!$C$184>=1,'Lotto4 DL560 Gen10 3'!$C$184,0)*Riepilogo!$Z$15","v":0},null,null,null,null,0,null,0,null,null,0,0,0,null,null,null,null,null,null,null,0]
[null,"",{"$f":"IF(AT83=0,\"\",(VLOOKUP(G83,Codici!B:F,5,FALSE)))","v":""},null,null,null,"",null,null,{"$f":"IF(AT83>0,(VLOOKUP(G83,Codici!B:F,4,FALSE)),\"\")","v":""},null,null,null,null,null,null,null,{"$f":"IF(AT83>0,(VLOOKUP(G83,Codici!B:F,2,FALSE)),\"\")","v":""},null,"",null,0,"TS2L4-DACAOCM3",{"$f":"IF('Lotto4 DL560 Gen10 1'!$C$187>=1,'Lotto4 DL560 Gen10 1'!$C$187,0)*Riepilogo!$X$15","v":0},{"$f":"IF('Lotto4 DL560 Gen10 2'!$C$187>=1,'Lotto4 DL560 Gen10 2'!$C$187,0)*Riepilogo!$Y$15","v":0},{"$f":"IF('Lotto4 DL560 Gen10 3'!$C$187>=1,'Lotto4 DL560 Gen10 3'!$C$187,0)*Riepilogo!$Z$15","v":0},null,null,null,null,0,null,0,null,null,0,0,0,null,null,null,null,null,null,null,0]
[null,"",{"$f":"IF(AT84=0,\"\",(VLOOKUP(G84,Codici!B:F,5,FALSE)))","v":""},null,null,null,"",null,null,{"$f":"IF(AT84>0,(VLOOKUP(G84,Codici!B:F,4,FALSE)),\"\")","v":""},null,null,null,null,null,null,null,{"$f":"IF(AT84>0,(VLOOKUP(G84,Codici!B:F,2,FALSE)),\"\")","v":""},null,"",null,0,"TS2L4-DACAOCM5",{"$f":"IF('Lotto4 DL560 Gen10 1'!$C$189>=1,'Lotto4 DL560 Gen10 1'!$C$189,0)*Riepilogo!$X$15","v":0},{"$f":"IF('Lotto4 DL560 Gen10 2'!$C$189>=1,'Lotto4 DL560 Gen10 2'!$C$189,0)*Riepilogo!$Y$15","v":0},{"$f":"IF('Lotto4 DL560 Gen10 3'!$C$189>=1,'Lotto4 DL560 Gen10 3'!$C$189,0)*Riepilogo!$Z$15","v":0},null,null,null,null,0,null,0,null,null,0,0,0,null,null,null,null,null,null,null,0]
[null,"",{"$f":"IF(AT85=0,\"\",(VLOOKUP(G85,Codici!B:F,5,FALSE)))","v":""},null,null,null,"",null,null,{"$f":"IF(AT85>0,(VLOOKUP(G85,Codici!B:F,4,FALSE)),\"\")","v":""},null,null,null,null,null,null,null,{"$f":"IF(AT85>0,(VLOOKUP(G85,Codici!B:F,2,FALSE)),\"\")","v":""},null,"",null,0,"TS2L4-DACAOCM7",{"$f":"IF('Lotto4 DL560 Gen10 1'!$C$191>=1,'Lotto4 DL560 Gen10 1'!$C$191,0)*Riepilogo!$X$15","v":0},{"$f":"IF('Lotto4 DL560 Gen10 2'!$C$191>=1,'Lotto4 DL560 Gen10 2'!$C$191,0)*Riepilogo!$Y$15","v":0},{"$f":"IF('Lotto4 DL560 Gen10 3'!$C$191>=1,'Lotto4 DL560 Gen10 3'!$C$191,0)*Riepilogo!$Z$15","v":0},null,null,null,null,0,null,0,null,null,0,0,0,null,null,null,null,null,null,null,0]
[null,"",{"$f":"IF(AT86=0,\"\",(VLOOKUP(G86,Codici!B:F,5,FALSE)))","v":""},null,null,null,{"$f":"IF(AT86>0,W86,\"\")","v":""},null,null,{"$f":"IF(AT86>0,(VLOOKUP(G86,Codici!B:F,4,FALSE)),\"\")","v":""},null,null,null,null,null,null,null,{"$f":"IF(AT86>0,(VLOOKUP(G86,Codici!B:F,2,FALSE)),\"\")","v":""},null,{"$f":"IF(B86=\"\",\"\",R86*B86)","v":""},null,0,"TS2L4-VSANSTD3Y",{"$f":"IF('Lotto4 DL560 Gen10 1'!$D$62=Riepilogo!$W$86,'Lotto4 DL560 Gen10 1'!$C$62,0)","v":0},{"$f":"IF('Lotto4 DL560 Gen10 2'!$D$62=Riepilogo!$W$86,'Lotto4 DL560 Gen10 2'!$C$62,0)","v":0},{"$f":"IF('Lotto4 DL560 Gen10 3'!$D$62=Riepilogo!$W$86,'Lotto4 DL560 Gen10 3'!$C$62,0)","v":0},null,null,null,null,0,null,0,null,null,{"$f":"X86*$X$15","v":0},{"$f":"Y86*$Y$15","v":0},{"$f":"Z86*$Z$15","v":0},null,null,null,null,null,null,null,0]
[null,"",{"$f":"IF(AT87=0,\"\",(VLOOKUP(G87,Codici!B:F,5,FALSE)))","v":""},null,null,null,"",null,null,{"$f":"IF(AT87>0,(VLOOKUP(G87,Codici!B:F,4,FALSE)),\"\")","v":""},null,null,null,null,null,null,null,{"$f":"IF(AT87>0,(VLOOKUP(G87,Codici!B:F,2,FALSE)),\"\")","v":""},null,"",null,0,"TS2L4-VSANADV3Y",{"$f":"IF('Lotto4 DL560 Gen10 1'!$D$62=Riepilogo!$W$87,'Lotto4 DL560 Gen10 1'!$C$62,0)","v":0},{"$f":"IF('Lotto4 DL560 Gen10 2'!$D$62=Riepilogo!$W$87,'Lotto4 DL560 Gen10 2'!$C$62,0)","v":0},{"$f":"IF('Lotto4 DL560 Gen10 3'!$D$62=Riepilogo!$W$87,'Lotto4 DL560 Gen10 3'!$C$62,0)","v":0},null,null,null,null,0,null,0,null,null,0,0,0,null,null,null,null,null,null,null,0]
[null,"",{"$f":"IF(AT88=0,\"\",(VLOOKUP(G88,Codici!B:F,5,FALSE)))","v":""},null,null,null,"",null,null,{"$f":"IF(AT88>0,(VLOOKUP(G88,Codici!B:F,4,FALSE)),\"\")","v":""},null,null,null,null,null,null,null,{"$f":"IF(AT88>0,(VLOOKUP(G88,Codici!B:F,2,FALSE)),\"\")","v":""},null,"",null,0,"TS2L4-SSD400MU",{"$f":"'Lotto4 DL560 Gen10 1'!$C$96","v":0},{"$f":"'Lotto4 DL560 Gen10 2'!$C$96","v":0},{"$f":"'Lotto4 DL560 Gen10 3'!$C$96","v":0},null,null,null,null,0,null,0,null,null,0,0,0,null,null,null,null,null,null,null,0]
[null,"",{"$f":"IF(AT89=0,\"\",(VLOOKUP(G89,Codici!B:F,5,FALSE)))","v":""},null,null,null,"",null,null,{"$f":"IF(AT89>0,(VLOOKUP(G89,Codici!B:F,4,FALSE)),\"\")","v":""},null,null,null,null,null,null,null,{"$f":"IF(AT89>0,(VLOOKUP(G89,Codici!B:F,2,FALSE)),\"\")","v":""},null,"",null,0,"TS2L4-SSD400WIB",{"$f":"'Lotto4 DL560 Gen10 1'!$C$98","v":0},{"$f":"'Lotto4 DL560 Gen10 2'!$C$98","v":0},{"$f":"'Lotto4 DL560 Gen10 3'!$C$98","v":0},null,null,null,null,0,null,0,null,null,0,0,0,null,null,null,null,null,null,null,0]
[null,"",{"$f":"IF(AT90=0,\"\",(VLOOKUP(G90,Codici!B:F,5,FALSE)))","v":""},null,null,null,"",null,null,{"$f":"IF(AT90>0,(VLOOKUP(G90,Codici!B:F,4,FALSE)),\"\")","v":""},null,null,null,null,null,null,null,{"$f":"IF(AT90>0,(VLOOKUP(G90,Codici!B:F,2,FALSE)),\"\")","v":""},null,"",null,0,"TS2L4-SSD800MU",{"$f":"'Lotto4 DL560 Gen10 1'!$C$100","v":0},{"$f":"'Lotto4 DL560 Gen10 2'!$C$100","v":0},{"$f":"'Lotto4 DL560 Gen10 3'!$C$100","v":0},null,null,null,null,0,null,0,null,null,0,0,0,null,null,null,null,null,null,null,0]
[null,"",{"$f":"IF(AT91=0,\"\",(VLOOKUP(G91,Codici!B:F,5,FALSE)))","v":""},null,null,null,"",null,null,{"$f":"IF(AT91>0,(VLOOKUP(G91,Codici!B:F,4,FALSE)),\"\")","v":""},null,null,null,null,null,null,null,{"$f":"IF(AT91>0,(VLOOKUP(G91,Codici!B:F,2,FALSE)),\"\")","v":""},null,"",null,0,"TS2L4-SSD960MU",{"$f":"'Lotto4 DL560 Gen10 1'!$C$102","v":0},{"$f":"'Lotto4 DL560 Gen10 2'!$C$102","v":0},{"$f":"'Lotto4 DL560 Gen10 3'!$C$102","v":0},null,null,null,null,0,null,0,null,null,0,0,0,null,null,null,null,null,null,null,0]
[null,"",{"$f":"IF(AT92=0,\"\",(VLOOKUP(G92,Codici!B:F,5,FALSE)))","v":""},null,null,null,"",null,null,{"$f":"IF(AT92>0,(VLOOKUP(G92,Codici!B:F,4,FALSE)),\"\")","v":""},null,null,null,null,null,null,null,{"$f":"IF(AT92>0,(VLOOKUP(G92,Codici!B:F,2,FALSE)),\"\")","v":""},null,"",null,0,"TS2L4-DUAL32GB",{"$f":"IF('Lotto4 DL560 Gen10 1'!$C$115=0,0,1)","v":0},{"$f":"IF('Lotto4 DL560 Gen10 2'!$C$115=0,0,1)","v":0},{"$f":"IF('Lotto4 DL560 Gen10 3'!$C$115=0,0,1)","v":0},null,null,null,null,0,null,0,null,null,0,0,0,null,null,null,null,null,null,null,0]
[null,{"$f":"IF(AT93=0,\"\",AT93)","v":""},{"$f":"IF(AT93=0,\"\",(VLOOKUP(G93,Codici!B:F,5,FALSE)))","v":""},null,null,null,{"$f":"IF(AT93>0,W93,\"\")","v":""},null,null,{"$f":"IF(AT93>0,(VLOOKUP(G93,Codici!B:F,4,FALSE)),\"\")","v":""},null,null,null,null,null,null,null,{"$f":"IF(AT93>0,(VLOOKUP(G93,Codici!B:F,2,FALSE)),\"\")","v":""},null,{"$f":"IF(B93=\"\",\"\",R93*B93)","v":""},null,{"$f":"IF(B93>=\"\",0,1)","v":0},"TS2L4-640SFP28",{"$f":"COUNTIF($AI$19:$AI$26,W93)","v":0},{"$f":"COUNTIF($AJ$19:$AJ$26,W93)","v":0},{"$f":"COUNTIF($AK$19:$AK$26,W93)","v":0},null,null,null,null,{"$f":"SUM(X93:AD93)","v":0},null,{"$f":"SUM(X93:Z93)","v":0},{"$f":"SUM(AA93:AC93)","v":0},{"$f":"SUM(AD93:AF93)","v":0},0,0,0,{"$f":"AA93*$X$35","v":0},{"$f":"AB93*$Y$35","v":0},{"$f":"AC93*$Z$35","v":0},{"$f":"AD93*$X$75","v":0},{"$f":"AE93*$Y$75","v":0},{"$f":"AF93*$Z$75","v":0},null,{"$f":"SUM(AJ93:AL93)","v":0}]
[null,"",{"$f":"IF(AT94=0,\"\",(VLOOKUP(G94,Codici!B:F,5,FALSE)))","v":""},null,null,null,"",null,null,{"$f":"IF(AT94>0,(VLOOKUP(G94,Codici!B:F,4,FALSE)),\"\")","v":""},null,null,null,null,null,null,null,{"$f":"IF(AT94>0,(VLOOKUP(G94,Codici!B:F,2,FALSE)),\"\")","v":""},null,"",null,0,"TS2L4-DAC3SFP28",{"$f":"IF('Lotto4 DL560 Gen10 1'!$C$176>=1,'Lotto4 DL560 Gen10 1'!$C$176,0)*Riepilogo!$X$15","v":0},{"$f":"IF('Lotto4 DL560 Gen10 2'!$C$178>=1,'Lotto4 DL560 Gen10 2'!$C$178,0)*Riepilogo!$Y$15","v":0},{"$f":"IF('Lotto4 DL560 Gen10 3'!$C$178>=1,'Lotto4 DL560 Gen10 3'!$C$178,0)*Riepilogo!$Z$15","v":0},null,null,null,null,{"$f":"SUM(X94:AD94)","v":0},null,{"$f":"SUM(X94:Z94)","v":0},null,null,{"$f":"X94","v":0},0,0,null,null,null,null,null,null,null,{"$f":"SUM(AJ94:AL94)","v":0}]
[null,"",{"$f":"IF(AT95=0,\"\",(VLOOKUP(G95,Codici!B:F,5,FALSE)))","v":""},null,null,null,"",null,null,{"$f":"IF(AT95>0,(VLOOKUP(G95,Codici!B:F,4,FALSE)),\"\")","v":""},null,null,null,null,null,null,null,{"$f":"IF(AT95>0,(VLOOKUP(G95,Codici!B:F,2,FALSE)),\"\")","v":""},null,"",null,0,"TS2L4-SFP28SR",{"$f":"IF('Lotto4 DL560 Gen10 1'!$C$198>=1,'Lotto4 DL560 Gen10 1'!$C$198,0)*Riepilogo!$X$15","v":0},{"$f":"IF('Lotto4 DL560 Gen10 2'!$C$202>=1,'Lotto4 DL560 Gen10 2'!$C$202,0)*Riepilogo!$Y$15","v":0},{"$f":"IF('Lotto4 DL560 Gen10 3'!$C$202>=1,'Lotto4 DL560 Gen10 3'!$C$202,0)*Riepilogo!$Z$15","v":0},null,null,null,null,0,null,0,null,null,0,0,0,null,null,null,null,null,null,null,0]
[null,"",{"$f":"IF(AT96=0,\"\",(VLOOKUP(G96,Codici!B:F,5,FALSE)))","v":""},null,null,null,"",null,null,{"$f":"IF(AT96>0,(VLOOKUP(G96,Codici!B:F,4,FALSE)),\"\")","v":""},null,null,null,null,null,null,null,{"$f":"IF(AT96>0,(VLOOKUP(G96,Codici!B:F,2,FALSE)),\"\")","v":""},null,"",null,0,"TS2L4-DACX240M3",{"$f":"IF('Lotto4 DL560 Gen10 1'!$C$170>=1,'Lotto4 DL560 Gen10 1'!$C$170,0)*Riepilogo!$X$15","v":0},{"$f":"IF('Lotto4 DL560 Gen10 2'!$C$170>=1,'Lotto4 DL560 Gen10 2'!$C$170,0)*Riepilogo!$Y$15","v":0},{"$f":"IF('Lotto4 DL560 Gen10 3'!$C$170>=1,'Lotto4 DL560 Gen10 3'!$C$170,0)*Riepilogo!$Z$15","v":0},null,null,null,null,0,null,0,null,null,{"$f":"X96","v":0},{"$f":"Y96*$Y$15","v":0},{"$f":"Z96*$Z$15","v":0},null,null,null,null,null,null,null,0]
[null,"",{"$f":"IF(AT97=0,\"\",(VLOOKUP(G97,Codici!B:F,5,FALSE)))","v":""},null,null,null,"",null,null,{"$f":"IF(AT97>0,(VLOOKUP(G97,Codici!B:F,4,FALSE)),\"\")","v":""},null,null,null,null,null,null,null,{"$f":"IF(AT97>0,(VLOOKUP(G97,Codici!B:F,2,FALSE)),\"\")","v":""},null,"",null,0,"TS2L4-DACX240M5",{"$f":"IF('Lotto4 DL560 Gen10 1'!$C$172>=1,'Lotto4 DL560 Gen10 1'!$C$172,0)*Riepilogo!$X$15","v":0},{"$f":"IF('Lotto4 DL560 Gen10 2'!$C$172>=1,'Lotto4 DL560 Gen10 2'!$C$172,0)*Riepilogo!$Y$15","v":0},{"$f":"IF('Lotto4 DL560 Gen10 3'!$C$172>=1,'Lotto4 DL560 Gen10 3'!$C$172,0)*Riepilogo!$Z$15","v":0},null,null,null,null,0,null,0,null,null,0,0,0,null,null,null,null,null,null,null,0]
[null,"",{"$f":"IF(AT98=0,\"\",(VLOOKUP(G98,Codici!B:F,5,FALSE)))","v":""},null,null,null,"",null,null,{"$f":"IF(AT98>0,(VLOOKUP(G98,Codici!B:F,4,FALSE)),\"\")","v":""},null,null,null,null,null,null,null,{"$f":"IF(AT98>0,(VLOOKUP(G98,Codici!B:F,2,FALSE)),\"\")","v":""},null,"",null,0,"TS2L4-DACX240M7",{"$f":"IF('Lotto4 DL560 Gen10 1'!$C$174>=1,'Lotto4 DL560 Gen10 1'!$C$174,0)*Riepilogo!$X$15","v":0},{"$f":"IF('Lotto4 DL560 Gen10 2'!$C$174>=1,'Lotto4 DL560 Gen10 2'!$C$174,0)*Riepilogo!$Y$15","v":0},{"$f":"IF('Lotto4 DL560 Gen10 3'!$C$174>=1,'Lotto4 DL560 Gen10 3'!$C$174,0)*Riepilogo!$Z$15","v":0},null,null,null,null,0,null,0,null,null,0,0,0,null,null,null,null,null,null,null,0]
[null,"TOTALE PRODOTTI CONVENZIONE (I.V.A. Esclusa)",null,null,null,null,null,null,null,null,null,null,null,null,null,null,null,{"$f":"SUM(T15:U49)","v":0},null,null,null,1]
[null,"TOTALE ULTERIORI OPZIONI (I.V.A. Esclusa)",null,null,null,null,null,null,null,null,null,null,null,null,null,null,null,{"$f":"SUM(T51:U98)","v":0},null,null,null,{"$f":"IF(R100>0,1,0)","v":0}]
[null,"TOTALE (I.V.A. Esclusa)",null,null,null,null,null,null,null,null,null,null,null,null,null,null,null,{"$f":"R100+R99","v":0},null,null,null,1]
[null,"I.V.A.",null,null,null,null,null,null,null,null,null,null,null,null,null,null,null,{"$f":"R101*22%","v":0},null,null,null,1]
[null,"TOTALE ORDINE",null,null,null,null,null,null,null,null,null,null,null,null,null,null,null,{"$f":"SUM(R101:U102)","v":0},null,null,null,1]
[null,null,null,null,null,null,null,null,null,null,null,null,null,null,null,null,null,null,null,null,null,1]
[null,null,null,null,null,null,null,null,null,null,null,null,null,null,null,null,null,null,null,null,null,1]
[null,null,null,null,null,null,null,null,null,null,null,null,null,null,null,null,null,null,null,null,null,1]
[null,null,null,{"$f":"IF(G6>0,\"DETTAGLIO CONFIGURAZIONI SERVER LOTTO 4 \",\"\")","v":""},null,null,null,null,null,null,null,null,null,null,null,null,null,null,null,null,null,1]
[null,null,null,null,null,null,null,null,null,null,null,null,null,null,null,null,null,null,null,null,null,1]
[null,null,null,null,null,null,null,null,null,null,null,null,null,null,null,null,null,null,null,null,null,1]
[null,null,null,null,null,null,null,null,null,null,null,null,null,null,null,null,null,null,null,null,null,{"$f":"IF($B$15>=\"\",0,1)","v":0}]
[null,"Proliant DL560 Gen10 Conf.1",null,null,{"$f":"SRV_A","v":0},"Server",null,null,"Proliant DL560 Gen10 Conf.2",null,null,{"$f":"SRV_AA","v":0},"Server",null,null,"Proliant DL560 Gen10  Conf.3",null,null,{"$f":"SRV_AAA","v":0},"Server",null,{"$f":"IF($B$15>=\"\",0,1)","v":0}]
[null,null,null,null,null,null,null,null,null,null,null,null,null,null,null,null,null,null,null,null,null,{"$f":"IF($B$15>=\"\",0,1)","v":0}]
[null,{"$f":"IF(SRV_A>0,\"1\",\"-\")","v":"-"},{"$f":"IF(B113=\"-\",\"-\",CONCATENATE(MID($C$15,1,21),\" - \",$G$15))","v":"-"},null,null,null,null,null,{"$f":"IF(SRV_AA>0,\"1\",\"-\")","v":"-"},{"$f":"IF(I113=\"-\",\"-\",CONCATENATE(MID($C$15,1,21),\" - \",$G$15))","v":"-"},null,null,null,null,null,{"$f":"IF(SRV_AAA>0,\"1\",\"-\")","v":"-"},{"$f":"IF(P113=\"-\",\"-\",CONCATENATE(MID($C$15,1,21),\" - \",$G$15))","v":"-"},null,null,null,null,{"$f":"IF($B$15>=\"\",0,1)","v":0}]
[null,{"$f":"IF(X16=0,\"-\",X16/$E$111)","v":"-"},{"$f":"IF(B114=\"-\",\"-\",CONCATENATE(MID($C$16,1,21),\" - \",$G$16))","v":"-"},null,null,null,null,null,{"$f":"IF(Y16=0,\"-\",Y16/$L$111)","v":"-"},{"$f":"IF(I114=\"-\",\"-\",CONCATENATE(MID(C16,1,21),\" - \",G16))","v":"-"},null,null,null,null,null,{"$f":"IF(Z16=0,\"-\",Z16/$S$111)","v":"-"},{"$f":"IF(P114=\"-\",\"-\",CONCATENATE(MID(C16,1,21),\" - \",G16))","v":"-"},null,null,null,null,{"$f":"Z114","v":0},{"$f":"IF(B114=\"-\",0,B114)","v":0},{"$f":"IF(I114=\"-\",0,I114)","v":0},{"$f":"IF(P114=\"-\",0,P114)","v":0},{"$f":"IF(X114+W114+Y114>0,1,0)","v":0}]
[null,"-",{"$f":"IF(B115=\"-\",\"-\",CONCATENATE(MID($C$17,1,21),\" - \",$G$17))","v":"-"},null,null,null,null,null,"-","-",null,null,null,null,null,"-","-",null,null,null,null,{"$f":"Z115","v":0},{"$f":"IF(B115=\"-\",0,B115)","v":0},{"$f":"IF(I115=\"-\",0,I115)","v":0},{"$f":"IF(P115=\"-\",0,P115)","v":0},{"$f":"IF(X115+W115+Y115>0,1,0)","v":0}]
[null,"-",{"$f":"IF(B116=\"-\",\"-\",CONCATENATE(MID($C$18,1,21),\" - \",$G$18))","v":"-"},null,null,null,null,null,"-","-",null,null,null,null,null,"-","-",null,null,null,null,0,0,0,0,0]
[null,"-",{"$f":"IF(B117=\"-\",\"-\",CONCATENATE(MID(C19,1,21),\" - \",G19))","v":"-"},null,null,null,null,null,"-","-",null,null,null,null,null,"-","-",null,null,null,null,0,0,0,0,0]
[null,"-","-",null,null,null,null,null,"-","-",null,null,null,null,null,"-","-",null,null,null,null,0,0,0,0,0]
[null,"-","-",null,null,null,null,null,"-","-",null,null,null,null,null,"-","-",null,null,null,null,0,0,0,0,0]
[null,"-","-",null,null,null,null,null,"-","-",null,null,null,null,null,"-","-",null,null,null,null,0,0,0,0,0]
[null,"-","-",null,null,null,null,null,"-","-",null,null,null,null,null,"-","-",null,null,null,null,0,0,0,0,0]
[null,"-","-",null,null,null,null,null,"-","-",null,null,null,null,null,"-","-",null,null,null,null,0,0,0,0,0]
[null,"-","-",null,null,null,null,null,"-","-",null,null,null,null,null,"-","-",null,null,null,null,0,0,0,0,0]
[null,"-","-",null,null,null,null,null,"-","-",null,null,null,null,null,"-","-",null,null,null,null,0,0,0,0,0]
[null,"-","-",null,null,null,null,null,"-","-",null,null,null,null,null,"-","-",null,null,null,null,0,0,0,0,0]
[null,"-","-",null,null,null,null,null,"-","-",null,null,null,null,null,"-","-",null,null,null,null,0,0,0,0,0]
[null,"-","-",null,null,null,null,null,"-","-",null,null,null,null,null,"-","-",null,null,null,null,0,0,0,0,0]
[null,"-","-",null,null,null,null,null,"-","-",null,null,null,null,null,"-","-",null,null,null,null,0,0,0,0,0]
[null,"-","-",null,null,null,null,null,"-","-",null,null,null,null,null,"-","-",null,null,null,null,0,0,0,0,0]
[null,"-","-",null,null,null,null,null,"-","-",null,null,null,null,null,"-","-",null,null,null,null,0,0,0,0,0]
[null,"-","-",null,null,null,null,null,"-","-",null,null,null,null,null,"-","-",null,null,null,null,0,0,0,0,0]
[null,{"$f":"IF(X35=0,\"-\",X35/$E$111)","v":"-"},{"$f":"IF(B132=\"-\",\"-\",CONCATENATE(MID(C35,1,21),\" - \",G35))","v":"-"},null,null,null,null,null,{"$f":"IF(Y35=0,\"-\",Y35/$L$111)","v":"-"},{"$f":"IF(I132=\"-\",\"-\",CONCATENATE(MID(C35,1,21),\" - \",G35))","v":"-"},null,null,null,null,null,{"$f":"IF(Z35=0,\"-\",Z35/$S$111)","v":"-"},{"$f":"IF(P132=\"-\",\"-\",CONCATENATE(MID(C35,1,21),\" - \",G35))","v":"-"},null,null,null,null,0,0,0,0,0]
[null,"-","-",null,null,null,null,null,"-","-",null,null,null,null,null,"-","-",null,null,null,null,0,0,0,0,0]
[null,"-","-",null,null,null,null,null,"-","-",null,null,null,null,null,"-","-",null,null,null,null,0,0,0,0,0]
[null,"-","-",null,null,null,null,null,"-","-",null,null,null,null,null,"-","-",null,null,null,null,0,0,0,{"$f":"IF(P135=\"-\",0,P135)","v":0},0]
[null,"-","-",null,null,null,null,null,"-","-",null,null,null,null,null,"-","-",null,null,null,null,0,0,0,{"$f":"IF(P136=\"-\",0,P136)","v":0},0]
[null,"-","-",null,null,null,null,null,"-","-",null,null,null,null,null,"-","-",null,null,null,null,{"$f":"Z137","v":0},{"$f":"IF(B137=\"-\",0,B137)","v":0},{"$f":"IF(I137=\"-\",0,I137)","v":0},{"$f":"IF(P137=\"-\",0,P137)","v":0},{"$f":"IF(X137+W137+Y137>0,1,0)","v":0}]
[null,"-","-",null,null,null,null,null,"-","-",null,null,null,null,null,"-","-",null,null,null,null,0,0,0,0,0]
[null,"-","-",null,null,null,null,null,"-","-",null,null,null,null,null,"-","-",null,null,null,null,0,0,0,0,0]
[null,"-","-",null,null,null,null,null,"-","-",null,null,null,null,null,"-","-",null,null,null,null,0,0,0,0,0]
[null,{"$f":"IF(X53=0,\"-\",X53)","v":"-"},{"$f":"IF(B141=\"-\",\"-\",CONCATENATE(MID(C53,1,21),\" - \",G53))","v":"-"},null,null,null,null,null,{"$f":"IF(Y53=0,\"-\",Y53)","v":"-"},{"$f":"IF(I141=\"-\",\"-\",CONCATENATE(MID(C53,1,24),\" - \",G53))","v":"-"},null,null,null,null,null,{"$f":"IF(Z53=0,\"-\",Z53)","v":"-"},{"$f":"IF(P141=\"-\",\"-\",CONCATENATE(MID(C53,1,24),\" - \",G53))","v":"-"},null,null,null,null,0,0,0,0,0]
[null,{"$f":"IF(X54=0,\"-\",X54)","v":"-"},{"$f":"IF(B142=\"-\",\"-\",CONCATENATE(MID(C54,1,21),\" - \",G54))","v":"-"},null,null,null,null,null,{"$f":"IF(Y54=0,\"-\",Y54)","v":"-"},{"$f":"IF(I142=\"-\",\"-\",CONCATENATE(MID(C54,1,24),\" - \",G54))","v":"-"},null,null,null,null,null,{"$f":"IF(Z54=0,\"-\",Z54)","v":"-"},{"$f":"IF(P142=\"-\",\"-\",CONCATENATE(MID(C54,1,24),\" - \",G54))","v":"-"},null,null,null,null,0,0,0,0,0]
[null,"-","-",null,null,null,null,null,"-","-",null,null,null,null,null,"-","-",null,null,null,null,{"$f":"Z143","v":0},{"$f":"IF(B143=\"-\",0,B143)","v":0},{"$f":"IF(I143=\"-\",0,I143)","v":0},{"$f":"IF(P143=\"-\",0,P143)","v":0},{"$f":"IF(X143+W143+Y143>0,1,0)","v":0}]
[null,"-","-",null,null,null,null,null,"-","-",null,null,null,null,null,"-","-",null,null,null,null,{"$f":"Z144","v":0},{"$f":"IF(B144=\"-\",0,B144)","v":0},{"$f":"IF(I144=\"-\",0,I144)","v":0},{"$f":"IF(P144=\"-\",0,P144)","v":0},{"$f":"IF(X144+W144+Y144>0,1,0)","v":0}]
[null,"-","-",null,null,null,null,null,"-","-",null,null,null,null,null,"-","-",null,null,null,null,{"$f":"Z145","v":0},{"$f":"IF(B145=\"-\",0,B145)","v":0},{"$f":"IF(I145=\"-\",0,I145)","v":0},{"$f":"IF(P145=\"-\",0,P145)","v":0},{"$f":"IF(X145+W145+Y145>0,1,0)","v":0}]
[null,"-","-",null,null,null,null,null,"-","-",null,null,null,null,null,"-","-",null,null,null,null,0,0,0,0,0]
[null,"-","-",null,null,null,null,null,"-","-",null,null,null,null,null,"-","-",null,null,null,null,0,0,0,0,0]
[null,"-","-",null,null,null,null,null,"-","-",null,null,null,null,null,"-","-",null,null,null,null,0,0,0,0,0]
[null,"-","-",null,null,null,null,null,"-","-",null,null,null,null,null,"-","-",null,null,null,null,0,0,0,0,0]
[null,"-","-",null,null,null,null,null,"-","-",null,null,null,null,null,"-","-",null,null,null,null,0,0,0,0,0]
[null,"-","-",null,null,null,null,null,"-","-",null,null,null,null,null,"-","-",null,null,null,null,0,0,0,0,0]
[null,"-","-",null,null,null,null,null,"-","-",null,null,null,null,null,"-","-",null,null,null,null,0,0,0,0,0]
[null,"-","-",null,null,null,null,null,"-","-",null,null,null,null,null,"-","-",null,null,null,null,0,0,0,0,0]
[null,"-","-",null,null,null,null,null,"-","-",null,null,null,null,null,"-","-",null,null,null,null,0,0,0,0,0]
[null,"-","-",null,null,null,null,null,"-","-",null,null,null,null,null,"-","-",null,null,null,null,0,0,0,0,0]
[null,"-","-",null,null,null,null,null,"-","-",null,null,null,null,null,"-","-",null,null,null,null,0,0,0,0,0]
[null,"-","-",null,null,null,null,null,"-","-",null,null,null,null,null,"-","-",null,null,null,null,0,{"$f":"IF(B157=\"-\",0,B157)","v":0},{"$f":"IF(I157=\"-\",0,I157)","v":0},{"$f":"IF(P157=\"-\",0,P157)","v":0},{"$f":"IF(X157+W157+Y157>0,1,0)","v":0}]
[null,"-","-",null,null,null,null,null,"-","-",null,null,null,null,null,"-","-",null,null,null,null,0,0,0,0,0]
[null,"-","-",null,null,null,null,null,"-","-",null,null,null,null,null,"-","-",null,null,null,null,0,0,0,0,0]
[null,"-","-",null,null,null,null,null,"-","-",null,null,null,null,null,"-","-",null,null,null,null,0,0,0,0,0]
[null,"-","-",null,null,null,null,null,"-","-",null,null,null,null,null,"-","-",null,null,null,null,0,0,0,0,0]
[null,"-","-",null,null,null,null,null,"-","-",null,null,null,null,null,"-","-",null,null,null,null,0,0,0,0,0]
[null,"-","-",null,null,null,null,null,"-","-",null,null,null,null,null,"-","-",null,null,null,null,0,0,0,0,0]
[null,"-","-",null,null,null,null,null,"-","-",null,null,null,null,null,"-","-",null,null,null,null,0,0,0,0,0]
[null,"-","-",null,null,null,null,null,"-","-",null,null,null,null,null,"-","-",null,null,null,null,0,0,0,0,0]
[null,"-","-",null,null,null,null,null,"-","-",null,null,null,null,null,"-","-",null,null,null,null,0,0,0,0,0]
[null,"-","-",null,null,null,null,null,"-","-",null,null,null,null,null,"-","-",null,null,null,null,0,0,0,0,0]
[null,"-","-",null,null,null,null,null,"-","-",null,null,null,null,null,"-","-",null,null,null,null,0,0,0,0,0]
[null,"-","-",null,null,null,null,null,"-","-",null,null,null,null,null,"-","-",null,null,null,null,0,0,0,0,0]
[null,"-","-",null,null,null,null,null,"-","-",null,null,null,null,null,"-","-",null,null,null,null,0,0,0,0,0]
[null,"-","-",null,null,null,null,null,"-","-",null,null,null,null,null,"-","-",null,null,null,null,0,0,0,0,0]
[null,"-","-",null,null,null,null,null,"-","-",null,null,null,null,null,"-","-",null,null,null,null,0,0,0,0,0]
[null,"-","-",null,null,null,null,null,"-","-",null,null,null,null,null,"-","-",null,null,null,null,0,{"$f":"IF(B173=\"-\",0,B173)","v":0},{"$f":"IF(I173=\"-\",0,I173)","v":0},{"$f":"IF(P173=\"-\",0,P173)","v":0},{"$f":"IF(X173+W173+Y173>0,1,0)","v":0}]
[null,"-","-",null,null,null,null,null,"-","-",null,null,null,null,null,"-","-",null,null,null,null,0,0,0,0,0]
[null,"-","-",null,null,null,null,null,"-","-",null,null,null,null,null,"-","-",null,null,null,null,0,0,0,0,0]
[null,"-","-",null,null,null,null,null,"-","-",null,null,null,null,null,"-","-",null,null,null,null,0,0,0,0,0]
[null,"-","-",null,null,null,null,null,"-","-",null,null,null,null,null,"-","-",null,null,null,null,0,0,0,0,0]
[null,"-","-",null,null,null,null,null,"-","-",null,null,null,null,null,"-","-",null,null,null,null,0,0,0,0,0]
[null,"-","-",null,null,null,null,null,"-","-",null,null,null,null,null,"-","-",null,null,null,null,{"$f":"Z179","v":0},0,0,0,0]
[null,"-","-",null,null,null,null,null,"-","-",null,null,null,null,null,"-","-",null,null,null,null,0,{"$f":"IF(B180=\"-\",0,B180)","v":0},{"$f":"IF(I180=\"-\",0,I180)","v":0},{"$f":"IF(P180=\"-\",0,P180)","v":0},{"$f":"IF(X180+W180+Y180>0,1,0)","v":0}]
[null,"-","-",null,null,null,null,null,"-","-",null,null,null,null,null,"-","-",null,null,null,null,0,0,0,0,0]
[null,"-","-",null,null,null,null,null,"-","-",null,null,null,null,null,"-","-",null,null,null,null,{"$f":"Z182","v":0},{"$f":"IF(B182=\"-\",0,B182)","v":0},{"$f":"IF(I182=\"-\",0,I182)","v":0},{"$f":"IF(P182=\"-\",0,P182)","v":0},{"$f":"IF(X182+W182+Y182>0,1,0)","v":0}]
[null,"-","-",null,null,null,null,null,"-","-",null,null,null,null,null,"-","-",null,null,null,null,0,0,0,0,0]
[null,"-","-",null,null,null,null,null,"-","-",null,null,null,null,null,"-","-",null,null,null,null,0,0,0,0,0]
[null,"-","-",null,null,null,null,null,"-","-",null,null,null,null,null,"-","-",null,null,null,null,0,0,0,0,0]
[null,"-","-",null,null,null,null,null,"-","-",null,null,null,null,null,"-","-",null,null,null,null,0,0,0,0,0]
[null,null,null,null,null,null,null,null,null,null,null,null,null,null,null,null,null,null,null,null,null,{"$f":"IF($B$15>=\"\",0,1)","v":0}]
[null,"Configurazione RAID",null,null,null,null,null,null,"Configurazione RAID",null,null,null,null,null,null,"Configurazione RAID",null,null,null,null,null,0]
[null,null,null,null,null,null,null,null,null,null,null,null,null,null,null,null,null,null,null,null,null,0]
[null,{"$f":"'Lotto4 DL560 Gen10 1'!B109","v":"Specificare la configurazione RAID per l'installazione del Sistema Operativo, se richiesto.\ne/o\ninserire eventuali note."},null,null,null,null,null,null,{"$f":"'Lotto4 DL560 Gen10 2'!B109","v":"Specificare la configurazione RAID per l'installazione del Sistema Operativo, se richiesto.\ne/o\ninserire eventuali note."},null,{"$f":"IF(#REF!=0,\"\",#REF!)","v":{"$error":"#REF!"}},null,null,null,null,{"$f":"'Lotto4 DL560 Gen10 3'!B109","v":"Specificare la configurazione RAID per l'installazione del Sistema Operativo, se richiesto.\ne/o\ninserire eventuali note."},null,{"$f":"IF(#REF!=0,\"\",#REF!)","v":{"$error":"#REF!"}},null,null,null,0]
[null,null,null,null,null,null,null,null,null,null,null,null,null,null,null,null,null,null,null,null,null,0]
[null,null,null,null,null,null,null,null,{"$f":"IF(#REF!=0,\"\",\"Hot spare HDD 300 GB\")","v":{"$error":"#REF!"}},null,null,null,{"$f":"IF(#REF!=0,\"\",#REF!)","v":{"$error":"#REF!"}},null,null,{"$f":"IF(#REF!=0,\"\",\"Hot spare HDD 300 GB\")","v":{"$error":"#REF!"}},null,null,null,{"$f":"IF(#REF!=0,\"\",#REF!)","v":{"$error":"#REF!"}},null,0]
[null,null,null,null,null,null,null,null,null,null,null,null,null,null,null,null,null,null,null,null,null,0]
[null,null,null,null,null,null,null,null,null,null,null,null,null,null,null,null,null,null,null,null,null,0]
[null,null,null,null,null,null,null,null,{"$f":"IF(#REF!=0,\"\",\"HDD 1000 GB\")","v":{"$error":"#REF!"}},null,{"$f":"IF(#REF!=0,\"\",#REF!)","v":{"$error":"#REF!"}},null,null,null,null,{"$f":"IF(#REF!=0,\"\",\"HDD 1000 GB\")","v":{"$error":"#REF!"}},null,{"$f":"IF(#REF!=0,\"\",#REF!)","v":{"$error":"#REF!"}},null,null,null,0]
[null,null,null,null,null,null,null,null,null,null,null,null,null,null,null,null,null,null,null,null,null,0]
[null,null,null,null,null,null,null,null,{"$f":"IF(#REF!=0,\"\",\"Hot spare HDD 1000 GB\")","v":{"$error":"#REF!"}},null,null,null,{"$f":"IF(#REF!=0,\"\",#REF!)","v":{"$error":"#REF!"}},null,null,{"$f":"IF(#REF!=0,\"\",\"Hot spare HDD 1000 GB\")","v":{"$error":"#REF!"}},null,null,null,{"$f":"IF(#REF!=0,\"\",#REF!)","v":{"$error":"#REF!"}},null,0]
[null,null,null,null,null,null,null,null,null,null,null,null,null,null,null,null,null,null,null,null,null,0]
[null,null,null,null,null,null,null,null,null,null,null,null,null,null,null,null,null,null,null,null,null,0]
[null,null,null,null,null,null,null,null,"Note RAID",null,null,null,null,null,null,"Note RAID",null,null,null,null,null,0]
[null,null,null,null,null,null,null,null,{"$f":"IF(#REF!=0,\"\",#REF!)","v":{"$error":"#REF!"}},null,null,null,null,null,null,{"$f":"IF(#REF!=0,\"\",#REF!)","v":{"$error":"#REF!"}},null,null,null,null,null,0]
[null,null,null,null,null,null,null,null,null,null,null,null,null,null,null,null,null,null,null,null,null,0]
[null,null,null,null,null,null,null,null,null,null,null,null,null,null,null,null,null,null,null,null,null,0]
[null,null,null,null,null,null,null,null,{"$f":"IF(#REF!=0,\"\",#REF!)","v":{"$error":"#REF!"}},null,null,null,null,null,null,{"$f":"IF(#REF!=0,\"\",#REF!)","v":{"$error":"#REF!"}},null,null,null,null,null,0]
[null,null,null,null,null,null,null,null,null,null,null,null,null,null,null,null,null,null,null,null,null,0]
[null,null,null,null,null,null,null,null,null,null,null,null,null,null,null,null,null,null,null,null,null,0]
[null,null,null,null,null,null,null,null,null,null,null,null,null,null,null,null,null,null,null,null,null,{"$f":"IF($B$15>=\"\",0,1)","v":0},null,null,null,"Calcolo x filtro"]
[null,null,null,null,null,null,null,null,null,null,null,null,null,null,null,null,null,null,null,null,null,1]
[null,null,null,null,null,null,null,null,null,null,null,null,null,null,null,null,null,null,null,null,null,1]
[null,null,null,{"$f":"MID(C208,13,5)","v":""},null,{"$f":"MID(E208,13,5)","v":""},null,"",null,"",null,"",null,"",null,"",null,"",null,"",null,1]
[null,null,null,"AREA RISERVATA AL FORNITORE",null,null,null,null,null,null,null,null,null,null,null,null,null,null,null,null,null,1]
[null,null,null,null,null,null,null,null,null,null,null,null,null,null,null,null,null,null,null,null,null,1]
[null,null,null,null,null,null,null,null,null,null,null,null,null,null,null,null,null,null,null,null,null,1]
[null,null,"VERIFICA STAGING",null,null,null,null,null,null,null,null,null,null,null,"VERIFICA INSTALLATORE",null,null,null,null,null,null,1]
[null,null,null,null,null,null,null,null,null,null,null,null,null,null,null,null,null,null,null,null,null,1]
[null,null,null,null,null,null,null,null,null,null,null,null,null,null,null,null,null,null,null,null,null,1]
[null,null,null,null,null,null,null,null,null,null,null,null,null,null,null,null,null,null,null,null,null,1]
[null,null,null,null,null,null,null,null,null,null,null,null,null,null,null,null,null,null,null,null,null,1]

{"sheet":"Codici","index":5,"n_rows":97,"n_cols":6,"rows_kept":97,"cut":false,"hidden":true,"merged":[[49,5,50,5],[51,5,53,5],[20,0,21,0],[20,1,21,1],[1,2,3,2],[18,2,19,2],[20,2,21,2],[1,0,3,0],[1,1,3,1],[5,0,6,0],[5,1,6,1],[18,0,19,0],[18,1,19,1],[26,0,27,0],[26,1,27,1],[39,0,40,0],[39,1,40,1],[24,2,25,2],[26,2,27,2],[39,2,40,2],[24,0,25,0],[24,1,25,1],[26,5,27,5],[39,5,40,5],[1,5,3,5],[5,5,6,5],[18,5,19,5],[20,5,21,5],[24,5,25,5],[49,0,50,0],[51,0,53,0],[49,1,50,1],[51,1,53,1],[49,2,50,2],[51,2,53,2]]}
["CODICE CONVERGE","CODICE CONVENZIONE","Prezzo vendita da Converge a CONSIP tot.","Qty Bundle","Description","CODICE CONVERGE"]
["TS2L4-SRV-U","TS2L4-SRV-U",4628,1,"HPE ProLiant DL560 Gen10 Server BASE (2CPU Intel Xeon E5-Gold 5218)","TS2L4-SRV-U"]
[null,null,null,1,"Manutenzione Server Base - via Day 1 contract"]
[null,null,null,1,"HPE Mobile USB DVDRW Drive"]
[]
["TS2L4-CPU-U","TS2L4-CPU-U",1961,2,"Intel Xeon-Gold 5218 (2.3GHz/16-core/125W) Processor Kit","TS2L4-CPU-U"]
[null,null,null,1,"HPE DL5x0 Gen10 CPU Mezzanine Board Kit"]
[]
["TS2H-RAM16-U","TS2L4-RAM16-U",136,1,"HPE 16GB 1Rx4 PC4-2933 Smart Kit","TS2H-RAM16-U"]
["TS2H-RAM32-U","TS2L4-RAM32-U",397,1,"HPE 32GB 2Rx4 PC4-2933 Smart Kit","TS2H-RAM32-U"]
["TS2H-RAM64-U","TS2L4-RAM64-U",705,1,"HPE 64GB 4Rx4 PC4-2933 Smart Kit","TS2H-RAM64-U"]
[]
["TS2H-15K300","TS2L4-15K300",135,1,"HPE 300GB SAS 15K SFF SC DS HDD","TS2H-15K300"]
["TS2H-10K1200","TS2L4-10K1200",146,1,"HPE 1.2TB SAS 10K SFF SC DS HDD","TS2H-10K1200"]
["TS2H-SSD480","TS2L4-SSD480",399,1,"HPE 480GB SAS 12G SFF SC DS SSD","TS2H-SSD480"]
["TS2H-SSDR960","TS2L4-SSDR960",664,1,"HPE 960GB SAS RI SFF SC DS SSD","TS2H-SSDR960"]
[]
["TS2H-LAN1","TS2L4-LAN1",32,1,"HPE Ethernet 1Gb 2P 332T Adptr","TS2H-LAN1"]
["TS2H-LAN10","TS2L4-LAN10",357,1,"HPE Ethernet 10Gb 2P 530SFP+ Adptr","TS2H-LAN10"]
[null,null,null,2,"HPE BLc 10G SFP+ SR Transceiver"]
["TS2H-CNA10","TS2L4-CNA10",723,1,"HPE CN1100R 2P Converged Network Adapter","TS2H-CNA10"]
[null,null,null,2,"HPE BLc 10G SFP+ SR Transceiver"]
["TS2H-FC16","TS2L4-FC16",356,1,"HPE SN1100Q 16Gb 2p FC HBA","TS2H-FC16"]
[]
["TS2H-4Y","TS2L4-4Y",300,1,"Estensione della manutenzione in garanzia per ulteriori 12 mesi","TS2H-4Y"]
[null,null,null,1,"Onsite Labor CRU, 1Year"]
["TS2H-5Y","TS2L4-5Y",600,1,"Estensione della manutenzione in garanzia per ulteriori 24 mesi","TS2H-5Y"]
[null,null,null,2,"Onsite Labor CRU, 1Year"]
[]
["TS2H-WIN1","TS2L4-WIN1",551,1,"Microsoft Windows Server 2019 Standard Edition ROK 16 Core","TS2H-WIN1"]
["TS2H-WIN2","TS2L4-WIN2",551,1,"Microsoft Windows Server 2019 Standard Edition Additional License 16 Core","TS2H-WIN2"]
["TS2H-CALDEV","TS2L4-CALDEV",21,1,"1-pack of Windows Server 2019 Device CALs","TS2H-CALDEV"]
["TS2H-CALUSER","TS2L4-CALUSER",21,1,"1-pack of Windows Server 2019 User CALs","TS2H-CALUSER"]
["TS2H-WIN2CORE","TS2L4-WIN2CORE",54,1,"Microsoft Windows Server 2019 Standard Edition Additional License 2 Core","TS2H-WIN2CORE"]
["TS2H-WINDC1","TS2L4-WINDC1",2159,1,"Microsoft Windows Server 2019 Datacenter Edition ROK 16 Core","TS2H-WINDC1"]
["TS2H-WINDC2","TS2L4-WINDC2",2159,1,"Microsoft Windows Server 2019 Datacenter Edition Additional License 16 Core","TS2H-WINDC2"]
["TS2H-WINDC2COR","TS2L4-WINDC2COR",399,1,"Microsoft Windows Server 2019 Datacenter Edition Additional License 2 Core","TS2H-WINDC2COR"]
["TS2-LINUX","TS2L4-LINUX",49,1,"CentOS 7.x","TS2-LINUX"]
[]
["TS2-UPS","TS2L4-UPS",387,1,"UPS MSR 3000VA + staffe","TS2-UPS"]
[null,null,{"$f":"B41*#REF!","v":{"$error":"#REF!"}},1,"Kit 2 Guide universali per UPS"]
["TS2-GUI","TS2L4-GUI",448,1,"Console KVM GUI da rack","TS2-GUI"]
["TS2-RACK","TS2L4-RACK",504,1,"Armadio Rack 42U","TS2-RACK"]
["TS2-KVMIP","TS2L4-KVMIP",495,1,"KVM Switch IP per GUI 16P con cavi","TS2-KVMIP"]
[]
["TS2-3MRJ45","TS2L4-3MRJ45",2,1,"Cavo Rete UTP cat. 5e 3 metri A20","TS2-3MRJ45"]
["TS2H-10K1800","TS2L4-10K1800",190,1,"HPE 1.8TB SAS 10K SFF HDD A20","TS2H-10K1800"]
["TS2H-SSDR1920","TS2L4-SSDR1920",1313,1,"HPE 1.92TB SAS 12G RI SFF SSD A20","TS2H-SSDR1920"]
["TS2H-3RISER","TS2L4-3RISER",285,1,"HPE DL560 Gen10 x8/x8 Tertiary Riser Kit","TS2H-3RISER"]
["TS2H-SASBAY2","TS2L4-SASBAY2",770,1,"HPE DL560 Gen10 8SFF HDD Bay2 Kit","TS2H-SASBAY2"]
[null,null,null,1,"HPE DL5x0 Gen10 12Gb SAS Expander"]
["TS2H-SASBAY12","TS2L4-SASBAY12",1030,1,"HPE DL560 Gen10 8SFF HDD Bay1 Kit","TS2H-SASBAY12"]
[null,null,null,1,"HPE DL560 Gen10 8SFF HDD Bay2 Kit"]
[null,null,null,1,"HPE DL5x0 Gen10 12Gb SAS Expander"]
["TS2H-530T","TS2L4-530T",298,1,"HPE Ethernet 10Gb 2-port 530T Adapter","TS2H-530T"]
["TS2H-521T","TS2L4-521T",298,1,"HPE Ethernet 10Gb 2-port 521T Adapter","TS2H-521T"]
["TS2H-536FLR","TS2L4-536FLR",610,1,"HPE FlexFabric 10Gb 4-port 536FLR-T Adapter","TS2H-536FLR"]
["TS2H-562SFP","TS2L4-562SFP",380,1,"HPE Ethernet 10Gb 2-port 562SFP+ Adapter","TS2H-562SFP"]
["TS2H-10OTSR","TS2L4-10OTSR",230,1,"HPE 10Gb SFP+ SR Transceiver","TS2H-10OTSR"]
["TS2H-10OTLR","TS2L4-10OTLR",481,1,"HPE 10G SFP+ LR Transceiver","TS2H-10OTLR"]
["TS2H-GPURSRKIT","TS2L4-GPURSRKIT",87,1,"HPE DL Gen10 x16 x16 GPU Rsr Kit","TS2H-GPURSRKIT"]
["TS2H-P2000GPU","TS2L4-P2000GPU",690,1,"HPE NVIDIA Quadro P2000 GPU Module","TS2H-P2000GPU"]
["TS2H-841QSFP28","TS2L4-841QSFP28",2699,1,"HPE InfiniBand EDR 100Gb 1-port 841QSFP28 Adapter","TS2H-841QSFP28"]
["TS2H-OP101","TS2L4-OP101",554,1,"HPE 100Gb 1-port OP101 QSFP28 x16 PCIe Gen3 with Intel Omni-Path Architecture Adapter","TS2H-OP101"]
["TS2H-547FLR","TS2L4-547FLR",461,1,"HPE InfiniBand FDR/Ethernet 40/50Gb 2-port 547FLR-QSFP Adapter","TS2H-547FLR"]
["TS2H-VMWSTD1P5Y","TS2L4-VMWSTD1P5Y",1933,1,"VMware vSphere Standard 1 Processor 5yr Software","TS2H-VMWSTD1P5Y"]
["TS2H-VMWEP1P5Y","TS2L4-VMWEP1P5Y",5889,1,"VMware vSphere Enterprise Plus 1 Processor 5yr Software","TS2H-VMWEP1P5Y"]
["TS2H-VMWSTD1P3Y","TS2L4-VMWSTD1P3Y",1506,1,"VMware vSphere Standard 1 Processor 3yr Software","TS2H-VMWSTD1P3Y"]
["TS2H-VMWEP1P3Y","TS2L4-VMWEP1P3Y",4734,1,"VMware vSphere Enterprise Plus 1 Processor 3yr Software","TS2H-VMWEP1P3Y"]
["TS2H-VMWKIT6P3Y","TS2L4-VMWKIT6P3Y",5052,1,"VMware vSphere Essentials Plus Kit 6 Processor 3yr","TS2H-VMWKIT6P3Y"]
["TS2H-VMWKIT6P5Y","TS2L4-VMWKIT6P5Y",6284,1,"VMware vSphere Essentials Plus Kit 6 Processor 5yr","TS2H-VMWKIT6P5Y"]
["TS2H-VMWVCSTD3Y","TS2L4-VMWVCSTD3Y",8240,1,"VMware vCenter Server Standard for vSphere 3yr SW","TS2H-VMWVCSTD3Y"]
["TS2H-VMWVCSTD5Y","TS2L4-VMWVCSTD5Y",10251,1,"VMware vCenter Server Standard for vSphere 5yr SW","TS2H-VMWVCSTD5Y"]
["TS2H-OV3YILO","TS2L4-OV3YILO",480,1,"HPE OneView 3yr 24x7 Supp Phys 1 Svr Lic","TS2H-OV3YILO"]
["TS2H-DACQSFPM2","TS2L4-DACQSFPM2",147,1,"HPE 2M IB FDR QSFP Copper Cable","TS2H-DACQSFPM2"]
["TS2H-DAC100M2","TS2L4-DAC100M2",117,1,"HPE 2M 100Gb QSFP28 OPA Copper Cable","TS2H-DAC100M2"]
["TS2H-DAC100M3","TS2L4-DAC100M3",147,1,"HPE 3M 100Gb QSFP28 OPA Copper Cable","TS2H-DAC100M3"]
["TS2H-DACAOCM3","TS2L4-DACAOCM3",612,1,"HPE 3M 100Gb QSFP28 OPA Optical PC2 Cbl","TS2H-DACAOCM3"]
["TS2H-DACAOCM5","TS2L4-DACAOCM5",619,1,"HPE 5M 100Gb QSFP28 OPA Optical PC2 Cbl","TS2H-DACAOCM5"]
["TS2H-DACAOCM7","TS2L4-DACAOCM7",627,1,"HPE 7M 100Gb QSFP28 OPA Optical PC2 Cbl","TS2H-DACAOCM7"]
["TS2H-DACX240M3","TS2L4-DACX240M3",81,1,"HPE X240 10G SFP+ SFP+ 3m DAC Cable","TS2H-DACX240M3"]
["TS2H-DACX240M5","TS2L4-DACX240M5",95,1,"HPE X240 10G SFP+ SFP+ 5m DAC Cable","TS2H-DACX240M5"]
["TS2H-DACX240M7","TS2L4-DACX240M7",106,1,"HPE X240 10G SFP+ SFP+ 7m DAC Cable","TS2H-DACX240M7"]
["TS2H-VSANSTD3Y","TS2L4-VSANSTD3Y",3611,1,"VMware vSAN Standard OEM  1 Processor 3yr Software A20","TS2H-VSANSTD3Y"]
["TS2H-VSANADV3Y","TS2L4-VSANADV3Y",5543,1,"VMware vSAN Advanced OEM  1 Processor 3yr Software A20","TS2H-VSANADV3Y"]
["TS2H-SSD400MU","TS2L4-SSD400MU",622,1,"HPE 400GB SAS 12G Mixed Use SFF (2.5in) SC DS SSD","TS2H-SSD400MU"]
["TS2H-SSD400WIB","TS2L4-SSD400WIB",959,1,"HPE 400GB SAS 12G Write Intensive SFF (2.5in) SC DS SSD","TS2H-SSD400WIB"]
["TS2H-SSD800MU","TS2L4-SSD800MU",980,1,"HPE 800GB SAS 12G Mixed Use SFF (2.5in) SC DS SSD","TS2H-SSD800MU"]
["TS2H-DAC3SFP28","TS2L4-DAC3SFP28",134,1,"HPE 25Gb SFP28 to SFP28 3m Direct Attach Cable","TS2H-DAC3SFP28"]
["TS2H-SFP28SR","TS2L4-SFP28SR",887,1,"HPE 25Gb SFP28 SR 100m Transceiver","TS2H-SFP28SR"]
["TS2H-DUAL32GB","TS2L4-DUAL32GB",306,1,"HPE 32GB Dual microSD USB Flash Drive","TS2H-DUAL32GB"]
["TS2H-640SFP28","TS2L4-640SFP28",467,null,"HPE Ethernet 10/25Gb 2-port 640SFP28 Adapter","TS2H-640SFP28"]
["TS2H-SSD960MU","TS2L4-SSD960MU",864,1,"HPE 960GB SAS 12G Mixed Use SC 3yr Wty Value SAS DS SSD","TS2H-SSD960MU"]
["TS2H-DUAL8GB","TS2L4-DUAL8GB",149,1,"HPE 8GB Dual microSD USB Flash Drive","TS2H-DUAL8GB"]
["TS2H-E208EP","TS2L4-E208EP",218,1,"HPE Smart Array E208e-p SR Gen10","TS2H-E208EP"]
["TS2H-PDU32A","TS2L4-PDU32A",436,1,"Coppia di PDU Vertical  1Ph-32A-18xC13-6xC19 - 0U Base + Kit di montaggio","TS2H-PDU32A"]
["TS2H-RACKPDU32","TS2L4-RACKPDU32",2200,1,"Armadio Rack 42U profonità 120cm con coppia di PDU 32A monofase","TS2H-RACKPDU32"]

{"sheet":"Operating System","index":6,"n_rows":74,"n_cols":30,"rows_kept":74,"cut":false,"hidden":true,"merged":[[0,1,0,2]]}
["Operating System"]
["DL560"]
["No Operating System",{"$f":"\"\"","v":""},{"$f":"\"\"","v":""},{"$f":"\"\"","v":""},{"$f":"\"\"","v":""},{"$f":"\"\"","v":""},"None",{"$f":"\"\"","v":""},{"$f":"\"\"","v":""},{"$f":"\"\"","v":""},{"$f":"\"\"","v":""},0,"None",{"$f":"\"\"","v":""},{"$f":"\"\"","v":""},{"$f":"\"\"","v":""},{"$f":"\"\"","v":""},0,{"$f":"\"\"","v":""},0,{"$f":"\"\"","v":""},{"$f":"\"\"","v":""},{"$f":"\"\"","v":""},0,{"$f":"\"\"","v":""},0,{"$f":"\"\"","v":""},{"$f":"\"\"","v":""},{"$f":"\"\"","v":""},0]
["Microsoft Windows Server 2019 Standard Edition ROK 16 Core",1,"TS2L4-WIN1","TS2L4-WIN1","P00487-B21",551,"1-pack of Windows Server 2019 User CALs",null,"TS2L4-CALUSER","TS2L4-CALUSER","871175-A21",21,"1-pack of Windows Server 2019 Device CALs",null,"TS2L4-CALDEV","TS2L4-CALDEV","871176-A21",21,"Microsoft Windows Server 2019 Standard Edition Additional License 16 Core",1,"TS2L4-WIN2","TS2L4-WIN2","871157-A21",551,{"$f":"\"\"","v":""},0,{"$f":"\"\"","v":""},{"$f":"\"\"","v":""},{"$f":"\"\"","v":""},0]
["Microsoft Windows Server 2019 Datacenter Edition ROK 16 Core",1,"TS2L4-WINDC1","TS2L4-WINDC1","P00488-B21",2159,"1-pack of Windows Server 2019 User CALs",null,"TS2L4-CALUSER","TS2L4-CALUSER","871175-A21",21,"1-pack of Windows Server 2019 Device CALs",null,"TS2L4-CALDEV","TS2L4-CALDEV","871176-A21",21,"Microsoft Windows Server 2019 Datacenter Edition Additional License 16 Core",1,"TS2L4-WINDC2","TS2L4-WINDC2","871166-A21",2159,{"$f":"\"\"","v":""},0,{"$f":"\"\"","v":""},{"$f":"\"\"","v":""},{"$f":"\"\"","v":""},0]
["CentOS 7.0",1,"TS2L4-LINUX","TS2L4-LINUX",null,49,"None",{"$f":"\"\"","v":""},{"$f":"\"\"","v":""},{"$f":"\"\"","v":""},{"$f":"\"\"","v":""},0,"None",{"$f":"\"\"","v":""},{"$f":"\"\"","v":""},{"$f":"\"\"","v":""},{"$f":"\"\"","v":""},0,{"$f":"\"\"","v":""},0,{"$f":"\"\"","v":""},{"$f":"\"\"","v":""},{"$f":"\"\"","v":""},0,{"$f":"\"\"","v":""},0,{"$f":"\"\"","v":""},{"$f":"\"\"","v":""},{"$f":"\"\"","v":""},0]
[]
["DL560 2CPU"]
["No Operating System",{"$f":"\"\"","v":""},{"$f":"\"\"","v":""},{"$f":"\"\"","v":""},{"$f":"\"\"","v":""},{"$f":"\"\"","v":""},"None",{"$f":"\"\"","v":""},{"$f":"\"\"","v":""},{"$f":"\"\"","v":""},{"$f":"\"\"","v":""},0,"None",{"$f":"\"\"","v":""},{"$f":"\"\"","v":""},{"$f":"\"\"","v":""},{"$f":"\"\"","v":""},0,{"$f":"\"\"","v":""},0,{"$f":"\"\"","v":""},{"$f":"\"\"","v":""},{"$f":"\"\"","v":""},0,{"$f":"\"\"","v":""},0,{"$f":"\"\"","v":""},{"$f":"\"\"","v":""},{"$f":"\"\"","v":""},0]
["Microsoft Windows Server 2019 Standard Edition ROK 16 Core",1,"TS2L4-WIN1","TS2L4-WIN1","P00487-B21",551,"1-pack of Windows Server 2019 User CALs",null,"TS2L4-CALUSER","TS2L4-CALUSER","871175-A21",21,"1-pack of Windows Server 2019 Device CALs",null,"TS2L4-CALDEV","TS2L4-CALDEV","871176-A21",21,"Microsoft Windows Server 2019 Standard Edition Additional License 16 Core",3,"TS2L4-WIN2","TS2L4-WIN2","871157-A21",551,{"$f":"\"\"","v":""},0,{"$f":"\"\"","v":""},{"$f":"\"\"","v":""},{"$f":"\"\"","v":""},0]
["Microsoft Windows Server 2019 Datacenter Edition ROK 16 Core",1,"TS2L4-WINDC1","TS2L4-WINDC1","P00488-B21",2159,"1-pack of Windows Server 2019 User CALs",null,"TS2L4-CALUSER","TS2L4-CALUSER","871175-A21",21,"1-pack of Windows Server 2019 Device CALs",null,"TS2L4-CALDEV","TS2L4-CALDEV","871176-A21",21,"Microsoft Windows Server 2019 Datacenter Edition Additional License 16 Core",3,"TS2L4-WINDC2","TS2L4-WINDC2","871166-A21",2159,{"$f":"\"\"","v":""},0,{"$f":"\"\"","v":""},{"$f":"\"\"","v":""},{"$f":"\"\"","v":""},0]
["CentOS 7.0",1,"TS2L4-LINUX","TS2L4-LINUX",null,49,"None",{"$f":"\"\"","v":""},{"$f":"\"\"","v":""},{"$f":"\"\"","v":""},{"$f":"\"\"","v":""},0,"None",{"$f":"\"\"","v":""},{"$f":"\"\"","v":""},{"$f":"\"\"","v":""},{"$f":"\"\"","v":""},0,{"$f":"\"\"","v":""},0,{"$f":"\"\"","v":""},{"$f":"\"\"","v":""},{"$f":"\"\"","v":""},0,{"$f":"\"\"","v":""},0,{"$f":"\"\"","v":""},{"$f":"\"\"","v":""},{"$f":"\"\"","v":""},0]
[]
[]
["DL580 ALTERNATIVO"]
["No Operating System",{"$f":"\"\"","v":""},{"$f":"\"\"","v":""},{"$f":"\"\"","v":""},{"$f":"\"\"","v":""},{"$f":"\"\"","v":""},"None",{"$f":"\"\"","v":""},{"$f":"\"\"","v":""},{"$f":"\"\"","v":""},{"$f":"\"\"","v":""},0,"None",{"$f":"\"\"","v":""},{"$f":"\"\"","v":""},{"$f":"\"\"","v":""},{"$f":"\"\"","v":""},0,{"$f":"\"\"","v":""},0,{"$f":"\"\"","v":""},{"$f":"\"\"","v":""},{"$f":"\"\"","v":""},0,{"$f":"\"\"","v":""},0,{"$f":"\"\"","v":""},{"$f":"\"\"","v":""},{"$f":"\"\"","v":""},0]
["Microsoft Windows Server 2019 Standard Edition ROK 16 Core",1,"TS2L4-WIN1","TS2L4-WIN1","871148-B21",556,"1-pack of Windows Server 2019 User CALs",null,"TS2L4-CALUSER","TS2L4-CALUSER","871175-A21",22,"1-pack of Windows Server 2019 Device CALs",null,"TS2L4-CALDEV","TS2L4-CALDEV","871176-A21",22,"Microsoft Windows Server 2019 Standard Edition Additional License 2 Core",4,"TS2L4-WIN2CORE","TS2L4-WIN2CORE","871159-A21",56,{"$f":"\"\"","v":""},0,{"$f":"\"\"","v":""},{"$f":"\"\"","v":""},{"$f":"\"\"","v":""},0]
["Microsoft Windows Server 2019 Datacenter Edition ROK 16 Core",1,"TS2L4-WINDC1","TS2L4-WINDC1","871153-B21",2174,"1-pack of Windows Server 2019 User CALs",null,"TS2L4-CALUSER","TS2L4-CALUSER","871175-A21",22,"1-pack of Windows Server 2019 Device CALs",null,"TS2L4-CALDEV","TS2L4-CALDEV","871176-A21",22,"Microsoft Windows Server 2019 Datacenter Edition Additional License 16 Core",1,"TS2L4-WINDC2","TS2L4-WINDC2","871166-A21",2105,{"$f":"\"\"","v":""},0,{"$f":"\"\"","v":""},{"$f":"\"\"","v":""},{"$f":"\"\"","v":""},0]
["CentOS 7.0",1,"TS2L4-LINUX","TS2L4-LINUX",null,50,"None",{"$f":"\"\"","v":""},{"$f":"\"\"","v":""},{"$f":"\"\"","v":""},{"$f":"\"\"","v":""},0,"None",{"$f":"\"\"","v":""},{"$f":"\"\"","v":""},{"$f":"\"\"","v":""},{"$f":"\"\"","v":""},0,{"$f":"\"\"","v":""},0,{"$f":"\"\"","v":""},{"$f":"\"\"","v":""},{"$f":"\"\"","v":""},0,{"$f":"\"\"","v":""},0,{"$f":"\"\"","v":""},{"$f":"\"\"","v":""},{"$f":"\"\"","v":""},0]
[]
["DL580 ALTERNATIVO 2CPU"]
["No Operating System",{"$f":"\"\"","v":""},{"$f":"\"\"","v":""},{"$f":"\"\"","v":""},{"$f":"\"\"","v":""},{"$f":"\"\"","v":""},"None",{"$f":"\"\"","v":""},{"$f":"\"\"","v":""},{"$f":"\"\"","v":""},{"$f":"\"\"","v":""},0,"None",{"$f":"\"\"","v":""},{"$f":"\"\"","v":""},{"$f":"\"\"","v":""},{"$f":"\"\"","v":""},0,{"$f":"\"\"","v":""},0,{"$f":"\"\"","v":""},{"$f":"\"\"","v":""},{"$f":"\"\"","v":""},0,{"$f":"\"\"","v":""},0,{"$f":"\"\"","v":""},{"$f":"\"\"","v":""},{"$f":"\"\"","v":""},0]
["Microsoft Windows Server 2019 Standard Edition ROK 16 Core",1,"TS2L4-WIN1","TS2L4-WIN1","871148-B21",556,"1-pack of Windows Server 2019 User CALs",null,"TS2L4-CALUSER","TS2L4-CALUSER","871175-A21",22,"1-pack of Windows Server 2019 Device CALs",null,"TS2L4-CALDEV","TS2L4-CALDEV","871176-A21",22,"Microsoft Windows Server 2019 Standard Edition Additional License 16 Core",2,"TS2L4-WIN2","TS2L4-WIN2","871157-A21",526,{"$f":"\"\"","v":""},0,{"$f":"\"\"","v":""},{"$f":"\"\"","v":""},{"$f":"\"\"","v":""},0]
["Microsoft Windows Server 2019 Datacenter Edition ROK 16 Core",1,"TS2L4-WINDC1","TS2L4-WINDC1","871153-B21",2174,"1-pack of Windows Server 2019 User CALs",null,"TS2L4-CALUSER","TS2L4-CALUSER","871175-A21",22,"1-pack of Windows Server 2019 Device CALs",null,"TS2L4-CALDEV","TS2L4-CALDEV","871176-A21",22,"Microsoft Windows Server 2019 Datacenter Edition Additional License 16 Core",2,"TS2L4-WINDC2","TS2L4-WINDC2","871166-A21",2105,{"$f":"\"\"","v":""},0,{"$f":"\"\"","v":""},{"$f":"\"\"","v":""},{"$f":"\"\"","v":""},0]
["CentOS 7.0",1,"TS2L4-LINUX","TS2L4-LINUX",null,50,"None",{"$f":"\"\"","v":""},{"$f":"\"\"","v":""},{"$f":"\"\"","v":""},{"$f":"\"\"","v":""},0,"None",{"$f":"\"\"","v":""},{"$f":"\"\"","v":""},{"$f":"\"\"","v":""},{"$f":"\"\"","v":""},0,{"$f":"\"\"","v":""},0,{"$f":"\"\"","v":""},{"$f":"\"\"","v":""},{"$f":"\"\"","v":""},0,{"$f":"\"\"","v":""},0,{"$f":"\"\"","v":""},{"$f":"\"\"","v":""},{"$f":"\"\"","v":""},0]
[]
["Dl580 PREST"]
["No Operating System",{"$f":"\"\"","v":""},{"$f":"\"\"","v":""},{"$f":"\"\"","v":""},{"$f":"\"\"","v":""},{"$f":"\"\"","v":""},"None",{"$f":"\"\"","v":""},{"$f":"\"\"","v":""},{"$f":"\"\"","v":""},{"$f":"\"\"","v":""},0,"None",{"$f":"\"\"","v":""},{"$f":"\"\"","v":""},{"$f":"\"\"","v":""},{"$f":"\"\"","v":""},0,{"$f":"\"\"","v":""},0,{"$f":"\"\"","v":""},{"$f":"\"\"","v":""},{"$f":"\"\"","v":""},0,{"$f":"\"\"","v":""},0,{"$f":"\"\"","v":""},{"$f":"\"\"","v":""},{"$f":"\"\"","v":""},0]
["Microsoft Windows Server 2019 Standard Edition ROK 16 Core",1,"TS2L4-WIN1","TS2L4-WIN1","871148-B21",556,"1-pack of Windows Server 2019 User CALs",null,"TS2L4-CALUSER","TS2L4-CALUSER","871175-A21",22,"1-pack of Windows Server 2019 Device CALs",null,"TS2L4-CALDEV","TS2L4-CALDEV","871176-A21",22,"Microsoft Windows Server 2019 Standard Edition Additional License 16 Core",1,"TS2L4-WIN2","2+Y23:AD23","871157-A21",526,"Microsoft Windows Server 2019 Standard Edition Additional License 2 Core",2,"TS1L2-WIN2CORE","TS1L2-WIN2CORE","871159-A21",56]
["Microsoft Windows Server 2019 Datacenter Edition ROK 16 Core",1,"TS2L4-WINDC1","TS2L4-WINDC1","871153-B21",2174,"1-pack of Windows Server 2019 User CALs",null,"TS2L4-CALUSER","TS2L4-CALUSER","871175-A21",22,"1-pack of Windows Server 2019 Device CALs",null,"TS2L4-CALDEV","TS2L4-CALDEV","871176-A21",22,"Microsoft Windows Server 2019 Datacenter Edition Additional License 16 Core",1,"TS2L4-WINDC2","TS2L4-WINDC2","871166-A21",2105,"Microsoft Windows Server 2019 Datacenter Edition Additional License 2 Core",2,"S2-871168-A21","S2-871168-A21",{"$f":"\"\"","v":""},530]
["CentOS 7.0",1,"TS2L4-LINUX","TS2L4-LINUX",null,50,"None",{"$f":"\"\"","v":""},{"$f":"\"\"","v":""},{"$f":"\"\"","v":""},{"$f":"\"\"","v":""},0,"None",{"$f":"\"\"","v":""},{"$f":"\"\"","v":""},{"$f":"\"\"","v":""},{"$f":"\"\"","v":""},0,{"$f":"\"\"","v":""},0,{"$f":"\"\"","v":""},{"$f":"\"\"","v":""},{"$f":"\"\"","v":""},0,{"$f":"\"\"","v":""},0,{"$f":"\"\"","v":""},{"$f":"\"\"","v":""},{"$f":"\"\"","v":""},0]
["Dl580 PREST 2CPU"]
["No Operating System",{"$f":"\"\"","v":""},{"$f":"\"\"","v":""},{"$f":"\"\"","v":""},{"$f":"\"\"","v":""},{"$f":"\"\"","v":""},"None",{"$f":"\"\"","v":""},{"$f":"\"\"","v":""},{"$f":"\"\"","v":""},{"$f":"\"\"","v":""},0,"None",{"$f":"\"\"","v":""},{"$f":"\"\"","v":""},{"$f":"\"\"","v":""},{"$f":"\"\"","v":""},0,{"$f":"\"\"","v":""},0,{"$f":"\"\"","v":""},{"$f":"\"\"","v":""},{"$f":"\"\"","v":""},0,{"$f":"\"\"","v":""},0,{"$f":"\"\"","v":""},{"$f":"\"\"","v":""},{"$f":"\"\"","v":""},0]
["Microsoft Windows Server 2019 Standard Edition ROK 16 Core",1,"TS2L4-WIN1","TS2L4-WIN1","871148-B21",556,"1-pack of Windows Server 2019 User CALs",null,"TS2L4-CALUSER","TS2L4-CALUSER","871175-A21",22,"1-pack of Windows Server 2019 Device CALs",null,"TS2L4-CALDEV","TS2L4-CALDEV","871176-A21",22,"Microsoft Windows Server 2019 Standard Edition Additional License 16 Core",4,"TS2L4-WIN2","TS2L4-WIN2","871157-A21",526,"Microsoft Windows Server 2019 Standard Edition Additional License 2 Core",4,"TS1L2-WIN2CORE","TS1L2-WIN2CORE","871159-A21",56]
["Microsoft Windows Server 2019 Datacenter Edition ROK 16 Core",1,"TS2L4-WINDC1","TS2L4-WINDC1","871153-B21",2174,"1-pack of Windows Server 2019 User CALs",null,"TS2L4-CALUSER","TS2L4-CALUSER","871175-A21",22,"1-pack of Windows Server 2019 Device CALs",null,"TS2L4-CALDEV","TS2L4-CALDEV","871176-A21",22,"Microsoft Windows Server 2019 Datacenter Edition Additional License 16 Core",4,"TS2L4-WINDC2","TS2L4-WINDC2","871166-A21",2105,{"$f":"\"\"","v":""},0,{"$f":"\"\"","v":""},{"$f":"\"\"","v":""},{"$f":"\"\"","v":""},0]
["CentOS 7.0",1,"TS2L4-LINUX","TS2L4-LINUX",null,50,"None",{"$f":"\"\"","v":""},{"$f":"\"\"","v":""},{"$f":"\"\"","v":""},{"$f":"\"\"","v":""},0,"None",{"$f":"\"\"","v":""},{"$f":"\"\"","v":""},{"$f":"\"\"","v":""},{"$f":"\"\"","v":""},0,{"$f":"\"\"","v":""},0,{"$f":"\"\"","v":""},{"$f":"\"\"","v":""},{"$f":"\"\"","v":""},0,{"$f":"\"\"","v":""},0,{"$f":"\"\"","v":""},{"$f":"\"\"","v":""},{"$f":"\"\"","v":""},0]
[]
[]
[]
[]
["Microsoft Windows Server 2019 Standard Edition ROK 16 Core",null,"TS2L4-WIN1","TS2L4-WIN1","871148-B21",551,"1-pack of Windows Server 2019 User CALs",null,"TS2L4-CALUSER","TS2L4-CALUSER","871175-A21",22,"1-pack of Windows Server 2019 Device CALs",null,"TS2L4-CALDEV","TS2L4-CALDEV","871176-A21",22]
["Microsoft Windows Server 2019 Standard Edition Additional License 16 Core",null,"TS2L4-WIN2","TS2L4-WIN2","871157-A21",551]
["Microsoft Windows Server 2019 Standard Edition Additional License 2 Core",null,"TS2L4-WIN2CORE","TS2L4-WIN2CORE","871159-A21",54]
[]
["Microsoft Windows Server 2019 Datacenter Edition ROK 16 Core",null,"TS2L4-WINDC1","TS2L4-WINDC1","871153-B21",2159,"1-pack of Windows Server 2019 User CALs",null,"TS2L4-CALUSER","TS2L4-CALUSER","871175-A21",22,"1-pack of Windows Server 2019 Device CALs",null,"TS2L4-CALDEV","TS2L4-CALDEV","871176-A21",22]
["Microsoft Windows Server 2019 Datacenter Edition Additional License 16 Core",null,"TS2L4-WINDC2","TS2L4-WINDC2","871166-A21",2159]
[]
["CentOS 7.0",null,"TS2L4-LINUX","TS2L4-LINUX",null,49]
[]
[]
[]
["None",{"$f":"\"\"","v":""},{"$f":"\"\"","v":""},{"$f":"\"\"","v":""},{"$f":"\"\"","v":""},0]
["VMware vSphere Standard 1 Processor 3yr Software",1,"TS2L4-VMWSTD1P3Y","TS2L4-VMWSTD1P3Y","BD711A",1506]
["VMware vSphere Enterprise Plus 1 Processor 3yr Software",1,"TS2L4-VMWEP1P3Y","TS2L4-VMWEP1P3Y","BD715A",4734]
["VMware vSphere Standard 1 Processor 5yr Software",1,"TS2L4-VMWSTD1P5Y","TS2L4-VMWSTD1P5Y","BD512A",1933]
["VMware vSphere Enterprise Plus 1 Processor 5yr Software",1,"TS2L4-VMWEP1P5Y","TS2L4-VMWEP1P5Y","BD514A",5889]
["None",0,{"$f":"\"\"","v":""},{"$f":"\"\"","v":""},{"$f":"\"\"","v":""},0]
["VMware vSphere Essentials Plus Kit 6 Processor 3yr",1,"TS2L4-VMWKIT6P3Y","TS2L4-VMWKIT6P3Y","F6M49A",5052]
["VMware vSphere Essentials Plus Kit 6 Processor 5yr",1,"TS2L4-VMWKIT6P5Y","TS2L4-VMWKIT6P5Y","F6M50A",6284]
["None",0,{"$f":"\"\"","v":""},{"$f":"\"\"","v":""},{"$f":"\"\"","v":""},0]
["VMware vCenter Server Standard for vSphere 3yr SW",1,"TS2L4-VMWVCSTD3Y","TS2L4-VMWVCSTD3Y","P9U41A",8240]
["VMware vCenter Server Standard for vSphere 5yr SW",1,"TS2L4-VMWVCSTD5Y","TS2L4-VMWVCSTD5Y","P9U42A",10251]
[]
[]
["None",0,{"$f":"\"\"","v":""},{"$f":"\"\"","v":""},{"$f":"\"\"","v":""},0]
["VMware vSAN Standard OEM  1 Processor 3yr Software A20",1,"TS2L4-VSANSTD3Y","TS2L4-VSANSTD3Y","G4Y18AAE",3611]
["VMware vSAN Advanced OEM  1 Processor 3yr Software A20",1,"TS2L4-VSANADV3Y","TS2L4-VSANADV3Y","P9H45AAE",5543]
[]
["None",0,{"$f":"\"\"","v":""},{"$f":"\"\"","v":""},{"$f":"\"\"","v":""},0]
["HPE 32GB Dual microSD USB Flash Drive",1,"TS2L4-DUAL32GB","TS2L4-DUAL32GB",null,306]
[]
[]
["_SavePDFon"]
["_SavePDFoff"]

{"sheet":"PCI","index":7,"n_rows":312,"n_cols":16,"rows_kept":312,"cut":false,"hidden":true,"merged":[[233,0,234,9]]}
[]
["HDD Bay2",null,0,{"$f":"\"\"","v":""},{"$f":"\"\"","v":""},{"$f":"\"\"","v":""},0]
[null,null,1,"TS2L4-SASBAY2","872235-B21",{"$f":"\"\"","v":""},770]
["HDD Bay1",null,0,{"$f":"\"\"","v":""},{"$f":"\"\"","v":""},{"$f":"\"\"","v":""},0]
[null,null,1,"TS2L4-SASBAY1","872233-B21 ;  873444-B21",{"$f":"\"\"","v":""},1030]
[]
["Secondary Riser",null,0,{"$f":"\"\"","v":""},{"$f":"\"\"","v":""},{"$f":"\"\"","v":""},0]
[null,null,1,"S2-870548-B21","870548-B21",{"$f":"\"\"","v":""},109]
["Secondary Riser (for GPU)",null,0,{"$f":"\"\"","v":""},{"$f":"\"\"","v":""},{"$f":"\"\"","v":""},0]
[null,null,1,"TS2L4-GPURSRKIT","826704-B21",{"$f":"\"\"","v":""},87]
["Tertiary riser",null,0,{"$f":"\"\"","v":""},{"$f":"\"\"","v":""},{"$f":"\"\"","v":""},0]
[null,null,1,"TS2L4-3RISER","872253-B21",{"$f":"\"\"","v":""},285]
["9-slot Sec Riser",null,0,{"$f":"\"\"","v":""},{"$f":"\"\"","v":""},{"$f":"\"\"","v":""},0]
[null,null,1,"S2-9SlotRiser","872340 830272",{"$f":"\"\"","v":""},671]
["Additional Card for PCIe Slot 1"]
["DL560"]
["None","","","","","","",0,null,""]
["[TS2L4-LAN1] HPE Ethernet 1Gb 2-port 332T Adapter",1,"TS2L4-LAN1","TS2L4-LAN1","615732-B21",32,"",0,null,""]
["[TS2L4-LAN10] HPE Ethernet 10Gb 2-port 530SFP Adapter",1,"TS2L4-LAN10","TS2L4-LAN10","652503-B21",357,"HPE BLc 10G SFP+ SR Transceiver",2,null,"455883-B21"]
["[TS2L4-CNA10] HPE CN1100R 2P Converged Network Adapter ",1,"TS2L4-CNA10","TS2L4-CNA10"," QW990A",723,"HPE BLc 10G SFP+ SR Transceiver",2,null,"455883-B21"]
["[TS2L4-FC16] HPE StoreFabric SN1100Q 16Gb Dual Port Fibre Channel HBA",1,"TS2L4-FC16","TS2L4-FC16","P9D94A",356,"",0,null,""]
[{"$f":"\"\"","v":""},{"$f":"\"\"","v":""},{"$f":"\"\"","v":""},{"$f":"\"\"","v":""},{"$f":"\"\"","v":""},{"$f":"\"\"","v":""},{"$f":"\"\"","v":""},{"$f":"\"\"","v":""},{"$f":"\"\"","v":""},{"$f":"\"\"","v":""}]
[":._.:.:*~*:._.:*~*:._.:*~*:._.: Componenti 20% .:*~*:._.:*~*:._.:*~*:._.:*~*:._.:",{"$f":"\"\"","v":""},{"$f":"\"\"","v":""},{"$f":"\"\"","v":""},{"$f":"\"\"","v":""},{"$f":"\"\"","v":""},{"$f":"\"\"","v":""},{"$f":"\"\"","v":""},{"$f":"\"\"","v":""},{"$f":"\"\"","v":""}]
["[TS2L4-530T] HPE Ethernet 10Gb 2-port 530T Adapter",1,"TS2L4-530T","TS2H-530T","656596-B21",null,null,null,298,{"$f":"\"\"","v":""}]
["[TS2L4-521T] HPE Ethernet 10Gb 2-port 521T Adapter",1,"TS2L4-521T","TS2H-521T","867707-B21",null,null,null,298,{"$f":"\"\"","v":""}]
["[TS2L4-640SFP28] HPE Ethernet 10/25Gb 2-port 640SFP28 Adapter",1,"TS2L4-640SFP28","TS2L4-640SFP28",null,null,null,null,467]
["[TS2L4-562SFP] HPE Ethernet 10Gb 2-port 562SFP+ Adapter",1,"TS2L4-562SFP","TS2H-562SFP","727055-B21",null,null,null,380,{"$f":"\"\"","v":""}]
["[TS2L4-841QSFP28] HPE InfiniBand EDR 100Gb 1-port 841QSFP28 Adapter",1,"TS2L4-841QSFP28","TS2H-841QSFP28","872725-B21",null,null,null,2699,{"$f":"\"\"","v":""}]
["[TS2L4-OP101] HPE 100Gb 1-port OP101 QSFP28 x16 PCIe Gen3 with Intel Omni-Path Architecture Adapter",1,"TS2L4-OP101","TS2H-OP101","829335-B21",null,null,null,554,{"$f":"\"\"","v":""}]
["HPE DL5x0 Gen10 12Gb SAS Expander Card Kit with Cables",1,"TS2L4-SASBAY1","TS2L4-SASBAY1","873444-B21"]
["Additional Card for PCIe Slot 2/3"]
["DL560"]
["None","","","","","","",0,null,""]
["[TS2L4-LAN1] HPE Ethernet 1Gb 2-port 332T Adapter",1,"TS2L4-LAN1","TS2L4-LAN1","615732-B21",32,"",0,null,""]
["[TS2L4-LAN10] HPE Ethernet 10Gb 2-port 530SFP Adapter",1,"TS2L4-LAN10","TS2L4-LAN10","652503-B21",357,"HPE BLc 10G SFP+ SR Transceiver",2,null,"455883-B21"]
["[TS2L4-CNA10] HPE CN1100R 2P Converged Network Adapter ",1,"TS2L4-CNA10","TS2L4-CNA10"," QW990A",723,"HPE BLc 10G SFP+ SR Transceiver",2,null,"455883-B21"]
["[TS2L4-FC16] HPE StoreFabric SN1100Q 16Gb Dual Port Fibre Channel HBA",1,"TS2L4-FC16","TS2L4-FC16","P9D94A",356,"",0,null,""]
[{"$f":"\"\"","v":""},{"$f":"\"\"","v":""},{"$f":"\"\"","v":""},{"$f":"\"\"","v":""},{"$f":"\"\"","v":""},{"$f":"\"\"","v":""},{"$f":"\"\"","v":""},{"$f":"\"\"","v":""},{"$f":"\"\"","v":""},{"$f":"\"\"","v":""}]
[":._.:.:*~*:._.:*~*:._.:*~*:._.: Componenti 20% .:*~*:._.:*~*:._.:*~*:._.:*~*:._.:",{"$f":"\"\"","v":""},{"$f":"\"\"","v":""},{"$f":"\"\"","v":""},{"$f":"\"\"","v":""},{"$f":"\"\"","v":""},{"$f":"\"\"","v":""},{"$f":"\"\"","v":""},{"$f":"\"\"","v":""},{"$f":"\"\"","v":""}]
["[TS2L4-530T] HPE Ethernet 10Gb 2-port 530T Adapter",1,"TS2L4-530T","TS2H-530T","656596-B21",null,null,null,298,{"$f":"\"\"","v":""}]
["[TS2L4-521T] HPE Ethernet 10Gb 2-port 521T Adapter",1,"TS2L4-521T","TS2H-521T","867707-B21",null,null,null,298,{"$f":"\"\"","v":""}]
["[TS2L4-640SFP28] HPE Ethernet 10/25Gb 2-port 640SFP28 Adapter",1,"TS2L4-640SFP28","TS2L4-640SFP28",null,null,null,null,467]
["[TS2L4-562SFP] HPE Ethernet 10Gb 2-port 562SFP+ Adapter",1,"TS2L4-562SFP","TS2H-562SFP","727055-B21",null,null,null,380,{"$f":"\"\"","v":""}]
["[TS2L4-E208EP] HPE Smart Array E208e-p SR Gen10",1,"TS2L4-E208EP","TS2L4-E208EP",null,null,null,null,218]
["[TS2L4-841QSFP28] HPE InfiniBand EDR 100Gb 1-port 841QSFP28 Adapter",1,"TS2L4-841QSFP28","TS2H-841QSFP28","872725-B21",null,null,null,2699,{"$f":"\"\"","v":""}]
["[TS2L4-OP101] HPE 100Gb 1-port OP101 QSFP28 x16 PCIe Gen3 with Intel Omni-Path Architecture Adapter",1,"TS2L4-OP101","TS2H-OP101","829335-B21",null,null,null,554,{"$f":"\"\"","v":""}]
[]
["Additional Card for PCIe Slot 3"]
["DL560"]
["None","","","","","","",0,null,""]
["[TS2L4-LAN1] HPE Ethernet 1Gb 2-port 332T Adapter",1,"TS2L4-LAN1","TS2L4-LAN1","615732-B21",32,"",0,null,""]
["[TS2L4-LAN10] HPE Ethernet 10Gb 2-port 530SFP Adapter",1,"TS2L4-LAN10","TS2L4-LAN10","652503-B21",357,"HPE BLc 10G SFP+ SR Transceiver",2,null,"455883-B21"]
["[TS2L4-CNA10] HPE CN1100R 2P Converged Network Adapter ",1,"TS2L4-CNA10","TS2L4-CNA10"," QW990A",723,"HPE BLc 10G SFP+ SR Transceiver",2,null,"455883-B21"]
["[TS2L4-FC16] HPE StoreFabric SN1100Q 16Gb Dual Port Fibre Channel HBA",1,"TS2L4-FC16","TS2L4-FC16","P9D94A",356,"",0,null,""]
[":._.:.:*~*:._.:*~*:._.:*~*:._.: Componenti 20% .:*~*:._.:*~*:._.:*~*:._.:*~*:._.:",{"$f":"\"\"","v":""},{"$f":"\"\"","v":""},{"$f":"\"\"","v":""},{"$f":"\"\"","v":""},{"$f":"\"\"","v":""},{"$f":"\"\"","v":""},{"$f":"\"\"","v":""},{"$f":"\"\"","v":""},{"$f":"\"\"","v":""}]
["[TS2L4-530T] HPE Ethernet 10Gb 2-port 530T Adapter",1,"TS2L4-530T","TS2L4-530T","656596-B21",null,null,null,298]
["[TS2L4-521T] HPE Ethernet 10Gb 2-port 521T Adapter",1,"TS2L4-521T","TS2L4-521T","867707-B21",null,null,null,298]
["[TS2L4-640SFP28] HPE Ethernet 10/25Gb 2-port 640SFP28 Adapter",1,"TS2L4-640SFP28","TS2L4-640SFP28",null,null,null,null,467]
["[TS2L4-562SFP] HPE Ethernet 10Gb 2-port 562SFP+ Adapter",1,"TS2L4-562SFP","TS2L4-562SFP","727055-B21",null,null,null,380]
["[TS2L4-E208EP] HPE Smart Array E208e-p SR Gen10",1,"TS2L4-E208EP","TS2L4-E208EP",null,null,null,null,218]
["[TS2L4-841QSFP28] HPE InfiniBand EDR 100Gb 1-port 841QSFP28 Adapter",1,"TS2L4-841QSFP28","TS2L4-841QSFP28","872725-B21",null,null,null,481]
[]
["Additional Card for PCIe Slot 4/5/6"]
["DL560"]
["None","","","","","","",0,null,""]
["[TS2L4-LAN1] HPE Ethernet 1Gb 2-port 332T Adapter",1,"TS2L4-LAN1","TS2L4-LAN1","615732-B21",32,"",0,null,""]
["[TS2L4-LAN10] HPE Ethernet 10Gb 2-port 530SFP Adapter",1,"TS2L4-LAN10","TS2L4-LAN10","652503-B21",357,"HPE BLc 10G SFP+ SR Transceiver",2,null,"455883-B21"]
["[TS2L4-CNA10] HPE CN1100R 2P Converged Network Adapter ",1,"TS2L4-CNA10","TS2L4-CNA10"," QW990A",723,"HPE BLc 10G SFP+ SR Transceiver",2,null,"455883-B21"]
["[TS2L4-FC16] HPE StoreFabric SN1100Q 16Gb Dual Port Fibre Channel HBA",1,"TS2L4-FC16","TS2L4-FC16","P9D94A",356,"",0,null,""]
[":._.:.:*~*:._.:*~*:._.:*~*:._.: Componenti 20% .:*~*:._.:*~*:._.:*~*:._.:*~*:._.:",{"$f":"\"\"","v":""},{"$f":"\"\"","v":""},{"$f":"\"\"","v":""},{"$f":"\"\"","v":""},{"$f":"\"\"","v":""},{"$f":"\"\"","v":""},{"$f":"\"\"","v":""},{"$f":"\"\"","v":""},{"$f":"\"\"","v":""}]
["[TS2L4-530T] HPE Ethernet 10Gb 2-port 530T Adapter",1,"TS2L4-530T","TS2L4-530T","656596-B21",null,null,null,298]
["[TS2L4-521T] HPE Ethernet 10Gb 2-port 521T Adapter",1,"TS2L4-521T","TS2L4-521T","867707-B21",null,null,null,298]
["[TS2L4-640SFP28] HPE Ethernet 10/25Gb 2-port 640SFP28 Adapter",1,"TS2L4-640SFP28","TS2L4-640SFP28",null,null,null,null,467]
["[TS2L4-562SFP] HPE Ethernet 10Gb 2-port 562SFP+ Adapter",1,"TS2L4-562SFP","TS2L4-562SFP","727055-B21",null,null,null,380]
["[TS2L4-841QSFP28] HPE InfiniBand EDR 100Gb 1-port 841QSFP28 Adapter",1,"TS2L4-841QSFP28","TS2L4-841QSFP28","872725-B21",null,null,null,481]
[]
["Additional Card for PCIe Slot 5"]
["DL560"]
["None","","","","","","",0,null,""]
["[TS2L4-LAN1] HPE Ethernet 1Gb 2-port 332T Adapter",1,"TS2L4-LAN1","TS2L4-LAN1","615732-B21",32,"",0,null,""]
["[TS2L4-LAN10] HPE Ethernet 10Gb 2-port 530SFP Adapter",1,"TS2L4-LAN10","TS2L4-LAN10","652503-B21",377,"HPE BLc 10G SFP+ SR Transceiver",2,null,"455883-B21"]
["[TS2L4-CNA10] HPE CN1100R 2P Converged Network Adapter ",1,"TS2L4-CNA10","TS2L4-CNA10"," QW990A",723,"HPE BLc 10G SFP+ SR Transceiver",2,null,"455883-B21"]
["[TS2L4-FC16] HPE StoreFabric SN1100Q 16Gb Dual Port Fibre Channel HBA",1,"TS2L4-FC16","TS2L4-FC16","P9D94A",356,"",0,null,""]
[{"$f":"\"\"","v":""},{"$f":"\"\"","v":""},{"$f":"\"\"","v":""},{"$f":"\"\"","v":""},{"$f":"\"\"","v":""},{"$f":"\"\"","v":""},{"$f":"\"\"","v":""},{"$f":"\"\"","v":""},{"$f":"\"\"","v":""},{"$f":"\"\"","v":""}]
[":._.:.:*~*:._.:*~*:._.:*~*:._.: Componenti 20% .:*~*:._.:*~*:._.:*~*:._.:*~*:._.:",{"$f":"\"\"","v":""},{"$f":"\"\"","v":""},{"$f":"\"\"","v":""},{"$f":"\"\"","v":""},{"$f":"\"\"","v":""},{"$f":"\"\"","v":""},{"$f":"\"\"","v":""},{"$f":"\"\"","v":""},{"$f":"\"\"","v":""}]
["[TS2L4-P2000GPU] HPE NVIDIA Quadro P2000 GPU Module",1,"TS2L4-P2000GPU","TS2H-P2000GPU","Q0V77A",null,null,null,690]
["[TS2L4-530T] HPE Ethernet 10Gb 2-port 530T Adapter",1,"TS2L4-530T","TS2H-530T","656596-B21",null,null,null,298,{"$f":"\"\"","v":""}]
["[TS2L4-521T] HPE Ethernet 10Gb 2-port 521T Adapter",1,"TS2L4-521T","TS2H-521T","867707-B21",null,null,null,298,{"$f":"\"\"","v":""}]
["[TS2L4-640SFP28] HPE Ethernet 10/25Gb 2-port 640SFP28 Adapter",1,"TS2L4-640SFP28","TS2L4-640SFP28",null,null,null,null,467]
["[TS2L4-562SFP] HPE Ethernet 10Gb 2-port 562SFP+ Adapter",1,"TS2L4-562SFP","TS2H-562SFP","727055-B21",null,null,null,380,{"$f":"\"\"","v":""}]
["[TS2L4-841QSFP28] HPE InfiniBand EDR 100Gb 1-port 841QSFP28 Adapter",1,"TS2L4-841QSFP28","TS2H-841QSFP28","872725-B21",null,null,null,2699,{"$f":"\"\"","v":""}]
["[TS2L4-OP101] HPE 100Gb 1-port OP101 QSFP28 x16 PCIe Gen3 with Intel Omni-Path Architecture Adapter",1,"TS2L4-OP101","TS2H-OP101","829335-B21",null,null,null,554,{"$f":"\"\"","v":""}]
["Additional Card for PCIe Slot 6"]
["DL560"]
["None","","","","","","",0,null,""]
["[TS2L4-LAN1] HPE Ethernet 1Gb 2-port 332T Adapter",1,"TS2L4-LAN1","TS2L4-LAN1","615732-B21",32,"",0,null,""]
["[TS2L4-LAN10] HPE Ethernet 10Gb 2-port 530SFP Adapter",1,"TS2L4-LAN10","TS2L4-LAN10","652503-B21",357,"HPE BLc 10G SFP+ SR Transceiver",2,null,"455883-B21"]
["[TS2L4-CNA10] HPE CN1100R 2P Converged Network Adapter ",1,"TS2L4-CNA10","TS2L4-CNA10"," QW990A",723,"HPE BLc 10G SFP+ SR Transceiver",2,null,"455883-B21"]
["[TS2L4-FC16] HPE StoreFabric SN1100Q 16Gb Dual Port Fibre Channel HBA",1,"TS2L4-FC16","TS2L4-FC16","P9D94A",356,"",0,null,""]
[":._.:.:*~*:._.:*~*:._.:*~*:._.: Componenti 20% .:*~*:._.:*~*:._.:*~*:._.:*~*:._.:",{"$f":"\"\"","v":""},{"$f":"\"\"","v":""},{"$f":"\"\"","v":""},{"$f":"\"\"","v":""},{"$f":"\"\"","v":""},{"$f":"\"\"","v":""},{"$f":"\"\"","v":""},{"$f":"\"\"","v":""},{"$f":"\"\"","v":""}]
["[TS2L4-530T] HPE Ethernet 10Gb 2-port 530T Adapter",1,"TS2L4-530T","TS2L4-530T","656596-B21",null,null,null,298]
["[TS2L4-521T] HPE Ethernet 10Gb 2-port 521T Adapter",1,"TS2L4-521T","TS2L4-521T","867707-B21",null,null,null,298]
["[TS2L4-640SFP28] HPE Ethernet 10/25Gb 2-port 640SFP28 Adapter",1,"TS2L4-640SFP28","TS2L4-640SFP28",null,null,null,null,467]
["[TS2L4-536FLR] HPE FlexFabric 10Gb 4-port 536FLR-T Adapter",1,"TS2L4-536FLR","TS2L4-536FLR","764302-B21",null,null,null,610]
["[TS2L4-562SFP] HPE Ethernet 10Gb 2-port 562SFP+ Adapter",1,"TS2L4-562SFP","TS2L4-562SFP","727055-B21",null,null,null,380]
["[TS2L4-841QSFP28] HPE InfiniBand EDR 100Gb 1-port 841QSFP28 Adapter",1,"TS2L4-841QSFP28","TS2L4-841QSFP28","872725-B21",null,null,null,481]
[]
["Additional Card for PCIe Slot 7/8"]
["DL560"]
["None","","","","","","",0,null,""]
["[TS2L4-LAN1] HPE Ethernet 1Gb 2-port 332T Adapter",1,"TS2L4-LAN1","TS2L4-LAN1","615732-B21",32,"",0,null,""]
["[TS2L4-LAN10] HPE Ethernet 10Gb 2-port 530SFP Adapter",1,"TS2L4-LAN10","TS2L4-LAN10","652503-B21",357,"HPE BLc 10G SFP+ SR Transceiver",2,null,"455883-B21"]
["[TS2L4-CNA10] HPE CN1100R 2P Converged Network Adapter ",1,"TS2L4-CNA10","TS2L4-CNA10"," QW990A",723,"HPE BLc 10G SFP+ SR Transceiver",2,null,"455883-B21"]
["[TS2L4-FC16] HPE StoreFabric SN1100Q 16Gb Dual Port Fibre Channel HBA",1,"TS2L4-FC16","TS2L4-FC16","P9D94A",356,"",0,null,""]
[":._.:.:*~*:._.:*~*:._.:*~*:._.: Componenti 20% .:*~*:._.:*~*:._.:*~*:._.:*~*:._.:",{"$f":"\"\"","v":""},{"$f":"\"\"","v":""},{"$f":"\"\"","v":""},{"$f":"\"\"","v":""},{"$f":"\"\"","v":""},{"$f":"\"\"","v":""},{"$f":"\"\"","v":""},{"$f":"\"\"","v":""},{"$f":"\"\"","v":""}]
["[TS2L4-530T] HPE Ethernet 10Gb 2-port 530T Adapter",1,"TS2L4-530T","TS2L4-530T","656596-B21",null,null,null,298]
["[TS2L4-521T] HPE Ethernet 10Gb 2-port 521T Adapter",1,"TS2L4-521T","TS2L4-521T","867707-B21",null,null,null,298]
["[TS2L4-640SFP28] HPE Ethernet 10/25Gb 2-port 640SFP28 Adapter",1,"TS2L4-640SFP28","TS2L4-640SFP28",null,null,null,null,467]
["[TS2L4-562SFP] HPE Ethernet 10Gb 2-port 562SFP+ Adapter",1,"TS2L4-562SFP","TS2L4-562SFP","727055-B21",null,null,null,380]
["[TS2L4-841QSFP28] HPE InfiniBand EDR 100Gb 1-port 841QSFP28 Adapter",1,"TS2L4-841QSFP28","TS2L4-841QSFP28","872725-B21",null,null,null,481]
[]
[]
["Additional Card for PCIe Slot 9 OCCUPATO"]
["DL580"]
["None","","","","","","",0,null,""]
["HPE Ethernet 1Gb 2P 332T Adptr",1,"10L2-LAN1GB","S10L1-DL560-LAN1","615732-B21",35,"",0,null,""]
["HPE Ethernet 10Gb 2P 530SFP+ Adptr",1,"10L2-LAN10GB","S10L1-DL560-LAN10","652503-B21",716,"HPE BLc 10G SFP+ SR Transceiver",2,null,"455883-B21"]
["HPE StoreFabric CN1200E 10Gb CNA",1,"10L2-CNA10","S10L1-DL560-CNA10","E7Y06A",778,"HPE BLc 10G SFP+ SR Transceiver",2,null,"455883-B21"]
["HPE 82Q 8Gb Dual Port PCI-e FC HBA",1,"10L2-FC","S10L1-DL560-FC","AJ764A",889,null,0,null,""]
[]
["Additional Card for PCIe Slot 8",null,null,null,null,null,null,null,null,null,null,1671,{"$f":"L131/100","v":16.71},{"$f":"M131*25","v":417.75},{"$f":"N131+L131","v":2088.75},2100]
["DL580"]
["None","","","","","","",0,null,""]
["HPE Ethernet 1Gb 2-port 332T Adapter",1,"TS2L4-1GB","TS2L4-1GB","615732-B21",29,"",0,null,""]
["HPE Ethernet 10Gb 2-port 530SFP Adapter",1,"TS2L4-10GB","TS2L4-10GB","652503-B21",259,"HPE BLc 10G SFP+ SR Transceiver",2,null,"455883-B21"]
["HPE StoreFabric CN1200E 10Gb Converged Network Adapter",1,"TS2L4-CNA","TS2L4-CNA","E7Y06A",720,"HPE BLc 10G SFP+ SR Transceiver",2,null,"455883-B21"]
["HPE Ethernet 10Gb 2P 530T Adapter",1,"TS1-656596","TS1-656596","656596-B21",null,null,null,298]
["HPE Ethernet 10Gb 2-port 521T Adapter",1,"TS1-867707","TS1-867707","867707-B21",null,null,null,298]
["HPE 82Q 8Gb 2-port PCIe Fibre Channel Host Bus Adapter",1,"TS2L4-FC","TS2L4-FC","AJ764A",356,null,0,null,""]
["HPE StoreFabric SN1100Q 16Gb Dual Port Fibre Channel Host Bus Adapter",1,"S2-P9D94A","S2-P9D94A","P9D94A",0,"",0,584,""]
[]
["Additional Card for PCIe Slot 7"]
["DL580"]
["None","","","","","","",0,null,""]
["HPE Ethernet 1Gb 2-port 332T Adapter",1,"TS2L4-1GB","TS2L4-1GB-ALT","615732-B21",29,"",0,null,""]
["HPE Ethernet 10Gb 2-port 530SFP Adapter",1,"TS2L4-10GB","TS2L4-10GB-ALT","652503-B21",259,"HPE BLc 10G SFP+ SR Transceiver",2,null,"455883-B21"]
["HPE StoreFabric CN1200E 10Gb Converged Network Adapter",1,"TS2L4-CNA","TS2L4-CNA-ALT","E7Y06A",720,"HPE BLc 10G SFP+ SR Transceiver",2,null,"455883-B21"]
["HPE Ethernet 10Gb 2P 530T Adapter",1,"TS1-656596","TS1-656596","656596-B21",null,null,null,298]
["HPE Ethernet 10Gb 2-port 521T Adapter",1,"TS1-867707","TS1-867707","867707-B21",null,null,null,298]
["HPE 82Q 8Gb 2-port PCIe Fibre Channel Host Bus Adapter",1,"TS2L4-FC","TS2L4-FC","AJ764A",356,null,0,null,""]
["HPE StoreFabric SN1100Q 16Gb Dual Port Fibre Channel Host Bus Adapter",1,"S2-P9D94A","S2-P9D94A-ALT","P9D94A",0,"",0,584,""]
[]
["Additional Card for PCIe Slot 6"]
["DL580 Slot 48HDD"]
["None","","","","","","",0,null,""]
["HPE Ethernet 1Gb 2-port 332T Adapter",1,"TS2L4-1GB","TS2L4-1GB-ALT","615732-B21",29,"",0,null,""]
["HPE DL580 Gen10 12G 24-port SAS Expander",1,"","","881101-B21"]
["HPE Smart Array P408i-p SR Gen10 Ctrlr",1,"","","830824-B21"]
["HPE Ethernet 10Gb 2-port 530SFP Adapter",1,"TS2L4-10GB","TS2L4-10GB-ALT","652503-B21",259,"HPE BLc 10G SFP+ SR Transceiver",2,null,"455883-B21"]
["HPE StoreFabric CN1200E 10Gb Converged Network Adapter",1,"TS2L4-CNA","TS2L4-CNA-ALT","E7Y06A",720,"HPE BLc 10G SFP+ SR Transceiver",2,null,"455883-B21"]
["HPE Ethernet 10Gb 2P 530T Adapter",1,"TS1-656596","TS1-656596","656596-B21",null,null,null,298]
["HPE Ethernet 10Gb 2-port 521T Adapter",1,"TS1-867707","TS1-867707","867707-B21",null,null,null,298]
["HPE 82Q 8Gb 2-port PCIe Fibre Channel Host Bus Adapter",1,"TS2L4-FC","TS2L4-FC","AJ764A",356,null,0,null,""]
["HPE StoreFabric SN1100Q 16Gb Dual Port Fibre Channel Host Bus Adapter",1,"S2-P9D94A","S2-P9D94A-ALT","P9D94A",0,"",0,584,""]
[]
["Additional Card for PCIe Slot 5"]
["DL580"]
["None","","","","","","",0,null,""]
["HPE Ethernet 1Gb 2-port 332T Adapter",1,"TS2L4-1GB","TS2L4-1GB","615732-B21",29,"",0,null,""]
["HPE Ethernet 10Gb 2-port 530SFP Adapter",1,"TS2L4-10GB","TS2L4-10GB","652503-B21",259,"HPE BLc 10G SFP+ SR Transceiver",2,null,"455883-B21"]
["HPE StoreFabric CN1200E 10Gb Converged Network Adapter",1,"TS2L4-CNA","TS2L4-CNA","E7Y06A",720,"HPE BLc 10G SFP+ SR Transceiver",2,null,"455883-B21"]
["HPE Ethernet 10Gb 2P 530T Adapter",1,"TS1-656596","TS1-656596","656596-B21",null,null,null,298]
["HPE Ethernet 10Gb 2-port 521T Adapter",1,"TS1-867707","TS1-867707","867707-B21",null,null,null,298]
["HPE 82Q 8Gb 2-port PCIe Fibre Channel Host Bus Adapter",1,"TS2L4-FC","TS2L4-FC","AJ764A",356,null,0,null,""]
["HPE StoreFabric SN1100Q 16Gb Dual Port Fibre Channel Host Bus Adapter",1,"S2-P9D94A","S2-P9D94A","P9D94A",0,"",0,584,""]
[]
["Additional Card for PCIe Slot 4"]
["DL580"]
["None","","","","","","",0,null,""]
["HPE Ethernet 1Gb 2-port 332T Adapter",1,"TS2L4-1GB","TS2L4-1GB","615732-B21",29,"",0,null,""]
["HPE Ethernet 10Gb 2-port 530SFP Adapter",1,"TS2L4-10GB","TS2L4-10GB","652503-B21",259,"HPE BLc 10G SFP+ SR Transceiver",2,null,"455883-B21"]
["HPE StoreFabric CN1200E 10Gb Converged Network Adapter",1,"TS2L4-CNA","TS2L4-CNA","E7Y06A",720,"HPE BLc 10G SFP+ SR Transceiver",2,null,"455883-B21"]
["HPE Ethernet 10Gb 2P 530T Adapter",1,"TS1-656596","TS1-656596","656596-B21",null,null,null,298]
["HPE Ethernet 10Gb 2-port 521T Adapter",1,"TS1-867707","TS1-867707","867707-B21",null,null,null,298]
["HPE 82Q 8Gb 2-port PCIe Fibre Channel Host Bus Adapter",1,"TS2L4-FC","TS2L4-FC","AJ764A",356,null,0,null,""]
["HPE StoreFabric SN1100Q 16Gb Dual Port Fibre Channel Host Bus Adapter",1,"S2-P9D94A","S2-P9D94A","P9D94A",0,"",0,584,""]
["NVIDIA Tesla V100 PCIe 16GB Module",1,"TS1-Q2N68A","TS1-Q2N68A","Q2N68A",null,null,null,10583]
["NVIDIA Tesla P40 24GB Module",1,"TS1-Q0V80A","TS1-Q0V80A","Q0V80A",null,null,null,7552]
["NVIDIA Quadro P6000 GPU Module",1,"TS1-Q0V76A","TS1-Q0V76A","Q0V76A",0,"",0,5310,""]
[]
["Additional Card for PCIe Slot 3"]
["DL580"]
["None","","","","","","",0,null,""]
["HPE Ethernet 1Gb 2-port 332T Adapter",1,"TS2L4-1GB","TS2L4-1GB-ALT","615732-B21",29,"",0,null,""]
["HPE Ethernet 10Gb 2-port 530SFP Adapter",1,"TS2L4-10GB","TS2L4-10GB-ALT","652503-B21",259,"HPE BLc 10G SFP+ SR Transceiver",2,null,"455883-B21"]
["HPE StoreFabric CN1200E 10Gb Converged Network Adapter",1,"TS2L4-CNA","TS2L4-CNA-ALT","E7Y06A",720,"HPE BLc 10G SFP+ SR Transceiver",2,null,"455883-B21"]
["HPE Ethernet 10Gb 2P 530T Adapter",1,"TS1-656596","TS1-656596","656596-B21",null,null,null,298]
["HPE Ethernet 10Gb 2-port 521T Adapter",1,"TS1-867707","TS1-867707","867707-B21",null,null,null,298]
["HPE 82Q 8Gb 2-port PCIe Fibre Channel Host Bus Adapter",1,"TS2L4-FC","TS2L4-FC","AJ764A",356,null,0,null,""]
["HPE StoreFabric SN1100Q 16Gb Dual Port Fibre Channel Host Bus Adapter",1,"S2-P9D94A","S2-P9D94A-ALT","P9D94A",0,"",0,584,""]
[]
["Additional Card for PCIe Slot 2"]
["DL580"]
["None","","","","","","",0,null,""]
["HPE Ethernet 1Gb 2-port 332T Adapter",1,"TS2L4-1GB","TS2L4-1GB-ALT","615732-B21",29,"",0,null,""]
["HPE Ethernet 10Gb 2-port 530SFP Adapter",1,"TS2L4-10GB","TS2L4-10GB-ALT","652503-B21",259,"HPE BLc 10G SFP+ SR Transceiver",2,null,"455883-B21"]
["HPE StoreFabric CN1200E 10Gb Converged Network Adapter",1,"TS2L4-CNA","TS2L4-CNA-ALT","E7Y06A",720,"HPE BLc 10G SFP+ SR Transceiver",2,null,"455883-B21"]
["HPE Ethernet 10Gb 2P 530T Adapter",1,"TS1-656596","TS1-656596","656596-B21",null,null,null,298]
["HPE Ethernet 10Gb 2-port 521T Adapter",1,"TS1-867707","TS1-867707","867707-B21",null,null,null,298]
["HPE 82Q 8Gb 2-port PCIe Fibre Channel Host Bus Adapter",1,"TS2L4-FC","TS2L4-FC","AJ764A",356,null,0,null,""]
["HPE StoreFabric SN1100Q 16Gb Dual Port Fibre Channel Host Bus Adapter",1,"S2-P9D94A","S2-P9D94A-ALT","P9D94A",0,"",0,584,""]
[]
["Additional Card for PCIe Slot 1"]
["DL580"]
["None","","","","","","",0,null,""]
["HPE Ethernet 1Gb 2-port 332T Adapter",1,"TS2L4-1GB","TS2L4-1GB-ALT","615732-B21",29,"",0,null,""]
["HPE Ethernet 10Gb 2-port 530SFP Adapter",1,"TS2L4-10GB","TS2L4-10GB-ALT","652503-B21",259,"HPE BLc 10G SFP+ SR Transceiver",2,null,"455883-B21"]
["HPE StoreFabric CN1200E 10Gb Converged Network Adapter",1,"TS2L4-CNA","TS2L4-CNA-ALT","E7Y06A",720,"HPE BLc 10G SFP+ SR Transceiver",2,null,"455883-B21"]
["HPE Ethernet 10Gb 2P 530T Adapter",1,"TS1-656596","TS1-656596","656596-B21",null,null,null,298]
["HPE Ethernet 10Gb 2-port 521T Adapter",1,"TS1-867707","TS1-867707","867707-B21",null,null,null,298]
["HPE 82Q 8Gb 2-port PCIe Fibre Channel Host Bus Adapter",1,"TS2L4-FC","TS2L4-FC","AJ764A",356,null,0,null,""]
["HPE StoreFabric SN1100Q 16Gb Dual Port Fibre Channel Host Bus Adapter",1,"S2-P9D94A","S2-P9D94A-ALT","P9D94A",0,"",0,584,""]
[]
["Aggiungere Coppia di Processori"]
[]
["Non Disponibile"]
["Aggiungere Secondary Riser"]
["Aggiungere Tertiary riser"]
[]
["Aggiungere 9 slot Secondary Riser"]
[]
[]
[]
["Slot dl560 con 20%"]
[]
["Additional Card for PCIe Slot 1"]
["DL560"]
["None","","","","","","",0,null,""]
["HPE Ethernet 1Gb 2-port 332T Adapter",1,"TS2L4-1GB","TS2L4-1GB","615732-B21",32,"",0,null,""]
["HPE Ethernet 10Gb 2-port 530SFP Adapter",1,"TS2L4-10GB","TS2L4-10GB","652503-B21",357,"HPE BLc 10G SFP+ SR Transceiver",2,null,"455883-B21"]
["HPE Ethernet 10Gb 2P 530T Adapter",1,"TS1-656596","TS1-656596","656596-B21",null,null,null,298]
["HPE Ethernet 10Gb 2-port 521T Adapter",1,"TS1-867707","TS1-867707","867707-B21",null,null,null,298]
["HPE StoreFabric CN1200E 10Gb Converged Network Adapter",1,"TS2L4-CNA","TS2L4-CNA","E7Y06A",723,"HPE BLc 10G SFP+ SR Transceiver",2,null,"455883-B21"]
["HPE StoreFabric SN1100Q 16Gb Dual Port Fibre Channel Host Bus Adapter",1,"TS2L4-FC","TS2L4-FC","AJ764A",356,null,0,null,""]
[]
["Additional Card for PCIe Slot 2/3"]
["DL560"]
["None","","","","","","",0,null,""]
["HPE Ethernet 1Gb 2-port 332T Adapter",1,"TS2L4-1GB","TS2L4-1GB","615732-B21",32,"",0,null,""]
["HPE Ethernet 10Gb 2-port 530SFP Adapter",1,"TS2L4-10GB","TS2L4-10GB","652503-B21",357,"HPE BLc 10G SFP+ SR Transceiver",2,null,"455883-B21"]
["HPE StoreFabric CN1200E 10Gb Converged Network Adapter",1,"TS2L4-CNA","TS2L4-CNA","E7Y06A",null,"HPE BLc 10G SFP+ SR Transceiver",2,null,"455883-B21"]
["HPE Ethernet 10Gb 2P 530T Adapter",1,"TS1-656596","TS1-656596","656596-B21",null,null,null,298]
["HPE Ethernet 10Gb 2-port 521T Adapter",1,"TS1-867707","TS1-867707","867707-B21",723,null,null,298]
["HPE StoreFabric SN1100Q 16Gb Dual Port Fibre Channel Host Bus Adapter",1,"TS2L4-FC","TS2L4-FC","AJ764A",356,null,0,null,""]
[]
["Additional Card for PCIe Slot 3"]
["DL560"]
["None","","","","","","",0,null,""]
["HPE Ethernet 1Gb 2-port 332T Adapter",1,"TS2L4-1GB","TS2L4-1GB","615732-B21",32,"",0,null,""]
["HPE Ethernet 10Gb 2-port 530SFP Adapter",1,"TS2L4-10GB","TS2L4-10GB","652503-B21",357,"HPE BLc 10G SFP+ SR Transceiver",2,null,"455883-B21"]
["HPE Ethernet 10Gb 2P 530T Adapter",1,"TS1-656596","TS1-656596","656596-B21",null,null,null,298]
["HPE Ethernet 10Gb 2-port 521T Adapter",1,"TS1-867707","TS1-867707","867707-B21",null,null,null,298]
["HPE StoreFabric CN1200E 10Gb Converged Network Adapter",1,"TS2L4-CNA","TS2L4-CNA","E7Y06A",723,"HPE BLc 10G SFP+ SR Transceiver",2,null,"455883-B21"]
["HPE StoreFabric SN1100Q 16Gb Dual Port Fibre Channel Host Bus Adapter",1,"TS2L4-FC","TS2L4-FC","AJ764A",356,null,0,null,""]
[]
["Additional Card for PCIe Slot 4/5/6"]
["DL560"]
["None","","","","","","",0,null,""]
["HPE Ethernet 1Gb 2-port 332T Adapter",1,"TS2L4-1GB","TS2L4-1GB","615732-B21",32,"",0,null,""]
["HPE Ethernet 10Gb 2-port 530SFP Adapter",1,"TS2L4-10GB","TS2L4-10GB","652503-B21",357,"HPE BLc 10G SFP+ SR Transceiver",2,null,"455883-B21"]
["HPE Ethernet 10Gb 2P 530T Adapter",1,"TS1-656596","TS1-656596","656596-B21",null,null,null,298]
["HPE Ethernet 10Gb 2-port 521T Adapter",1,"TS1-867707","TS1-867707","867707-B21",null,null,null,298]
["HPE StoreFabric CN1200E 10Gb Converged Network Adapter",1,"TS2L4-CNA","TS2L4-CNA","E7Y06A",723,"HPE BLc 10G SFP+ SR Transceiver",2,null,"455883-B21"]
["HPE StoreFabric SN1100Q 16Gb Dual Port Fibre Channel Host Bus Adapter",1,"TS2L4-FC","TS2L4-FC","AJ764A",356,null,0,null,""]
[]
["Additional Card for PCIe Slot 5"]
["DL560"]
["None","","","","","","",0,null,""]
["NVIDIA Quadro P2000 GPU Module",1,"TS1-Q0V77A","TS1-Q0V77A","Q0V77A",null,null,null,518]
["HPE Ethernet 1Gb 2-port 332T Adapter",1,"TS2L4-1GB","TS2L4-1GB","615732-B21",32,"",0,null,""]
["HPE Ethernet 10Gb 2-port 530SFP Adapter",1,"TS2L4-10GB","TS2L4-10GB","652503-B21",357,"HPE BLc 10G SFP+ SR Transceiver",2,null,"455883-B21"]
["HPE Ethernet 10Gb 2P 530T Adapter",1,"TS1-656596","TS1-656596","656596-B21",null,null,null,298]
["HPE Ethernet 10Gb 2-port 521T Adapter",1,"TS1-867707","TS1-867707","867707-B21",null,null,null,298]
["HPE StoreFabric CN1200E 10Gb Converged Network Adapter",1,"TS2L4-CNA","TS2L4-CNA","E7Y06A",723,"HPE BLc 10G SFP+ SR Transceiver",2,null,"455883-B21"]
["HPE StoreFabric SN1100Q 16Gb Dual Port Fibre Channel Host Bus Adapter",1,"TS2L4-FC","TS2L4-FC","AJ764A",356,null,0,null,""]
[]
["Additional Card for PCIe Slot 6"]
["DL560"]
["None","","","","","","",0,null,""]
["HPE Ethernet 1Gb 2-port 332T Adapter",1,"TS2L4-1GB","TS2L4-1GB","615732-B21",32,"",0,null,""]
["HPE Ethernet 10Gb 2-port 530SFP Adapter",1,"TS2L4-10GB","TS2L4-10GB","652503-B21",357,"HPE BLc 10G SFP+ SR Transceiver",2,null,"455883-B21"]
["HPE Ethernet 10Gb 2P 530T Adapter",1,"TS1-656596","TS1-656596","656596-B21",null,null,null,298]
["HPE Ethernet 10Gb 2-port 521T Adapter",1,"TS1-867707","TS1-867707","867707-B21",null,null,null,298]
["HPE StoreFabric CN1200E 10Gb Converged Network Adapter",1,"TS2L4-CNA","TS2L4-CNA","E7Y06A",723,"HPE BLc 10G SFP+ SR Transceiver",2,null,"455883-B21"]
["HPE StoreFabric SN1100Q 16Gb Dual Port Fibre Channel Host Bus Adapter",1,"TS2L4-FC","TS2L4-FC","AJ764A",356,null,0,null,""]
[]
["Additional Card for PCIe Slot 7/8"]
["DL560"]
["None","","","","","","",0,null,""]
["HPE Ethernet 1Gb 2-port 332T Adapter",1,"TS2L4-1GB","TS2L4-1GB","615732-B21",32,"",0,null,""]
["HPE Ethernet 10Gb 2-port 530SFP Adapter",1,"TS2L4-10GB","TS2L4-10GB","652503-B21",357,"HPE BLc 10G SFP+ SR Transceiver",2,null,"455883-B21"]
["HPE Ethernet 10Gb 2P 530T Adapter",1,"TS1-656596","TS1-656596","656596-B21",null,null,null,298]
["HPE Ethernet 10Gb 2-port 521T Adapter",1,"TS1-867707","TS1-867707","867707-B21",null,null,null,298]
["HPE StoreFabric CN1200E 10Gb Converged Network Adapter",1,"TS2L4-CNA","TS2L4-CNA","E7Y06A",723,"HPE BLc 10G SFP+ SR Transceiver",2,null,"455883-B21"]
["HPE StoreFabric SN1100Q 16Gb Dual Port Fibre Channel Host Bus Adapter",1,"TS2L4-FC","TS2L4-FC","AJ764A",356,null,0,null,""]
[]
[]
[]
[]
["HPE Ethernet 1Gb 4-port 331FLR Adapter",1,{"$f":"\"\"","v":""},"629135-B22",{"$f":"\"\"","v":""},{"$f":"\"\"","v":""},{"$f":"\"\"","v":""},{"$f":"\"\"","v":""},0,{"$f":"\"\"","v":""}]
["[TS2L4-536FLR] HPE FlexFabric 10Gb 4-port 536FLR-T Adapter",1,"TS2L4-536FLR","TS2L4-536FLR","764302-B21",null,null,null,610]
["[TS2L4-547FLR] HPE InfiniBand FDR/Ethernet 40/50Gb 2-port 547FLR-QSFP Adapter",1,"TS2L4-547FLR","TS2H-547FLR","879482-B21",null,null,null,461,{"$f":"\"\"","v":""}]

{"sheet":"Processor","index":8,"n_rows":23,"n_cols":12,"rows_kept":23,"cut":false,"hidden":true,"merged":[]}
["Additional Processor"]
["Server DL560",null,"CPU-A"]
["No Additional Processor",0,{"$f":"\"\"","v":""},null,{"$f":"\"\"","v":""},{"$f":"\"\"","v":""},{"$f":"\"\"","v":""},{"$f":"\"\"","v":""}]
["Intel Xeon-Gold 5218 (2.3GHz/16-core/125W) Processor Kit",2,"TS2L4-CPU-U","TS2L4-CPU-U","P02978-L21","ProLiant HPE DL5x0 Gen10 CPU Mezzanine Board Kit ",1,"872222-B21",null,null,null,1961]
[]
["Server DL580",null,"CPU-B"]
["No Additional Processor",0,{"$f":"\"\"","v":""},null,{"$f":"\"\"","v":""},{"$f":"\"\"","v":""},{"$f":"\"\"","v":""},{"$f":"\"\"","v":""},null,null,null,{"$f":"\"\"","v":""}]
["HPE DL580 Gen10 Intel® Xeon-Gold 5118 (2.3GHz/12-core/105W) FIO Processor Kit",2,"TS1L2-CPU-ALT-U","TS1L2-CPU-ALT-U","878126-L21","ProLiant HPE DL5x0 Gen10 CPU Mezzanine Board Kit ",1,"872222-B21",null,null,null,2584]
[]
["Server DL580 Prestazionale"]
["No Additional Processor",0,{"$f":"\"\"","v":""},null,null,{"$f":"\"\"","v":""},{"$f":"\"\"","v":""},{"$f":"\"\"","v":""},null,null,null,{"$f":"\"\"","v":""}]
["HPE DL580 Gen10 Intel® Xeon-Gold 6140M (2.3GHz/18-core/140W) FIO Processor Kit",2,"TS1L2-CPU-580-U","TS1L2-CPU-580-U","878138-L21","ProLiant HPE DL5x0 Gen10 CPU Mezzanine Board Kit ",1,"872222-B21",null,null,null,5056]
[]
[]
[]
[]
[]
[]
["HPE OneView Advanced standalone licenses"]
["None",0,{"$f":"\"\"","v":""},{"$f":"\"\"","v":""},{"$f":"\"\"","v":""},0,{"$f":"\"\"","v":""},{"$f":"\"\"","v":""},{"$f":"\"\"","v":""},{"$f":"\"\"","v":""},{"$f":"\"\"","v":""},{"$f":"\"\"","v":""}]
["HPE OneView Advanced with iLO Advanced incl 3yr 24x7 Supp Phys 1 Svr Lic",1,"TS2L4-OV3YILO","TS2L4-OV3YILO","E5Y34A",480]
[]
[" "]

{"sheet":"Memory","index":9,"n_rows":89,"n_cols":27,"rows_kept":89,"cut":false,"hidden":true,"merged":[[41,7,41,9],[41,1,41,6],[41,10,41,15]]}
[null,"Total Memory"]
[]
[null,"HPE 16GB (1x16GB) Dual Rank x4 DDR4-2400 Registered Memory Kit",1,"TS2L4-16GB-2400","TS2L4-16GB-580","836220-B21",172,"DL580 Gen9"]
[null,"HP 32GB (1x32GB) Dual Rank x4 DDR4-2400 Registered Memory Kit",1,"TS2L4-32GB-2400","TS2L4-32GB-580","805351-B21",344,"DL580 Gen9"]
[null,"HPE 64GB (1x64GB) Quad Rank x4 DDR4-2400 Load Reduced Memory Kit",1,"TS2L4-64GB-2400","TS2L4-64GB-580","805358-B21",750,"DL580 Gen9"]
[null,"HPE 16GB 1Rx4 PC4-2933 Smart Kit",1,"TS2L4-RAM16","TS2L4-RAM16","815098-B21",136]
[null,"HPE 32GB 2Rx4 PC4-2933 Smart Kit",1,"TS2L4-RAM32-U","TS2L4-RAM32-U","815100-B21",397,{"$f":"G7*4","v":1588}]
[null,"HPE 64GB 4Rx4 PC4-2933 Smart Kit",1,"TS2L4-RAM64-U","TS2L4-RAM64-U","815101-B21",705]
[]
[]
["2CPU","MEMORY A"]
[".:*~*:._.:*~*:._.:*~*:._.:Moduli da 32GB.:*~*:._.:*~*:._.:*~*:._.:",{"$f":"$B$7","v":"HPE 32GB 2Rx4 PC4-2933 Smart Kit"},4,{"$f":"\"\"","v":""},"TS2L4-RAM32-U","815100-B21",0,{"$f":"$B$7","v":"HPE 32GB 2Rx4 PC4-2933 Smart Kit"},4,{"$f":"$F$7","v":"815100-B21"},{"$f":"\"\"","v":""},{"$f":"\"\"","v":""},{"$f":"\"\"","v":""},{"$f":"\"\"","v":""},{"$f":"\"\"","v":""},{"$f":"\"\"","v":""}]
["128        (DIMM 32GB)","HPE 32GB 2Rx4 PC4-2933 Smart Kit",4,{"$f":"\"\"","v":""},"TS2L4-RAM32-U","815100-B21",0,"HPE 32GB 2Rx4 PC4-2933 Smart Kit",4,"815100-B21",{"$f":"\"\"","v":""},{"$f":"\"\"","v":""},{"$f":"\"\"","v":""},{"$f":"\"\"","v":""},{"$f":"\"\"","v":""},{"$f":"\"\"","v":""}]
["192        (DIMM 32GB)","HPE 32GB 2Rx4 PC4-2933 Smart Kit",6,"TS2L4-RAM32-U","TS2L4-RAM32-U","815100-B21",{"$f":"($G$7*C14)-$H$7","v":794},"HPE 32GB 2Rx4 PC4-2933 Smart Kit",4,"815100-B21",{"$f":"\"\"","v":""},{"$f":"\"\"","v":""},{"$f":"\"\"","v":""},{"$f":"\"\"","v":""},{"$f":"\"\"","v":""},{"$f":"\"\"","v":""}]
["256        (DIMM 32GB)","HPE 32GB 2Rx4 PC4-2933 Smart Kit",8,"TS2L4-RAM32-U","TS2L4-RAM32-U","815100-B21",{"$f":"($G$7*C15)-$H$7","v":1588},"HPE 32GB 2Rx4 PC4-2933 Smart Kit",4,"815100-B21",{"$f":"\"\"","v":""},{"$f":"\"\"","v":""},{"$f":"\"\"","v":""},{"$f":"\"\"","v":""},{"$f":"\"\"","v":""},{"$f":"\"\"","v":""}]
["384        (DIMM 32GB)","HPE 32GB 2Rx4 PC4-2933 Smart Kit",12,"TS2L4-RAM32-U","TS2L4-RAM32-U","815100-B21",3176,"HPE 32GB 2Rx4 PC4-2933 Smart Kit",4,"815100-B21",{"$f":"\"\"","v":""},{"$f":"\"\"","v":""},{"$f":"\"\"","v":""},{"$f":"\"\"","v":""},{"$f":"\"\"","v":""},{"$f":"\"\"","v":""}]
["512        (DIMM 32GB)","HPE 32GB 2Rx4 PC4-2933 Smart Kit",16,"TS2L4-RAM32-U","TS2L4-RAM32-U","815100-B21",4764,"HPE 32GB 2Rx4 PC4-2933 Smart Kit",4,"815100-B21",{"$f":"\"\"","v":""},{"$f":"\"\"","v":""},{"$f":"\"\"","v":""},{"$f":"\"\"","v":""},{"$f":"\"\"","v":""},{"$f":"\"\"","v":""}]
["768        (DIMM 32GB)","HPE 32GB 2Rx4 PC4-2933 Smart Kit",24,"TS2L4-RAM32-U","TS2L4-RAM32-U","815100-B21",7940,"HPE 32GB 2Rx4 PC4-2933 Smart Kit",4,"815100-B21",{"$f":"\"\"","v":""},{"$f":"\"\"","v":""},{"$f":"\"\"","v":""},{"$f":"\"\"","v":""},{"$f":"\"\"","v":""},{"$f":"\"\"","v":""}]
[".:*~*:._.:*~*:._.:*~*:._.:Moduli da 64GB.:*~*:._.:*~*:._.:*~*:._.:",{"$f":"\"\"","v":""},{"$f":"\"\"","v":""},{"$f":"\"\"","v":""},{"$f":"\"\"","v":""},{"$f":"\"\"","v":""},{"$f":"\"\"","v":""},{"$f":"\"\"","v":""},{"$f":"\"\"","v":""},{"$f":"\"\"","v":""},"HPE 64GB 4Rx4 PC4-2933 Smart Kit",8,"TS2L4-RAM64-U","TS2L4-RAM64-U","815101-B21",{"$f":"$G$8*L19","v":5640}]
["512        (DIMM 64GB)",{"$f":"\"\"","v":""},{"$f":"\"\"","v":""},{"$f":"\"\"","v":""},{"$f":"\"\"","v":""},{"$f":"\"\"","v":""},{"$f":"\"\"","v":""},{"$f":"\"\"","v":""},{"$f":"\"\"","v":""},{"$f":"\"\"","v":""},"HPE 64GB 4Rx4 PC4-2933 Smart Kit",8,"TS2L4-RAM64-U","TS2L4-RAM64-U","815101-B21",5640]
["768        (DIMM 64GB)",{"$f":"\"\"","v":""},{"$f":"\"\"","v":""},{"$f":"\"\"","v":""},{"$f":"\"\"","v":""},{"$f":"\"\"","v":""},{"$f":"\"\"","v":""},{"$f":"\"\"","v":""},{"$f":"\"\"","v":""},{"$f":"\"\"","v":""},"HPE 64GB 4Rx4 PC4-2933 Smart Kit",12,"TS2L4-RAM64-U","TS2L4-RAM64-U","815101-B21",8460]
["1024      (DIMM 64GB)",{"$f":"\"\"","v":""},{"$f":"\"\"","v":""},{"$f":"\"\"","v":""},{"$f":"\"\"","v":""},{"$f":"\"\"","v":""},{"$f":"\"\"","v":""},{"$f":"\"\"","v":""},{"$f":"\"\"","v":""},{"$f":"\"\"","v":""},"HPE 64GB 4Rx4 PC4-2933 Smart Kit",16,"TS2L4-RAM64-U","TS2L4-RAM64-U","815101-B21",{"$f":"$G$8*L22","v":11280}]
["1536      (DIMM 64GB)",{"$f":"\"\"","v":""},{"$f":"\"\"","v":""},{"$f":"\"\"","v":""},{"$f":"\"\"","v":""},{"$f":"\"\"","v":""},{"$f":"\"\"","v":""},{"$f":"\"\"","v":""},{"$f":"\"\"","v":""},{"$f":"\"\"","v":""},"HPE 64GB 4Rx4 PC4-2933 Smart Kit",24,"TS2L4-RAM64-U","TS2L4-RAM64-U","815101-B21",{"$f":"$G$8*L23","v":16920}]
["4CPU"]
[".:*~*:._.:*~*:._.:*~*:._.:Moduli da 32GB.:*~*:._.:*~*:._.:*~*:._.:",{"$f":"$B$7","v":"HPE 32GB 2Rx4 PC4-2933 Smart Kit"},4,{"$f":"\"\"","v":""},{"$f":"\"\"","v":""},"815100-B21",0,{"$f":"$B$7","v":"HPE 32GB 2Rx4 PC4-2933 Smart Kit"},4,{"$f":"$F$7","v":"815100-B21"},{"$f":"\"\"","v":""},{"$f":"\"\"","v":""},{"$f":"\"\"","v":""},{"$f":"\"\"","v":""},{"$f":"\"\"","v":""},{"$f":"\"\"","v":""}]
["128        (DIMM 32GB)","HPE 32GB 2Rx4 PC4-2933 Smart Kit",4,{"$f":"\"\"","v":""},{"$f":"\"\"","v":""},"815100-B21",0,"HPE 32GB 2Rx4 PC4-2933 Smart Kit",4,"815100-B21",{"$f":"\"\"","v":""},{"$f":"\"\"","v":""},{"$f":"\"\"","v":""},{"$f":"\"\"","v":""},{"$f":"\"\"","v":""},{"$f":"\"\"","v":""}]
["256        (DIMM 32GB)","HPE 32GB 2Rx4 PC4-2933 Smart Kit",8,"TS2L4-RAM32-U","TS2L4-RAM32-U","815100-B21",{"$f":"($G$7*C27)-$H$7","v":1588},{"$f":"$B$7","v":"HPE 32GB 2Rx4 PC4-2933 Smart Kit"},4,{"$f":"$F$7","v":"815100-B21"},{"$f":"\"\"","v":""},{"$f":"\"\"","v":""},{"$f":"\"\"","v":""},{"$f":"\"\"","v":""},{"$f":"\"\"","v":""},{"$f":"\"\"","v":""}]
["384        (DIMM 32GB)","HPE 32GB 2Rx4 PC4-2933 Smart Kit",12,"TS2L4-RAM32-U","TS2L4-RAM32-U","815100-B21",{"$f":"($G$7*C28)-$H$7","v":3176},"HPE 32GB 2Rx4 PC4-2933 Smart Kit",4,"815100-B21",{"$f":"\"\"","v":""},{"$f":"\"\"","v":""},{"$f":"\"\"","v":""},{"$f":"\"\"","v":""},{"$f":"\"\"","v":""},{"$f":"\"\"","v":""}]
["512        (DIMM 32GB)","HPE 32GB 2Rx4 PC4-2933 Smart Kit",16,"TS2L4-RAM32-U","TS2L4-RAM32-U","815100-B21",4764,"HPE 32GB 2Rx4 PC4-2933 Smart Kit",4,"815100-B21",{"$f":"\"\"","v":""},{"$f":"\"\"","v":""},{"$f":"\"\"","v":""},{"$f":"\"\"","v":""},{"$f":"\"\"","v":""},{"$f":"\"\"","v":""}]
["768        (DIMM 32GB)","HPE 32GB 2Rx4 PC4-2933 Smart Kit",24,"TS2L4-RAM32-U","TS2L4-RAM32-U","815100-B21",7940,"HPE 32GB 2Rx4 PC4-2933 Smart Kit",4,"815100-B21",{"$f":"\"\"","v":""},{"$f":"\"\"","v":""},{"$f":"\"\"","v":""},{"$f":"\"\"","v":""},{"$f":"\"\"","v":""},{"$f":"\"\"","v":""}]
["1024      (DIMM 32GB)","HPE 32GB 2Rx4 PC4-2933 Smart Kit",32,"TS2L4-RAM32-U","TS2L4-RAM32-U","815100-B21",11116,"HPE 32GB 2Rx4 PC4-2933 Smart Kit",4,"815100-B21",{"$f":"\"\"","v":""},{"$f":"\"\"","v":""},{"$f":"\"\"","v":""},{"$f":"\"\"","v":""},{"$f":"\"\"","v":""},{"$f":"\"\"","v":""}]
["1536      (DIMM 32GB)","HPE 32GB 2Rx4 PC4-2933 Smart Kit",48,"TS2L4-RAM32-U","TS2L4-RAM32-U","815100-B21",17468,"HPE 32GB 2Rx4 PC4-2933 Smart Kit",4,"815100-B21",{"$f":"\"\"","v":""},{"$f":"\"\"","v":""},{"$f":"\"\"","v":""},{"$f":"\"\"","v":""},{"$f":"\"\"","v":""},{"$f":"\"\"","v":""}]
[".:*~*:._.:*~*:._.:*~*:._.:Moduli da 64GB.:*~*:._.:*~*:._.:*~*:._.:",{"$f":"\"\"","v":""},{"$f":"\"\"","v":""},{"$f":"\"\"","v":""},{"$f":"\"\"","v":""},{"$f":"\"\"","v":""},{"$f":"\"\"","v":""},{"$f":"\"\"","v":""},{"$f":"\"\"","v":""},{"$f":"\"\"","v":""},"HPE 64GB 4Rx4 PC4-2933 Smart Kit",8,"TS2L4-RAM64-U","TS2L4-RAM64-U","815101-B21",{"$f":"$G$8*L33","v":5640}]
["512        (DIMM 64GB)",{"$f":"\"\"","v":""},{"$f":"\"\"","v":""},{"$f":"\"\"","v":""},{"$f":"\"\"","v":""},{"$f":"\"\"","v":""},{"$f":"\"\"","v":""},{"$f":"\"\"","v":""},{"$f":"\"\"","v":""},{"$f":"\"\"","v":""},"HPE 64GB 4Rx4 PC4-2933 Smart Kit",8,"TS2L4-RAM64-U","TS2L4-RAM64-U","815101-B21",5640]
["768        (DIMM 64GB)",{"$f":"\"\"","v":""},{"$f":"\"\"","v":""},{"$f":"\"\"","v":""},{"$f":"\"\"","v":""},{"$f":"\"\"","v":""},{"$f":"\"\"","v":""},{"$f":"\"\"","v":""},{"$f":"\"\"","v":""},{"$f":"\"\"","v":""},"HPE 64GB 4Rx4 PC4-2933 Smart Kit",12,"TS2L4-RAM64-U","TS2L4-RAM64-U","815101-B21",8460]
["1024      (DIMM 64GB)",{"$f":"\"\"","v":""},{"$f":"\"\"","v":""},{"$f":"\"\"","v":""},{"$f":"\"\"","v":""},{"$f":"\"\"","v":""},{"$f":"\"\"","v":""},{"$f":"\"\"","v":""},{"$f":"\"\"","v":""},{"$f":"\"\"","v":""},"HPE 64GB 4Rx4 PC4-2933 Smart Kit",16,"TS2L4-RAM64-U","TS2L4-RAM64-U","815101-B21",{"$f":"$G$8*L36","v":11280}]
["1536      (DIMM 64GB)",{"$f":"\"\"","v":""},{"$f":"\"\"","v":""},{"$f":"\"\"","v":""},{"$f":"\"\"","v":""},{"$f":"\"\"","v":""},{"$f":"\"\"","v":""},{"$f":"\"\"","v":""},{"$f":"\"\"","v":""},{"$f":"\"\"","v":""},"HPE 64GB 4Rx4 PC4-2933 Smart Kit",24,"TS2L4-RAM64-U","TS2L4-RAM64-U","815101-B21",{"$f":"$G$8*L37","v":16920}]
["2048      (DIMM 64GB)",{"$f":"\"\"","v":""},{"$f":"\"\"","v":""},{"$f":"\"\"","v":""},{"$f":"\"\"","v":""},{"$f":"\"\"","v":""},{"$f":"\"\"","v":""},{"$f":"\"\"","v":""},{"$f":"\"\"","v":""},{"$f":"\"\"","v":""},"HPE 64GB 4Rx4 PC4-2933 Smart Kit",32,"TS2L4-RAM64-U","TS2L4-RAM64-U","815101-B21",{"$f":"$G$8*L38","v":22560}]
["3072      (DIMM 64GB)",{"$f":"\"\"","v":""},{"$f":"\"\"","v":""},{"$f":"\"\"","v":""},{"$f":"\"\"","v":""},{"$f":"\"\"","v":""},{"$f":"\"\"","v":""},{"$f":"\"\"","v":""},{"$f":"\"\"","v":""},{"$f":"\"\"","v":""},"HPE 64GB 4Rx4 PC4-2933 Smart Kit",48,"TS2L4-RAM64-U","TS2L4-RAM64-U","815101-B21",{"$f":"$G$8*L39","v":33840}]
[]
[null,"MEMORY B"]
["2CPU","UPGRADE 16GB",null,null,null,null,null,"MEMORIA BASE",null,null,"UPGRADE 32GB",null,null,null,null,null,null,null,null,"Memoria Totale","Prezzo Totale Memorie","Memory Cartridge Totali","DIMM Slot",32,16,16]
[64,{"$f":"\"\"","v":""},{"$f":"\"\"","v":""},{"$f":"\"\"","v":""},{"$f":"\"\"","v":""},{"$f":"\"\"","v":""},{"$f":"\"\"","v":""},{"$f":"$B$7","v":"HPE 32GB 2Rx4 PC4-2933 Smart Kit"},"2",{"$f":"$F$7","v":"815100-B21"},{"$f":"\"\"","v":""},{"$f":"\"\"","v":""},{"$f":"\"\"","v":""},{"$f":"\"\"","v":""},{"$f":"\"\"","v":""},{"$f":"\"\"","v":""},null,null,null,null,null,null,null,{"$f":"IF(L43=\"\",0,L43)","v":0},{"$f":"IF(I43=\"\",0,I43)","v":"2"},{"$f":"IF(C43=\"\",0,C43)","v":0},{"$f":"SUM(X43:Z43)","v":0}]
[128,"HPE 32GB 2Rx4 PC4-2933 Smart Kit",2,"TS2L4-32GB","TS2L4-32GB","815100-B21",{"$f":"$G$7*C44","v":794},{"$f":"$B$7","v":"HPE 32GB 2Rx4 PC4-2933 Smart Kit"},"2",{"$f":"$F$7","v":"815100-B21"},{"$f":"\"\"","v":""},{"$f":"\"\"","v":""},{"$f":"\"\"","v":""},{"$f":"\"\"","v":""},{"$f":"\"\"","v":""},{"$f":"\"\"","v":""},null,null,null,null,null,null,null,0,"2",2,2]
[192,"HPE 32GB 2Rx4 PC4-2933 Smart Kit",4,"TS2L4-32GB","TS2L4-32GB","815100-B21",1588,"HPE 32GB 2Rx4 PC4-2933 Smart Kit","2","815100-B21",{"$f":"\"\"","v":""},{"$f":"\"\"","v":""},{"$f":"\"\"","v":""},{"$f":"\"\"","v":""},{"$f":"\"\"","v":""},{"$f":"\"\"","v":""},null,null,null,null,null,null,null,0,"2",4,4]
[256,"HPE 32GB 2Rx4 PC4-2933 Smart Kit",6,"TS2L4-32GB","TS2L4-32GB","815100-B21",2382,"HPE 32GB 2Rx4 PC4-2933 Smart Kit","2","815100-B21",{"$f":"\"\"","v":""},{"$f":"\"\"","v":""},{"$f":"\"\"","v":""},{"$f":"\"\"","v":""},{"$f":"\"\"","v":""},{"$f":"\"\"","v":""},null,null,null,null,null,null,null,0,"2",6,6]
[384,"HPE 32GB 2Rx4 PC4-2933 Smart Kit",10,"TS2L4-32GB","TS2L4-32GB","815100-B21",3970,"HPE 32GB 2Rx4 PC4-2933 Smart Kit","2","815100-B21",{"$f":"\"\"","v":""},{"$f":"\"\"","v":""},{"$f":"\"\"","v":""},{"$f":"\"\"","v":""},{"$f":"\"\"","v":""},{"$f":"\"\"","v":""},null,null,null,null,null,null,null,0,"2",10,10]
[512,"HPE 32GB 2Rx4 PC4-2933 Smart Kit",14,"TS2L4-32GB","TS2L4-32GB","815100-B21",5558,"HPE 32GB 2Rx4 PC4-2933 Smart Kit","2","815100-B21",{"$f":"\"\"","v":""},{"$f":"\"\"","v":""},{"$f":"\"\"","v":""},{"$f":"\"\"","v":""},{"$f":"\"\"","v":""},{"$f":"\"\"","v":""},null,null,null,null,null,null,null,0,"2",14,14]
[768,"HPE 32GB 2Rx4 PC4-2933 Smart Kit",22,"TS2L4-32GB","TS2L4-32GB","815100-B21",8734,"HPE 32GB 2Rx4 PC4-2933 Smart Kit","2","815100-B21",{"$f":"\"\"","v":""},{"$f":"\"\"","v":""},{"$f":"\"\"","v":""},{"$f":"\"\"","v":""},{"$f":"\"\"","v":""},{"$f":"\"\"","v":""},null,null,null,null,null,null,null,0,"2",22,22]
[1024,{"$f":"\"\"","v":""},{"$f":"\"\"","v":""},{"$f":"\"\"","v":""},{"$f":"\"\"","v":""},{"$f":"\"\"","v":""},{"$f":"\"\"","v":""},{"$f":"\"\"","v":""},{"$f":"\"\"","v":""},{"$f":"\"\"","v":""},"HPE 64GB 4Rx4 PC4-2933 Smart Kit",16,"TS1L2-64GB","TS1L2-64GB","815101-B21",{"$f":"$G$8*L50","v":11280},null,null,null,null,null,null,null,16,0,0,16]
[1536,{"$f":"\"\"","v":""},{"$f":"\"\"","v":""},{"$f":"\"\"","v":""},{"$f":"\"\"","v":""},{"$f":"\"\"","v":""},{"$f":"\"\"","v":""},{"$f":"\"\"","v":""},{"$f":"\"\"","v":""},{"$f":"\"\"","v":""},"HPE 64GB 4Rx4 PC4-2933 Smart Kit",24,"TS1L2-64GB","TS1L2-64GB","815101-B21",{"$f":"$G$8*L51","v":16920},null,null,null,null,null,null,null,24,0,0,24]
["4CPU"]
[128,"HPE 32GB 2Rx4 PC4-2933 Smart Kit",2,"TS2L4-32GB","TS2L4-32GB","815100-B21",{"$f":"$G$7*C53","v":794},{"$f":"$B$7","v":"HPE 32GB 2Rx4 PC4-2933 Smart Kit"},"2",{"$f":"$F$7","v":"815100-B21"},{"$f":"\"\"","v":""},{"$f":"\"\"","v":""},{"$f":"\"\"","v":""},{"$f":"\"\"","v":""},{"$f":"\"\"","v":""},{"$f":"\"\"","v":""},null,null,null,null,null,null,null,{"$f":"IF(L53=\"\",0,L53)","v":0},{"$f":"IF(I53=\"\",0,I53)","v":"2"},{"$f":"IF(C53=\"\",0,C53)","v":2},{"$f":"SUM(X53:Z53)","v":2}]
[256,"HPE 32GB 2Rx4 PC4-2933 Smart Kit",6,"TS2L4-32GB","TS2L4-32GB","815100-B21",2382,{"$f":"$B$7","v":"HPE 32GB 2Rx4 PC4-2933 Smart Kit"},"2",{"$f":"$F$7","v":"815100-B21"},{"$f":"\"\"","v":""},{"$f":"\"\"","v":""},{"$f":"\"\"","v":""},{"$f":"\"\"","v":""},{"$f":"\"\"","v":""},{"$f":"\"\"","v":""},null,null,null,null,null,null,null,0,"2",6,6]
[384,"HPE 32GB 2Rx4 PC4-2933 Smart Kit",10,"TS2L4-32GB","TS2L4-32GB","815100-B21",3970,"HPE 32GB 2Rx4 PC4-2933 Smart Kit","2","815100-B21",{"$f":"\"\"","v":""},{"$f":"\"\"","v":""},{"$f":"\"\"","v":""},{"$f":"\"\"","v":""},{"$f":"\"\"","v":""},{"$f":"\"\"","v":""},null,null,null,null,null,null,null,0,"2",10,10]
[512,"HPE 32GB 2Rx4 PC4-2933 Smart Kit",14,"TS2L4-32GB","TS2L4-32GB","815100-B21",5558,"HPE 32GB 2Rx4 PC4-2933 Smart Kit","2","815100-B21",{"$f":"\"\"","v":""},{"$f":"\"\"","v":""},{"$f":"\"\"","v":""},{"$f":"\"\"","v":""},{"$f":"\"\"","v":""},{"$f":"\"\"","v":""},null,null,null,null,null,null,null,0,"2",14,14]
[768,"HPE 32GB 2Rx4 PC4-2933 Smart Kit",22,"TS2L4-32GB","TS2L4-32GB","815100-B21",8734,"HPE 32GB 2Rx4 PC4-2933 Smart Kit","2","815100-B21",{"$f":"\"\"","v":""},{"$f":"\"\"","v":""},{"$f":"\"\"","v":""},{"$f":"\"\"","v":""},{"$f":"\"\"","v":""},{"$f":"\"\"","v":""},null,null,null,null,null,null,null,0,"2",22,22]
[1024,"HPE 32GB 2Rx4 PC4-2933 Smart Kit",30,"TS2L4-32GB","TS2L4-32GB","815100-B21",11910,"HPE 32GB 2Rx4 PC4-2933 Smart Kit","2","815100-B21",{"$f":"\"\"","v":""},{"$f":"\"\"","v":""},{"$f":"\"\"","v":""},{"$f":"\"\"","v":""},{"$f":"\"\"","v":""},{"$f":"\"\"","v":""},null,null,null,null,null,null,null,0,"2",30,30]
[1536,"HPE 32GB 2Rx4 PC4-2933 Smart Kit",46,"TS2L4-32GB","TS2L4-32GB","815100-B21",18262,"HPE 32GB 2Rx4 PC4-2933 Smart Kit","2","815100-B21",{"$f":"\"\"","v":""},{"$f":"\"\"","v":""},{"$f":"\"\"","v":""},{"$f":"\"\"","v":""},{"$f":"\"\"","v":""},{"$f":"\"\"","v":""},null,null,null,null,null,null,null,0,"2",46,46]
[2048,{"$f":"\"\"","v":""},{"$f":"\"\"","v":""},{"$f":"\"\"","v":""},{"$f":"\"\"","v":""},{"$f":"\"\"","v":""},{"$f":"\"\"","v":""},{"$f":"\"\"","v":""},{"$f":"\"\"","v":""},{"$f":"\"\"","v":""},"HPE 64GB 4Rx4 PC4-2933 Smart Kit",32,"TS1L2-64GB","TS1L2-64GB","815101-B21",{"$f":"$G$8*L60","v":22560},null,null,null,null,null,null,null,32,0,0,32]
[3072,{"$f":"\"\"","v":""},{"$f":"\"\"","v":""},{"$f":"\"\"","v":""},{"$f":"\"\"","v":""},{"$f":"\"\"","v":""},{"$f":"\"\"","v":""},{"$f":"\"\"","v":""},{"$f":"\"\"","v":""},{"$f":"\"\"","v":""},"HPE 64GB 4Rx4 PC4-2933 Smart Kit",48,"TS1L2-64GB","TS1L2-64GB","815101-B21",{"$f":"$G$8*L61","v":33840},null,null,null,null,null,null,null,48,0,0,48]
[]
["1CPU","MEMORY C",null,null,null,null,null,null,null,null,null,null,null,null,null,null,null,null,null,"Memoria Totale","Prezzo Totale Memorie","Memory Cartridge Totali","DIMM Slot",32,16,16]
[{"$f":"32*I64","v":128},{"$f":"\"\"","v":""},{"$f":"\"\"","v":""},{"$f":"\"\"","v":""},{"$f":"\"\"","v":""},null,{"$f":"\"\"","v":""},"HPE 32GB 2Rx4 PC4-2933 Smart Kit",4,"815100-B21",{"$f":"\"\"","v":""},{"$f":"\"\"","v":""},{"$f":"\"\"","v":""},{"$f":"\"\"","v":""},{"$f":"\"\"","v":""},{"$f":"\"\"","v":""},null,null,null,null,null,null,null,{"$f":"IF(L64=\"\",0,L64)","v":0},{"$f":"IF(I64=\"\",0,I64)","v":4},{"$f":"IF(C64=\"\",0,C64)","v":0},{"$f":"SUM(X64:Z64)","v":4}]
[{"$f":"(32*I65)+(C65*32)","v":256},"HPE 32GB 2Rx4 PC4-2933 Smart Kit",4,"TS2L4-32GB","TS2L4-32GB","815100-B21",{"$f":"$G$4*C65","v":1376},"HPE 32GB 2Rx4 PC4-2933 Smart Kit",4,"815100-B21",{"$f":"\"\"","v":""},{"$f":"\"\"","v":""},{"$f":"\"\"","v":""},{"$f":"\"\"","v":""},{"$f":"\"\"","v":""},{"$f":"\"\"","v":""},null,null,null,null,null,null,null,{"$f":"IF(L65=\"\",0,L65)","v":0},{"$f":"IF(I65=\"\",0,I65)","v":4},{"$f":"IF(C65=\"\",0,C65)","v":4},{"$f":"SUM(X65:Z65)","v":8}]
[{"$f":"(32*I66)+(C66*32)","v":512},"HPE 32GB 2Rx4 PC4-2933 Smart Kit",12,"TS2L4-32GB","TS2L4-32GB","815100-B21",{"$f":"$G$4*C66","v":4128},"HPE 32GB 2Rx4 PC4-2933 Smart Kit",4,"815100-B21",{"$f":"\"\"","v":""},{"$f":"\"\"","v":""},{"$f":"\"\"","v":""},{"$f":"\"\"","v":""},{"$f":"\"\"","v":""},{"$f":"\"\"","v":""},null,null,null,null,null,null,null,0,4,12,16]
[{"$f":"(32*I67)+(C67*32)","v":640},"HPE 32GB 2Rx4 PC4-2933 Smart Kit",16,"TS2L4-32GB","TS2L4-32GB","815100-B21",{"$f":"$G$4*C67","v":5504},"HPE 32GB 2Rx4 PC4-2933 Smart Kit",4,"815100-B21",{"$f":"\"\"","v":""},{"$f":"\"\"","v":""},{"$f":"\"\"","v":""},{"$f":"\"\"","v":""},{"$f":"\"\"","v":""},{"$f":"\"\"","v":""},null,null,null,null,null,null,null,{"$f":"IF(L67=\"\",0,L67)","v":0},{"$f":"IF(I67=\"\",0,I67)","v":4},{"$f":"IF(C67=\"\",0,C67)","v":16},{"$f":"SUM(X67:Z67)","v":20}]
[{"$f":"(32*I68)+(C68*32)","v":768},"HPE 32GB 2Rx4 PC4-2933 Smart Kit",20,"TS2L4-32GB","TS2L4-32GB","815100-B21",{"$f":"$G$4*C68","v":6880},"HPE 32GB 2Rx4 PC4-2933 Smart Kit",4,"815100-B21",{"$f":"\"\"","v":""},{"$f":"\"\"","v":""},{"$f":"\"\"","v":""},{"$f":"\"\"","v":""},{"$f":"\"\"","v":""},{"$f":"\"\"","v":""},null,null,null,null,null,null,null,0,4,20,24]
[{"$f":"(L69*64)","v":1024},{"$f":"\"\"","v":""},{"$f":"\"\"","v":""},{"$f":"\"\"","v":""},{"$f":"\"\"","v":""},{"$f":"\"\"","v":""},{"$f":"\"\"","v":""},{"$f":"\"\"","v":""},{"$f":"\"\"","v":""},{"$f":"\"\"","v":""},"HPE 64GB 4Rx4 PC4-2933 Smart Kit",16,"TS1L2-64GB","TS1L2-64GB","815101-B21",{"$f":"$G$8*L69","v":11280},null,null,null,null,null,null,null,16,0,0,16]
[{"$f":"(L70*64)","v":1280},{"$f":"\"\"","v":""},{"$f":"\"\"","v":""},{"$f":"\"\"","v":""},{"$f":"\"\"","v":""},{"$f":"\"\"","v":""},{"$f":"\"\"","v":""},{"$f":"\"\"","v":""},{"$f":"\"\"","v":""},{"$f":"\"\"","v":""},"HPE 64GB 4Rx4 PC4-2933 Smart Kit",20,"TS1L2-64GB","TS1L2-64GB","815101-B21",{"$f":"$G$8*L70","v":14100},null,null,null,null,null,null,null,20,0,0,20]
[{"$f":"(L71*64)","v":1536},{"$f":"\"\"","v":""},{"$f":"\"\"","v":""},{"$f":"\"\"","v":""},{"$f":"\"\"","v":""},{"$f":"\"\"","v":""},{"$f":"\"\"","v":""},{"$f":"\"\"","v":""},{"$f":"\"\"","v":""},{"$f":"\"\"","v":""},"HPE 64GB 4Rx4 PC4-2933 Smart Kit",24,"TS1L2-64GB","TS1L2-64GB","815101-B21",{"$f":"$G$8*L71","v":16920},null,null,null,null,null,null,null,{"$f":"IF(L71=\"\",0,L71)","v":24},{"$f":"IF(I71=\"\",0,I71)","v":0},{"$f":"IF(C71=\"\",0,C71)","v":0},{"$f":"SUM(X71:Z71)","v":24}]
["2CPU"]
[{"$f":"(32*I73)+(C73*32)","v":256},"HPE 32GB 2Rx4 PC4-2933 Smart Kit",4,"TS2L4-32GB","TS2L4-32GB","815100-B21",{"$f":"$G$4*C73","v":1376},"HPE 32GB 2Rx4 PC4-2933 Smart Kit",4,"815100-B21",{"$f":"\"\"","v":""},{"$f":"\"\"","v":""},{"$f":"\"\"","v":""},{"$f":"\"\"","v":""},{"$f":"\"\"","v":""},{"$f":"\"\"","v":""},null,null,null,null,null,null,null,{"$f":"IF(L73=\"\",0,L73)","v":0},{"$f":"IF(I73=\"\",0,I73)","v":4},{"$f":"IF(C73=\"\",0,C73)","v":4},{"$f":"SUM(X73:Z73)","v":8}]
[512,"HPE 32GB 2Rx4 PC4-2933 Smart Kit",12,"TS2L4-32GB","TS2L4-32GB","815100-B21",4128,"HPE 32GB 2Rx4 PC4-2933 Smart Kit",4,"815100-B21",{"$f":"\"\"","v":""},{"$f":"\"\"","v":""},{"$f":"\"\"","v":""},{"$f":"\"\"","v":""},{"$f":"\"\"","v":""},{"$f":"\"\"","v":""},null,null,null,null,null,null,null,0,4,12,16]
[640,"HPE 32GB 2Rx4 PC4-2933 Smart Kit",16,"TS2L4-32GB","TS2L4-32GB","815100-B21",5504,"HPE 32GB 2Rx4 PC4-2933 Smart Kit",4,"815100-B21",{"$f":"\"\"","v":""},{"$f":"\"\"","v":""},{"$f":"\"\"","v":""},{"$f":"\"\"","v":""},{"$f":"\"\"","v":""},{"$f":"\"\"","v":""},null,null,null,null,null,null,null,0,4,16,20]
[768,"HPE 32GB 2Rx4 PC4-2933 Smart Kit",20,"TS2L4-32GB","TS2L4-32GB","815100-B21",6880,"HPE 32GB 2Rx4 PC4-2933 Smart Kit",4,"815100-B21",{"$f":"\"\"","v":""},{"$f":"\"\"","v":""},{"$f":"\"\"","v":""},{"$f":"\"\"","v":""},{"$f":"\"\"","v":""},{"$f":"\"\"","v":""},null,null,null,null,null,null,null,0,4,20,24]
[1024,"HPE 32GB 2Rx4 PC4-2933 Smart Kit",28,"TS2L4-32GB","TS2L4-32GB","815100-B21",9632,"HPE 32GB 2Rx4 PC4-2933 Smart Kit",4,"815100-B21",{"$f":"\"\"","v":""},{"$f":"\"\"","v":""},{"$f":"\"\"","v":""},{"$f":"\"\"","v":""},{"$f":"\"\"","v":""},{"$f":"\"\"","v":""},null,null,null,null,null,null,null,0,4,28,32]
[1280,"HPE 32GB 2Rx4 PC4-2933 Smart Kit",36,"TS2L4-32GB","TS2L4-32GB","815100-B21",12384,"HPE 32GB 2Rx4 PC4-2933 Smart Kit",4,"815100-B21",{"$f":"\"\"","v":""},{"$f":"\"\"","v":""},{"$f":"\"\"","v":""},{"$f":"\"\"","v":""},{"$f":"\"\"","v":""},{"$f":"\"\"","v":""},null,null,null,null,null,null,null,0,4,36,40]
[1536,"HPE 32GB 2Rx4 PC4-2933 Smart Kit",44,"TS2L4-32GB","TS2L4-32GB","815100-B21",15136,"HPE 32GB 2Rx4 PC4-2933 Smart Kit",4,"815100-B21",{"$f":"\"\"","v":""},{"$f":"\"\"","v":""},{"$f":"\"\"","v":""},{"$f":"\"\"","v":""},{"$f":"\"\"","v":""},{"$f":"\"\"","v":""},null,null,null,null,null,null,null,{"$f":"IF(L79=\"\",0,L79)","v":0},{"$f":"IF(I79=\"\",0,I79)","v":4},{"$f":"IF(C79=\"\",0,C79)","v":44},{"$f":"SUM(X79:Z79)","v":48}]
[{"$f":"(L80*64)","v":2048},{"$f":"\"\"","v":""},{"$f":"\"\"","v":""},{"$f":"\"\"","v":""},{"$f":"\"\"","v":""},{"$f":"\"\"","v":""},{"$f":"\"\"","v":""},{"$f":"\"\"","v":""},{"$f":"\"\"","v":""},{"$f":"\"\"","v":""},"HPE 64GB 4Rx4 PC4-2933 Smart Kit",32,"TS1L2-64GB","TS1L2-64GB","815101-B21",{"$f":"$G$8*L80","v":22560},null,null,null,null,null,null,null,{"$f":"IF(L80=\"\",0,L80)","v":32},{"$f":"IF(I80=\"\",0,I80)","v":0},{"$f":"IF(C80=\"\",0,C80)","v":0},{"$f":"SUM(X80:Z80)","v":32}]
[{"$f":"(L81*64)","v":3072},{"$f":"\"\"","v":""},{"$f":"\"\"","v":""},{"$f":"\"\"","v":""},{"$f":"\"\"","v":""},{"$f":"\"\"","v":""},{"$f":"\"\"","v":""},{"$f":"\"\"","v":""},{"$f":"\"\"","v":""},{"$f":"\"\"","v":""},"HPE 64GB 4Rx4 PC4-2933 Smart Kit",48,"TS1L2-64GB","TS1L2-64GB","815101-B21",{"$f":"$G$8*L81","v":33840},null,null,null,null,null,null,null,{"$f":"IF(L81=\"\",0,L81)","v":48},{"$f":"IF(I81=\"\",0,I81)","v":0},{"$f":"IF(C81=\"\",0,C81)","v":0},{"$f":"SUM(X81:Z81)","v":48}]
[]
[]
[]
[]
[]
[]
[]
[null,null,null,null,null,null,null,null,null,null,null,null,"44GB8"]

{"sheet":"HDD","index":10,"n_rows":190,"n_cols":15,"rows_kept":190,"cut":false,"hidden":true,"merged":[]}
["Hard Drives"]
["DL560"]
["HP 300GB 12G SAS 15K 2.5in SC ENT HDD",null,"10L2-HDD300GB","S10L2-DL560-HDD300","759208-B21",140]
["HP 1TB 6G SAS 7.2K 2.5in SC MDL HDD",null,"10L2-HDD1TB","S10L2-DL560-HDD1000","652749-B21",278]
[null,"DL560","DL560 2","DL560 3"]
["HDD max",8,8,8]
["HDD 300GB Base",2,2,2,"Hot Spare for 300GB HDD",{"$f":"'Lotto4 DL560 Gen10 1'!$C$112","v":"No"},{"$f":"IF(F7=\"Yes\",1,0)","v":0},{"$f":"#REF!","v":{"$error":"#REF!"}},{"$f":"IF(H7=\"Yes\",1,0)","v":{"$error":"#REF!"}},{"$f":"#REF!","v":{"$error":"#REF!"}},{"$f":"IF(J7=\"Yes\",1,0)","v":{"$error":"#REF!"}}]
["HDD 300GB Selected",{"$f":"'Lotto4 DL560 Gen10 1'!#REF!","v":{"$error":"#REF!"}},{"$f":"#REF!","v":{"$error":"#REF!"}},{"$f":"#REF!","v":{"$error":"#REF!"}}]
["HP 300GB 12G SAS 15K 2.5in SC ENT HDD",0,0,0]
[null,1,1,1]
[null,2,2,2]
[null,3,3,3]
[null,4,4,4]
[null,5,5,5]
[null,6,6,6]
["HDD max",8,8,8]
["HDD 300GB",{"$f":"B7+B8","v":{"$error":"#REF!"}},{"$f":"C7+C8","v":{"$error":"#REF!"}},{"$f":"D7+D8","v":{"$error":"#REF!"}}]
["HDD 1TB Selected",{"$f":"'Lotto4 DL560 Gen10 1'!#REF!","v":{"$error":"#REF!"}},{"$f":"#REF!","v":{"$error":"#REF!"}},{"$f":"#REF!","v":{"$error":"#REF!"}},"Hot Spare for 1TB HDD",{"$f":"'Lotto4 DL560 Gen10 1'!$C$116","v":0},{"$f":"IF(F18=\"Yes\",1,0)","v":0},{"$f":"#REF!","v":{"$error":"#REF!"}},{"$f":"IF(H18=\"Yes\",1,0)","v":{"$error":"#REF!"}},{"$f":"#REF!","v":{"$error":"#REF!"}},{"$f":"IF(J18=\"Yes\",1,0)","v":{"$error":"#REF!"}}]
["HP 1TB 6G SAS 7.2K 2.5in SC MDL HDD",{"$f":"B$6-B$7-B$8","v":{"$error":"#REF!"}},{"$f":"C$6-C$7-C$8","v":{"$error":"#REF!"}},{"$f":"D$6-D$7-D$8","v":{"$error":"#REF!"}}]
[null,{"$f":"IF(B19-1<1,0,B19-1)","v":{"$error":"#REF!"}},{"$error":"#REF!"},{"$error":"#REF!"}]
[null,{"$error":"#REF!"},{"$error":"#REF!"},{"$error":"#REF!"}]
[null,{"$error":"#REF!"},{"$error":"#REF!"},{"$error":"#REF!"}]
[null,{"$error":"#REF!"},{"$error":"#REF!"},{"$error":"#REF!"}]
[null,{"$error":"#REF!"},{"$error":"#REF!"},{"$error":"#REF!"}]
[null,{"$error":"#REF!"},{"$error":"#REF!"},{"$error":"#REF!"}]
[null,{"$error":"#REF!"}]
[null,{"$error":"#REF!"}]
[]
["Hot Spare","Yes"]
[null,"No"]
[]
["RAID Configuration",null,null,"HDD 300GB DL560",null,"HDD 1TB DL560",null,"HDD 300GB DL560 2",null,"HDD 1TB DL560 2",null,"HDD 300GB DL560 3",null,"HDD 1TB DL560 3"]
["RAID Personalizzato",{"$f":"IF($B$109<=8,0,\"\")","v":0},{"$f":"\"\"","v":""},{"$f":"IF($G$7=0,A33,\"\")","v":"RAID Personalizzato"},{"$f":"IF($G$7=0,C33,\"\")","v":""},{"$f":"IF($G$18=0,A33,\"\")","v":"RAID Personalizzato"},{"$f":"IF($G$18=0,C33,\"\")","v":""},{"$f":"IF(I7=0,$A$33,\"\")","v":{"$error":"#REF!"}},{"$f":"IF(I7=0,$C$33,\"\")","v":{"$error":"#REF!"}},{"$f":"IF(I18=0,$A$33,\"\")","v":{"$error":"#REF!"}},{"$f":"IF(I18=0,$C$33,\"\")","v":{"$error":"#REF!"}},{"$f":"IF(K7=0,$A$33,\"\")","v":{"$error":"#REF!"}},{"$f":"IF(K7=0,$C$33,\"\")","v":{"$error":"#REF!"}},{"$f":"IF(K18=0,$A$33,\"\")","v":{"$error":"#REF!"}},{"$f":"IF(K18=0,$C$33,\"\")","v":{"$error":"#REF!"}}]
["RAID non Configurato (1-8 HDDs)",1,{"$f":"\"\"","v":""},{"$f":"IF($G$7=0,A34,\"\")","v":"RAID non Configurato (1-8 HDDs)"},{"$f":"IF($G$7=0,C34,\"\")","v":""},{"$f":"IF($G$18=0,A34,\"\")","v":"RAID non Configurato (1-8 HDDs)"},{"$f":"IF($G$18=0,C34,\"\")","v":""},{"$f":"IF(I7=0,$A$34,\"\")","v":{"$error":"#REF!"}},{"$f":"IF(I7=0,$C$34,\"\")","v":{"$error":"#REF!"}},{"$f":"IF(I18=0,$A$34,\"\")","v":{"$error":"#REF!"}},{"$f":"IF(I18=0,$C$34,\"\")","v":{"$error":"#REF!"}},{"$f":"IF(K7=0,$A$34,\"\")","v":{"$error":"#REF!"}},{"$f":"IF(K7=0,$C$34,\"\")","v":{"$error":"#REF!"}},{"$f":"IF(K18=0,$A$34,\"\")","v":{"$error":"#REF!"}},{"$f":"IF(K18=0,$C$34,\"\")","v":{"$error":"#REF!"}}]
["RAID 0 (1-8 HDDs)",1,{"$f":"\"\"","v":""},{"$f":"IF($G$7=0,A35,\"\")","v":"RAID 0 (1-8 HDDs)"},{"$f":"IF($G$7=0,C35,\"\")","v":""},{"$f":"IF($G$18=0,A35,\"\")","v":"RAID 0 (1-8 HDDs)"},{"$f":"IF($G$18=0,C35,\"\")","v":""},{"$f":"IF(I7=0,$A$35,\"\")","v":{"$error":"#REF!"}},{"$f":"IF(I7=0,$C$35,\"\")","v":{"$error":"#REF!"}},{"$f":"IF(I18=0,$A$35,\"\")","v":{"$error":"#REF!"}},{"$f":"IF(I18=0,$C$35,\"\")","v":{"$error":"#REF!"}},{"$f":"IF(K7=0,$A$35,\"\")","v":{"$error":"#REF!"}},{"$f":"IF(K7=0,$C$35,\"\")","v":{"$error":"#REF!"}},{"$f":"IF(K18=0,$A$35,\"\")","v":{"$error":"#REF!"}},{"$f":"IF(K18=0,$C$35,\"\")","v":{"$error":"#REF!"}}]
["RAID 1  (2 HDDs)",1,{"$f":"\"\"","v":""},{"$f":"IF($B$7+$B$8-$G$7=2,A36,\"\")","v":{"$error":"#REF!"}},{"$f":"IF($B$7+$B$8-$G$7=2,C36,\"\")","v":{"$error":"#REF!"}},{"$f":"IF($B$18-$G$18=2,A36,\"\")","v":{"$error":"#REF!"}},{"$f":"IF($B$18-$G$18=2,C36,\"\")","v":{"$error":"#REF!"}},{"$f":"IF($C$7+$C$8-I7=2,$A$36,\"\")","v":{"$error":"#REF!"}},{"$f":"IF($C$7+$C$8-I7=2,$C$36,\"\")","v":{"$error":"#REF!"}},{"$f":"IF($C$18-I18=2,A36,\"\")","v":{"$error":"#REF!"}},{"$f":"IF($C$18-I18=2,$C$36,\"\")","v":{"$error":"#REF!"}},{"$f":"IF($C$7+$C$8-K7=2,$A$36,\"\")","v":{"$error":"#REF!"}},{"$f":"IF($C$7+$C$8-K7=2,$C$36,\"\")","v":{"$error":"#REF!"}},{"$f":"IF($C$18-M18=2,E36,\"\")","v":{"$error":"#REF!"}},{"$f":"IF($D$18-K18=2,$C$36,\"\")","v":{"$error":"#REF!"}}]
["RAID 5 (da 3 a 10 HDDs)",1,{"$f":"\"\"","v":""},{"$f":"IF($B$7+$B$8-$G$7>=3,A37,\"\")","v":{"$error":"#REF!"}},{"$f":"IF($B$7+$B$8-$G$7>=3,C37,\"\")","v":{"$error":"#REF!"}},{"$f":"IF($B$18-$G$18>=3,A37,\"\")","v":{"$error":"#REF!"}},{"$f":"IF($B$18-$G$18>=3,C37,\"\")","v":{"$error":"#REF!"}},{"$f":"IF($C$7+$C$8-I7>=3,$A$37,\"\")","v":{"$error":"#REF!"}},{"$f":"IF($C$7+$C$8-I7>=3,$C$37,\"\")","v":{"$error":"#REF!"}},{"$f":"IF($C$18-I18>=3,$A$37,\"\")","v":{"$error":"#REF!"}},{"$f":"IF($C$18-I18>=3,$C$37,\"\")","v":{"$error":"#REF!"}},{"$f":"IF($D$7+$D$8-K7>=3,$A$37,\"\")","v":{"$error":"#REF!"}},{"$f":"IF($D$7+$D$8-K7>=3,$C$37,\"\")","v":{"$error":"#REF!"}},{"$f":"IF($D$18-K18>=3,$A$37,\"\")","v":{"$error":"#REF!"}},{"$f":"IF($D$18-K18>=3,$C$37,\"\")","v":{"$error":"#REF!"}}]
["RAID 10 (4-8 HDDs in pairs) ",1,{"$f":"\"\"","v":""},{"$f":"IF($B$7+$B$8-$G$7=4,A38,\"\")","v":{"$error":"#REF!"}},{"$f":"IF($B$7+$B$8-$G$7=4,C38,\"\")","v":{"$error":"#REF!"}},{"$f":"IF($B$18-$G$18=4,A38,\"\")","v":{"$error":"#REF!"}},{"$f":"IF($B$18-$G$18=4,C38,\"\")","v":{"$error":"#REF!"}},{"$f":"IF($C$7+$C$8-I7=4,$A$38,\"\")","v":{"$error":"#REF!"}},{"$f":"IF($C$7+$C$8-I7=4,$C$38,\"\")","v":{"$error":"#REF!"}},{"$f":"IF($C$18-I18=4,$A$38,\"\")","v":{"$error":"#REF!"}},{"$f":"IF($C$18-I18=4,$C$38,\"\")","v":{"$error":"#REF!"}},{"$f":"IF($D$7+$D$8-K7=4,$A$38,\"\")","v":{"$error":"#REF!"}},{"$f":"IF($D$7+$D$8-K7=4,$C$38,\"\")","v":{"$error":"#REF!"}},{"$f":"IF($D$18-K18=4,$A$38,\"\")","v":{"$error":"#REF!"}},{"$f":"IF($D$18-K18=4,$C$38,\"\")","v":{"$error":"#REF!"}}]
["RAID 1+RAID 1 (2 + 2 HDDs) ",1,{"$f":"\"\"","v":""},{"$f":"IF($B$7+$B$8-$G$7=4,A39,\"\")","v":{"$error":"#REF!"}},{"$f":"IF($B$7+$B$8-$G$7=4,C39,\"\")","v":{"$error":"#REF!"}},{"$f":"IF($B$18-$G$18=4,A39,\"\")","v":{"$error":"#REF!"}},{"$f":"IF($B$18-$G$18=4,C39,\"\")","v":{"$error":"#REF!"}},{"$f":"IF($C$7+$C$8-I7=4,$A$39,\"\")","v":{"$error":"#REF!"}},{"$f":"IF($C$7+$C$8-I7=4,$C$39,\"\")","v":{"$error":"#REF!"}},{"$f":"IF($C$18-I18=4,A39,\"\")","v":{"$error":"#REF!"}},{"$f":"IF($C$18-I18=4,$C$39,\"\")","v":{"$error":"#REF!"}},{"$f":"IF($D$7+$D$8-K7=4,$A$39,\"\")","v":{"$error":"#REF!"}},{"$f":"IF($D$7+$D$8-K7=4,$C$39,\"\")","v":{"$error":"#REF!"}},{"$f":"IF($D$18-K18=4,A39,\"\")","v":{"$error":"#REF!"}},{"$f":"IF($D$18-K18=4,$C$39,\"\")","v":{"$error":"#REF!"}}]
["RAID 1+RAID 5 (2 + 3-8 HDDs)",1,{"$f":"\"\"","v":""},{"$f":"IF($B$7+$B$8-$G$7>=5,A40,\"\")","v":{"$error":"#REF!"}},{"$f":"IF($B$7+$B$8-$G$7>=5,C40,\"\")","v":{"$error":"#REF!"}},{"$f":"IF($B$18-$G$18>=5,A40,\"\")","v":{"$error":"#REF!"}},{"$f":"IF($B$18-$G$18>=5,C40,\"\")","v":{"$error":"#REF!"}},{"$f":"IF($C$7+$C$8-I7>=5,$A$40,\"\")","v":{"$error":"#REF!"}},{"$f":"IF($C$7+$C$8-I7>=5,$C$40,\"\")","v":{"$error":"#REF!"}},{"$f":"IF($C$18-I18>=5,$A$40,\"\")","v":{"$error":"#REF!"}},{"$f":"IF($C$18-I18>=5,$C$40,\"\")","v":{"$error":"#REF!"}},{"$f":"IF($D$7+$D$8-K7>=5,$A$40,\"\")","v":{"$error":"#REF!"}},{"$f":"IF($D$7+$D$8-K7>=5,$C$40,\"\")","v":{"$error":"#REF!"}},{"$f":"IF($D$18-K18>=5,$A$40,\"\")","v":{"$error":"#REF!"}},{"$f":"IF($D$18-K18>=5,$C$40,\"\")","v":{"$error":"#REF!"}}]
["RAID 1 + RAID 10 (2 + 4 HDDs in pairs) ",1,{"$f":"\"\"","v":""},{"$f":"IF($B$7+$B$8-$G$7=6,A41,\"\")","v":{"$error":"#REF!"}},{"$f":"IF($B$7+$B$8-$G$7=6,C41,\"\")","v":{"$error":"#REF!"}},{"$f":"IF($B$18-$G$18=6,A41,\"\")","v":{"$error":"#REF!"}},{"$f":"IF($B$18-$G$18=6,C41,\"\")","v":{"$error":"#REF!"}},{"$f":"IF($C$7+$C$8-I7=6,$A$41,\"\")","v":{"$error":"#REF!"}},{"$f":"IF($C$7+$C$8-I7=6,$C$41,\"\")","v":{"$error":"#REF!"}},{"$f":"IF($C$18-I18=6,A41,\"\")","v":{"$error":"#REF!"}},{"$f":"IF($C$18-I18=6,$C$41,\"\")","v":{"$error":"#REF!"}},{"$f":"IF($D$7+$D$8-M7=6,$A$41,\"\")","v":{"$error":"#REF!"}},{"$f":"IF($D$7+$D$8-M7=6,$C$41,\"\")","v":{"$error":"#REF!"}},{"$f":"IF($D$18-K18=6,A41,\"\")","v":{"$error":"#REF!"}},{"$f":"IF($D$18-K18=6,$C$41,\"\")","v":{"$error":"#REF!"}}]
[]
["R730xd"]
["HP 300GB 12G SAS 15K 2.5in SC ENT HDD",null,"10L2-HDD300GB","S10L2-DL580-HDD300","759208-B21",140]
[]
[]
[]
["HP 1TB 6G SAS 7.2K 2.5in SC MDL HDD",null,"10L2-HDD1TB","S10L2-DL580-HDD1000","652749-B21",278]
[null,{"$f":"#REF!","v":{"$error":"#REF!"}},{"$f":"#REF!","v":{"$error":"#REF!"}},{"$f":"#REF!","v":{"$error":"#REF!"}}]
["HDD max",10,10,10]
["HDD 300GB Base",2,2,2]
["Hot Spare for 300GB HDD",{"$f":"IF(B49=\"Yes\",1,0)","v":{"$error":"#REF!"}},{"$f":"IF(C49=\"Yes\",1,0)","v":{"$error":"#REF!"}},{"$f":"IF(D49=\"Yes\",1,0)","v":{"$error":"#REF!"}}]
["HDD 300GB Selected",{"$f":"#REF!","v":{"$error":"#REF!"}},{"$f":"#REF!","v":{"$error":"#REF!"}},{"$f":"#REF!","v":{"$error":"#REF!"}}]
["HP 300GB 12G SAS 15K 2.5in SC ENT HDD",0,0,0]
[null,1,1,1]
[null,2,2,2]
[null,3,3,3]
[null,4,4,4]
[null,5,5,5]
[null,6,6,6]
[null,7,7,7]
[null,8,8,8]
[]
[]
[]
[]
[]
[]
[null,{"$f":"#REF!","v":{"$error":"#REF!"}},{"$f":"#REF!","v":{"$error":"#REF!"}},{"$f":"#REF!","v":{"$error":"#REF!"}}]
["HDD max",10,10,10]
["HDD 300GB",{"$f":"B51+B53","v":{"$error":"#REF!"}},{"$f":"C51+C53","v":{"$error":"#REF!"}},{"$f":"D51+D53","v":{"$error":"#REF!"}}]
["Hot Spare for 1TB HDD",{"$f":"IF(B69=\"Yes\",1,0)","v":{"$error":"#REF!"}},{"$f":"IF(C69=\"Yes\",1,0)","v":{"$error":"#REF!"}},{"$f":"IF(D69=\"Yes\",1,0)","v":{"$error":"#REF!"}}]
["HDD 1TB Selected",{"$f":"#REF!","v":{"$error":"#REF!"}},{"$f":"#REF!","v":{"$error":"#REF!"}},{"$f":"#REF!","v":{"$error":"#REF!"}}]
["HP 1TB 6G SAS 7.2K 2.5in SC MDL HDD",{"$f":"$B$70-$B$71-$B$73","v":{"$error":"#REF!"}},{"$f":"$C$70-$C$71-$C$73","v":{"$error":"#REF!"}},{"$f":"$D$70-$D$71-$D$73","v":{"$error":"#REF!"}}]
[null,{"$f":"IF(B74-1<1,0,B74-1)","v":{"$error":"#REF!"}},{"$error":"#REF!"},{"$f":"IF(D74-1<1,0,D74-1)","v":{"$error":"#REF!"}}]
[null,{"$error":"#REF!"},{"$error":"#REF!"},{"$error":"#REF!"}]
[null,{"$error":"#REF!"},{"$error":"#REF!"},{"$error":"#REF!"}]
[null,{"$error":"#REF!"},{"$error":"#REF!"},{"$error":"#REF!"}]
[null,{"$error":"#REF!"},{"$error":"#REF!"},{"$error":"#REF!"}]
[null,{"$error":"#REF!"},{"$error":"#REF!"},{"$error":"#REF!"}]
[null,{"$error":"#REF!"},{"$error":"#REF!"},{"$error":"#REF!"}]
[null,{"$error":"#REF!"},{"$error":"#REF!"},{"$error":"#REF!"}]
[]
[]
[]
[]
[]
[]
[]
[]
[]
["RAID Configuration",null,null,"HDD 300GB R730xd",null,"HDD 1TB R730xd",null,"HDD 300GB R730xd 2",null,"HDD 1TB R730xd 2",null,"HDD 300GB R730xd 3",null,"HDD 1TB R730xd 3"]
["RAID Personalizzato",{"$f":"IF($B$109<=8,0,\"\")","v":0},"[780-BBJC]",{"$f":"IF($B$52=0,A93,\"\")","v":{"$error":"#REF!"}},{"$f":"IF($B$52=0,C93,\"\")","v":{"$error":"#REF!"}},{"$f":"IF($B$72=0,A93,\"\")","v":{"$error":"#REF!"}},{"$f":"IF($B$72=0,C93,\"\")","v":{"$error":"#REF!"}},{"$f":"IF($C$52=0,A93,\"\")","v":{"$error":"#REF!"}},{"$f":"IF($C$52=0,C93,\"\")","v":{"$error":"#REF!"}},{"$f":"IF($C$72=0,A93,\"\")","v":{"$error":"#REF!"}},{"$f":"IF($C$72=0,C93,\"\")","v":{"$error":"#REF!"}},{"$f":"IF($D$52=0,A93,\"\")","v":{"$error":"#REF!"}},{"$f":"IF($D$52=0,C93,\"\")","v":{"$error":"#REF!"}},{"$f":"IF($D$72=0,A93,\"\")","v":{"$error":"#REF!"}},{"$f":"IF($D$72=0,C93,\"\")","v":{"$error":"#REF!"}}]
["RAID non Configurato (1-8 HDDs)",1,"[780-BBJD] ",{"$f":"IF($B$52=0,A94,\"\")","v":{"$error":"#REF!"}},{"$f":"IF($B$52=0,C94,\"\")","v":{"$error":"#REF!"}},{"$f":"IF($B$72=0,A94,\"\")","v":{"$error":"#REF!"}},{"$f":"IF($B$72=0,C94,\"\")","v":{"$error":"#REF!"}},{"$f":"IF($C$52=0,A94,\"\")","v":{"$error":"#REF!"}},{"$f":"IF($C$52=0,C94,\"\")","v":{"$error":"#REF!"}},{"$f":"IF($C$72=0,A94,\"\")","v":{"$error":"#REF!"}},{"$f":"IF($C$72=0,C94,\"\")","v":{"$error":"#REF!"}},{"$f":"IF($D$52=0,A94,\"\")","v":{"$error":"#REF!"}},{"$f":"IF($D$52=0,C94,\"\")","v":{"$error":"#REF!"}},{"$f":"IF($D$72=0,A94,\"\")","v":{"$error":"#REF!"}},{"$f":"IF($D$72=0,C94,\"\")","v":{"$error":"#REF!"}}]
["RAID 0 (1-8 HDDs)",1,"[780-BBJF]",{"$f":"IF($B$52=0,A95,\"\")","v":{"$error":"#REF!"}},{"$f":"IF($B$52=0,C95,\"\")","v":{"$error":"#REF!"}},{"$f":"IF($B$72=0,A95,\"\")","v":{"$error":"#REF!"}},{"$f":"IF($B$72=0,C95,\"\")","v":{"$error":"#REF!"}},{"$f":"IF($C$52=0,A95,\"\")","v":{"$error":"#REF!"}},{"$f":"IF($C$52=0,C95,\"\")","v":{"$error":"#REF!"}},{"$f":"IF($C$72=0,A95,\"\")","v":{"$error":"#REF!"}},{"$f":"IF($C$72=0,C95,\"\")","v":{"$error":"#REF!"}},{"$f":"IF($D$52=0,A95,\"\")","v":{"$error":"#REF!"}},{"$f":"IF($D$52=0,C95,\"\")","v":{"$error":"#REF!"}},{"$f":"IF($D$72=0,A95,\"\")","v":{"$error":"#REF!"}},{"$f":"IF($D$72=0,C95,\"\")","v":{"$error":"#REF!"}}]
["RAID 1  (2 HDDs)",1,"[780-BBJK]",{"$f":"IF($B$51+$B$53-$B$52=2,A96,\"\")","v":{"$error":"#REF!"}},{"$f":"IF($B$51+$B$53-$B$52=2,C96,\"\")","v":{"$error":"#REF!"}},{"$f":"IF($B$73-$B$72=2,A96,\"\")","v":{"$error":"#REF!"}},{"$f":"IF($B$73-$B$72=2,C96,\"\")","v":{"$error":"#REF!"}},{"$f":"IF($C$51+$C$53-$C$52=2,A96,\"\")","v":{"$error":"#REF!"}},{"$f":"IF($C$51+$C$53-$C$52=2,C96,\"\")","v":{"$error":"#REF!"}},{"$f":"IF($C$73-$C$72=2,A96,\"\")","v":{"$error":"#REF!"}},{"$f":"IF($C$73-$C$72=2,C96,\"\")","v":{"$error":"#REF!"}},{"$f":"IF($D$51+$D$53-$D$52=2,A96,\"\")","v":{"$error":"#REF!"}},{"$f":"IF($D$51+$D$53-$D$52=2,C96,\"\")","v":{"$error":"#REF!"}},{"$f":"IF($D$73-$D$72=2,A96,\"\")","v":{"$error":"#REF!"}},{"$f":"IF($D$73-$D$72=2,C96,\"\")","v":{"$error":"#REF!"}}]
["RAID 5 (da 3 a 10 HDDs)",1,"[780-BBJL]",{"$f":"IF($B$51+$B$53-$B$52>=3,A97,\"\")","v":{"$error":"#REF!"}},{"$f":"IF($B$51+$B$53-$B$52>=3,C97,\"\")","v":{"$error":"#REF!"}},{"$f":"IF($B$73-$B$72>=3,A97,\"\")","v":{"$error":"#REF!"}},{"$f":"IF($B$73-$B$72>=3,C97,\"\")","v":{"$error":"#REF!"}},{"$f":"IF($C$51+$C$53-$C$52>=3,A97,\"\")","v":{"$error":"#REF!"}},{"$f":"IF($C$51+$C$53-$C$52>=3,C97,\"\")","v":{"$error":"#REF!"}},{"$f":"IF($C$73-$C$72>=3,A97,\"\")","v":{"$error":"#REF!"}},{"$f":"IF($C$73-$C$72>=3,C97,\"\")","v":{"$error":"#REF!"}},{"$f":"IF($D$51+$D$53-$D$52>=3,A97,\"\")","v":{"$error":"#REF!"}},{"$f":"IF($D$51+$D$53-$D$52>=3,C97,\"\")","v":{"$error":"#REF!"}},{"$f":"IF($D$73-$D$72>=3,A97,\"\")","v":{"$error":"#REF!"}},{"$f":"IF($D$73-$D$72>=3,C97,\"\")","v":{"$error":"#REF!"}}]
["RAID 10 (4-8 HDDs in pairs) ",1,"[780-BBJN]",{"$f":"IF($B$51+$B$53-$B$52=4,A98,\"\")","v":{"$error":"#REF!"}},{"$f":"IF($B$51+$B$53-$B$52=4,C98,\"\")","v":{"$error":"#REF!"}},{"$f":"IF($B$73-$B$72=4,A98,\"\")","v":{"$error":"#REF!"}},{"$f":"IF($B$73-$B$72=4,C98,\"\")","v":{"$error":"#REF!"}},{"$f":"IF($C$51+$C$53-$C$52=4,A98,\"\")","v":{"$error":"#REF!"}},{"$f":"IF($C$51+$C$53-$C$52=4,C98,\"\")","v":{"$error":"#REF!"}},{"$f":"IF($C$73-$C$72=4,A98,\"\")","v":{"$error":"#REF!"}},{"$f":"IF($C$73-$C$72=4,C98,\"\")","v":{"$error":"#REF!"}},{"$f":"IF($D$51+$D$53-$D$52=4,A98,\"\")","v":{"$error":"#REF!"}},{"$f":"IF($D$51+$D$53-$D$52=4,C98,\"\")","v":{"$error":"#REF!"}},{"$f":"IF($D$73-$D$72=4,A98,\"\")","v":{"$error":"#REF!"}},{"$f":"IF($D$73-$D$72=4,C98,\"\")","v":{"$error":"#REF!"}}]
["RAID 1+RAID 1 (2 + 2 HDDs) ",1,"[780-BBJO]",{"$f":"IF($B$51+$B$53-$B$52=4,A99,\"\")","v":{"$error":"#REF!"}},{"$f":"IF($B$51+$B$53-$B$52=4,C99,\"\")","v":{"$error":"#REF!"}},{"$f":"IF($B$73-$B$72=4,A99,\"\")","v":{"$error":"#REF!"}},{"$f":"IF($B$73-$B$72=4,C99,\"\")","v":{"$error":"#REF!"}},{"$f":"IF($C$51+$C$53-$C$52=4,A99,\"\")","v":{"$error":"#REF!"}},{"$f":"IF($C$51+$C$53-$C$52=4,C99,\"\")","v":{"$error":"#REF!"}},{"$f":"IF($C$73-$C$72=4,A99,\"\")","v":{"$error":"#REF!"}},{"$f":"IF($C$73-$C$72=4,C99,\"\")","v":{"$error":"#REF!"}},{"$f":"IF($D$51+$D$53-$D$52=4,A99,\"\")","v":{"$error":"#REF!"}},{"$f":"IF($D$51+$D$53-$D$52=4,C99,\"\")","v":{"$error":"#REF!"}},{"$f":"IF($D$73-$D$72=4,A99,\"\")","v":{"$error":"#REF!"}},{"$f":"IF($D$73-$D$72=4,C99,\"\")","v":{"$error":"#REF!"}}]
["RAID 1+RAID 5 (2 + 3-8 HDDs)",1,"[780-BBJP]",{"$f":"IF($B$51+$B$53-$B$52>=5,A100,\"\")","v":{"$error":"#REF!"}},{"$f":"IF($B$51+$B$53-$B$52>=5,C100,\"\")","v":{"$error":"#REF!"}},{"$f":"IF($B$73-$B$72>=5,A100,\"\")","v":{"$error":"#REF!"}},{"$f":"IF($B$73-$B$72>=5,C100,\"\")","v":{"$error":"#REF!"}},{"$f":"IF($C$51+$C$53-$C$52>=5,A100,\"\")","v":{"$error":"#REF!"}},{"$f":"IF($C$51+$C$53-$C$52>=5,C100,\"\")","v":{"$error":"#REF!"}},{"$f":"IF($C$73-$C$72>=5,A100,\"\")","v":{"$error":"#REF!"}},{"$f":"IF($C$73-$C$72>=5,C100,\"\")","v":{"$error":"#REF!"}},{"$f":"IF($D$51+$D$53-$D$52>=5,A100,\"\")","v":{"$error":"#REF!"}},{"$f":"IF($D$51+$D$53-$D$52>=5,C100,\"\")","v":{"$error":"#REF!"}},{"$f":"IF($D$73-$D$72>=5,A100,\"\")","v":{"$error":"#REF!"}},{"$f":"IF($D$73-$D$72>=5,C100,\"\")","v":{"$error":"#REF!"}}]
["RAID 1 + RAID 10 (2 + 4 HDDs in pairs) ",1,"[780-BBJQ] ",{"$f":"IF($B$51+$B$53-$B$52=6,A101,\"\")","v":{"$error":"#REF!"}},{"$f":"IF($B$51+$B$53-$B$52=6,C101,\"\")","v":{"$error":"#REF!"}},{"$f":"IF($B$73-$B$72=6,A101,\"\")","v":{"$error":"#REF!"}},{"$f":"IF($B$73-$B$72=6,C101,\"\")","v":{"$error":"#REF!"}},{"$f":"IF($C$51+$C$53-$C$52=6,A101,\"\")","v":{"$error":"#REF!"}},{"$f":"IF($C$51+$C$53-$C$52=6,C101,\"\")","v":{"$error":"#REF!"}},{"$f":"IF($C$73-$C$72=6,A101,\"\")","v":{"$error":"#REF!"}},{"$f":"IF($C$73-$C$72=6,C101,\"\")","v":{"$error":"#REF!"}},{"$f":"IF($D$51+$D$53-$D$52=6,A101,\"\")","v":{"$error":"#REF!"}},{"$f":"IF($D$51+$D$53-$D$52=6,C101,\"\")","v":{"$error":"#REF!"}},{"$f":"IF($D$73-$D$72=6,A101,\"\")","v":{"$error":"#REF!"}},{"$f":"IF($D$73-$D$72=6,C101,\"\")","v":{"$error":"#REF!"}}]
[]
[]
[]
[]
[]
[]
["T630"]
["300GB 10K RPM SAS 12Gbps 2.5in Hot-plug Hard Drive,CusKit",null,"10L1-HDD300GB-T","S10L1-T630-HDD300","[400-AJOQ]",91]
["1TB 7.2K RPM NLSAS 6Gbps 2.5in Hot-plug Hard Drive,13G,CusKit",null,"10L1-HDD1TB","S10L1-T630-HDD1000","[400-AEFF]",296]
[]
["HDD max",32]
["HDD 300GB Base",2]
["HDD 300GB Selected",{"$f":"#REF!","v":{"$error":"#REF!"}}]
["300GB 10K RPM SAS 12Gbps 2.5in Hot-plug Hard Drive,CusKit",0,null,"Hot Spare for 300GB HDD",{"$f":"#REF!","v":{"$error":"#REF!"}},{"$f":"IF(E115=\"Yes\",1,0)","v":{"$error":"#REF!"}}]
[null,1]
[null,2]
[null,3]
[null,4]
[null,5]
[null,6]
[null,7]
[null,8]
[null,9]
[null,10]
[null,11]
[null,12]
[null,13]
[null,14]
[null,15]
[null,16]
[null,17]
[null,18]
[null,19]
[null,20]
[null,21]
[null,22]
[null,23]
[null,24]
[null,25]
[null,26]
[null,27]
[null,28]
[null,29]
[null,30]
["HDD max",32]
["HDD 300GB",{"$f":"B113+B114","v":{"$error":"#REF!"}}]
["HDD 1TB Selected",{"$f":"#REF!","v":{"$error":"#REF!"}},null,"Hot Spare for 1TB HDD",{"$f":"#REF!","v":{"$error":"#REF!"}},{"$f":"IF(E148=\"Yes\",1,0)","v":{"$error":"#REF!"}}]
["1TB 7.2K RPM NLSAS 6Gbps 2.5in Hot-plug Hard Drive,13G,CusKit",{"$f":"$B$146-$B$147-$B$148","v":{"$error":"#REF!"}}]
[null,{"$f":"IF(B149-1<1,0,B149-1)","v":{"$error":"#REF!"}}]
[null,{"$error":"#REF!"}]
[null,{"$error":"#REF!"}]
[null,{"$error":"#REF!"}]
[null,{"$error":"#REF!"}]
[null,{"$error":"#REF!"}]
[null,{"$error":"#REF!"}]
[null,{"$error":"#REF!"}]
[null,{"$f":"IF(B157-1<1,0,B157-1)","v":{"$error":"#REF!"}}]
[null,{"$error":"#REF!"}]
[null,{"$error":"#REF!"}]
[null,{"$error":"#REF!"}]
[null,{"$error":"#REF!"}]
[null,{"$error":"#REF!"}]
[null,{"$error":"#REF!"}]
[null,{"$error":"#REF!"}]
[null,{"$error":"#REF!"}]
[null,{"$error":"#REF!"}]
[null,{"$error":"#REF!"}]
[null,{"$error":"#REF!"}]
[null,{"$error":"#REF!"}]
[null,{"$error":"#REF!"}]
[null,{"$error":"#REF!"}]
[null,{"$error":"#REF!"}]
[null,{"$error":"#REF!"}]
[null,{"$error":"#REF!"}]
[null,{"$error":"#REF!"}]
[null,{"$error":"#REF!"}]
[null,{"$error":"#REF!"}]
[null,{"$error":"#REF!"}]
[]
["RAID Configuration",null,null,"HDD 300GB",null,"HDD 1TB"]
["C1 - No RAID for H330 (1-8 HDDs)",{"$f":"IF($B$109<=8,0,\"\")","v":0},"[780-BBJC]",{"$f":"IF($F$115=0,A182,\"\")","v":{"$error":"#REF!"}},{"$f":"IF($F$115=0,C182,\"\")","v":{"$error":"#REF!"}},{"$f":"IF($F$148=0,A182,\"\")","v":{"$error":"#REF!"}},{"$f":"IF($F$148=0,C182,\"\")","v":{"$error":"#REF!"}}]
["C10 - Unconfigured RAID for H330 (1-8 HDDs)",1,"[780-BBJD] ",{"$f":"IF($F$115=0,A183,\"\")","v":{"$error":"#REF!"}},{"$f":"IF($F$115=0,C183,\"\")","v":{"$error":"#REF!"}},{"$f":"IF($F$148=0,A183,\"\")","v":{"$error":"#REF!"}},{"$f":"IF($F$148=0,C183,\"\")","v":{"$error":"#REF!"}}]
["C2 - RAID 0 for H330 (1-8 HDDs)",1,"[780-BBJF]",{"$f":"IF($F$115=0,A184,\"\")","v":{"$error":"#REF!"}},{"$f":"IF($F$115=0,C184,\"\")","v":{"$error":"#REF!"}},{"$f":"IF($F$148=0,A184,\"\")","v":{"$error":"#REF!"}},{"$f":"IF($F$148=0,C184,\"\")","v":{"$error":"#REF!"}}]
["C3 - RAID 1 for H330 (2 HDDs)",1,"[780-BBJK]",{"$f":"IF($B$113+$B$114-$F$115=2,A185,\"\")","v":{"$error":"#REF!"}},{"$f":"IF($B$113+$B$114-$F$115=2,C185,\"\")","v":{"$error":"#REF!"}},{"$f":"IF($B$148-$F$148=2,A185,\"\")","v":{"$error":"#REF!"}},{"$f":"IF($B$148-$F$148=2,C185,\"\")","v":{"$error":"#REF!"}}]
["C4 - RAID 5 for H330 (3-8 HDDs)",1,"[780-BBJL]",{"$f":"IF($B$113+$B$114-$F$115>=3,A186,\"\")","v":{"$error":"#REF!"}},{"$f":"IF($B$113+$B$114-$F$115>=3,C186,\"\")","v":{"$error":"#REF!"}},{"$f":"IF($B$148-$F$148>=3,A186,\"\")","v":{"$error":"#REF!"}},{"$f":"IF($B$148-$F$148>=3,C186,\"\")","v":{"$error":"#REF!"}}]
["C6 - RAID 10 forH330 (4-8 HDDs in pairs) ",1,"[780-BBJN]",{"$f":"IF($B$113+$B$114-$F$115=4,A187,\"\")","v":{"$error":"#REF!"}},{"$f":"IF($B$113+$B$114-$F$115=4,C187,\"\")","v":{"$error":"#REF!"}},{"$f":"IF($B$148-$F$148=4,A187,\"\")","v":{"$error":"#REF!"}},{"$f":"IF($B$148-$F$148=4,C187,\"\")","v":{"$error":"#REF!"}}]
["C7 - RAID 1+RAID 1 for H330 (2 + 2 HDDs) ",1,"[780-BBJO]",{"$f":"IF($B$113+$B$114-$F$115=4,A188,\"\")","v":{"$error":"#REF!"}},{"$f":"IF($B$113+$B$114-$F$115=4,C188,\"\")","v":{"$error":"#REF!"}},{"$f":"IF($B$148-$F$148=4,A188,\"\")","v":{"$error":"#REF!"}},{"$f":"IF($B$148-$F$148=4,C188,\"\")","v":{"$error":"#REF!"}}]
["C8 - RAID 1+RAID 5 for H330 (2 + 3-8 HDDs)",1,"[780-BBJP]",{"$f":"IF($B$113+$B$114-$F$115>=5,A189,\"\")","v":{"$error":"#REF!"}},{"$f":"IF($B$113+$B$114-$F$115>=5,C189,\"\")","v":{"$error":"#REF!"}},{"$f":"IF($B$148-$F$148>=5,A189,\"\")","v":{"$error":"#REF!"}},{"$f":"IF($B$148-$F$148>=5,C189,\"\")","v":{"$error":"#REF!"}}]
["C9 - RAID 1+RAID 10 for H330 (2 + 4 HDDs in pairs) ",1,"[780-BBJQ] ",{"$f":"IF($B$113+$B$114-$F$115=6,A190,\"\")","v":{"$error":"#REF!"}},{"$f":"IF($B$113+$B$114-$F$115=6,C190,\"\")","v":{"$error":"#REF!"}},{"$f":"IF($B$148-$F$148=6,A190,\"\")","v":{"$error":"#REF!"}},{"$f":"IF($B$148-$F$148=6,C190,\"\")","v":{"$error":"#REF!"}}]

{"sheet":"Servizi Opzionali","index":11,"n_rows":81,"n_cols":13,"rows_kept":81,"cut":false,"hidden":true,"merged":[]}
["Warranty Upgrades",null,null,null,null,null,"Protezione dei dati - Keep Your Hard Drive "]
["DL560"]
["None",{"$f":"\"\"","v":""},{"$f":"\"\"","v":""},{"$f":"\"\"","v":""},{"$f":"\"\"","v":""},{"$f":"\"\"","v":""},null,null,{"$f":"IF(($A$22=$A$12),\"\",IF($A$8=$A$3,I13,IF($A$8=$A$4,I14,IF($A$8=$A$5,I15))))","v":""},{"$f":"IF(($A$22=$A$12),\"\",IF($A$8=$A$3,J13,IF($A$8=$A$4,J14,IF($A$8=$A$5,J15))))","v":""},{"$f":"IF(($A$22=$A$12),\"\",IF($A$8=$A$3,K13,IF($A$8=$A$4,K14,IF($A$8=$A$5,K15))))","v":""},{"$f":"IF(($A$22=$A$12),\"\",IF($A$8=$A$3,L13,IF($A$8=$A$4,L14,IF($A$8=$A$5,L15))))","v":""},{"$f":"IF(($A$22=$A$12),\"\",IF($A$8=$A$3,M13,IF($A$8=$A$4,M14,IF($A$8=$A$5,M15))))","v":""}]
["4Yr Warranty upgrade ",1,"10L2-SO-12M","S10L2-DL560-S-12M",{"$f":"\"\"","v":""},350]
["5Yr Warranty upgrade ",1,"10L2-SO-24M","S10L2-DL560-S-24M",{"$f":"\"\"","v":""},700]
[]
["Estensione Garanzia Selezionata"]
[{"$f":"'Lotto4 DL560 Gen10 1'!$B$201","v":"None"},null,"DL560"]
[{"$f":"#REF!","v":{"$error":"#REF!"}},null,"DL560 2"]
[{"$f":"#REF!","v":{"$error":"#REF!"}},null,"DL560 3"]
[]
["None",{"$f":"\"\"","v":""},{"$f":"\"\"","v":""},{"$f":"\"\"","v":""},{"$f":"\"\"","v":""},{"$f":"\"\"","v":""},null,"None"]
[{"$f":"IF($A$8=$A$3,H13,IF($A$8=$A$4,H14,IF($A$8=$A$5,H15)))","v":"3Yr Data Protection - Keep Your Hard Drive"},1,"10L2-SO-HDD","S10L2-DL560-S-HDD",{"$f":"IF($A$8=$A$3,L13,IF($A$8=$A$4,L14,IF($A$8=$A$5,L15)))","v":""},300,null,"3Yr Data Protection - Keep Your Hard Drive",1,"10L2-SO-HDD","S10L2-DL560-S-HDD",{"$f":"\"\"","v":""},300]
["None",{"$f":"\"\"","v":""},{"$f":"\"\"","v":""},{"$f":"\"\"","v":""},{"$f":"\"\"","v":""},{"$f":"\"\"","v":""},null,"4Yr Data Protection - Keep Your Hard Drive",{"$f":"I13","v":1},{"$f":"J13","v":"10L2-SO-HDD"},{"$f":"K13","v":"S10L2-DL560-S-HDD"},{"$f":"\"\"","v":""},{"$f":"M13","v":300}]
[{"$f":"IF(A9=A3,H13,IF(A9=A4,H14,IF(A9=A5,H15)))","v":{"$error":"#REF!"}},1,"10L2-SO-HDD","S10L2-DL560-S-HDD",{"$f":"IF(A9=A3,L13,IF(A9=A4,L14,IF(A9=A5,L15)))","v":{"$error":"#REF!"}},300,null,"5Yr Data Protection - Keep Your Hard Drive",{"$f":"I13","v":1},{"$f":"J13","v":"10L2-SO-HDD"},{"$f":"K13","v":"S10L2-DL560-S-HDD"},{"$f":"\"\"","v":""},{"$f":"M13","v":300}]
["None",{"$f":"\"\"","v":""},{"$f":"\"\"","v":""},{"$f":"\"\"","v":""},{"$f":"\"\"","v":""},{"$f":"\"\"","v":""}]
[{"$f":"IF(A10=A3,H13,IF(A10=A4,H14,IF(A10=A5,H15)))","v":{"$error":"#REF!"}},1,"10L2-SO-HDD","S10L2-DL560-S-HDD",{"$f":"IF(A10=A3,L13,IF(A10=A4,L14,IF(A10=A5,L15)))","v":{"$error":"#REF!"}},300]
[]
[]
[]
["Protezione dei dati Selezionata"]
[{"$f":"'Lotto4 DL560 Gen10 1'!B204","v":"None"}]
[]
["Servizio Specialistico di System and Network Management per sistema opertivo Windows, erogato on site.",1,"10L2-SO-WIN","S10L1-R630-S-WIN",null,200]
["Servizio Specialistico di System and Network Management per sistema opertivo Linux, erogato on site.",1,"10L2-SO-LINUX","S10L1-R630-S-LINUX",null,200]
[]
["None",{"$f":"\"\"","v":""},{"$f":"\"\"","v":""},{"$f":"\"\"","v":""},{"$f":"\"\"","v":""},{"$f":"\"\"","v":""}]
[{"$f":"IF('Lotto4 DL560 Gen10 1'!$C$16>=5,H28,\"None\")","v":"None"},{"$f":"IF('Lotto4 DL560 Gen10 1'!$C$16>=5,I28,\"\")","v":""},{"$f":"IF('Lotto4 DL560 Gen10 1'!$C$16>=5,J28,\"\")","v":""},{"$f":"IF('Lotto4 DL560 Gen10 1'!$C$16>=5,K28,\"\")","v":""},{"$f":"IF('Lotto4 DL560 Gen10 1'!$C$16>=5,L28,\"\")","v":""},{"$f":"IF('Lotto4 DL560 Gen10 1'!$C$16>=5,M28,\"\")","v":""},null,"Servizi di manutenzione preventiva",1,"10L1-SO-PREV","S10L1-T630-S-PREV",null,200]
[]
["Warranty Upgrades",null,null,null,null,null,"Protezione dei dati - Keep Your Hard Drive "]
["DL580"]
["None",{"$f":"\"\"","v":""},{"$f":"\"\"","v":""},{"$f":"\"\"","v":""},{"$f":"\"\"","v":""},{"$f":"\"\"","v":""},null,null,{"$f":"IF(($A$22=$A$12),\"\",IF($A$8=$A$3,I42,IF($A$8=$A$4,I43,IF($A$8=$A$5,I44))))","v":""},{"$f":"IF(($A$22=$A$12),\"\",IF($A$8=$A$3,J42,IF($A$8=$A$4,J43,IF($A$8=$A$5,J44))))","v":""},{"$f":"IF(($A$22=$A$12),\"\",IF($A$8=$A$3,K42,IF($A$8=$A$4,K43,IF($A$8=$A$5,K44))))","v":""},{"$f":"IF(($A$22=$A$12),\"\",IF($A$8=$A$3,L42,IF($A$8=$A$4,L43,IF($A$8=$A$5,L44))))","v":""},{"$f":"IF(($A$22=$A$12),\"\",IF($A$8=$A$3,M42,IF($A$8=$A$4,M43,IF($A$8=$A$5,M44))))","v":""}]
["Estensione della manutenzione in garanzia per ulteriori 12 mesi",1,"TS2L4-4Y","TS2L4-4Y","HA537A1",300]
["Estensione della manutenzione in garanzia per ulteriori 24 mesi",1,"TS2L4-5Y","TS2L4-5Y","HA538A1",600]
[]
["Estensione Garanzia Selezionata"]
[{"$f":"#REF!","v":{"$error":"#REF!"}},null,"DL580 "]
[{"$f":"#REF!","v":{"$error":"#REF!"}},null,"DL580 2"]
[{"$f":"#REF!","v":{"$error":"#REF!"}},null,"DL580 3"]
[]
["None",{"$f":"\"\"","v":""},{"$f":"\"\"","v":""},{"$f":"\"\"","v":""},{"$f":"\"\"","v":""},{"$f":"\"\"","v":""},null,"None"]
[{"$f":"IF($A$37=$A$32,H42,IF($A$37=$A$33,H43,IF($A$37=$A$34,H44)))","v":{"$error":"#REF!"}},1,"10L2-SO-HDD","S10L2-DL580-S-HDD",{"$f":"IF($A$37=$A$32,L42,IF($A$37=$A$33,L43,IF($A$37=$A$34,L44)))","v":{"$error":"#REF!"}},300,null,"3Yr Data Protection - Keep Your Hard Drive",1,"10L2-SO-HDD","S10L2-DL580-S-HDD","[733-10057]",300]
["None",{"$f":"\"\"","v":""},{"$f":"\"\"","v":""},{"$f":"\"\"","v":""},{"$f":"\"\"","v":""},{"$f":"\"\"","v":""},null,"4Yr Data Protection - Keep Your Hard Drive",{"$f":"I42","v":1},{"$f":"J42","v":"10L2-SO-HDD"},{"$f":"K42","v":"S10L2-DL580-S-HDD"},"[733-10058]",{"$f":"M42","v":300}]
[{"$f":"IF(A38=A32,H42,IF(A38=A33,H43,IF(A38=A34,H44)))","v":{"$error":"#REF!"}},1,"10L2-SO-HDD","S10L2-DL580-S-HDD",{"$f":"IF(A38=A32,L42,IF(A38=A33,L43,IF(A38=A34,L44)))","v":{"$error":"#REF!"}},300,null,"5Yr Data Protection - Keep Your Hard Drive",{"$f":"I42","v":1},{"$f":"J42","v":"10L2-SO-HDD"},{"$f":"K42","v":"S10L2-DL580-S-HDD"},"[733-10059]",{"$f":"M42","v":300}]
["None",{"$f":"\"\"","v":""},{"$f":"\"\"","v":""},{"$f":"\"\"","v":""},{"$f":"\"\"","v":""},{"$f":"\"\"","v":""}]
[{"$f":"IF(A39=A32,H42,IF(A39=A33,H43,IF(A39=A34,H44)))","v":{"$error":"#REF!"}},1,"10L2-SO-HDD","S10L2-DL580-S-HDD",{"$f":"IF(A39=A32,L42,IF(A39=A33,L43,IF(A39=A34,L44)))","v":{"$error":"#REF!"}},300]
[]
[]
[]
["Protezione dei dati Selezionata"]
[{"$f":"#REF!","v":{"$error":"#REF!"}}]
[]
["Servizio Specialistico di System and Network Management per sistema opertivo Windows, erogato on site.",1,"10L2-SO-WIN","S10L1-R730xd-S-WIN",null,200]
["Servizio Specialistico di System and Network Management per sistema opertivo Linux, erogato on site.",1,"10L2-SO-LINUX","S10L1-R730xd-S-LINUX",null,200]
[]
["None",{"$f":"\"\"","v":""},{"$f":"\"\"","v":""},{"$f":"\"\"","v":""},{"$f":"\"\"","v":""},{"$f":"\"\"","v":""}]
[{"$f":"IF(#REF!>=5,H57,\"None\")","v":{"$error":"#REF!"}},{"$f":"IF(#REF!>=5,I57,\"\")","v":{"$error":"#REF!"}},{"$f":"IF(#REF!>=5,J57,\"\")","v":{"$error":"#REF!"}},{"$f":"IF(#REF!>=5,K57,\"\")","v":{"$error":"#REF!"}},{"$f":"IF(#REF!>=5,L57,\"\")","v":{"$error":"#REF!"}},{"$f":"IF(#REF!>=5,M57,\"\")","v":{"$error":"#REF!"}},null,"Servizi di manutenzione preventiva",1,"10L2-SO-PREV","S10L2-DL580-S-PREV",null,200]
[]
[]
["Warranty Upgrades",null,null,null,null,null,"Protezione dei dati - Keep Your Hard Drive "]
["T630"]
["None",{"$f":"\"\"","v":""},{"$f":"\"\"","v":""},{"$f":"\"\"","v":""},{"$f":"\"\"","v":""},{"$f":"\"\"","v":""},null,null,{"$f":"IF(($A$22=$A$12),\"\",IF($A$8=$A$3,I70,IF($A$8=$A$4,I71,IF($A$8=$A$5,I72))))","v":""},{"$f":"IF(($A$22=$A$12),\"\",IF($A$8=$A$3,J70,IF($A$8=$A$4,J71,IF($A$8=$A$5,J72))))","v":""},{"$f":"IF(($A$22=$A$12),\"\",IF($A$8=$A$3,K70,IF($A$8=$A$4,K71,IF($A$8=$A$5,K72))))","v":""},{"$f":"IF(($A$22=$A$12),\"\",IF($A$8=$A$3,L70,IF($A$8=$A$4,L71,IF($A$8=$A$5,L72))))","v":""},{"$f":"IF(($A$22=$A$12),\"\",IF($A$8=$A$3,M70,IF($A$8=$A$4,M71,IF($A$8=$A$5,M72))))","v":""}]
["4Yr Warranty upgrade ",1,"10L1-SO-12M-T","S10L1-T630-S-12M",{"$f":"\"\"","v":""},175]
["5Yr Warranty upgrade ",1,"10L1-SO-24M-T","S10L1-T630-S-24M",{"$f":"\"\"","v":""},350]
[]
["Estensione Garanzia Selezionata"]
[{"$f":"#REF!","v":{"$error":"#REF!"}}]
[]
["None",{"$f":"\"\"","v":""},{"$f":"\"\"","v":""},{"$f":"\"\"","v":""},{"$f":"\"\"","v":""},{"$f":"\"\"","v":""},null,"None"]
[{"$f":"IF($A$67=$A$62,H70,IF($A$67=$A$63,H71,IF($A$67=$A$64,H72)))","v":{"$error":"#REF!"}},1,"10L1-SO-HDD","S10L1-T630-S-HDD",{"$f":"IF($A$67=$A$62,L70,IF($A$67=$A$63,L71,IF($A$67=$A$64,L72)))","v":{"$error":"#REF!"}},150,null,"3Yr Data Protection - Keep Your Hard Drive",1,"10L1-SO-HDD","S10L1-T630-S-HDD","[733-10057]",150]
[null,null,null,null,null,null,null,"4Yr Data Protection - Keep Your Hard Drive",{"$f":"I70","v":1},{"$f":"J70","v":"10L1-SO-HDD"},{"$f":"K70","v":"S10L1-T630-S-HDD"},"[733-10058]",{"$f":"M70","v":150}]
[null,null,null,null,null,null,null,"5Yr Data Protection - Keep Your Hard Drive",{"$f":"I70","v":1},{"$f":"J70","v":"10L1-SO-HDD"},{"$f":"K70","v":"S10L1-T630-S-HDD"},"[733-10059]",{"$f":"M70","v":150}]
[]
["Protezione dei dati Selezionata"]
[{"$f":"#REF!","v":{"$error":"#REF!"}}]
[]
["Servizio Specialistico di System and Network Management per sistema opertivo Windows, erogato on site.",1,"10L1-SO-WIN","S10L1-T630-S-WIN",null,193]
["Servizio Specialistico di System and Network Management per sistema opertivo Linux, erogato on site.",1,"10L1-SO-LINUX","S10L1-T630-S-LINUX",null,193]
[]
["None",{"$f":"\"\"","v":""},{"$f":"\"\"","v":""},{"$f":"\"\"","v":""},{"$f":"\"\"","v":""},{"$f":"\"\"","v":""}]
[{"$f":"IF(#REF!>=5,H81,\"None\")","v":{"$error":"#REF!"}},{"$f":"IF(#REF!>=5,I81,\"\")","v":{"$error":"#REF!"}},{"$f":"IF(#REF!>=5,J81,\"\")","v":{"$error":"#REF!"}},{"$f":"IF(#REF!>=5,K81,\"\")","v":{"$error":"#REF!"}},{"$f":"IF(#REF!>=5,L81,\"\")","v":{"$error":"#REF!"}},{"$f":"IF(#REF!>=5,M81,\"\")","v":{"$error":"#REF!"}},null,"Servizi di manutenzione preventiva",1,"10L1-SO-PREV","S10L1-T630-S-PREV",null,193]