{"text_format":"1","workbook":"xlsx","n_sheets":12,"sheets":["Lotto5 DL560 Gen10 1","Lotto5 DL560 Gen10 2","Lotto5 DL560 Gen10 3","RACK, Accessori e Servizi","Riepilogo","Codici","Operating System","PCI","Processor","Memory","HDD","Servizi Opzionali"],"not_rendered":{"charts":0,"images":28,"macros":1,"external_links":0,"defined_names":96,"comments":0,"pivot_tables":0},"unopened":[],"bounds":{"document_bytes":16777216,"sheet_cells":100000,"rows_first":2000,"rows_last":500,"rows_between":2000,"halvings":0,"cell_chars":16384,"cell_head_chars":4096},"cells_cut":0,"cells_raw":0,"read":"whole","date_system":"1900"}

{"sheet":"Lotto5 DL560 Gen10 1","index":0,"n_rows":221,"n_cols":82,"rows_kept":221,"cut":false,"hidden":false,"merged":[[135,2,135,4],[134,1,134,4],[80,2,80,4],[127,2,127,4],[130,1,130,4],[124,1,124,4],[125,2,125,4],[126,1,126,3],[0,7,1,7],[49,2,49,4],[53,1,53,4],[5,0,5,4],[17,1,17,4],[3,0,4,4],[2,1,2,2],[73,2,73,4],[79,1,79,4],[43,1,43,4],[44,2,44,4],[34,2,34,3],[72,1,72,4],[66,1,66,4],[69,1,69,4],[158,1,158,4],[161,1,161,4],[167,1,167,4],[159,2,159,4],[162,2,162,4],[165,2,165,4],[164,1,164,4],[153,2,153,4],[155,1,155,4],[156,2,156,4],[150,2,150,4],[137,1,137,4],[138,2,138,4],[140,1,140,4],[141,2,141,4],[149,1,149,4],[219,2,219,4],[221,1,221,4],[216,2,216,4],[183,2,183,4],[185,1,185,4],[188,1,188,4],[198,1,198,4],[201,1,201,4],[206,1,206,4],[203,1,203,4],[213,1,213,4],[210,1,210,4],[208,1,208,4],[182,1,182,4],[171,2,171,4],[173,1,173,4],[174,2,174,4],[176,1,176,4],[180,2,180,4],[177,2,177,4],[179,1,179,4],[170,1,170,4],[168,2,168,4],[49,0,53,0],[10,0,11,2],[28,2,28,4],[20,1,20,4],[24,2,24,4],[27,1,27,4],[48,1,48,4],[30,1,30,4],[31,2,31,4],[33,1,33,4],[36,1,36,4],[37,2,37,4],[131,2,131,4],[152,1,152,4]]}
[null,null,"TOTALE PRODOTTI CONVENZIONE",{"$f":"H10","v":0},null,null,{"$f":"IF(D105=\"      OK\",0,1)","v":0},{"$f":"IF(G1+G2=0,(D1+D2),\"ERRORE VERIFICARE LA CONFIGURAZIONE\")","v":0}]
[null,null,"TOTALE ARTICOLI 20%",{"$f":"H11","v":0}]
[null,"Indicare qui la quantità Server ----->",null,0,null,null,null,{"$f":"Riepilogo!T6","v":"ver. 3.3"},null,null,null,null,null,null,null,null,null,null,null,null,null,null,null,null,null,null,null,null,null,null,null,null,null,null,null,null,null,null,null,null,null,null,null,null,null,null,null,null,null,null,null,null,null,null,null,null,null,null,null,null,null,null,null,null,null,null,null,null,null,null,null,null,null,null,null,null,null,null,null,null,null,0]
["Tecnologie Server 2 Lotto 5 Prestazionale DL560 Gen10"]
["Tecnologie Server 2 Lotto 5 Prestazionale DL560 Gen10"]
[]
[]
[]
[]
[null,null,null,"Totale Server e Opzioni",null,null,null,{"$f":"F17*SRV_A","v":0}]
["Components: \nServer HPE Proliant DL560 Gen10 (2CPU Intel® Xeon-Gold 5220)",null,null,"Totale Ulteriori Opzioni ",null,null,null,{"$f":"G17*SRV_A","v":0}]
[]
[null,null,null,"TOTALE CONVENZIONE",null,null,null,{"$f":"H11+H10","v":0}]
[]
[null,null,null,null,null,6078]
[null,"Quantity: ",{"$f":"SRV_A","v":0},null,null,{"$f":"SUM(F20:F222)","v":0}]
[null,null,null,null,null,{"$f":"SUM(F15:F16)","v":6078},{"$f":"SUM(G20:G216)","v":10}]
[]
[null,"Base"]
[null,"HPE DL560 Gen10 8SFF CTO Server",1,null,"841730-B21"]
[]
[null,"Configurazione dello chassis"]
[null,"HPE DL560 Gen10 8SFF HDD Bay2 Kit",1,null,"872235-B21"]
[]
[null,"Processore"]
[null,"Intel Xeon-Gold 5220 (2.2GHz/18-core/125W)",2,null,"840389-L21"]
[null,"HPE DL560 Gen10 Intel® Xeon-Gold 5118 (2.3GHz/12-core/105W) Processor",1,null,"840399-B21"]
[]
[null,"Processore aggiuntivo"]
[null,"No Additional Processor",{"$f":"VLOOKUP($B$30, CPU_A, 2, FALSE)","v":0},{"$f":"VLOOKUP($B$30, CPU_A, 3, FALSE)","v":""},"840399-L21",{"$f":"VLOOKUP(B30, CPU_A, 12, FALSE)","v":0}]
[]
[null,"Mezz Board Option"]
[null,{"$f":"VLOOKUP($B$30, CPU_A, 6, FALSE)","v":""},{"$f":"VLOOKUP($B$30, CPU_A, 7, FALSE)","v":""},null,{"$f":"VLOOKUP($B$30, CPU_A, 8, FALSE)","v":""}]
[]
[null,"Memoria Totale in GB",{"$f":"IF(F30=2584,IF(B36=64,\"ATTENZIONE: AUMENTARE LA RAM\",\"\"),\"\")","v":""}]
[null,"128        (DIMM 32GB)"]
[]
[null,"Capacità di memoria"]
[null,{"$f":"IF($B$30=\"No Additional Processor\",VLOOKUP($B$36, MEM_A1, 8, FALSE),VLOOKUP($B$36, MEM_A2, 8, FALSE))","v":"HPE 32GB 2Rx4 PC4-2933 Smart Kit"},{"$f":"IF($B$30=\"No Additional Processor\",VLOOKUP($B$36, MEM_A1, 9, FALSE),VLOOKUP($B$36, MEM_A2, 9, FALSE))","v":4},null,{"$f":"IF($B$30=\"No Additional Processor\",VLOOKUP($B$36, MEM_A1, 10, FALSE),VLOOKUP($B$36, MEM_A2, 10, FALSE))","v":"815100-B21"}]
[]
[null,{"$f":"IF($B$30=\"No Additional Processor\",VLOOKUP($B$36, MEM_A1, 2, FALSE),VLOOKUP($B$36, MEM_A2, 2, FALSE))","v":"HPE 32GB 2Rx4 PC4-2933 Smart Kit"},{"$f":"IF($B$30=\"No Additional Processor\",VLOOKUP($B$36, MEM_A1, 3, FALSE),VLOOKUP($B$36, MEM_A2, 3, FALSE))","v":4},{"$f":"IF($B$30=\"No Additional Processor\",VLOOKUP($B$36, MEM_A1, 4, FALSE),VLOOKUP($B$36, MEM_A2, 4, FALSE))","v":""},{"$f":"IF($B$30=\"No Additional Processor\",VLOOKUP($B$36, MEM_A1, 6, FALSE),VLOOKUP($B$36, MEM_A2, 6, FALSE))","v":"815100-B21"},{"$f":"IF($B$30=\"No Additional Processor\",VLOOKUP($B$36, MEM_A1, 7, FALSE),VLOOKUP($B$36, MEM_A2, 7, FALSE))","v":0}]
[null,{"$f":"IF($B$30=\"No Additional Processor\",VLOOKUP($B$36, MEM_A1, 11, FALSE),VLOOKUP($B$36, MEM_A2, 11, FALSE))","v":""},{"$f":"IF($B$30=\"No Additional Processor\",VLOOKUP($B$36, MEM_A1, 12, FALSE),VLOOKUP($B$36, MEM_A2, 12, FALSE))","v":""},{"$f":"IF($B$30=\"No Additional Processor\",VLOOKUP($B$36, MEM_A1, 13, FALSE),VLOOKUP($B$36, MEM_A2, 13, FALSE))","v":""},{"$f":"IF($B$30=\"No Additional Processor\",VLOOKUP($B$36, MEM_A1, 15, FALSE),VLOOKUP($B$36, MEM_A2, 15, FALSE))","v":""},{"$f":"IF($B$30=\"No Additional Processor\",VLOOKUP($B$36, MEM_A1, 16, FALSE),VLOOKUP($B$36, MEM_A2, 16, FALSE))","v":""}]
[]
[]
[null,"Sistema operativo preinstallato"]
[null,"No Operating System",{"$f":"VLOOKUP($B$46, OS_A, 2, FALSE)","v":""},{"$f":"VLOOKUP($B$46, OS_A, 3, FALSE)","v":""},{"$f":"VLOOKUP($B$46, OS_A, 5, FALSE)","v":""},{"$f":"VLOOKUP($B$46, OS_A, 6, FALSE)","v":""}]
[null,{"$f":"IF($B$30=\"No Additional Processor\",VLOOKUP($B$46, OS_A, 19, FALSE),VLOOKUP($B$46, OS_A2, 19, FALSE))","v":""},{"$f":"IF($B$30=\"No Additional Processor\",VLOOKUP($B$46, OS_A, 20, FALSE),VLOOKUP($B$46, OS_A2, 20, FALSE))","v":0},{"$f":"IF($B$30=\"No Additional Processor\",VLOOKUP($B$46, OS_A, 21, FALSE),VLOOKUP($B$46, OS_A2, 21, FALSE))","v":""},{"$f":"IF($B$30=\"No Additional Processor\",VLOOKUP($B$46, OS_A, 23, FALSE),VLOOKUP($B$46, OS_A2, 23, FALSE))","v":""},{"$f":"IF($B$30=\"No Additional Processor\",VLOOKUP($B$46, OS_A, 24, FALSE)*C47,VLOOKUP($B$46, OS_A2, 24, FALSE)*C47)","v":0}]
[null,{"$f":"IF($B$30=\"No Additional Processor\",VLOOKUP($B$46, OS_A, 25, FALSE),VLOOKUP($B$46, OS_A2, 25, FALSE))","v":""},{"$f":"IF($B$30=\"No Additional Processor\",VLOOKUP($B$46, OS_A, 26, FALSE),VLOOKUP($B$46, OS_A2, 26, FALSE))","v":0},{"$f":"IF($B$30=\"No Additional Processor\",VLOOKUP($B$46, OS_A, 27, FALSE),VLOOKUP($B$46, OS_A2, 27, FALSE))","v":""},{"$f":"IF($B$30=\"No Additional Processor\",VLOOKUP($B$46, OS_A, 29, FALSE),VLOOKUP($B$46, OS_A2, 29, FALSE))","v":""},{"$f":"IF($B$30=\"No Additional Processor\",VLOOKUP($B$46, OS_A, 30, FALSE)*C48,VLOOKUP($B$46, OS_A2, 30, FALSE)*C48)","v":0}]
[]
[null,"Client Access Licenses"]
[null,{"$f":"VLOOKUP($B$46, OS_A, 7, FALSE)","v":"None"},0,{"$f":"VLOOKUP($B$46, OS_A, 9, FALSE)","v":""},{"$f":"VLOOKUP($B$46, OS_A, 11, FALSE)","v":""},{"$f":"VLOOKUP($B$46, OS_A, 12, FALSE)*C51","v":0}]
[]
[null,{"$f":"VLOOKUP($B$46, OS_A, 13, FALSE)","v":"None"},0,{"$f":"VLOOKUP($B$46, OS_A, 15, FALSE)","v":""},{"$f":"VLOOKUP($B$46, OS_A, 17, FALSE)","v":""},{"$f":"VLOOKUP($B$46, OS_A, 18, FALSE)*C53","v":0}]
[]
[null,"VMware vSphere"]
[null,"None",{"$f":"IF(D56=\"\",0,(C26+C30))","v":0},{"$f":"VLOOKUP($B$56,vmware, 3, FALSE)","v":""},{"$f":"VLOOKUP($B$56,vmware, 5, FALSE)","v":""},null,{"$f":"VLOOKUP($B$56,vmware, 6, FALSE)*C56","v":0}]
[null,"VMware vSphere Essentials Plus"]
[null,"None",{"$f":"VLOOKUP($B$58,vmwareplus, 2, FALSE)","v":0},{"$f":"VLOOKUP($B$58,vmwareplus, 3, FALSE)","v":""},{"$f":"VLOOKUP($B$58,vmwareplus, 5, FALSE)","v":""},null,{"$f":"VLOOKUP($B$58,vmwareplus, 6, FALSE)*C58","v":0}]
[null,"VMware vCenter Server"]
[null,"None",{"$f":"VLOOKUP($B$60,vmwarevcenter, 2, FALSE)","v":0},{"$f":"VLOOKUP($B$60,vmwarevcenter, 3, FALSE)","v":""},{"$f":"VLOOKUP($B$60,vmwarevcenter, 5, FALSE)","v":""},null,{"$f":"VLOOKUP($B$60, vmwarevcenter, 6, FALSE)*C60","v":0}]
[null,"VMware vSAN"]
[null,"None",{"$f":"IF(D62=\"\",0,($C$26+$C$30))","v":0},{"$f":"VLOOKUP($B$62,vmvsan, 3, FALSE)","v":""},{"$f":"VLOOKUP($B$62,vmvsan, 5, FALSE)","v":""},null,{"$f":"VLOOKUP($B$62,vmvsan, 6, FALSE)*C62","v":0}]
[]
[]
[null,"HPE OneView Advanced (with HPE iLO Advanced)"]
[null,"None",{"$f":"VLOOKUP($B$66, OpzOVAdv, 2, FALSE)","v":0},{"$f":"VLOOKUP($B$66, OpzOVAdv, 3, FALSE)","v":""},{"$f":"VLOOKUP($B$66, OpzOVAdv, 5, FALSE)","v":""},null,{"$f":"VLOOKUP($B$66, OpzOVAdv, 6, FALSE)","v":0}]
[]
[null,"Configurazione dello chassis"]
[null,"HPE DL560 Gen10 NVMe 8 SSD Express Bay Kit (opzione disponibile con 4 CPU)",0,{"$f":"VLOOKUP($C$69, HDD_NVMe, 2, FALSE)","v":""},{"$f":"VLOOKUP($C$69, HDD_NVMe, 4, FALSE)","v":0},null,{"$f":"VLOOKUP($C$69, HDD_NVMe, 5, FALSE)","v":0}]
[]
[]
[null,"HPE DL560 Gen10 8SFF HDD Bay1 Kit",0,{"$f":"IF(C69+C72=2,\"TS2L5-HDDBAY\",VLOOKUP($C$72,HDD_BAY1,2,FALSE))","v":""},{"$f":"VLOOKUP($C$72, HDD_BAY1, 4, FALSE)","v":0},null,{"$f":"IF(C69+C72=2,\"191,00\",VLOOKUP($C$72,HDD_BAY1,5,FALSE))","v":0}]
[]
[null,"Controller RAID"]
[null,"HPE Smart Array P816i-a SR Gen10",{"$f":"VLOOKUP($B$75, _Array, 2, FALSE)","v":1},{"$f":"VLOOKUP($B$75, _Array, 3, FALSE)","v":""},{"$f":"VLOOKUP($B$75, _Array, 5, FALSE)","v":"869083-B21"},null,{"$f":"VLOOKUP($B$75, _Array, 6, FALSE)","v":""}]
[]
[null,{"$f":"VLOOKUP($B$75, _Array, 7, FALSE)","v":"HPE 96W Smart Storage Battery with 145mm Cable Kit"},{"$f":"VLOOKUP($B$75, _Array, 8, FALSE)","v":1},{"$f":"VLOOKUP($B$75, _Array, 9, FALSE)","v":""},{"$f":"VLOOKUP($B$75, _Array, 10, FALSE)","v":"P01366-B21"}]
[]
[null,{"$f":"IF(C72=0,\"\",IF(C69+C72=2,\"\",\"HPE DL5x0 Gen10 12Gb SAS Expander Card Kit with Cables\"))","v":""},{"$f":"IF(C72=0,\"\",IF(C69+C72=2,\"\",1))","v":""},{"$f":"IF(C72=0,\"\",IF(C69+C72=2,\"\",\"TS2L5-SASBAY1\"))","v":""},{"$f":"IF(C72=0,\"\",IF(C69+C72=2,\"\",\"873444-B21\"))","v":""}]
[]
[null,{"$f":"IF(5+E72+E69=5,\"Dischi rigidi SAS/SSD (numero massimo totale 16)\",IF(5+E72+E69=8,\"Dischi rigidi  SAS/SSD (numero massimo totale 16)\",IF(5+E72+E69=6,\"Dischi rigidi SAS/SSD (numero massimo totale 24)\",IF(5+E72+E69=7,\"Dischi rigidi SAS/SSD (numero massimo totale 8)\"))))","v":"Dischi rigidi SAS/SSD (numero massimo totale 16)"}]
[null,"HPE 300GB SAS 15K SFF SC DS HDD",2,null,"870753-B21"]
[]
[null,"HPE 300GB SAS 15K SFF SC DS HDD",2,"TS2L5-15K300","872475-B21",{"$f":"IF(C84<=2,0,C84-2)*137","v":0}]
[]
[null,"HPE 1.2TB SAS 10K SFF SC DS HDD",0,"TS2L5-10K1200","872479-B21",{"$f":"C86*146","v":0}]
[]
["HDD SAS ","HPE 1.8TB SAS 10K SFF SC 512e DS HDD",0,"TS2L5-10K1800","872481-B21",{"$f":"C88*190","v":0}]
[]
[]
[null,"HPE 400GB SAS 12G Mixed Use SFF (2.5in) SC DS SSD",0,"TS2L5-SSD400MU","P09088-B21",null,{"$f":"C91*622","v":0}]
[]
[null,"HPE 400GB SAS 12G Write Intensive SFF (2.5in) SC DS SSD",0,"TS2L5-SSD400WIB","P09098-B21",null,{"$f":"C93*959","v":0}]
[]
[null,"HPE 800GB SAS 12G Mixed Use SFF (2.5in) SC DS SSD",0,"TS2L5-SSD800MU","P09090-B21",null,{"$f":"C95*980","v":0}]
["SSD SAS"]
[null,"HPE 960GB SAS 12G Mixed Use SC SAS DS SSD",0,"TS2L5-SSD960MU","P10448-B21",null,{"$f":"C97*864","v":0}]
[]
[null,"HPE 960GB SAS RI SFF SC DS SSD",0,"TS2L5-SSDR960","P06584-B21",{"$f":"C99*664","v":0}]
[]
[null,"HPE 1.92TB SAS 12G Read Intensive SFF",0,"TS2L5-SSDR1920","P06586-B21",{"$f":"C101*1313","v":0}]
[]
[null,"HPE 3.84TB SAS 12G Read Intensive SFF (2.5in) SC",0,"TS2L5-SSD3840RI","P04521-B21",null,{"$f":"C103*2066","v":0}]
[null,null,null,null,{"$f":"IF(C105<=E105,0,1)","v":0}]
[null,"DISCHI TOTALI",{"$f":"SUM(C84:C101)","v":2},{"$f":"IF(C105<=E105,\"      OK\",\"     ERRORE:   Totale n° di dischi superiore al consentito\")","v":"      OK"},{"$f":"IF(5+E72+E69=5,16,IF(5+E72+E69=7,8,IF(5+E72+E69=6,24,IF(5+E72+E69=8,16))))","v":16}]
[null,null,null,null,{"$f":"E104+E123","v":0}]
[]
[null,"HPE 375GB NVMe x4 Lanes Write Intensive SFF (2.5in) SCN",0,"TS2L5-375NVMEWI","878014-B21",null,{"$f":"C108*2398","v":0}]
[]
[null,"HPE 750GB NVMe x4 Write Intensive SFF (2.5in) SCN",0,"TS2L5-750NVMEWI","P06952-B21",null,{"$f":"C110*4797","v":0}]
[]
[null,"HPE 800GB NVMe x4 Lanes Mixed Use SFF (2.5in) SCN",0,"TS2L5-800NVMEMU","P13668-B21",null,{"$f":"C112*900","v":0}]
[]
[null,"HPE 2TB NVMe x4 Lanes Read Intensive SFF (2.5in) SCN",0,"TS2L5-2000NVMERI","P13695-B21",null,{"$f":"C114*1912","v":0}]
["NVMe SSD"]
["NVMe SSD","HPE 3.84TB SAS 12G Read Intensive SFF (2.5in) SC",0,"TS2L5-SSD3840RI","P04521-B21",null,{"$f":"C116*2066","v":0}]
[]
[null,"HPE 4TB NVMe x4 Lanes Read Intensive SFF (2.5in) SCN",0,"TS2L5-4000NVMERI","P13697-B21",null,{"$f":"C118*3748","v":0}]
[]
[null,"HPE 1.6TB NVMe x4 Lanes Mixed Use SFF (2.5in) SCN",0,"TS2L5-1600NVMEMU","P13699-B21",null,{"$f":"C120*1569","v":0}]
[]
[null,"HPE 3.2TB NVMe x4 Lanes Mixed Use SFF (2.5in) SCN",0,"TS2L5-3200NVMEMU","P13701-B21",null,{"$f":"C122*3452","v":0}]
[null,null,null,null,{"$f":"IF(C124<=8,0,1)","v":0}]
[null,"DISCHI NVMe  TOTALI",{"$f":"SUM(C108:C122)","v":0},{"$f":"IF(C124<=8,\"      OK\",\"     ERRORE:   Totale n° di dischi NVMe superiore al consentito\")","v":"      OK"}]
[]
[null,"NOTE sulla configurazione (CAMPO OBBLIGATORIO)"]
[{"$f":"IF(E123+E104=0,\"\",\"ERRORE:   Totale n° di dischi superiore al consentito\")","v":""},"Specificare la configurazione RAID per l'installazione del Sistema Operativo, se richiesto.\ne/o\ninserire eventuali note.",null,null,"Specificare la configurazione RAID per l'installazione del Sistema Operativo, se richiesto.\ne/o\ninserire eventuali note.",null,null,{"$f":"IF(B127=E127,\"ERRORE:   Compilare il campo NOTE\",\"\")","v":"ERRORE:   Compilare il campo NOTE"}]
[null,"Configurazione RAID con HDD 300GB"]
[null,"RAID 1  (2 HDDs)",1,null,{"$f":"VLOOKUP($B$129,  RAID_A1, 2, FALSE)","v":{"$error":"#N/A"}}]
[null,"Hot Spare for 300GB HDD","No"]
[]
[null,"Configurazione RAID con HDD 1TB"]
[null,"",1,null,{"$f":"VLOOKUP($B$133,  RAID_A2, 2, FALSE)","v":{"$error":"#N/A"}}]
[null,"Hot Spare for 1TB HDD","No"]
[]
[null,"Micro SD (USB Flash Drive)"]
[null,"None",{"$f":"VLOOKUP($B$137,microsd, 2, FALSE)","v":0},{"$f":"VLOOKUP($B$137,microsd, 3, FALSE)","v":""},{"$f":"VLOOKUP($B$137,microsd, 5, FALSE)","v":""},null,{"$f":"VLOOKUP($B$137, microsd, 6, FALSE)*C137","v":0}]
[]
[null,"Alimentatore"]
[null,"HPE 1600W Flex Slot Platinum Hot Plug Low Halogen Power Supply Kit",2,null,"830272-B21"]
[]
[null,"PCIe Riser"]
[null,"Primary, Secondary Riser & Tertiary Riser Kit",1,null,"870548-B21 -  872253-B21"]
[]
[null,"Secondary Riser",0,{"$f":"VLOOKUP($C$145, Riser2, 2, FALSE)","v":""},{"$f":"VLOOKUP($C$145, Riser2, 3, FALSE)","v":""},{"$f":"VLOOKUP($C$145, Riser2, 4, FALSE)","v":""},{"$f":"VLOOKUP($C$145, Riser2, 5, FALSE)","v":0},{"$f":"IF(C145+C147=2,\"ERRORE - SELEZIONARE SOLO UNA SECONDARY RISER\",\"\")","v":""}]
[]
[null,"Secondary Riser for GPU (abilita l'installazione della GPU P2000 su slot 5)",0,{"$f":"VLOOKUP($C$147, Riser2GPU, 2, FALSE)","v":""},{"$f":"VLOOKUP($C$147, Riser2GPU, 3, FALSE)","v":""},{"$f":"VLOOKUP($C$147, Riser2GPU, 4, FALSE)","v":""},{"$f":"VLOOKUP($C$147, Riser2GPU, 5, FALSE)","v":0}]
[]
[null,"Tertiary riser",0,{"$f":"VLOOKUP($C$149, Riser3, 2, FALSE)","v":""},{"$f":"VLOOKUP($C$149, Riser3, 3, FALSE)","v":""},{"$f":"VLOOKUP($C$149, Riser3, 4, FALSE)","v":""},{"$f":"VLOOKUP($C$149, Riser3, 5, FALSE)","v":0}]
[]
[null,"Scheda FlexibleLOM"]
[null,"HPE Ethernet 1Gb 4-port 331FLR Adapter",{"$f":"VLOOKUP(B152,  FLR_Slot, 2, FALSE)","v":1},{"$f":"VLOOKUP(B152,  FLR_Slot, 3, FALSE)","v":""},{"$f":"VLOOKUP(B152,  FLR_Slot, 5, FALSE)","v":""},{"$f":"VLOOKUP(B152,  FLR_Slot, 6, FALSE)","v":""},{"$f":"VLOOKUP(B152,  FLR_Slot, 9, FALSE)","v":0}]
[]
[null,"Additional Card for PCIe Slot 1 x8 CPU 1 "]
[null,"None",{"$f":"IF(B155=B79,\"\",VLOOKUP(B155,  PCI_A1, 2, FALSE))","v":""},{"$f":"IF(B155=B79,\"\",VLOOKUP(B155,  PCI_A1, 3, FALSE))","v":""},{"$f":"IF(B155=B79,\"\",VLOOKUP(B155,  PCI_A1, 5, FALSE))","v":""},{"$f":"IF(B155=B79,\"\",VLOOKUP(B155,  PCI_A1, 6, FALSE))","v":""},{"$f":"IF(B155=B79,\"\",VLOOKUP(B155,  PCI_A1, 9, FALSE))","v":0}]
[]
[null,"Additional Card for PCIe Slot 2 x16 CPU 1 "]
[null,"None",{"$f":"VLOOKUP(B158,  PCI_A2, 2, FALSE)","v":""},{"$f":"VLOOKUP(B158,  PCI_A2, 3, FALSE)","v":""},{"$f":"VLOOKUP(B158,  PCI_A2, 5, FALSE)","v":""},{"$f":"VLOOKUP(B158,  PCI_A2, 6, FALSE)","v":""},{"$f":"VLOOKUP(B158,  PCI_A2, 9, FALSE)","v":0}]
[]
[null,"Additional Card for PCIe Slot 3 x8 CPU 1 "]
[null,"None",{"$f":"VLOOKUP(B161,  PCI_A3, 2, FALSE)","v":""},{"$f":"VLOOKUP(B161,  PCI_A3, 3, FALSE)","v":""},{"$f":"VLOOKUP(B161,  PCI_A3, 5, FALSE)","v":""},{"$f":"VLOOKUP(B161,  PCI_A3, 6, FALSE)","v":""},{"$f":"VLOOKUP(B161,  PCI_A3, 9, FALSE)","v":0}]
[]
[null,{"$f":"IF(C147=1,\"Additional Card for PCIe Slot 4 x8 CPU 2 \",\"Additional Card for PCIe Slot 4 x8 CPU 2 \")","v":"Additional Card for PCIe Slot 4 x8 CPU 2 "}]
[null,"None",{"$f":"VLOOKUP(B164,  PCI_A2, 2, FALSE)","v":""},{"$f":"VLOOKUP(B164,  PCI_A2, 3, FALSE)","v":""},{"$f":"VLOOKUP(B164,  PCI_A2, 5, FALSE)","v":""},{"$f":"VLOOKUP(B164,  PCI_A2, 6, FALSE)","v":""},{"$f":"VLOOKUP(B164,  PCI_A2, 9, FALSE)","v":0}]
[]
[null,"Additional Card for PCIe Slot 5 (GPU SLOT) x16 CPU 2"]
[null,"None",{"$f":"VLOOKUP(B167,  PCI_A5, 2, FALSE)","v":""},{"$f":"VLOOKUP(B167,  PCI_A5, 3, FALSE)","v":""},{"$f":"VLOOKUP(B167,  PCI_A5, 5, FALSE)","v":""},{"$f":"VLOOKUP(B167,  PCI_A5, 6, FALSE)","v":""},{"$f":"VLOOKUP(B167,  PCI_A5, 9, FALSE)","v":0}]
[]
[null,"Additional Card for PCIe Slot 6 x8 CPU 2"]
[null,"None",{"$f":"VLOOKUP(B170,  PCI_A3, 2, FALSE)","v":""},{"$f":"VLOOKUP(B170,  PCI_A3, 3, FALSE)","v":""},{"$f":"VLOOKUP(B170,  PCI_A3, 5, FALSE)","v":""},{"$f":"VLOOKUP(B170,  PCI_A3, 6, FALSE)","v":""},{"$f":"VLOOKUP(B170,  PCI_A3, 9, FALSE)","v":0}]
[]
[null,"Additional Card for PCIe Slot 7 x8 CPU 2"]
[null,"None",{"$f":"VLOOKUP(B173,  PCI_A2, 2, FALSE)","v":""},{"$f":"VLOOKUP(B173,  PCI_A2, 3, FALSE)","v":""},{"$f":"VLOOKUP(B173,  PCI_A2, 5, FALSE)","v":""},{"$f":"VLOOKUP(B173,  PCI_A2, 6, FALSE)","v":""},{"$f":"VLOOKUP(B173,  PCI_A2, 9, FALSE)","v":0}]
[]
[null,"Additional Card for PCIe Slot 8 x8 CPU 2"]
[null,"None",{"$f":"VLOOKUP(B176,  PCI_A2, 2, FALSE)","v":""},{"$f":"VLOOKUP(B176,  PCI_A2, 3, FALSE)","v":""},{"$f":"VLOOKUP(B176,  PCI_A2, 5, FALSE)","v":""},{"$f":"VLOOKUP(B176,  PCI_A2, 6, FALSE)","v":""},{"$f":"VLOOKUP(B176,  PCI_A2, 9, FALSE)","v":0}]
[]
[null,"Bezel"]
[null,"None",1]
[]
[null,"Unità ottica"]
[null,"HP Mobile USB DVDRW Drive",1,null,"701498-B21"]
[]
[null,"Accessori per Server"]
[null,"HPE 240GB SATA 6G Mixed Use M.2 2280",0,{"$f":"IF(C185=0,\"\",\"TS2L5-M2240\")","v":""},"875488-B21",null,{"$f":"C185*175","v":0}]
[]
[null,"Cavi rj45"]
[null,"Cavo Rete UTP cat. 5e 3 metri",5,{"$f":"IF(C188=0,\"\",\"TS2L5-3MRJ45\")","v":"TS2L5-3MRJ45"},"ROS1403/G",null,{"$f":"2*C188","v":10}]
[]
[null,"Omni-Path Architecture Optical"]
[null,"HPE X240 10G SFP+ SFP+ 3m DAC Cable",0,{"$f":"IF(C191=0,\"\",\"TS2L5-DACX240M3\")","v":""},"JD097C",null,{"$f":"C191*81","v":0}]
[]
[null,"HPE X240 10G SFP+ SFP+ 5m DAC Cable",0,{"$f":"IF(C193=0,\"\",\"TS2L5-DACX240M5\")","v":""},"JG081C",null,{"$f":"C193*95","v":0}]
[]
[null,"HPE X240 10G SFP+ SFP+ 7m DAC Cable",0,{"$f":"IF(C195=0,\"\",\"TS2L5-DACX240M7\")","v":""},"JC784C",null,{"$f":"C195*106","v":0}]
[]
[null,"InfiniBand Copper Cable"]
[null,"HPE 2M FDR Quad Small Form Factor Pluggable InfiniBand Copper Cable",0,{"$f":"IF(C198=0,\"\",\"TS2L5-DACQSFPM2\")","v":""},"670759-B24",null,{"$f":"C198*147","v":0}]
[]
[null,"Omni-Path Architecture Copper Cable"]
[null,"HPE 2M 100Gb QSFP28 Omni-Path Architecture Copper Cable",0,{"$f":"IF(C201=0,\"\",\"TS2L5-DAC100M2\")","v":""},"830024-B24",null,{"$f":"C201*117","v":0}]
[]
[null,"HPE 3M 100Gb QSFP28 Omni-Path Architecture Copper Cable",0,{"$f":"IF(C203=0,\"\",\"TS2L5-DAC100M3\")","v":""},"830024-B25",null,{"$f":"C203*147","v":0}]
[]
[null,"Omni-Path Architecture Optical"]
[null,"HPE 3M 100Gb QSFP28 Omni-Path Architecture Optical Power Class 2 Cable",0,{"$f":"IF(C206=0,\"\",\"TS2L5-DACAOCM3\")","v":""},"881204-B21",null,{"$f":"C206*612","v":0}]
[]
[null,"HPE 5M 100Gb QSFP28 Omni-Path Architecture Optical Power Class 2 Cable",0,{"$f":"IF(C208=0,\"\",\"TS2L5-DACAOCM5\")","v":""},"881204-B22",null,{"$f":"C208*619","v":0}]
[]
[null,"HPE 7M 100Gb QSFP28 Omni-Path Architecture Optical Power Class 2 Cable",0,{"$f":"IF(C210=0,\"\",\"TS2L5-DACAOCM7\")","v":""},"881204-B23",null,{"$f":"C210*627","v":0}]
[]
[null,"Optical Transceiver"]
[null,"HPE 10Gb SFP+ SR Transceiver",0,{"$f":"IF(C213=0,\"\",\"TS2L5-10OTSR\")","v":""},"455883-B21",null,{"$f":"C213*230","v":0}]
[]
[null,"HPE 10G SFP+ LR Transceiver",0,{"$f":"IF(C215=0,\"\",\"TS2L5-10OTLR\")","v":""},"455886-B21",null,{"$f":"C215*481","v":0}]
[]
[null,"Estensione di Garanzia"]
[null,"None",{"$f":"VLOOKUP($B$218,  SO_B1,2, FALSE)","v":""},{"$f":"VLOOKUP($B$218,  SO_B1, 3, FALSE)","v":""},{"$f":"VLOOKUP($B$218,  SO_B1, 5, FALSE)","v":""},{"$f":"VLOOKUP($B$218,  SO_B1, 6, FALSE)","v":""}]
[]
[]
[null,"None",{"$f":"VLOOKUP($B$221,  SO_A2, 2, FALSE)","v":""},{"$f":"VLOOKUP($B$221,  SO_A2, 3, FALSE)","v":""},{"$f":"VLOOKUP($B$221,  SO_A2,5, FALSE)","v":""},{"$f":"VLOOKUP($B$221,  SO_A2, 6, FALSE)","v":""}]

{"sheet":"Lotto5 DL560 Gen10 2","index":1,"n_rows":218,"n_cols":8,"rows_kept":218,"cut":false,"hidden":false,"merged":[[0,7,1,7],[34,2,34,3],[49,2,49,4],[53,1,53,4],[5,0,5,4],[2,1,2,2],[49,0,53,0],[3,0,4,4],[44,2,44,4],[79,1,79,4],[80,2,80,4],[10,0,11,2],[48,1,48,4],[20,1,20,4],[24,2,24,4],[27,1,27,4],[28,2,28,4],[30,1,30,4],[31,2,31,4],[33,1,33,4],[36,1,36,4],[37,2,37,4],[43,1,43,4],[18,2,18,4],[17,1,17,4],[69,1,69,4],[66,1,66,4],[72,1,72,4],[73,2,73,4],[182,1,182,4],[124,1,124,4],[125,2,125,4],[126,1,126,3],[127,2,127,4],[130,1,130,4],[131,2,131,4],[161,1,161,4],[162,2,162,4],[159,2,159,4],[134,1,134,4],[158,1,158,4],[135,2,135,4],[137,1,137,4],[138,2,138,4],[140,1,140,4],[141,2,141,4],[149,1,149,4],[150,2,150,4],[152,1,152,4],[153,2,153,4],[155,1,155,4],[156,2,156,4],[164,1,164,4],[165,2,165,4],[168,2,168,4],[170,1,170,4],[171,2,171,4],[173,1,173,4],[167,1,167,4],[174,2,174,4],[176,1,176,4],[185,1,185,4],[206,1,206,4],[177,2,177,4],[179,1,179,4],[180,2,180,4],[183,2,183,4],[188,1,188,4],[208,1,208,4],[210,1,210,4],[213,1,213,4],[216,2,216,4],[198,1,198,4],[201,1,201,4],[203,1,203,4]]}
[null,null,"TOTALE PRODOTTI CONVENZIONE",{"$f":"H10","v":0},null,null,{"$f":"IF(D105=\"      OK\",0,1)","v":0},{"$f":"IF(G1+G2=0,(D1+D2),\"ERRORE VERIFICARE LA CONFIGURAZIONE\")","v":0}]
[null,null,"TOTALE ARTICOLI 20%",{"$f":"H11","v":0}]
[null,"Indicare qui la quantità Server ----->",null,0,null,null,null,{"$f":"Riepilogo!T6","v":"ver. 3.3"}]
["Tecnologie Server 2 Lotto 5 Prestazionale DL560 Gen10"]
["Tecnologie Server 2 Lotto 5 Prestazionale DL560 Gen10"]
[]
[]
[]
[]
[null,null,null,"Totale Server e Opzioni",null,null,null,{"$f":"F17*SRV_AA","v":0}]
["Components: \nServer HPE Proliant DL560 Gen10 (2CPU Intel® Xeon-Gold 5220)",null,null,"Totale Ulteriori Opzioni ",null,null,null,{"$f":"G17*SRV_AA","v":0}]
[]
[null,null,null,"TOTALE CONVENZIONE",null,null,null,{"$f":"H11+H10","v":0}]
[]
[null,null,null,null,null,6078]
[null,"Quantity: ",{"$f":"SRV_AA","v":0},null,null,{"$f":"SUM(F20:F1048576)","v":0}]
[null,null,null,null,null,{"$f":"SUM(F15:F16)","v":6078},{"$f":"SUM(G20:G216)","v":10}]
[]
[null,"Base"]
[null,"HPE DL560 Gen10 8SFF CTO Server",1,null,"841730-B21"]
[]
[null,"Configurazione dello chassis"]
[null,"HPE DL560 Gen10 8SFF HDD Bay2 Kit",1,null,"872235-B21"]
[]
[null,"Processore"]
[null,"Intel Xeon-Gold 5220 (2.2GHz/18-core/125W)",2,null,"840389-L21"]
[null,"HPE DL560 Gen10 Intel® Xeon-Gold 5118 (2.3GHz/12-core/105W) Processor",1,null,"840399-B21"]
[]
[null,"Processore aggiuntivo"]
[null,"No Additional Processor",{"$f":"VLOOKUP($B$30, CPU_A, 2, FALSE)","v":0},{"$f":"VLOOKUP($B$30, CPU_A, 3, FALSE)","v":""},{"$f":"VLOOKUP($B$30, CPU_A, 5, FALSE)","v":""},{"$f":"VLOOKUP(B30, CPU_A, 12, FALSE)","v":0}]
[]
[null,"Mezz Board Option"]
[null,{"$f":"VLOOKUP($B$30, CPU_A, 6, FALSE)","v":""},{"$f":"VLOOKUP($B$30, CPU_A, 7, FALSE)","v":""},null,{"$f":"VLOOKUP($B$30, CPU_A, 8, FALSE)","v":""}]
[]
[null,"Memoria Totale in GB",{"$f":"IF(F30=2584,IF(B36=64,\"ATTENZIONE: AUMENTARE LA RAM\",\"\"),\"\")","v":""}]
[null,"128        (DIMM 32GB)"]
[]
[null,"Capacità di memoria"]
[null,{"$f":"IF($B$30=\"No Additional Processor\",VLOOKUP($B$36, MEM_A1, 8, FALSE),VLOOKUP($B$36, MEM_A2, 8, FALSE))","v":"HPE 32GB 2Rx4 PC4-2933 Smart Kit"},{"$f":"IF($B$30=\"No Additional Processor\",VLOOKUP($B$36, MEM_A1, 9, FALSE),VLOOKUP($B$36, MEM_A2, 9, FALSE))","v":4},null,{"$f":"IF($B$30=\"No Additional Processor\",VLOOKUP($B$36, MEM_A1, 10, FALSE),VLOOKUP($B$36, MEM_A2, 10, FALSE))","v":"815100-B21"}]
[]
[null,{"$f":"IF($B$30=\"No Additional Processor\",VLOOKUP($B$36, MEM_A1, 2, FALSE),VLOOKUP($B$36, MEM_A2, 2, FALSE))","v":"HPE 32GB 2Rx4 PC4-2933 Smart Kit"},{"$f":"IF($B$30=\"No Additional Processor\",VLOOKUP($B$36, MEM_A1, 3, FALSE),VLOOKUP($B$36, MEM_A2, 3, FALSE))","v":4},{"$f":"IF($B$30=\"No Additional Processor\",VLOOKUP($B$36, MEM_A1, 4, FALSE),VLOOKUP($B$36, MEM_A2, 4, FALSE))","v":""},{"$f":"IF($B$30=\"No Additional Processor\",VLOOKUP($B$36, MEM_A1, 6, FALSE),VLOOKUP($B$36, MEM_A2, 6, FALSE))","v":"815100-B21"},{"$f":"IF($B$30=\"No Additional Processor\",VLOOKUP($B$36, MEM_A1, 7, FALSE),VLOOKUP($B$36, MEM_A2, 7, FALSE))","v":0}]
[null,{"$f":"IF($B$30=\"No Additional Processor\",VLOOKUP($B$36, MEM_A1, 11, FALSE),VLOOKUP($B$36, MEM_A2, 11, FALSE))","v":""},{"$f":"IF($B$30=\"No Additional Processor\",VLOOKUP($B$36, MEM_A1, 12, FALSE),VLOOKUP($B$36, MEM_A2, 12, FALSE))","v":""},{"$f":"IF($B$30=\"No Additional Processor\",VLOOKUP($B$36, MEM_A1, 13, FALSE),VLOOKUP($B$36, MEM_A2, 13, FALSE))","v":""},{"$f":"IF($B$30=\"No Additional Processor\",VLOOKUP($B$36, MEM_A1, 15, FALSE),VLOOKUP($B$36, MEM_A2, 15, FALSE))","v":""},{"$f":"IF($B$30=\"No Additional Processor\",VLOOKUP($B$36, MEM_A1, 16, FALSE),VLOOKUP($B$36, MEM_A2, 16, FALSE))","v":""}]
[]
[]
[null,"Sistema operativo preinstallato"]
[null,"No Operating System",{"$f":"VLOOKUP($B$46, OS_A, 2, FALSE)","v":""},{"$f":"VLOOKUP($B$46, OS_A, 3, FALSE)","v":""},{"$f":"VLOOKUP($B$46, OS_A, 5, FALSE)","v":""},{"$f":"VLOOKUP($B$46, OS_A, 6, FALSE)","v":""}]
[null,{"$f":"IF($B$30=\"No Additional Processor\",VLOOKUP($B$46, OS_A, 19, FALSE),VLOOKUP($B$46, OS_A2, 19, FALSE))","v":""},{"$f":"IF($B$30=\"No Additional Processor\",VLOOKUP($B$46, OS_A, 20, FALSE),VLOOKUP($B$46, OS_A2, 20, FALSE))","v":0},{"$f":"IF($B$30=\"No Additional Processor\",VLOOKUP($B$46, OS_A, 21, FALSE),VLOOKUP($B$46, OS_A2, 21, FALSE))","v":""},{"$f":"IF($B$30=\"No Additional Processor\",VLOOKUP($B$46, OS_A, 23, FALSE),VLOOKUP($B$46, OS_A2, 23, FALSE))","v":""},{"$f":"IF($B$30=\"No Additional Processor\",VLOOKUP($B$46, OS_A, 24, FALSE)*C47,VLOOKUP($B$46, OS_A2, 24, FALSE)*C47)","v":0},null,{"$f":"IF(D46=\"TS1L2-WIN1\",3,IF(D46=\"TS1L2-WINDC1\",4,0))","v":0}]
[null,{"$f":"IF($B$30=\"No Additional Processor\",VLOOKUP($B$46, OS_A, 25, FALSE),VLOOKUP($B$46, OS_A2, 25, FALSE))","v":""},{"$f":"IF($B$30=\"No Additional Processor\",VLOOKUP($B$46, OS_A, 26, FALSE),VLOOKUP($B$46, OS_A2, 26, FALSE))","v":0},{"$f":"IF($B$30=\"No Additional Processor\",VLOOKUP($B$46, OS_A, 27, FALSE),VLOOKUP($B$46, OS_A2, 27, FALSE))","v":""},{"$f":"IF($B$30=\"No Additional Processor\",VLOOKUP($B$46, OS_A, 29, FALSE),VLOOKUP($B$46, OS_A2, 29, FALSE))","v":""},{"$f":"IF($B$30=\"No Additional Processor\",VLOOKUP($B$46, OS_A, 30, FALSE)*C48,VLOOKUP($B$46, OS_A2, 30, FALSE)*C48)","v":0}]
[]
[null,"Client Access Licenses"]
[null,{"$f":"VLOOKUP($B$46, OS_A, 7, FALSE)","v":"None"},0,{"$f":"VLOOKUP($B$46, OS_A, 9, FALSE)","v":""},{"$f":"VLOOKUP($B$46, OS_A, 11, FALSE)","v":""},{"$f":"VLOOKUP($B$46, OS_A, 12, FALSE)*C51","v":0}]
[]
[null,{"$f":"VLOOKUP($B$46, OS_A, 13, FALSE)","v":"None"},0,{"$f":"VLOOKUP($B$46, OS_A, 15, FALSE)","v":""},{"$f":"VLOOKUP($B$46, OS_A, 17, FALSE)","v":""},{"$f":"VLOOKUP($B$46, OS_A, 18, FALSE)*C53","v":0}]
[]
[null,"VMware vSphere"]
[null,"None",{"$f":"IF(D56=\"\",0,(C26+C30))","v":0},{"$f":"VLOOKUP($B$56,vmware, 3, FALSE)","v":""},{"$f":"VLOOKUP($B$56,vmware, 5, FALSE)","v":""},null,{"$f":"VLOOKUP($B$56,vmware, 6, FALSE)*C56","v":0}]
[null,"VMware vSphere Essentials Plus"]
[null,"None",{"$f":"VLOOKUP($B$58,vmwareplus, 2, FALSE)","v":0},{"$f":"VLOOKUP($B$58,vmwareplus, 3, FALSE)","v":""},{"$f":"VLOOKUP($B$58,vmwareplus, 5, FALSE)","v":""},null,{"$f":"VLOOKUP($B$58,vmwareplus, 6, FALSE)*C58","v":0}]
[null,"VMware vCenter Server"]
[null,"None",{"$f":"VLOOKUP($B$60,vmwarevcenter, 2, FALSE)","v":0},{"$f":"VLOOKUP($B$60,vmwarevcenter, 3, FALSE)","v":""},{"$f":"VLOOKUP($B$60,vmwarevcenter, 5, FALSE)","v":""},null,{"$f":"VLOOKUP($B$60, vmwarevcenter, 6, FALSE)*C60","v":0}]
[null,"VMware vSAN"]
[null,"None",{"$f":"IF(D62=\"\",0,($C$26+$C$30))","v":0},{"$f":"VLOOKUP($B$62,vmvsan, 3, FALSE)","v":""},{"$f":"VLOOKUP($B$62,vmvsan, 5, FALSE)","v":""},null,{"$f":"VLOOKUP($B$62,vmvsan, 6, FALSE)*C62","v":0}]
[]
[]
[null,"HPE OneView Advanced (with HPE iLO Advanced)"]
[null,"None",{"$f":"VLOOKUP($B$66, OpzOVAdv, 2, FALSE)","v":0},{"$f":"VLOOKUP($B$66, OpzOVAdv, 3, FALSE)","v":""},{"$f":"VLOOKUP($B$66, OpzOVAdv, 5, FALSE)","v":""},null,{"$f":"VLOOKUP($B$66, OpzOVAdv, 6, FALSE)","v":0}]
[]
[null,"Configurazione dello chassis"]
[null,"HPE DL560 Gen10 NVMe 8 SSD Express Bay Kit (opzione disponibile con 4 CPU)",0,{"$f":"VLOOKUP($C$69, HDD_NVMe, 2, FALSE)","v":""},{"$f":"VLOOKUP($C$69, HDD_NVMe, 4, FALSE)","v":0},null,{"$f":"VLOOKUP($C$69, HDD_NVMe, 5, FALSE)","v":0}]
[]
[]
[null,"HPE DL560 Gen10 8SFF HDD Bay1 Kit",0,{"$f":"IF(C69+C72=2,\"TS2L5-HDDBAY\",VLOOKUP($C$72,HDD_BAY1,2,FALSE))","v":""},{"$f":"VLOOKUP($C$72, HDD_BAY1, 4, FALSE)","v":0},null,{"$f":"IF(C69+C72=2,\"191,00\",VLOOKUP($C$72,HDD_BAY1,5,FALSE))","v":0}]
[]
[null,"Controller RAID"]
[null,"HPE Smart Array P816i-a SR Gen10",{"$f":"VLOOKUP($B$75, _Array, 2, FALSE)","v":1},{"$f":"VLOOKUP($B$75, _Array, 3, FALSE)","v":""},{"$f":"VLOOKUP($B$75, _Array, 5, FALSE)","v":"869083-B21"},null,{"$f":"VLOOKUP($B$75, _Array, 6, FALSE)","v":""}]
[]
[null,{"$f":"VLOOKUP($B$75, _Array, 7, FALSE)","v":"HPE 96W Smart Storage Battery with 145mm Cable Kit"},{"$f":"VLOOKUP($B$75, _Array, 8, FALSE)","v":1},{"$f":"VLOOKUP($B$75, _Array, 9, FALSE)","v":""},{"$f":"VLOOKUP($B$75, _Array, 10, FALSE)","v":"P01366-B21"}]
[]
[null,{"$f":"IF(C72=0,\"\",IF(C69+C72=2,\"\",\"HPE DL5x0 Gen10 12Gb SAS Expander Card Kit with Cables\"))","v":""},{"$f":"IF(C72=0,\"\",IF(C69+C72=2,\"\",1))","v":""},{"$f":"IF(C72=0,\"\",IF(C69+C72=2,\"\",\"TS2L5-SASBAY1\"))","v":""},{"$f":"IF(C72=0,\"\",IF(C69+C72=2,\"\",\"873444-B21\"))","v":""}]
[]
[null,{"$f":"IF(5+E72+E69=5,\"Dischi rigidi SAS/SSD (numero massimo totale 16)\",IF(5+E72+E69=8,\"Dischi rigidi  SAS/SSD (numero massimo totale 16)\",IF(5+E72+E69=6,\"Dischi rigidi SAS/SSD (numero massimo totale 24)\",IF(5+E72+E69=7,\"Dischi rigidi SAS/SSD (numero massimo totale 8)\"))))","v":"Dischi rigidi SAS/SSD (numero massimo totale 16)"}]
[null,"HPE 300GB SAS 15K SFF SC DS HDD",2,null,"870753-B21"]
[]
[null,"HPE 300GB SAS 15K SFF SC DS HDD",2,"TS2L5-15K300","872475-B21",{"$f":"IF(C84<=2,0,C84-2)*137","v":0}]
[]
[null,"HPE 1.2TB SAS 10K SFF SC DS HDD",0,"TS2L5-10K1200","872479-B21",{"$f":"C86*146","v":0}]
[]
["HDD SAS ","HPE 1.8TB SAS 10K SFF SC 512e DS HDD",0,"TS2L5-10K1800","872481-B21",{"$f":"C88*190","v":0}]
[]
[]
[null,"HPE 400GB SAS 12G Mixed Use SFF (2.5in) SC DS SSD",0,"TS2L5-SSD400MU","P09088-B21",null,{"$f":"C91*622","v":0}]
[]
[null,"HPE 400GB SAS 12G Write Intensive SFF (2.5in) SC DS SSD",0,"TS2L5-SSD400WIB","P09098-B21",null,{"$f":"C93*959","v":0}]
[]
[null,"HPE 800GB SAS 12G Mixed Use SFF (2.5in) SC DS SSD",0,"TS2L5-SSD800MU","P09090-B21",null,{"$f":"C95*980","v":0}]
["SSD SAS"]
[null,"HPE 960GB SAS 12G Mixed Use SC SAS DS SSD",0,"TS2L5-SSD960MU","P10448-B21",null,{"$f":"C97*864","v":0}]
[]
[null,"HPE 960GB SAS RI SFF SC DS SSD",0,"TS2L5-SSDR960","P06584-B21",{"$f":"C99*664","v":0}]
[]
[null,"HPE 1.92TB SAS 12G Read Intensive SFF",0,"TS2L5-SSDR1920","P06586-B21",{"$f":"C101*1313","v":0}]
[]
[null,"HPE 3.84TB SAS 12G Read Intensive SFF (2.5in) SC",0,"TS2L5-SSD3840RI","P04521-B21",null,{"$f":"C103*2066","v":0}]
[null,null,null,null,{"$f":"IF(C105<=E105,0,1)","v":0}]
[null,"DISCHI TOTALI",{"$f":"SUM(C84:C101)","v":2},{"$f":"IF(C105<=E105,\"      OK\",\"     ERRORE:   Totale n° di dischi superiore al consentito\")","v":"      OK"},{"$f":"IF(5+E72+E69=5,16,IF(5+E72+E69=7,8,IF(5+E72+E69=6,24,IF(5+E72+E69=8,16))))","v":16}]
[null,null,null,null,{"$f":"E104+E123","v":0}]
[]
[null,"HPE 375GB NVMe x4 Lanes Write Intensive SFF (2.5in) SCN",0,"TS2L5-375NVMEWI","878014-B21",null,{"$f":"C108*2398","v":0}]
[]
[null,"HPE 750GB NVMe x4 Write Intensive SFF (2.5in) SCN",0,"TS2L5-750NVMEWI","P06952-B21",null,{"$f":"C110*4797","v":0}]
[]
[null,"HPE 800GB NVMe x4 Lanes Mixed Use SFF (2.5in) SCN",0,"TS2L5-800NVMEMU","P13668-B21",null,{"$f":"C112*900","v":0}]
[]
[null,"HPE 2TB NVMe x4 Lanes Read Intensive SFF (2.5in) SCN",0,"TS2L5-2000NVMERI","P13695-B21",null,{"$f":"C114*1912","v":0}]
["NVMe SSD"]
["NVMe SSD","HPE 3.84TB SAS 12G Read Intensive SFF (2.5in) SC",0,"TS2L5-SSD3840RI","P04521-B21",null,{"$f":"C116*2066","v":0}]
[]
[null,"HPE 4TB NVMe x4 Lanes Read Intensive SFF (2.5in) SCN",0,"TS2L5-4000NVMERI","P13697-B21",null,{"$f":"C118*3748","v":0}]
[]
[null,"HPE 1.6TB NVMe x4 Lanes Mixed Use SFF (2.5in) SCN",0,"TS2L5-1600NVMEMU","P13699-B21",null,{"$f":"C120*1569","v":0}]
[]
[null,"HPE 3.2TB NVMe x4 Lanes Mixed Use SFF (2.5in) SCN",0,"TS2L5-3200NVMEMU","P13701-B21",null,{"$f":"C122*3452","v":0}]
[null,null,null,null,{"$f":"IF(C124<=8,0,1)","v":0}]
[null,"DISCHI NVMe  TOTALI",{"$f":"SUM(C108:C122)","v":0},{"$f":"IF(C124<=8,\"      OK\",\"     ERRORE:   Totale n° di dischi NVMe superiore al consentito\")","v":"      OK"}]
[]
[null,"NOTE sulla configurazione (CAMPO OBBLIGATORIO)"]
[{"$f":"IF(E123+E104=0,\"\",\"ERRORE:   Totale n° di dischi superiore al consentito\")","v":""},"Specificare la configurazione RAID per l'installazione del Sistema Operativo, se richiesto.\ne/o\ninserire eventuali note.",null,null,"Specificare la configurazione RAID per l'installazione del Sistema Operativo, se richiesto.\ne/o\ninserire eventuali note.",null,null,{"$f":"IF(B127=E127,\"ERRORE:   Compilare il campo NOTE\",\"\")","v":"ERRORE:   Compilare il campo NOTE"}]
[null,"Configurazione RAID con HDD 300GB"]
[null,"RAID 1  (2 HDDs)",1,null,{"$f":"VLOOKUP($B$129,  RAID_A1, 2, FALSE)","v":{"$error":"#N/A"}}]
[null,"Hot Spare for 300GB HDD","No"]
[]
[null,"Configurazione RAID con HDD 1TB"]
[null,"",1,null,{"$f":"VLOOKUP($B$133,  RAID_A2, 2, FALSE)","v":{"$error":"#N/A"}}]
[null,"Hot Spare for 1TB HDD","No"]
[]
[null,"Micro SD (USB Flash Drive)"]
[null,"None",{"$f":"VLOOKUP($B$137,microsd, 2, FALSE)","v":0},{"$f":"VLOOKUP($B$137,microsd, 3, FALSE)","v":""},{"$f":"VLOOKUP($B$137,microsd, 5, FALSE)","v":""},null,{"$f":"VLOOKUP($B$137, microsd, 6, FALSE)*C137","v":0}]
[]
[null,"Alimentatore"]
[null,"HPE 1600W Flex Slot Platinum Hot Plug Low Halogen Power Supply Kit",2,null,"830272-B21"]
[]
[null,"PCIe Riser"]
[null,"Primary, Secondary Riser & Tertiary Riser Kit",1,null,"870548-B21 -  872253-B21"]
[]
[null,"Secondary Riser",0,{"$f":"VLOOKUP($C$145, Riser2, 2, FALSE)","v":""},{"$f":"VLOOKUP($C$145, Riser2, 3, FALSE)","v":""},{"$f":"VLOOKUP($C$145, Riser2, 4, FALSE)","v":""},{"$f":"VLOOKUP($C$145, Riser2, 5, FALSE)","v":0},{"$f":"IF(C145+C147=2,\"ERRORE - SELEZIONARE SOLO UNA SECONDARY RISER\",\"\")","v":""}]
[]
[null,"Secondary Riser for GPU (abilita l'installazione della GPU P2000 su slot 5)",0,{"$f":"VLOOKUP($C$147, Riser2GPU, 2, FALSE)","v":""},{"$f":"VLOOKUP($C$147, Riser2GPU, 3, FALSE)","v":""},{"$f":"VLOOKUP($C$147, Riser2GPU, 4, FALSE)","v":""},{"$f":"VLOOKUP($C$147, Riser2GPU, 5, FALSE)","v":0}]
[]
[null,"Tertiary riser",0,{"$f":"VLOOKUP($C$149, Riser3, 2, FALSE)","v":""},{"$f":"VLOOKUP($C$149, Riser3, 3, FALSE)","v":""},{"$f":"VLOOKUP($C$149, Riser3, 4, FALSE)","v":""},{"$f":"VLOOKUP($C$149, Riser3, 5, FALSE)","v":0}]
[]
[null,"Scheda FlexibleLOM"]
[null,"HPE Ethernet 1Gb 4-port 331FLR Adapter",{"$f":"VLOOKUP(B152,  FLR_Slot, 2, FALSE)","v":1},{"$f":"VLOOKUP(B152,  FLR_Slot, 3, FALSE)","v":""},{"$f":"VLOOKUP(B152,  FLR_Slot, 5, FALSE)","v":""},{"$f":"VLOOKUP(B152,  FLR_Slot, 6, FALSE)","v":""},{"$f":"VLOOKUP(B152,  FLR_Slot, 9, FALSE)","v":0}]
[]
[null,"Additional Card for PCIe Slot 1 x8 CPU 1 "]
[null,"None",{"$f":"IF(B155=B79,\"\",VLOOKUP(B155,  PCI_A1, 2, FALSE))","v":""},{"$f":"IF(B155=B79,\"\",VLOOKUP(B155,  PCI_A1, 3, FALSE))","v":""},{"$f":"IF(B155=B79,\"\",VLOOKUP(B155,  PCI_A1, 5, FALSE))","v":""},{"$f":"IF(B155=B79,\"\",VLOOKUP(B155,  PCI_A1, 6, FALSE))","v":""},{"$f":"IF(B155=B79,\"\",VLOOKUP(B155,  PCI_A1, 9, FALSE))","v":0}]
[]
[null,"Additional Card for PCIe Slot 2 x16 CPU 1 "]
[null,"None",{"$f":"VLOOKUP(B158,  PCI_A2, 2, FALSE)","v":""},{"$f":"VLOOKUP(B158,  PCI_A2, 3, FALSE)","v":""},{"$f":"VLOOKUP(B158,  PCI_A2, 5, FALSE)","v":""},{"$f":"VLOOKUP(B158,  PCI_A2, 6, FALSE)","v":""},{"$f":"VLOOKUP(B158,  PCI_A2, 9, FALSE)","v":0}]
[]
[null,"Additional Card for PCIe Slot 3 x8 CPU 1 "]
[null,"None",{"$f":"VLOOKUP(B161,  PCI_A3, 2, FALSE)","v":""},{"$f":"VLOOKUP(B161,  PCI_A3, 3, FALSE)","v":""},{"$f":"VLOOKUP(B161,  PCI_A3, 5, FALSE)","v":""},{"$f":"VLOOKUP(B161,  PCI_A3, 6, FALSE)","v":""},{"$f":"VLOOKUP(B161,  PCI_A3, 9, FALSE)","v":0}]
[]
[null,{"$f":"IF(C147=1,\"Additional Card for PCIe Slot 4 x8 CPU 2 \",\"Additional Card for PCIe Slot 4 x8 CPU 2 \")","v":"Additional Card for PCIe Slot 4 x8 CPU 2 "}]
[null,"None",{"$f":"VLOOKUP(B164,  PCI_A2, 2, FALSE)","v":""},{"$f":"VLOOKUP(B164,  PCI_A2, 3, FALSE)","v":""},{"$f":"VLOOKUP(B164,  PCI_A2, 5, FALSE)","v":""},{"$f":"VLOOKUP(B164,  PCI_A2, 6, FALSE)","v":""},{"$f":"VLOOKUP(B164,  PCI_A2, 9, FALSE)","v":0}]
[]
[null,"Additional Card for PCIe Slot 5 (GPU SLOT) x16 CPU 2"]
[null,"None",{"$f":"VLOOKUP(B167,  PCI_A5, 2, FALSE)","v":""},{"$f":"VLOOKUP(B167,  PCI_A5, 3, FALSE)","v":""},{"$f":"VLOOKUP(B167,  PCI_A5, 5, FALSE)","v":""},{"$f":"VLOOKUP(B167,  PCI_A5, 6, FALSE)","v":""},{"$f":"VLOOKUP(B167,  PCI_A5, 9, FALSE)","v":0}]
[]
[null,"Additional Card for PCIe Slot 6 x8 CPU 2"]
[null,"None",{"$f":"VLOOKUP(B170,  PCI_A3, 2, FALSE)","v":""},{"$f":"VLOOKUP(B170,  PCI_A3, 3, FALSE)","v":""},{"$f":"VLOOKUP(B170,  PCI_A3, 5, FALSE)","v":""},{"$f":"VLOOKUP(B170,  PCI_A3, 6, FALSE)","v":""},{"$f":"VLOOKUP(B170,  PCI_A3, 9, FALSE)","v":0}]
[]
[null,"Additional Card for PCIe Slot 7 x8 CPU 2"]
[null,"None",{"$f":"VLOOKUP(B173,  PCI_A2, 2, FALSE)","v":""},{"$f":"VLOOKUP(B173,  PCI_A2, 3, FALSE)","v":""},{"$f":"VLOOKUP(B173,  PCI_A2, 5, FALSE)","v":""},{"$f":"VLOOKUP(B173,  PCI_A2, 6, FALSE)","v":""},{"$f":"VLOOKUP(B173,  PCI_A2, 9, FALSE)","v":0}]
[]
[null,"Additional Card for PCIe Slot 8 x8 CPU 2"]
[null,"None",{"$f":"VLOOKUP(B176,  PCI_A2, 2, FALSE)","v":""},{"$f":"VLOOKUP(B176,  PCI_A2, 3, FALSE)","v":""},{"$f":"VLOOKUP(B176,  PCI_A2, 5, FALSE)","v":""},{"$f":"VLOOKUP(B176,  PCI_A2, 6, FALSE)","v":""},{"$f":"VLOOKUP(B176,  PCI_A2, 9, FALSE)","v":0}]
[]
[null,"Bezel"]
[null,"None",1]
[]
[null,"Unità ottica"]
[null,"HP Mobile USB DVDRW Drive",1,null,"701498-B21"]
[]
[null,"Accessori per Server"]
[null,"HPE 240GB SATA 6G Mixed Use M.2 2280",0,{"$f":"IF(C185=0,\"\",\"TS2L5-M2240\")","v":""},"875488-B21",null,{"$f":"C185*175","v":0}]
[]
[null,"Cavi rj45"]
[null,"Cavo Rete UTP cat. 5e 3 metri",5,{"$f":"IF(C188=0,\"\",\"TS2L5-3MRJ45\")","v":"TS2L5-3MRJ45"},"ROS1403/G",null,{"$f":"2*C188","v":10}]
[]
[null,"Omni-Path Architecture Optical"]
[null,"HPE X240 10G SFP+ SFP+ 3m DAC Cable",0,{"$f":"IF(C191=0,\"\",\"TS2L5-DACX240M3\")","v":""},"JD097C",null,{"$f":"C191*81","v":0}]
[]
[null,"HPE X240 10G SFP+ SFP+ 5m DAC Cable",0,{"$f":"IF(C193=0,\"\",\"TS2L5-DACX240M5\")","v":""},"JG081C",null,{"$f":"C193*95","v":0}]
[]
[null,"HPE X240 10G SFP+ SFP+ 7m DAC Cable",0,{"$f":"IF(C195=0,\"\",\"TS2L5-DACX240M7\")","v":""},"JC784C",null,{"$f":"C195*106","v":0}]
[]
[null,"InfiniBand Copper Cable"]
[null,"HPE 2M FDR Quad Small Form Factor Pluggable InfiniBand Copper Cable",0,{"$f":"IF(C198=0,\"\",\"TS2L5-DACQSFPM2\")","v":""},"670759-B24",null,{"$f":"C198*147","v":0}]
[]
[null,"Omni-Path Architecture Copper Cable"]
[null,"HPE 2M 100Gb QSFP28 Omni-Path Architecture Copper Cable",0,{"$f":"IF(C201=0,\"\",\"TS2L5-DAC100M2\")","v":""},"830024-B24",null,{"$f":"C201*117","v":0}]
[]
[null,"HPE 3M 100Gb QSFP28 Omni-Path Architecture Copper Cable",0,{"$f":"IF(C203=0,\"\",\"TS2L5-DAC100M3\")","v":""},"830024-B25",null,{"$f":"C203*147","v":0}]
[]
[null,"Omni-Path Architecture Optical"]
[null,"HPE 3M 100Gb QSFP28 Omni-Path Architecture Optical Power Class 2 Cable",0,{"$f":"IF(C206=0,\"\",\"TS2L5-DACAOCM3\")","v":""},"881204-B21",null,{"$f":"C206*612","v":0}]
[]
[null,"HPE 5M 100Gb QSFP28 Omni-Path Architecture Optical Power Class 2 Cable",0,{"$f":"IF(C208=0,\"\",\"TS2L5-DACAOCM5\")","v":""},"881204-B22",null,{"$f":"C208*619","v":0}]
[]
[null,"HPE 7M 100Gb QSFP28 Omni-Path Architecture Optical Power Class 2 Cable",0,{"$f":"IF(C210=0,\"\",\"TS2L5-DACAOCM7\")","v":""},"881204-B23",null,{"$f":"C210*627","v":0}]
[]
[null,"Optical Transceiver"]
[null,"HPE 10Gb SFP+ SR Transceiver",0,{"$f":"IF(C213=0,\"\",\"TS2L5-10OTSR\")","v":""},"455883-B21",null,{"$f":"C213*230","v":0}]
[]
[null,"HPE 10G SFP+ LR Transceiver",0,{"$f":"IF(C215=0,\"\",\"TS2L5-10OTLR\")","v":""},"455886-B21",null,{"$f":"C215*481","v":0}]
[]
[null,"Estensione di Garanzia"]
[null,"None",{"$f":"VLOOKUP($B$218,  SO_B1,2, FALSE)","v":""},{"$f":"VLOOKUP($B$218,  SO_B1, 3, FALSE)","v":""},{"$f":"VLOOKUP($B$218,  SO_B1, 5, FALSE)","v":""},{"$f":"VLOOKUP($B$218,  SO_B1, 6, FALSE)","v":""}]

{"sheet":"Lotto5 DL560 Gen10 3","index":2,"n_rows":218,"n_cols":8,"rows_kept":218,"cut":false,"hidden":false,"merged":[[0,7,1,7],[2,1,2,2],[3,0,4,4],[49,0,53,0],[5,0,5,4],[10,0,11,2],[33,1,33,4],[36,1,36,4],[37,2,37,4],[43,1,43,4],[44,2,44,4],[34,2,34,3],[49,2,49,4],[17,1,17,4],[53,1,53,4],[18,2,18,4],[80,2,80,4],[124,1,124,4],[125,2,125,4],[72,1,72,4],[126,1,126,3],[48,1,48,4],[20,1,20,4],[24,2,24,4],[27,1,27,4],[28,2,28,4],[30,1,30,4],[31,2,31,4],[66,1,66,4],[170,1,170,4],[171,2,171,4],[150,2,150,4],[152,1,152,4],[155,1,155,4],[156,2,156,4],[158,1,158,4],[159,2,159,4],[153,2,153,4],[79,1,79,4],[131,2,131,4],[73,2,73,4],[130,1,130,4],[127,2,127,4],[69,1,69,4],[173,1,173,4],[174,2,174,4],[176,1,176,4],[134,1,134,4],[135,2,135,4],[137,1,137,4],[138,2,138,4],[140,1,140,4],[141,2,141,4],[164,1,164,4],[165,2,165,4],[167,1,167,4],[168,2,168,4],[161,1,161,4],[162,2,162,4],[149,1,149,4],[177,2,177,4],[179,1,179,4],[180,2,180,4],[183,2,183,4],[188,1,188,4],[185,1,185,4],[182,1,182,4],[210,1,210,4],[213,1,213,4],[216,2,216,4],[198,1,198,4],[201,1,201,4],[203,1,203,4],[206,1,206,4],[208,1,208,4]]}
[null,null,"TOTALE PRODOTTI CONVENZIONE",{"$f":"H10","v":0},null,null,{"$f":"IF(D105=\"      OK\",0,1)","v":0},{"$f":"IF(G1+G2=0,(D1+D2),\"ERRORE VERIFICARE LA CONFIGURAZIONE\")","v":0}]
[null,null,"TOTALE ARTICOLI 20%",{"$f":"H11","v":0}]
[null,"Indicare qui la quantità Server ----->",null,0,null,null,null,{"$f":"Riepilogo!T6","v":"ver. 3.3"}]
["Tecnologie Server 2 Lotto 5 Prestazionale DL560 Gen10"]
["Tecnologie Server 2 Lotto 5 Prestazionale DL560 Gen10"]
[]
[]
[]
[]
[null,null,null,"Totale Server e Opzioni",null,null,null,{"$f":"F17*SRV_AAA","v":0}]
["Components: \nServer HPE Proliant DL560 Gen10 (2CPU Intel® Xeon-Gold 5220)",null,null,"Totale Ulteriori Opzioni ",null,null,null,{"$f":"G17*SRV_AAA","v":0}]
[]
[null,null,null,"TOTALE CONVENZIONE",null,null,null,{"$f":"H11+H10","v":0}]
[]
[null,null,null,null,null,6078]
[null,"Quantity: ",{"$f":"SRV_AAA","v":0},null,null,{"$f":"SUM(F20:F1048576)","v":0}]
[null,null,null,null,null,{"$f":"SUM(F15:F16)","v":6078},{"$f":"SUM(G20:G216)","v":10}]
[]
[null,"Base"]
[null,"HPE DL560 Gen10 8SFF CTO Server",1,null,"841730-B21"]
[]
[null,"Configurazione dello chassis"]
[null,"HPE DL560 Gen10 8SFF HDD Bay2 Kit",1,null,"872235-B21"]
[]
[null,"Processore"]
[null,"Intel Xeon-Gold 5220 (2.2GHz/18-core/125W)",2,null,"840389-L21"]
[null,"HPE DL560 Gen10 Intel® Xeon-Gold 5118 (2.3GHz/12-core/105W) Processor",1,null,"840399-B21"]
[]
[null,"Processore aggiuntivo"]
[null,"No Additional Processor",{"$f":"VLOOKUP($B$30, CPU_A, 2, FALSE)","v":0},{"$f":"VLOOKUP($B$30, CPU_A, 3, FALSE)","v":""},{"$f":"VLOOKUP($B$30, CPU_A, 5, FALSE)","v":""},{"$f":"VLOOKUP(B30, CPU_A, 12, FALSE)","v":0}]
[]
[null,"Mezz Board Option"]
[null,{"$f":"VLOOKUP($B$30, CPU_A, 6, FALSE)","v":""},{"$f":"VLOOKUP($B$30, CPU_A, 7, FALSE)","v":""},null,{"$f":"VLOOKUP($B$30, CPU_A, 8, FALSE)","v":""}]
[]
[null,"Memoria Totale in GB",{"$f":"IF(F30=2584,IF(B36=64,\"ATTENZIONE: AUMENTARE LA RAM\",\"\"),\"\")","v":""}]
[null,"128        (DIMM 32GB)"]
[]
[null,"Capacità di memoria"]
[null,{"$f":"IF($B$30=\"No Additional Processor\",VLOOKUP($B$36, MEM_A1, 8, FALSE),VLOOKUP($B$36, MEM_A2, 8, FALSE))","v":"HPE 32GB 2Rx4 PC4-2933 Smart Kit"},{"$f":"IF($B$30=\"No Additional Processor\",VLOOKUP($B$36, MEM_A1, 9, FALSE),VLOOKUP($B$36, MEM_A2, 9, FALSE))","v":4},null,{"$f":"IF($B$30=\"No Additional Processor\",VLOOKUP($B$36, MEM_A1, 10, FALSE),VLOOKUP($B$36, MEM_A2, 10, FALSE))","v":"815100-B21"}]
[]
[null,{"$f":"IF($B$30=\"No Additional Processor\",VLOOKUP($B$36, MEM_A1, 2, FALSE),VLOOKUP($B$36, MEM_A2, 2, FALSE))","v":"HPE 32GB 2Rx4 PC4-2933 Smart Kit"},{"$f":"IF($B$30=\"No Additional Processor\",VLOOKUP($B$36, MEM_A1, 3, FALSE),VLOOKUP($B$36, MEM_A2, 3, FALSE))","v":4},{"$f":"IF($B$30=\"No Additional Processor\",VLOOKUP($B$36, MEM_A1, 4, FALSE),VLOOKUP($B$36, MEM_A2, 4, FALSE))","v":""},{"$f":"IF($B$30=\"No Additional Processor\",VLOOKUP($B$36, MEM_A1, 6, FALSE),VLOOKUP($B$36, MEM_A2, 6, FALSE))","v":"815100-B21"},{"$f":"IF($B$30=\"No Additional Processor\",VLOOKUP($B$36, MEM_A1, 7, FALSE),VLOOKUP($B$36, MEM_A2, 7, FALSE))","v":0}]
[null,{"$f":"IF($B$30=\"No Additional Processor\",VLOOKUP($B$36, MEM_A1, 11, FALSE),VLOOKUP($B$36, MEM_A2, 11, FALSE))","v":""},{"$f":"IF($B$30=\"No Additional Processor\",VLOOKUP($B$36, MEM_A1, 12, FALSE),VLOOKUP($B$36, MEM_A2, 12, FALSE))","v":""},{"$f":"IF($B$30=\"No Additional Processor\",VLOOKUP($B$36, MEM_A1, 13, FALSE),VLOOKUP($B$36, MEM_A2, 13, FALSE))","v":""},{"$f":"IF($B$30=\"No Additional Processor\",VLOOKUP($B$36, MEM_A1, 15, FALSE),VLOOKUP($B$36, MEM_A2, 15, FALSE))","v":""},{"$f":"IF($B$30=\"No Additional Processor\",VLOOKUP($B$36, MEM_A1, 16, FALSE),VLOOKUP($B$36, MEM_A2, 16, FALSE))","v":""}]
[]
[]
[null,"Sistema operativo preinstallato"]
[null,"No Operating System",{"$f":"VLOOKUP($B$46, OS_A, 2, FALSE)","v":""},{"$f":"VLOOKUP($B$46, OS_A, 3, FALSE)","v":""},{"$f":"VLOOKUP($B$46, OS_A, 5, FALSE)","v":""},{"$f":"VLOOKUP($B$46, OS_A, 6, FALSE)","v":""}]
[null,{"$f":"IF($B$30=\"No Additional Processor\",VLOOKUP($B$46, OS_A, 19, FALSE),VLOOKUP($B$46, OS_A2, 19, FALSE))","v":""},{"$f":"IF($B$30=\"No Additional Processor\",VLOOKUP($B$46, OS_A, 20, FALSE),VLOOKUP($B$46, OS_A2, 20, FALSE))","v":0},{"$f":"IF($B$30=\"No Additional Processor\",VLOOKUP($B$46, OS_A, 21, FALSE),VLOOKUP($B$46, OS_A2, 21, FALSE))","v":""},{"$f":"IF($B$30=\"No Additional Processor\",VLOOKUP($B$46, OS_A, 23, FALSE),VLOOKUP($B$46, OS_A2, 23, FALSE))","v":""},{"$f":"IF($B$30=\"No Additional Processor\",VLOOKUP($B$46, OS_A, 24, FALSE)*C47,VLOOKUP($B$46, OS_A2, 24, FALSE)*C47)","v":0},null,{"$f":"IF(D46=\"TS1L2-WIN1\",3,IF(D46=\"TS1L2-WINDC1\",4,0))","v":0}]
[null,{"$f":"IF($B$30=\"No Additional Processor\",VLOOKUP($B$46, OS_A, 25, FALSE),VLOOKUP($B$46, OS_A2, 25, FALSE))","v":""},{"$f":"IF($B$30=\"No Additional Processor\",VLOOKUP($B$46, OS_A, 26, FALSE),VLOOKUP($B$46, OS_A2, 26, FALSE))","v":0},{"$f":"IF($B$30=\"No Additional Processor\",VLOOKUP($B$46, OS_A, 27, FALSE),VLOOKUP($B$46, OS_A2, 27, FALSE))","v":""},{"$f":"IF($B$30=\"No Additional Processor\",VLOOKUP($B$46, OS_A, 29, FALSE),VLOOKUP($B$46, OS_A2, 29, FALSE))","v":""},{"$f":"IF($B$30=\"No Additional Processor\",VLOOKUP($B$46, OS_A, 30, FALSE)*C48,VLOOKUP($B$46, OS_A2, 30, FALSE)*C48)","v":0}]
[]
[null,"Client Access Licenses"]
[null,{"$f":"VLOOKUP($B$46, OS_A, 7, FALSE)","v":"None"},0,{"$f":"VLOOKUP($B$46, OS_A, 9, FALSE)","v":""},{"$f":"VLOOKUP($B$46, OS_A, 11, FALSE)","v":""},{"$f":"VLOOKUP($B$46, OS_A, 12, FALSE)*C51","v":0}]
[]
[null,{"$f":"VLOOKUP($B$46, OS_A, 13, FALSE)","v":"None"},0,{"$f":"VLOOKUP($B$46, OS_A, 15, FALSE)","v":""},{"$f":"VLOOKUP($B$46, OS_A, 17, FALSE)","v":""},{"$f":"VLOOKUP($B$46, OS_A, 18, FALSE)*C53","v":0}]
[]
[null,"VMware vSphere"]
[null,"None",{"$f":"IF(D56=\"\",0,(C26+C30))","v":0},{"$f":"VLOOKUP($B$56,vmware, 3, FALSE)","v":""},{"$f":"VLOOKUP($B$56,vmware, 5, FALSE)","v":""},null,{"$f":"VLOOKUP($B$56,vmware, 6, FALSE)*C56","v":0}]
[null,"VMware vSphere Essentials Plus"]
[null,"None",{"$f":"VLOOKUP($B$58,vmwareplus, 2, FALSE)","v":0},{"$f":"VLOOKUP($B$58,vmwareplus, 3, FALSE)","v":""},{"$f":"VLOOKUP($B$58,vmwareplus, 5, FALSE)","v":""},null,{"$f":"VLOOKUP($B$58,vmwareplus, 6, FALSE)*C58","v":0}]
[null,"VMware vCenter Server"]
[null,"None",{"$f":"VLOOKUP($B$60,vmwarevcenter, 2, FALSE)","v":0},{"$f":"VLOOKUP($B$60,vmwarevcenter, 3, FALSE)","v":""},{"$f":"VLOOKUP($B$60,vmwarevcenter, 5, FALSE)","v":""},null,{"$f":"VLOOKUP($B$60, vmwarevcenter, 6, FALSE)*C60","v":0}]
[null,"VMware vSAN"]
[null,"None",{"$f":"IF(D62=\"\",0,($C$26+$C$30))","v":0},{"$f":"VLOOKUP($B$62,vmvsan, 3, FALSE)","v":""},{"$f":"VLOOKUP($B$62,vmvsan, 5, FALSE)","v":""},null,{"$f":"VLOOKUP($B$62,vmvsan, 6, FALSE)*C62","v":0}]
[]
[]
[null,"HPE OneView Advanced (with HPE iLO Advanced)"]
[null,"None",{"$f":"VLOOKUP($B$66, OpzOVAdv, 2, FALSE)","v":0},{"$f":"VLOOKUP($B$66, OpzOVAdv, 3, FALSE)","v":""},{"$f":"VLOOKUP($B$66, OpzOVAdv, 5, FALSE)","v":""},null,{"$f":"VLOOKUP($B$66, OpzOVAdv, 6, FALSE)","v":0}]
[]
[null,"Configurazione dello chassis"]
[null,"HPE DL560 Gen10 NVMe 8 SSD Express Bay Kit (opzione disponibile con 4 CPU)",0,{"$f":"VLOOKUP($C$69, HDD_NVMe, 2, FALSE)","v":""},{"$f":"VLOOKUP($C$69, HDD_NVMe, 4, FALSE)","v":0},null,{"$f":"VLOOKUP($C$69, HDD_NVMe, 5, FALSE)","v":0}]
[]
[]
[null,"HPE DL560 Gen10 8SFF HDD Bay1 Kit",0,{"$f":"IF(C69+C72=2,\"TS2L5-HDDBAY\",VLOOKUP($C$72,HDD_BAY1,2,FALSE))","v":""},{"$f":"VLOOKUP($C$72, HDD_BAY1, 4, FALSE)","v":0},null,{"$f":"IF(C69+C72=2,\"191,00\",VLOOKUP($C$72,HDD_BAY1,5,FALSE))","v":0}]
[]
[null,"Controller RAID"]
[null,"HPE Smart Array P816i-a SR Gen10",{"$f":"VLOOKUP($B$75, _Array, 2, FALSE)","v":1},{"$f":"VLOOKUP($B$75, _Array, 3, FALSE)","v":""},{"$f":"VLOOKUP($B$75, _Array, 5, FALSE)","v":"869083-B21"},null,{"$f":"VLOOKUP($B$75, _Array, 6, FALSE)","v":""}]
[]
[null,{"$f":"VLOOKUP($B$75, _Array, 7, FALSE)","v":"HPE 96W Smart Storage Battery with 145mm Cable Kit"},{"$f":"VLOOKUP($B$75, _Array, 8, FALSE)","v":1},{"$f":"VLOOKUP($B$75, _Array, 9, FALSE)","v":""},{"$f":"VLOOKUP($B$75, _Array, 10, FALSE)","v":"P01366-B21"}]
[]
[null,{"$f":"IF(C72=0,\"\",IF(C69+C72=2,\"\",\"HPE DL5x0 Gen10 12Gb SAS Expander Card Kit with Cables\"))","v":""},{"$f":"IF(C72=0,\"\",IF(C69+C72=2,\"\",1))","v":""},{"$f":"IF(C72=0,\"\",IF(C69+C72=2,\"\",\"TS2L5-SASBAY1\"))","v":""},{"$f":"IF(C72=0,\"\",IF(C69+C72=2,\"\",\"873444-B21\"))","v":""}]
[]
[null,{"$f":"IF(5+E72+E69=5,\"Dischi rigidi SAS/SSD (numero massimo totale 16)\",IF(5+E72+E69=8,\"Dischi rigidi  SAS/SSD (numero massimo totale 16)\",IF(5+E72+E69=6,\"Dischi rigidi SAS/SSD (numero massimo totale 24)\",IF(5+E72+E69=7,\"Dischi rigidi SAS/SSD (numero massimo totale 8)\"))))","v":"Dischi rigidi SAS/SSD (numero massimo totale 16)"}]
[null,"HPE 300GB SAS 15K SFF SC DS HDD",2,null,"870753-B21"]
[]
[null,"HPE 300GB SAS 15K SFF SC DS HDD",2,"TS2L5-15K300","872475-B21",{"$f":"IF(C84<=2,0,C84-2)*137","v":0}]
[]
[null,"HPE 1.2TB SAS 10K SFF SC DS HDD",0,"TS2L5-10K1200","872479-B21",{"$f":"C86*146","v":0}]
[]
["HDD SAS ","HPE 1.8TB SAS 10K SFF SC 512e DS HDD",0,"TS2L5-10K1800","872481-B21",{"$f":"C88*190","v":0}]
[]
[]
[null,"HPE 400GB SAS 12G Mixed Use SFF (2.5in) SC DS SSD",0,"TS2L5-SSD400MU","P09088-B21",null,{"$f":"C91*622","v":0}]
[]
[null,"HPE 400GB SAS 12G Write Intensive SFF (2.5in) SC DS SSD",0,"TS2L5-SSD400WIB","P09098-B21",null,{"$f":"C93*959","v":0}]
[]
[null,"HPE 800GB SAS 12G Mixed Use SFF (2.5in) SC DS SSD",0,"TS2L5-SSD800MU","P09090-B21",null,{"$f":"C95*980","v":0}]
["SSD SAS"]
[null,"HPE 960GB SAS 12G Mixed Use SC SAS DS SSD",0,"TS2L5-SSD960MU","P10448-B21",null,{"$f":"C97*864","v":0}]
[]
[null,"HPE 960GB SAS RI SFF SC DS SSD",0,"TS2L5-SSDR960","P06584-B21",{"$f":"C99*664","v":0}]
[]
[null,"HPE 1.92TB SAS 12G Read Intensive SFF",0,"TS2L5-SSDR1920","P06586-B21",{"$f":"C101*1313","v":0}]
[]
[null,"HPE 3.84TB SAS 12G Read Intensive SFF (2.5in) SC",0,"TS2L5-SSD3840RI","P04521-B21",null,{"$f":"C103*2066","v":0}]
[null,null,null,null,{"$f":"IF(C105<=E105,0,1)","v":0}]
[null,"DISCHI TOTALI",{"$f":"SUM(C84:C101)","v":2},{"$f":"IF(C105<=E105,\"      OK\",\"     ERRORE:   Totale n° di dischi superiore al consentito\")","v":"      OK"},{"$f":"IF(5+E72+E69=5,16,IF(5+E72+E69=7,8,IF(5+E72+E69=6,24,IF(5+E72+E69=8,16))))","v":16}]
[null,null,null,null,{"$f":"E104+E123","v":0}]
[]
[null,"HPE 375GB NVMe x4 Lanes Write Intensive SFF (2.5in) SCN",0,"TS2L5-375NVMEWI","878014-B21",null,{"$f":"C108*2398","v":0}]
[]
[null,"HPE 750GB NVMe x4 Write Intensive SFF (2.5in) SCN",0,"TS2L5-750NVMEWI","P06952-B21",null,{"$f":"C110*4797","v":0}]
[]
[null,"HPE 800GB NVMe x4 Lanes Mixed Use SFF (2.5in) SCN",0,"TS2L5-800NVMEMU","P13668-B21",null,{"$f":"C112*900","v":0}]
[]
[null,"HPE 2TB NVMe x4 Lanes Read Intensive SFF (2.5in) SCN",0,"TS2L5-2000NVMERI","P13695-B21",null,{"$f":"C114*1912","v":0}]
["NVMe SSD"]
["NVMe SSD","HPE 3.84TB SAS 12G Read Intensive SFF (2.5in) SC",0,"TS2L5-SSD3840RI","P04521-B21",null,{"$f":"C116*2066","v":0}]
[]
[null,"HPE 4TB NVMe x4 Lanes Read Intensive SFF (2.5in) SCN",0,"TS2L5-4000NVMERI","P13697-B21",null,{"$f":"C118*3748","v":0}]
[]
[null,"HPE 1.6TB NVMe x4 Lanes Mixed Use SFF (2.5in) SCN",0,"TS2L5-1600NVMEMU","P13699-B21",null,{"$f":"C120*1569","v":0}]
[]
[null,"HPE 3.2TB NVMe x4 Lanes Mixed Use SFF (2.5in) SCN",0,"TS2L5-3200NVMEMU","P13701-B21",null,{"$f":"C122*3452","v":0}]
[null,null,null,null,{"$f":"IF(C124<=8,0,1)","v":0}]
[null,"DISCHI NVMe  TOTALI",{"$f":"SUM(C108:C122)","v":0},{"$f":"IF(C124<=8,\"      OK\",\"     ERRORE:   Totale n° di dischi NVMe superiore al consentito\")","v":"      OK"}]
[]
[null,"NOTE sulla configurazione (CAMPO OBBLIGATORIO)"]
[{"$f":"IF(E123+E104=0,\"\",\"ERRORE:   Totale n° di dischi superiore al consentito\")","v":""},"Specificare la configurazione RAID per l'installazione del Sistema Operativo, se richiesto.\ne/o\ninserire eventuali note.",null,null,"Specificare la configurazione RAID per l'installazione del Sistema Operativo, se richiesto.\ne/o\ninserire eventuali note.",null,null,{"$f":"IF(B127=E127,\"ERRORE:   Compilare il campo NOTE\",\"\")","v":"ERRORE:   Compilare il campo NOTE"}]
[null,"Configurazione RAID con HDD 300GB"]
[null,"RAID 1  (2 HDDs)",1,null,{"$f":"VLOOKUP($B$129,  RAID_A1, 2, FALSE)","v":{"$error":"#N/A"}}]
[null,"Hot Spare for 300GB HDD","No"]
[]
[null,"Configurazione RAID con HDD 1TB"]
[null,"",1,null,{"$f":"VLOOKUP($B$133,  RAID_A2, 2, FALSE)","v":{"$error":"#N/A"}}]
[null,"Hot Spare for 1TB HDD","No"]
[]
[null,"Micro SD (USB Flash Drive)"]
[null,"None",{"$f":"VLOOKUP($B$137,microsd, 2, FALSE)","v":0},{"$f":"VLOOKUP($B$137,microsd, 3, FALSE)","v":""},{"$f":"VLOOKUP($B$137,microsd, 5, FALSE)","v":""},null,{"$f":"VLOOKUP($B$137, microsd, 6, FALSE)*C137","v":0}]
[]
[null,"Alimentatore"]
[null,"HPE 1600W Flex Slot Platinum Hot Plug Low Halogen Power Supply Kit",2,null,"830272-B21"]
[]
[null,"PCIe Riser"]
[null,"Primary, Secondary Riser & Tertiary Riser Kit",1,null,"870548-B21 -  872253-B21"]
[]
[null,"Secondary Riser",0,{"$f":"VLOOKUP($C$145, Riser2, 2, FALSE)","v":""},{"$f":"VLOOKUP($C$145, Riser2, 3, FALSE)","v":""},{"$f":"VLOOKUP($C$145, Riser2, 4, FALSE)","v":""},{"$f":"VLOOKUP($C$145, Riser2, 5, FALSE)","v":0},{"$f":"IF(C145+C147=2,\"ERRORE - SELEZIONARE SOLO UNA SECONDARY RISER\",\"\")","v":""}]
[]
[null,"Secondary Riser for GPU (abilita l'installazione della GPU P2000 su slot 5)",0,{"$f":"VLOOKUP($C$147, Riser2GPU, 2, FALSE)","v":""},{"$f":"VLOOKUP($C$147, Riser2GPU, 3, FALSE)","v":""},{"$f":"VLOOKUP($C$147, Riser2GPU, 4, FALSE)","v":""},{"$f":"VLOOKUP($C$147, Riser2GPU, 5, FALSE)","v":0}]
[]
[null,"Tertiary riser",0,{"$f":"VLOOKUP($C$149, Riser3, 2, FALSE)","v":""},{"$f":"VLOOKUP($C$149, Riser3, 3, FALSE)","v":""},{"$f":"VLOOKUP($C$149, Riser3, 4, FALSE)","v":""},{"$f":"VLOOKUP($C$149, Riser3, 5, FALSE)","v":0}]
[]
[null,"Scheda FlexibleLOM"]
[null,"HPE Ethernet 1Gb 4-port 331FLR Adapter",{"$f":"VLOOKUP(B152,  FLR_Slot, 2, FALSE)","v":1},{"$f":"VLOOKUP(B152,  FLR_Slot, 3, FALSE)","v":""},{"$f":"VLOOKUP(B152,  FLR_Slot, 5, FALSE)","v":""},{"$f":"VLOOKUP(B152,  FLR_Slot, 6, FALSE)","v":""},{"$f":"VLOOKUP(B152,  FLR_Slot, 9, FALSE)","v":0}]
[]
[null,"Additional Card for PCIe Slot 1 x8 CPU 1 "]
[null,"None",{"$f":"IF(B155=B79,\"\",VLOOKUP(B155,  PCI_A1, 2, FALSE))","v":""},{"$f":"IF(B155=B79,\"\",VLOOKUP(B155,  PCI_A1, 3, FALSE))","v":""},{"$f":"IF(B155=B79,\"\",VLOOKUP(B155,  PCI_A1, 5, FALSE))","v":""},{"$f":"IF(B155=B79,\"\",VLOOKUP(B155,  PCI_A1, 6, FALSE))","v":""},{"$f":"IF(B155=B79,\"\",VLOOKUP(B155,  PCI_A1, 9, FALSE))","v":0}]
[]
[null,"Additional Card for PCIe Slot 2 x16 CPU 1 "]
[null,"None",{"$f":"VLOOKUP(B158,  PCI_A2, 2, FALSE)","v":""},{"$f":"VLOOKUP(B158,  PCI_A2, 3, FALSE)","v":""},{"$f":"VLOOKUP(B158,  PCI_A2, 5, FALSE)","v":""},{"$f":"VLOOKUP(B158,  PCI_A2, 6, FALSE)","v":""},{"$f":"VLOOKUP(B158,  PCI_A2, 9, FALSE)","v":0}]
[]
[null,"Additional Card for PCIe Slot 3 x8 CPU 1 "]
[null,"None",{"$f":"VLOOKUP(B161,  PCI_A3, 2, FALSE)","v":""},{"$f":"VLOOKUP(B161,  PCI_A3, 3, FALSE)","v":""},{"$f":"VLOOKUP(B161,  PCI_A3, 5, FALSE)","v":""},{"$f":"VLOOKUP(B161,  PCI_A3, 6, FALSE)","v":""},{"$f":"VLOOKUP(B161,  PCI_A3, 9, FALSE)","v":0}]
[]
[null,{"$f":"IF(C147=1,\"Additional Card for PCIe Slot 4 x8 CPU 2 \",\"Additional Card for PCIe Slot 4 x8 CPU 2 \")","v":"Additional Card for PCIe Slot 4 x8 CPU 2 "}]
[null,"None",{"$f":"VLOOKUP(B164,  PCI_A2, 2, FALSE)","v":""},{"$f":"VLOOKUP(B164,  PCI_A2, 3, FALSE)","v":""},{"$f":"VLOOKUP(B164,  PCI_A2, 5, FALSE)","v":""},{"$f":"VLOOKUP(B164,  PCI_A2, 6, FALSE)","v":""},{"$f":"VLOOKUP(B164,  PCI_A2, 9, FALSE)","v":0}]
[]
[null,"Additional Card for PCIe Slot 5 (GPU SLOT) x16 CPU 2"]
[null,"None",{"$f":"VLOOKUP(B167,  PCI_A5, 2, FALSE)","v":""},{"$f":"VLOOKUP(B167,  PCI_A5, 3, FALSE)","v":""},{"$f":"VLOOKUP(B167,  PCI_A5, 5, FALSE)","v":""},{"$f":"VLOOKUP(B167,  PCI_A5, 6, FALSE)","v":""},{"$f":"VLOOKUP(B167,  PCI_A5, 9, FALSE)","v":0}]
[]
[null,"Additional Card for PCIe Slot 6 x8 CPU 2"]
[null,"None",{"$f":"VLOOKUP(B170,  PCI_A3, 2, FALSE)","v":""},{"$f":"VLOOKUP(B170,  PCI_A3, 3, FALSE)","v":""},{"$f":"VLOOKUP(B170,  PCI_A3, 5, FALSE)","v":""},{"$f":"VLOOKUP(B170,  PCI_A3, 6, FALSE)","v":""},{"$f":"VLOOKUP(B170,  PCI_A3, 9, FALSE)","v":0}]
[]
[null,"Additional Card for PCIe Slot 7 x8 CPU 2"]
[null,"None",{"$f":"VLOOKUP(B173,  PCI_A2, 2, FALSE)","v":""},{"$f":"VLOOKUP(B173,  PCI_A2, 3, FALSE)","v":""},{"$f":"VLOOKUP(B173,  PCI_A2, 5, FALSE)","v":""},{"$f":"VLOOKUP(B173,  PCI_A2, 6, FALSE)","v":""},{"$f":"VLOOKUP(B173,  PCI_A2, 9, FALSE)","v":0}]
[]
[null,"Additional Card for PCIe Slot 8 x8 CPU 2"]
[null,"None",{"$f":"VLOOKUP(B176,  PCI_A2, 2, FALSE)","v":""},{"$f":"VLOOKUP(B176,  PCI_A2, 3, FALSE)","v":""},{"$f":"VLOOKUP(B176,  PCI_A2, 5, FALSE)","v":""},{"$f":"VLOOKUP(B176,  PCI_A2, 6, FALSE)","v":""},{"$f":"VLOOKUP(B176,  PCI_A2, 9, FALSE)","v":0}]
[]
[null,"Bezel"]
[null,"None",1]
[]
[null,"Unità ottica"]
[null,"HP Mobile USB DVDRW Drive",1,null,"701498-B21"]
[]
[null,"Accessori per Server"]
[null,"HPE 240GB SATA 6G Mixed Use M.2 2280",0,{"$f":"IF(C185=0,\"\",\"TS2L5-M2240\")","v":""},"875488-B21",null,{"$f":"C185*175","v":0}]
[]
[null,"Cavi rj45"]
[null,"Cavo Rete UTP cat. 5e 3 metri",5,{"$f":"IF(C188=0,\"\",\"TS2L5-3MRJ45\")","v":"TS2L5-3MRJ45"},"ROS1403/G",null,{"$f":"2*C188","v":10}]
[]
[null,"Omni-Path Architecture Optical"]
[null,"HPE X240 10G SFP+ SFP+ 3m DAC Cable",0,{"$f":"IF(C191=0,\"\",\"TS2L5-DACX240M3\")","v":""},"JD097C",null,{"$f":"C191*81","v":0}]
[]
[null,"HPE X240 10G SFP+ SFP+ 5m DAC Cable",0,{"$f":"IF(C193=0,\"\",\"TS2L5-DACX240M5\")","v":""},"JG081C",null,{"$f":"C193*95","v":0}]
[]
[null,"HPE X240 10G SFP+ SFP+ 7m DAC Cable",0,{"$f":"IF(C195=0,\"\",\"TS2L5-DACX240M7\")","v":""},"JC784C",null,{"$f":"C195*106","v":0}]
[]
[null,"InfiniBand Copper Cable"]
[null,"HPE 2M FDR Quad Small Form Factor Pluggable InfiniBand Copper Cable",0,{"$f":"IF(C198=0,\"\",\"TS2L5-DACQSFPM2\")","v":""},"670759-B24",null,{"$f":"C198*147","v":0}]
[]
[null,"Omni-Path Architecture Copper Cable"]
[null,"HPE 2M 100Gb QSFP28 Omni-Path Architecture Copper Cable",0,{"$f":"IF(C201=0,\"\",\"TS2L5-DAC100M2\")","v":""},"830024-B24",null,{"$f":"C201*117","v":0}]
[]
[null,"HPE 3M 100Gb QSFP28 Omni-Path Architecture Copper Cable",0,{"$f":"IF(C203=0,\"\",\"TS2L5-DAC100M3\")","v":""},"830024-B25",null,{"$f":"C203*147","v":0}]
[]
[null,"Omni-Path Architecture Optical"]
[null,"HPE 3M 100Gb QSFP28 Omni-Path Architecture Optical Power Class 2 Cable",0,{"$f":"IF(C206=0,\"\",\"TS2L5-DACAOCM3\")","v":""},"881204-B21",null,{"$f":"C206*612","v":0}]
[]
[null,"HPE 5M 100Gb QSFP28 Omni-Path Architecture Optical Power Class 2 Cable",0,{"$f":"IF(C208=0,\"\",\"TS2L5-DACAOCM5\")","v":""},"881204-B22",null,{"$f":"C208*619","v":0}]
[]
[null,"HPE 7M 100Gb QSFP28 Omni-Path Architecture Optical Power Class 2 Cable",0,{"$f":"IF(C210=0,\"\",\"TS2L5-DACAOCM7\")","v":""},"881204-B23",null,{"$f":"C210*627","v":0}]
[]
[null,"Optical Transceiver"]
[null,"HPE 10Gb SFP+ SR Transceiver",0,{"$f":"IF(C213=0,\"\",\"TS2L5-10OTSR\")","v":""},"455883-B21",null,{"$f":"C213*230","v":0}]
[]
[null,"HPE 10G SFP+ LR Transceiver",0,{"$f":"IF(C215=0,\"\",\"TS2L5-10OTLR\")","v":""},"455886-B21",null,{"$f":"C215*481","v":0}]
[]
[null,"Estensione di Garanzia"]
[null,"None",{"$f":"VLOOKUP($B$218,  SO_B1,2, FALSE)","v":""},{"$f":"VLOOKUP($B$218,  SO_B1, 3, FALSE)","v":""},{"$f":"VLOOKUP($B$218,  SO_B1, 5, FALSE)","v":""},{"$f":"VLOOKUP($B$218,  SO_B1, 6, FALSE)","v":""}]

{"sheet":"RACK, Accessori e Servizi","index":3,"n_rows":79,"n_cols":13,"rows_kept":79,"cut":false,"hidden":false,"merged":[[63,2,63,6],[3,12,10,12],[20,2,20,7],[0,11,1,11],[12,12,39,12],[32,2,32,7],[38,2,38,7],[39,4,39,7],[5,2,5,7],[7,2,7,7],[9,2,9,7],[14,2,14,7],[23,2,23,7],[26,2,26,7],[29,2,29,7],[17,2,17,7],[35,2,35,7]]}
[null,null,null,null,null,null,null,null,null,"TOTALE PRODOTTI CONVENZIONE",{"$f":"L15+L24+L27+L30","v":0},{"$f":"K1+K2","v":0}]
[null,null,null,null,null,null,null,null,null,"TOTALE ARTICOLI 20%",{"$f":"L33+L39+L36","v":0}]
[]
[null,null,null,null,null,null,null,null,null,null,null,null,"SERVIZI"]
[null,null,{"$f":"IF(SRV_A+SRV_B>=1,\"Servizi Specialistici\",\"\")","v":{"$error":"#NAME?"}}]
[null,null,{"$f":"IF(SRV_A+SRV_B>=1,\"Servizio Specialistico di System and Network Management per sistema opertivo Windows, erogato on site. (GG/Uomo)\",\"\")","v":{"$error":"#NAME?"}},null,null,null,null,null,null,null,{"$f":"IF(J6>=1,\"10L2-SO-WIN\",\"\")","v":""}]
[]
[null,null,{"$f":"IF(SRV_A+SRV_B>=1,\"Servizio Specialistico di System and Network Management per sistema opertivo Linux, erogato on site. (GG/Uomo)\",\"\")","v":{"$error":"#NAME?"}},null,null,null,null,null,null,null,{"$f":"IF(J8>=1,\"10L2-SO-LINUX\",\"\")","v":""}]
[]
[null,null,{"$f":"IF((SRV_A+SRV_AA+SRV_AAA+SRV_B+SRV_BB+SRV_BBB)>=5,\"Servizi specialistici sistemistici per aggiornare e prevenire malfunzionamenti. \n(Minimo 5 Server)\",\"\")","v":{"$error":"#NAME?"}},null,null,null,null,null,null,null,{"$f":"IF(J10>=1,\"10L2-SO-PREV\",\"\")","v":""}]
[]
[]
[null,null,null,null,null,null,null,null,null,null,null,null,"SERVER RACK"]
[null,null,{"$f":"IF((SRV_A+SRV_AA+SRV_AAA)>\"\",\"\",\"Rack (OpzRack)\")","v":"Rack (OpzRack)"}]
[null,null,{"$f":"IF((SRV_A+SRV_AA+SRV_AAA)>=1,\"Tecnosteel: armadio Rack 19'' 42U\",\"\")","v":""},null,null,null,null,null,null,null,{"$f":"IF(J15>=1,\"TS2L5-RACK\",\"\")","v":""},{"$f":"IF(J15>=1,504*J15,\"0\")","v":"0"}]
[]
[null,null,"PDU (OpzPDU32A)"]
[null,null,{"$f":"IF((SRV_A+SRV_AA+SRV_AAA)>=1,\"PDU Vertical 20+4 outlets C13 with MCB - IEC60309 input\",\"\")","v":""},null,null,null,null,null,null,null,{"$f":"IF(J18>=1,\"TS1-646861\",\"\")","v":""}]
[]
[null,null,"OpzPDU_TRIFASE"]
[null,null,{"$f":"IF((SRV_A+SRV_AA+SRV_AAA)>=1,\"PDU Vertical  18+6 outlets (C13+C19)  with MCB and ammeter - IEC60309 input - 3 phase\",\"\")","v":""},null,null,null,null,null,null,null,{"$f":"IF(J21>=1,\"TS1-646875\",\"\")","v":""}]
[]
[null,null,"KVM (OpzGUIRack)"]
[null,null,{"$f":"IF((SRV_A+SRV_AA+SRV_AAA)>=1,\"Tecnosteel: 1U Rackmount Console 17'' with Italian Keyboard\",\"\")","v":""},null,null,null,null,null,null,null,{"$f":"IF(J24>=1,\"TS2L5-GUI\",\"\")","v":""},{"$f":"IF(J24>=1,448*J24,\"0\")","v":"0"}]
[]
[null,null,"KVM Option (OpzSWGUIRack)"]
[null,null,{"$f":"IF((SRV_A+SRV_AA+SRV_AAA)>=1,\"Tecnosteel: 16-port remote KVM switch with one remote user\",\"\")","v":""},null,null,null,null,null,null,null,{"$f":"IF(J27>=1,\"TS2L5-KVMIP\",\"\")","v":""},{"$f":"IF(J27>=1,495*J27,\"0\")","v":"0"}]
[]
[null,null,"Uninterrupted Power Supply (OpzUPS 3000VA)"]
[null,null,{"$f":"IF((SRV_A+SRV_AA+SRV_AAA)>=1,\"Riello - UPS MSR3000EVO 3000VA 2U Rackmount (SNMP+USB+RS232)\",\"\")","v":""},null,null,null,null,null,null,null,{"$f":"IF(J30>=1,\"TS2L5-UPS\",\"\")","v":""},{"$f":"IF(J30>=1,387*J30,\"0\")","v":"0"}]
[]
[null,null,"PDU da Rack"]
[null,null,{"$f":"IF((SRV_A+SRV_AA+SRV_AAA)>=1,\"Coppia di PDU Vertical  1Ph-32A-18xC13-6xC19 - 0U Base + Kit di montaggio)\",\"\")","v":""},null,null,null,null,null,null,null,{"$f":"IF(J33>=1,\"TS2L5-PDU32A\",\"\")","v":""},{"$f":"IF(J33>=1,436*J33,\"0\")","v":"0"}]
[]
[null,null,"Armadio Rack 42U PDU Trifase"]
[null,null,{"$f":"IF((SRV_A+SRV_AA+SRV_AAA)>=1,\"Armadio Rack 42U profonità 120cm con coppia di PDU 32A trifase\",\"\")","v":""},null,null,null,null,null,null,null,{"$f":"IF(J36>=1,\"TS2L5-RACK3PH\",\"\")","v":""},{"$f":"IF(J36>=1,2177*J36,\"0\")","v":"0"}]
[]
[null,null,"Armadio Rack 42U PDU Monofase"]
[null,null,{"$f":"IF((SRV_A+SRV_AA+SRV_AAA)>=1,\"Armadio Rack 42U profonità 120cm con coppia di PDU 32A monofase\",\"\")","v":""},null,null,null,null,null,null,null,{"$f":"IF(J39>=1,\"TS2L5-RACKPDU32\",\"\")","v":""},{"$f":"IF(J39>=1,2200*J39,\"0\")","v":"0"}]
[]
[]
[null,null,null,"Totale-"]
[null,null,null,"RACK A","RACK B","RACK C","RACK D","RACK E","RACK F","RACK G","RACK H","RACK I","RACK J"]
[null,null,{"$f":"J15","v":0},{"$f":"IF(H64>0,IF(C44-H64=0,0,C44-H64),0)","v":0},{"$f":"IF(I64>0,IF(D44-I64=0,0,D44-I64),0)","v":0},0,0,0,0,{"$f":"IF(#REF!>0,IF(I44-#REF!=0,0,I44-#REF!),0)","v":{"$error":"#REF!"}},{"$f":"IF(#REF!>0,IF(J44-#REF!=0,0,J44-#REF!),0)","v":{"$error":"#REF!"}},{"$f":"IF(#REF!>0,IF(K44-#REF!=0,0,K44-#REF!),0)","v":{"$error":"#REF!"}},{"$f":"IF(#REF!>0,IF(L44-#REF!=0,0,L44-#REF!),0)","v":{"$error":"#REF!"}}]
[]
[]
[null,null,null,"Server Modello 1",null,null,{"$f":"SRV_A","v":0}]
[null,null,null,"Server Modello 2",null,null,{"$f":"SRV_AA","v":0}]
[null,null,null,"Server Modello 3",null,null,{"$f":"SRV_AAA","v":0}]
[null,null,null,"Server Modello 4",null,null,{"$f":"SRV_B","v":{"$error":"#NAME?"}}]
[null,null,null,"Server Modello 5",null,null,{"$f":"SRV_BB","v":{"$error":"#NAME?"}}]
[null,null,null,"Server Modello 6",null,null,{"$f":"SRV_BBB","v":{"$error":"#NAME?"}}]
[]
[null,null,null,null,null,null,null,{"$f":"SUM(H5:H10)+H12+H96*2+H98*2","v":0},0,0,0,0,0]
[]
[]
[]
[]
[]
[]
[]
[null,null,"Rack ancora da configurare",null,null,{"$f":"J15-H64-I64-J64-K64-L64-M64-#REF!-#REF!-#REF!-#REF!","v":{"$error":"#REF!"}}]
[]
[null,null,"Indicare il numero di rack per questa configurazione"]
[]
[null,null,null,null,"Totali","da inserire",null,{"$f":"IF(C44>0,\"RACK A\",\"\")","v":""},{"$f":"IF(D44>0,\"RACK B\",\"\")","v":""},{"$f":"IF(E44>0,\"RACK C\",\"\")","v":""},{"$f":"IF(F44>0,\"RACK D\",\"\")","v":""},{"$f":"IF(G44>0,\"RACK E\",\"\")","v":""},{"$f":"IF(H44>0,\"RACK F\",\"\")","v":""}]
[]
[null,null,{"$f":"IF(G47*$J$15>0,\"Server Lotto2 DL560 Conf.1\",\"\")","v":""},null,{"$f":"G47","v":0},{"$f":"(E68-(H68*$H$64)-(I68*$I$64)-(J68*$J$64)-(K68*$K$64)-(L68*$L$64)-(M68*$M$64)-(#REF!*#REF!)-(#REF!*#REF!)-(#REF!*#REF!)-(#REF!*#REF!))","v":{"$error":"#REF!"}}]
[null,null,{"$f":"IF(G48*$J$15>0,\"Server Lotto2 DL560 Conf.2\",\"\")","v":""},null,0,{"$f":"(E69-(H69*$H$64)-(I69*$I$64)-(J69*$J$64)-(K69*$K$64)-(L69*$L$64)-(M69*$M$64)-(#REF!*#REF!)-(#REF!*#REF!)-(#REF!*#REF!)-(#REF!*#REF!))","v":{"$error":"#REF!"}}]
[null,null,{"$f":"IF(G49*$J$15>0,\"Server Lotto2 DL560 Conf.3\",\"\")","v":""},null,0,{"$f":"(E70-(H70*$H$64)-(I70*$I$64)-(J70*$J$64)-(K70*$K$64)-(L70*$L$64)-(M70*$M$64)-(#REF!*#REF!)-(#REF!*#REF!)-(#REF!*#REF!)-(#REF!*#REF!))","v":{"$error":"#REF!"}}]
[null,null,{"$f":"IF(G50*$J$15>0,\"Server Lotto2 DL580 Conf.1\",\"\")","v":{"$error":"#NAME?"}},null,{"$error":"#NAME?"},{"$f":"(E71-(H71*$H$64)-(I71*$I$64)-(J71*$J$64)-(K71*$K$64)-(L71*$L$64)-(M71*$M$64)-(#REF!*#REF!)-(#REF!*#REF!)-(#REF!*#REF!)-(#REF!*#REF!))","v":{"$error":"#NAME?"}}]
[null,null,{"$f":"IF(G51*$J$15>0,\"Server Lotto2 DL580 Conf.2\",\"\")","v":{"$error":"#NAME?"}},null,{"$error":"#NAME?"},{"$f":"(E72-(H72*$H$64)-(I72*$I$64)-(J72*$J$64)-(K72*$K$64)-(L72*$L$64)-(M72*$M$64)-(#REF!*#REF!)-(#REF!*#REF!)-(#REF!*#REF!)-(#REF!*#REF!))","v":{"$error":"#NAME?"}}]
[null,null,{"$f":"IF(G52*$J$15>0,\"Server Lotto2 DL580 Conf.3\",\"\")","v":{"$error":"#NAME?"}},null,{"$error":"#NAME?"},{"$f":"(E73-(H73*$H$64)-(I73*$I$64)-(J73*$J$64)-(K73*$K$64)-(L73*$L$64)-(M73*$M$64)-(#REF!*#REF!)-(#REF!*#REF!)-(#REF!*#REF!)-(#REF!*#REF!))","v":{"$error":"#NAME?"}}]
[]
[null,null,{"$f":"IF(J24>0,\"OpzGUIRack Disponibili\",\" \")","v":" "},null,{"$f":"J24","v":0},{"$f":"J24-H75*H64-I75*I64-J75*J64-K75*K64-L75*L64-M75*M64-#REF!*#REF!-#REF!*#REF!-#REF!*#REF!-#REF!*#REF!","v":{"$error":"#REF!"}}]
[]
[null,null,{"$f":"IF(J27>0,\"OpzSWGUIRack Disponibili\",\" \")","v":" "},null,{"$f":"J27","v":0},{"$f":"J27-H77*H64-I77*I64-J77*J64-K77*K64-L77*L64-M77*M64-#REF!*#REF!-#REF!*#REF!-#REF!*#REF!-#REF!*#REF!","v":{"$error":"#REF!"}}]
[]
[null,null,{"$f":"IF(J39>0,\"OpzUPS 3000VA Disponibili\",\" \")","v":" "},null,{"$f":"J39","v":0},{"$f":"J39-H79*H64-I79*I64-J79*J64-K79*K64-L79*L64-M79*M64-#REF!*#REF!-#REF!*#REF!-#REF!*#REF!-#REF!*#REF!","v":{"$error":"#REF!"}}]

{"sheet":"Riepilogo","index":4,"n_rows":248,"n_cols":46,"rows_kept":248,"cut":false,"hidden":false,"merged":[[207,2,207,5],[208,2,208,5],[209,2,209,5],[196,2,196,5],[196,9,196,12],[196,16,196,19],[193,2,193,5],[193,9,193,12],[193,16,193,19],[194,2,194,5],[194,9,194,12],[194,16,194,19],[195,2,195,5],[195,9,195,12],[195,16,195,19],[200,16,200,19],[201,9,201,12],[202,9,202,12],[203,9,203,12],[204,9,204,12],[197,9,197,12],[198,9,198,12],[185,16,185,19],[186,16,186,19],[186,9,186,12],[180,16,180,19],[174,16,174,19],[175,16,175,19],[176,16,176,19],[205,2,205,5],[206,2,206,5],[190,2,190,5],[190,9,190,12],[190,16,190,19],[191,2,191,5],[191,9,191,12],[191,16,191,19],[192,2,192,5],[192,9,192,12],[192,16,192,19],[189,16,189,19],[183,16,183,19],[184,16,184,19],[145,9,145,12],[188,2,188,5],[185,9,185,12],[160,2,160,5],[160,9,160,12],[160,16,160,19],[181,2,181,5],[181,9,181,12],[181,16,181,19],[182,2,182,5],[183,2,183,5],[184,2,184,5],[182,9,182,12],[187,16,187,19],[154,9,154,12],[149,16,149,19],[157,2,157,5],[157,9,157,12],[159,2,159,5],[182,16,182,19],[170,9,170,12],[49,35,49,37],[131,16,131,19],[132,2,132,5],[132,9,132,12],[132,16,132,19],[125,3,126,18],[121,1,121,16],[129,8,129,10],[120,17,120,20],[119,1,119,16],[83,17,83,18],[83,19,83,20],[84,17,84,18],[87,19,87,20],[81,19,81,20],[85,17,85,18],[85,19,85,20],[88,6,88,8],[88,9,88,16],[87,6,87,8],[89,19,89,20],[31,9,31,16],[73,2,73,5],[73,6,73,8],[73,9,73,16],[73,17,73,18],[73,19,73,20],[97,19,97,20],[98,9,98,16],[98,17,98,18],[92,17,92,18],[92,19,92,20],[89,6,89,8],[89,9,89,16],[89,17,89,18],[93,9,93,16],[95,19,95,20],[91,17,91,18],[90,6,90,8],[97,6,97,8],[97,9,97,16],[97,17,97,18],[86,19,86,20],[83,9,83,16],[84,9,84,16],[168,2,168,5],[169,2,169,5],[161,9,161,12],[162,16,162,19],[162,9,162,12],[163,9,163,12],[103,17,103,18],[103,19,103,20],[150,9,150,12],[151,9,151,12],[152,9,152,12],[145,16,145,19],[145,2,145,5],[144,16,144,19],[149,2,149,5],[151,2,151,5],[152,2,152,5],[129,15,129,17],[131,2,131,5],[131,9,131,12],[135,9,135,12],[135,16,135,19],[117,17,117,20],[105,2,105,5],[156,2,156,5],[156,9,156,12],[156,16,156,19],[157,16,157,19],[168,16,168,19],[169,16,169,19],[179,16,179,19],[177,16,177,19],[170,16,170,19],[171,16,171,19],[159,9,159,12],[159,16,159,19],[177,2,177,5],[178,2,178,5],[161,2,161,5],[162,2,162,5],[163,2,163,5],[164,2,164,5],[177,9,177,12],[172,9,172,12],[173,9,173,12],[165,2,165,5],[166,2,166,5],[171,9,171,12],[104,17,104,18],[104,19,104,20],[135,2,135,5],[105,17,105,18],[105,19,105,20],[142,2,142,5],[143,2,143,5],[143,9,143,12],[144,9,144,12],[129,1,129,3],[118,1,118,16],[118,17,118,20],[108,19,108,20],[108,17,108,18],[106,17,106,18],[106,19,106,20],[107,17,107,18],[108,2,108,5],[108,6,108,8],[105,6,105,8],[139,9,139,12],[133,9,133,12],[140,2,140,5],[107,19,107,20],[0,17,1,20],[0,1,0,5],[1,1,1,5],[1,6,1,7],[2,1,2,5],[2,6,2,7],[3,1,3,5],[3,6,3,7],[4,1,4,7],[1,8,3,16],[0,6,0,16],[4,8,4,16],[22,19,22,20],[25,2,25,5],[25,6,25,8],[172,2,172,5],[173,2,173,5],[174,2,174,5],[175,2,175,5],[176,2,176,5],[23,2,23,5],[23,6,23,8],[23,9,23,16],[26,6,26,8],[26,9,26,16],[26,17,26,18],[26,2,26,5],[33,9,33,16],[27,2,27,5],[27,6,27,8],[27,9,27,16],[27,17,27,18],[28,2,28,5],[28,6,28,8],[29,9,29,16],[94,2,94,5],[25,19,25,20],[14,2,14,5],[5,1,5,5],[5,6,5,7],[7,1,7,3],[7,4,7,8],[7,9,7,10],[7,11,7,14],[9,4,9,8],[9,9,9,10],[9,11,9,14],[16,2,16,5],[16,6,16,8],[16,9,16,16],[9,1,9,3],[12,2,12,5],[12,6,12,8],[12,9,12,16],[12,17,12,18],[13,1,13,20],[12,19,12,20],[15,19,15,20],[11,1,11,20],[24,19,24,20],[22,6,22,8],[18,2,18,5],[18,6,18,8],[18,9,18,16],[19,2,19,5],[21,6,21,8],[21,9,21,16],[22,2,22,5],[21,17,21,18],[16,19,16,20],[14,17,14,18],[14,19,14,20],[15,2,15,5],[15,6,15,8],[15,9,15,16],[15,17,15,18],[17,19,17,20],[20,19,20,20],[17,2,17,5],[17,6,17,8],[17,9,17,16],[19,6,19,8],[19,9,19,16],[19,17,19,18],[19,19,19,20],[18,17,18,18],[18,19,18,20],[16,17,16,18],[17,17,17,18],[14,6,14,8],[14,9,14,16],[21,19,21,20],[20,2,20,5],[20,6,20,8],[20,9,20,16],[20,17,20,18],[21,2,21,5],[24,17,24,18],[22,9,22,16],[32,2,32,5],[32,6,32,8],[32,9,32,16],[22,17,22,18],[24,2,24,5],[24,6,24,8],[24,9,24,16],[28,9,28,16],[28,17,28,18],[23,17,23,18],[25,9,25,16],[25,17,25,18],[26,19,26,20],[32,19,32,20],[27,19,27,20],[31,2,31,5],[29,17,29,18],[30,2,30,5],[30,6,30,8],[30,9,30,16],[30,17,30,18],[41,9,41,16],[37,9,37,16],[34,1,34,20],[39,2,39,5],[38,9,38,16],[38,17,38,18],[39,6,39,8],[39,9,39,16],[39,17,39,18],[37,17,37,18],[41,17,41,18],[41,2,41,5],[41,6,41,8],[29,19,29,20],[31,17,31,18],[30,19,30,20],[33,19,33,20],[33,17,33,18],[31,6,31,8],[28,19,28,20],[29,2,29,5],[29,6,29,8],[35,19,35,20],[40,2,40,5],[40,6,40,8],[40,9,40,16],[40,17,40,18],[40,19,40,20],[35,2,35,5],[35,6,35,8],[35,9,35,16],[35,17,35,18],[37,19,37,20],[36,17,36,18],[36,19,36,20],[37,2,37,5],[37,6,37,8],[38,2,38,5],[38,6,38,8],[33,2,33,5],[33,6,33,8],[32,17,32,18],[31,19,31,20],[236,14,236,15],[236,16,236,17],[236,18,236,19],[236,2,236,3],[236,4,236,5],[236,6,236,7],[236,8,236,9],[236,10,236,11],[236,12,236,13],[216,8,216,10],[216,1,216,3],[216,15,216,17],[141,16,141,19],[142,16,142,19],[143,16,143,19],[146,16,146,19],[136,9,136,12],[136,16,136,19],[138,2,138,5],[139,16,139,19],[140,16,140,19],[179,2,179,5],[180,2,180,5],[174,9,174,12],[175,9,175,12],[176,9,176,12],[178,16,178,19],[178,9,178,12],[179,9,179,12],[180,9,180,12],[170,2,170,5],[171,2,171,5],[161,16,161,19],[218,1,234,5],[218,8,234,12],[218,15,234,19],[243,2,246,7],[243,14,246,19],[36,2,36,5],[36,6,36,8],[36,9,36,16],[39,19,39,20],[45,19,45,20],[41,19,41,20],[43,2,43,5],[43,6,43,8],[43,9,43,16],[43,17,43,18],[43,19,43,20],[137,2,137,5],[137,9,137,12],[137,16,137,19],[48,19,48,20],[49,17,49,18],[49,19,49,20],[119,17,119,20],[51,2,51,5],[239,3,240,18],[242,2,242,7],[242,14,242,19],[23,19,23,20],[153,16,153,19],[149,9,149,12],[153,9,153,12],[155,9,155,12],[155,16,155,19],[154,2,154,5],[155,2,155,5],[154,16,154,19],[150,16,150,19],[151,16,151,19],[152,16,152,19],[153,2,153,5],[150,2,150,5],[44,6,44,8],[38,19,38,20],[55,19,55,20],[81,17,81,18],[146,9,146,12],[144,2,144,5],[146,2,146,5],[75,19,75,20],[80,19,80,20],[77,17,77,18],[77,19,77,20],[82,17,82,18],[82,19,82,20],[46,17,46,18],[51,19,51,20],[52,17,52,18],[52,19,52,20],[48,17,48,18],[47,19,47,20],[57,19,57,20],[58,17,58,18],[58,19,58,20],[59,17,59,18],[59,19,59,20],[60,17,60,18],[60,19,60,20],[55,2,55,5],[55,6,55,8],[55,9,55,16],[55,17,55,18],[48,2,48,5],[48,6,48,8],[48,9,48,16],[47,9,47,16],[47,17,47,18],[50,1,50,20],[51,6,51,8],[51,9,51,16],[51,17,51,18],[46,2,46,5],[46,6,46,8],[46,9,46,16],[74,2,74,5],[74,6,74,8],[74,9,74,16],[49,2,49,5],[49,6,49,8],[49,9,49,16],[70,2,70,5],[70,6,70,8],[52,2,52,5],[52,6,52,8],[52,9,52,16],[71,9,71,16],[58,2,58,5],[58,6,58,8],[58,9,58,16],[59,2,59,5],[59,6,59,8],[59,9,59,16],[60,2,60,5],[60,6,60,8],[60,9,60,16],[44,17,44,18],[79,17,79,18],[79,19,79,20],[80,2,80,5],[80,6,80,8],[80,9,80,16],[80,17,80,18],[44,19,44,20],[46,19,46,20],[45,2,45,5],[45,6,45,8],[45,9,45,16],[45,17,45,18],[47,2,47,5],[47,6,47,8],[78,9,78,16],[78,17,78,18],[78,19,78,20],[79,9,79,16],[79,2,79,5],[79,6,79,8],[71,17,71,18],[71,2,71,5],[71,6,71,8],[100,17,100,18],[100,19,100,20],[96,19,96,20],[98,19,98,20],[99,19,99,20],[44,2,44,5],[44,9,44,16],[76,2,76,5],[78,2,78,5],[85,6,85,8],[77,6,77,8],[77,9,77,16],[75,2,75,5],[75,6,75,8],[75,9,75,16],[82,2,82,5],[82,9,82,16],[81,2,81,5],[83,2,83,5],[81,6,81,8],[85,9,85,16],[82,6,82,8],[83,6,83,8],[84,2,84,5],[93,17,93,18],[95,17,95,18],[94,17,94,18],[96,17,96,18],[90,17,90,18],[70,9,70,16],[70,17,70,18],[70,19,70,20],[102,6,102,8],[102,9,102,16],[72,9,72,16],[72,17,72,18],[72,19,72,20],[88,19,88,20],[99,6,99,8],[99,9,99,16],[101,17,101,18],[101,19,101,20],[100,6,100,8],[71,19,71,20],[99,17,99,18],[91,19,91,20],[93,19,93,20],[94,19,94,20],[85,2,85,5],[88,2,88,5],[86,6,86,8],[88,17,88,18],[84,6,84,8],[78,6,78,8],[74,17,74,18],[75,17,75,18],[81,9,81,16],[87,9,87,16],[87,17,87,18],[72,2,72,5],[72,6,72,8],[134,9,134,12],[134,16,134,19],[141,2,141,5],[94,9,94,16],[95,2,95,5],[96,6,96,8],[133,16,133,19],[133,2,133,5],[141,9,141,12],[138,16,138,19],[101,2,101,5],[74,19,74,20],[76,6,76,8],[84,19,84,20],[86,9,86,16],[86,17,86,18],[103,2,103,5],[103,6,103,8],[103,9,103,16],[92,2,92,5],[77,2,77,5],[86,2,86,5],[92,9,92,16],[108,9,108,16],[106,2,106,5],[106,6,106,8],[106,9,106,16],[107,2,107,5],[107,6,107,8],[107,9,107,16],[102,2,102,5],[99,2,99,5],[100,2,100,5],[105,9,105,16],[100,9,100,16],[101,6,101,8],[101,9,101,16],[104,2,104,5],[104,6,104,8],[104,9,104,16],[7,16,7,20],[9,16,9,20],[158,2,158,5],[158,9,158,12],[158,16,158,19],[42,2,42,5],[42,6,42,8],[42,9,42,16],[42,17,42,18],[42,19,42,20],[121,17,121,20],[102,17,102,18],[102,19,102,20],[120,1,120,16],[117,1,117,16],[76,9,76,16],[76,17,76,18],[76,19,76,20],[87,2,87,5],[89,2,89,5],[91,2,91,5],[91,6,91,8],[91,9,91,16],[96,2,96,5],[56,2,56,5],[56,6,56,8],[56,9,56,16],[56,17,56,18],[56,19,56,20],[57,2,57,5],[57,6,57,8],[57,9,57,16],[57,17,57,18],[53,2,53,5],[53,6,53,8],[53,9,53,16],[53,17,53,18],[53,19,53,20],[54,2,54,5],[54,6,54,8],[54,9,54,16],[54,17,54,18],[54,19,54,20],[61,2,61,5],[61,6,61,8],[61,9,61,16],[61,17,61,18],[61,19,61,20],[62,2,62,5],[62,6,62,8],[62,9,62,16],[62,17,62,18],[62,19,62,20],[63,2,63,5],[63,6,63,8],[63,9,63,16],[63,17,63,18],[63,19,63,20],[64,2,64,5],[64,6,64,8],[64,9,64,16],[64,17,64,18],[64,19,64,20],[65,2,65,5],[65,6,65,8],[65,9,65,16],[65,17,65,18],[65,19,65,20],[66,2,66,5],[66,6,66,8],[66,9,66,16],[66,17,66,18],[66,19,66,20],[67,2,67,5],[67,6,67,8],[67,9,67,16],[67,17,67,18],[67,19,67,20],[68,2,68,5],[68,6,68,8],[68,9,68,16],[68,17,68,18],[68,19,68,20],[69,2,69,5],[69,6,69,8],[69,9,69,16],[69,17,69,18],[69,19,69,20],[90,19,90,20],[109,19,109,20],[110,2,110,5],[110,6,110,8],[110,9,110,16],[110,17,110,18],[110,19,110,20],[98,2,98,5],[98,6,98,8],[93,2,93,5],[93,6,93,8],[94,6,94,8],[90,2,90,5],[97,2,97,5],[95,6,95,8],[95,9,95,16],[96,9,96,16],[90,9,90,16],[92,6,92,8],[163,16,163,19],[164,16,164,19],[165,16,165,19],[166,16,166,19],[167,16,167,19],[172,16,172,19],[173,16,173,19],[115,2,115,5],[115,6,115,8],[115,9,115,16],[148,9,148,12],[147,2,147,5],[147,9,147,12],[138,9,138,12],[139,2,139,5],[148,16,148,19],[142,9,142,12],[134,2,134,5],[140,9,140,12],[136,2,136,5],[147,16,147,19],[164,9,164,12],[165,9,165,12],[148,2,148,5],[114,9,114,16],[114,17,114,18],[114,19,114,20],[111,2,111,5],[111,6,111,8],[111,9,111,16],[111,17,111,18],[111,19,111,20],[112,2,112,5],[112,6,112,8],[112,9,112,16],[112,17,112,18],[112,19,112,20],[113,2,113,5],[113,6,113,8],[113,9,113,16],[113,17,113,18],[113,19,113,20],[214,9,214,12],[210,2,210,5],[211,2,211,5],[212,2,212,5],[213,2,213,5],[214,2,214,5],[166,9,166,12],[167,9,167,12],[168,9,168,12],[169,9,169,12],[167,2,167,5],[185,2,185,5],[197,2,197,5],[198,2,198,5],[199,2,199,5],[200,2,200,5],[186,2,186,5],[187,2,187,5],[187,9,187,12],[188,9,188,12],[183,9,183,12],[184,9,184,12],[189,2,189,5],[189,9,189,12],[201,2,201,5],[202,2,202,5],[203,2,203,5],[204,2,204,5],[205,9,205,12],[210,16,210,19],[211,16,211,19],[109,2,109,5],[109,6,109,8],[109,9,109,16],[109,17,109,18],[188,16,188,19],[197,16,197,19],[198,16,198,19],[199,16,199,19],[115,17,115,18],[115,19,115,20],[116,2,116,5],[116,6,116,8],[116,9,116,16],[116,17,116,18],[116,19,116,20],[114,2,114,5],[114,6,114,8],[206,9,206,12],[207,9,207,12],[208,9,208,12],[209,9,209,12],[210,9,210,12],[211,9,211,12],[212,9,212,12],[213,9,213,12],[199,9,199,12],[200,9,200,12],[214,16,214,19],[201,16,201,19],[202,16,202,19],[203,16,203,19],[204,16,204,19],[205,16,205,19],[206,16,206,19],[207,16,207,19],[208,16,208,19],[209,16,209,19],[212,16,212,19],[213,16,213,19]]}
[null,"Amministrazione ",null,null,null,null,null,null,null,null,null,null,null,null,null,null,null,"CONFIGURATORE ELETTRONICO TECNOLOGIE SERVER 2 LOTTO 5",null,null,null,1,null,"Server1","Server2","Server3"]
[null,"N° Identificativo Ordine ",null,null,null,null,null,null,{"$f":"IF(AA2>0,\"ERRORE DI CONFIGURAZIONE\",IF(Y13>0,\"ERRORE DI MANCATA COMPILAZIONE DATI NECESSARI PER L'ORDINATIVO\",\"Configurazione OK\"))","v":"ERRORE DI MANCATA COMPILAZIONE DATI NECESSARI PER L'ORDINATIVO"},null,null,null,null,null,null,null,null,null,null,null,null,1,"Errore",{"$f":"IF('Lotto5 DL560 Gen10 1'!H1=\"ERRORE VERIFICARE LA CONFIGURAZIONE\",1,0)","v":0},{"$f":"IF('Lotto5 DL560 Gen10 2'!H1=\"ERRORE VERIFICARE LA CONFIGURAZIONE\",1,0)","v":0},{"$f":"IF('Lotto5 DL560 Gen10 3'!H1=\"ERRORE VERIFICARE LA CONFIGURAZIONE\",1,0)","v":0},{"$f":"SUM(X2:Z2)","v":0},null,null,{"$f":"IF('Lotto5 DL560 Gen10 1'!N1=\"ERRORE VERIFICARE LA CONFIGURAZIONE\",1,0)","v":0}]
[null,"Data Ordine",null,null,null,null,null,null,null,null,null,null,null,null,null,null,null,null,null,null,null,1,"Dati non compilati","Amministrazione ",{"$f":"IF(G1>0,0,1)","v":1}]
[null,"Tot Ordine Portale CONSIP IVA incl.",null,null,null,null,{"$f":"R122","v":0},null,null,null,null,null,null,null,null,null,null,null,null,null,"Nel \"Tot Ordine Portale CONSIP\" deve essere inserito l'importo totale risultante dall'ordinativo del portale CONSIP.\nQualora l'importo inserito corrisponde al valore ricalcolato dal configuratore viene attivato il pulsante \"Salva in formato PDF\" che permette di generare il file pdf da allegare all'ordinativo.",1,null,"N° Identificativo Ordine ",{"$f":"IF(G2>0,0,1)","v":1}]
[null,"LE CELLE IN GIALLO DEVO ESSERE COMPILATE OBBLIGATORIAMENTE",null,null,null,null,null,null,{"$f":"IF(AA2>0,\"\",IF(Y13>0,\"\",\"Cliccare il pulsante --------------> \nper generare il PDF da allegare\"))","v":""},null,null,null,null,null,null,null,null,null,null,null,null,1,null,"Data Ordine",{"$f":"IF(G3>0,0,1)","v":1}]
[null,"Quantità Server Ordinati",null,null,null,null,{"$f":"IF(B15=\"\",0,B15)","v":0},null,null,null,null,null,null,null,null,null,null,null,null,"ver. 3.3",null,1,null,"Tot Ordine Portale CONSIP IVA incl.",{"$f":"IF(G4>0,0,1)","v":1}]
[null,null,null,null,null,null,null,null,null,null,null,null,null,null,null,null,null,null,null,null,null,1,null,"Referente per la Consegna",{"$f":"IF(E8>0,0,1)","v":1}]
[null,"Referente per la Consegna",null,null,null,null,null,null,null,"Telefono",null,null,null,null,null,"email",null,null,null,null,null,1,null,"Telefono",{"$f":"IF(L8>0,0,1)","v":1}]
[null,null,null,null,null,null,null,null,null,null,null,null,null,null,null,null,null,null,null,null,null,1,null,"email",{"$f":"IF(Q8>0,0,1)","v":1}]
[null,"Referente per l'installazione",null,null,null,null,null,null,null,"Telefono",null,null,null,null,null,"email",null,null,null,null,null,1,null,"Referente per l'installazione",{"$f":"IF(E10>0,0,1)","v":1}]
[null,null,null,null,null,null,null,null,null,null,null,null,null,null,null,null,null,null,null,null,null,1,null,"Telefono",{"$f":"IF(L10>0,0,1)","v":1}]
[null,"ATTENZIONE: I CODICI PRODOTTO DELL'ORDINE DEVONO ESSERE SPECULARI A QUELLI GENERATI DAL CONFIGURATORE.",null,null,null,null,null,null,null,null,null,null,null,null,null,null,null,null,null,null,null,1,null,"email",{"$f":"IF(Q10>0,0,1)","v":1}]
[null,"Qtà Ordinata","CODICE ARTICOLO PRODUTTORE",null,null,null,"CODICE ARTICOLO CONVENZIONE",null,null,"Descrizione Sintetica \n(si faccia riferimento alla guida alla convenzione per la descrizione estesa e \nper le regole di acquisto delle opzioni)",null,null,null,null,null,null,null,"Costo Unitario",null,"Costo Complessivo",null,1,null,null,{"$f":"SUM(Y3:Y12)","v":10},null,{"$f":"Y13+AA2","v":10},{"$f":"IF(AA13=0,\"_SavePDFon\",\"_SavePDFoff\")","v":"_SavePDFoff"}]
[null,"SERVER PRESTAZIONALE (HPE PROLIANT DL560 Gen10)",null,null,null,null,null,null,null,null,null,null,null,null,null,null,null,null,null,null,null,{"$f":"IF(B15>=\"\",0,1)","v":0},"DL560","Server1","Server2","Server3"]
[null,{"$f":"IF(AE15>=1,AE15,\"\")","v":""},{"$f":"IF(AE15>0,(VLOOKUP(G15,COD_A,2,FALSE)),\"\")","v":""},null,null,null,{"$f":"IF(AE15>=1,W15,\"\")","v":""},null,null,{"$f":"IF(AE15>0,(VLOOKUP(G15,COD_A,5,FALSE)),\"\")","v":""},null,null,null,null,null,null,null,{"$f":"IF(AE15>0,(VLOOKUP(G15,COD_A,3,FALSE)),\"\")","v":""},null,{"$f":"IF(B15=\"\",\"\",R15*B15)","v":""},null,{"$f":"IF(B15>=\"\",0,1)","v":0},"TS2L5-SRV-U",{"$f":"SRV_A","v":0},{"$f":"SRV_AA","v":0},{"$f":"SRV_AAA","v":0},null,null,null,null,{"$f":"SUM(X15:AD15)","v":0}]
[null,{"$f":"IF(AE16>=1,AE16,\"\")","v":""},"",null,null,null,{"$f":"IF(AE16>=1,W16,\"\")","v":""},null,null,"",null,null,null,null,null,null,null,"",null,{"$f":"IF(B16=\"\",\"\",R16*B16)","v":""},null,{"$f":"IF(B16>=\"\",0,1)","v":0},"TS2L5-CPU-U",{"$f":"'Lotto5 DL560 Gen10 1'!$C$30/2*$X$15","v":0},{"$f":"'Lotto5 DL560 Gen10 2'!$C$30/2*$Y$15","v":0},{"$f":"'Lotto5 DL560 Gen10 3'!$C$30/2*$Z$15","v":0},null,null,null,null,{"$f":"SUM(X16:AD16)","v":0}]
[null,{"$f":"IF(AE17>=1,AE17,\"\")","v":""},{"$f":"IF(AE17=0,\"\",(VLOOKUP(G17,Codici!B:F,5,FALSE)))","v":""},null,null,null,{"$f":"IF(AE17>=1,W17,\"\")","v":""},null,null,{"$f":"IF(AE17>0,(VLOOKUP(G17,Codici!B:F,4,FALSE)),\"\")","v":""},null,null,null,null,null,null,null,{"$f":"IF(AE17>0,(VLOOKUP(G17,Codici!B:F,2,FALSE)),\"\")","v":""},null,{"$f":"IF(B17=\"\",\"\",R17*B17)","v":""},null,0,"TS2L5-RAM32-U",{"$f":"IF(MEM_A=\"\",0,(MEM_A-4)*$X$15)","v":0},{"$f":"IF(MEM_AA=\"\",0,(MEM_AA-4)*$Y$15)","v":0},{"$f":"IF(MEM_AAA=\"\",0,(MEM_AAA-4)*$Z$15)","v":0},null,null,null,null,0]
[null,"",{"$f":"IF(AE18=0,\"\",(VLOOKUP(G18,Codici!B:F,5,FALSE)))","v":""},null,null,null,"",null,null,{"$f":"IF(AE18>0,(VLOOKUP(G18,Codici!B:F,4,FALSE)),\"\")","v":""},null,null,null,null,null,null,null,{"$f":"IF(AE18>0,(VLOOKUP(G18,Codici!B:F,2,FALSE)),\"\")","v":""},null,"",null,0,"TS2L5-RAM64-U",{"$f":"IF(MEM_A32=\"\",0,MEM_A32*$X$15)","v":0},{"$f":"IF(MEM_AA32=\"\",0,MEM_AA32*$Y$15)","v":0},{"$f":"IF(MEM_AAA32=\"\",0,MEM_AAA32*$Z$15)","v":0},null,null,null,null,0]
[null,"",{"$f":"IF(AE19=0,\"\",(VLOOKUP(G19,Codici!B:F,5,FALSE)))","v":""},null,null,null,"",null,null,{"$f":"IF(AE19>0,(VLOOKUP(G19,Codici!B:F,4,FALSE)),\"\")","v":""},null,null,null,null,null,null,null,{"$f":"IF(AE19>0,(VLOOKUP(G19,Codici!B:F,2,FALSE)),\"\")","v":""},null,"",null,0,null,null,null,null,null,null,null,null,0,null,null,"slot1",{"$f":"'Lotto5 DL560 Gen10 1'!$D$155","v":""},{"$f":"'Lotto5 DL560 Gen10 2'!$D$155","v":""},{"$f":"'Lotto5 DL560 Gen10 3'!$D$155","v":""}]
[null,"",{"$f":"IF(AE20=0,\"\",(VLOOKUP(G20,Codici!B:F,5,FALSE)))","v":""},null,null,null,"",null,null,{"$f":"IF(AE20>0,(VLOOKUP(G20,Codici!B:F,4,FALSE)),\"\")","v":""},null,null,null,null,null,null,null,{"$f":"IF(AE20>0,(VLOOKUP(G20,Codici!B:F,2,FALSE)),\"\")","v":""},null,"",null,0,"TS2L5-LAN1",{"$f":"COUNTIF($AI$19:$AI$26,W20)*$X$15","v":0},{"$f":"COUNTIF($AJ$19:$AJ$26,W20)*$Y$15","v":0},{"$f":"COUNTIF($AK$19:$AK$26,W20)*$Z$15","v":0},null,null,null,null,0,null,null,"slot2",{"$f":"'Lotto5 DL560 Gen10 1'!$D$158","v":""},{"$f":"'Lotto5 DL560 Gen10 2'!$D$158","v":""},{"$f":"'Lotto5 DL560 Gen10 3'!$D$158","v":""}]
[null,"",{"$f":"IF(AE21=0,\"\",(VLOOKUP(G21,Codici!B:F,5,FALSE)))","v":""},null,null,null,"",null,null,{"$f":"IF(AE21>0,(VLOOKUP(G21,Codici!B:F,4,FALSE)),\"\")","v":""},null,null,null,null,null,null,null,{"$f":"IF(AE21>0,(VLOOKUP(G21,Codici!B:F,2,FALSE)),\"\")","v":""},null,"",null,0,null,{"$f":"COUNTIF($AI$19:$AI$26,W21)*$X$15","v":0},{"$f":"COUNTIF($AJ$19:$AJ$26,W21)*$Y$15","v":0},{"$f":"COUNTIF($AK$19:$AK$26,W21)*$Z$15","v":0},null,null,null,null,0,null,null,"slot3",{"$f":"'Lotto5 DL560 Gen10 1'!$D$161","v":""},{"$f":"'Lotto5 DL560 Gen10 2'!$D$161","v":""},{"$f":"'Lotto5 DL560 Gen10 3'!$D$161","v":""}]
[null,"",{"$f":"IF(AE22=0,\"\",(VLOOKUP(G22,Codici!B:F,5,FALSE)))","v":""},null,null,null,"",null,null,{"$f":"IF(AE22>0,(VLOOKUP(G22,Codici!B:F,4,FALSE)),\"\")","v":""},null,null,null,null,null,null,null,{"$f":"IF(AE22>0,(VLOOKUP(G22,Codici!B:F,2,FALSE)),\"\")","v":""},null,"",null,0,"TS2L5-LAN10",0,0,0,null,null,null,null,0,null,null,"slot4",{"$f":"'Lotto5 DL560 Gen10 1'!$D$164","v":""},{"$f":"'Lotto5 DL560 Gen10 2'!$D$164","v":""},{"$f":"'Lotto5 DL560 Gen10 3'!$D$164","v":""}]
[null,"",{"$f":"IF(AE23=0,\"\",(VLOOKUP(G23,Codici!B:F,5,FALSE)))","v":""},null,null,null,"",null,null,{"$f":"IF(AE23>0,(VLOOKUP(G23,Codici!B:F,4,FALSE)),\"\")","v":""},null,null,null,null,null,null,null,{"$f":"IF(AE23>0,(VLOOKUP(G23,Codici!B:F,2,FALSE)),\"\")","v":""},null,"",null,0,null,0,0,0,null,null,null,null,0,null,null,"slot5",{"$f":"'Lotto5 DL560 Gen10 1'!$D$167","v":""},{"$f":"'Lotto5 DL560 Gen10 2'!$D$167","v":""},{"$f":"'Lotto5 DL560 Gen10 3'!$D$167","v":""}]
[null,"",{"$f":"IF(AE24=0,\"\",(VLOOKUP(G24,Codici!B:F,5,FALSE)))","v":""},null,null,null,"",null,null,{"$f":"IF(AE24>0,(VLOOKUP(G24,Codici!B:F,4,FALSE)),\"\")","v":""},null,null,null,null,null,null,null,{"$f":"IF(AE24>0,(VLOOKUP(G24,Codici!B:F,2,FALSE)),\"\")","v":""},null,"",null,0,"TS2L5-CNA10",0,0,0,null,null,null,null,0,null,null,"slot6",{"$f":"'Lotto5 DL560 Gen10 1'!$D$170","v":""},{"$f":"'Lotto5 DL560 Gen10 2'!$D$170","v":""},{"$f":"'Lotto5 DL560 Gen10 3'!$D$170","v":""}]
[null,{"$f":"IF(AE25>=1,AE25,\"\")","v":""},{"$f":"IF(AE25=0,\"\",(VLOOKUP(G25,Codici!B:F,5,FALSE)))","v":""},null,null,null,{"$f":"IF(AE25>=1,W25,\"\")","v":""},null,null,{"$f":"IF(AE25>0,(VLOOKUP(G25,Codici!B:F,4,FALSE)),\"\")","v":""},null,null,null,null,null,null,null,{"$f":"IF(AE25>0,(VLOOKUP(G25,Codici!B:F,2,FALSE)),\"\")","v":""},null,{"$f":"IF(B25=\"\",\"\",R25*B25)","v":""},null,0,null,{"$f":"COUNTIF($AI$19:$AI$26,W25)*$X$15","v":0},{"$f":"COUNTIF($AJ$19:$AJ$26,W25)*$Y$15","v":0},{"$f":"COUNTIF($AK$19:$AK$26,W25)*$Z$15","v":0},null,null,null,null,{"$f":"SUM(X25:AD25)","v":0},null,null,"slot7",{"$f":"'Lotto5 DL560 Gen10 1'!$D$173","v":""},{"$f":"'Lotto5 DL560 Gen10 2'!$D$173","v":""},{"$f":"'Lotto5 DL560 Gen10 3'!$D$173","v":""}]
[null,{"$f":"IF(AE26>=1,AE26,\"\")","v":""},{"$f":"IF(AE26=0,\"\",(VLOOKUP(G26,Codici!B:F,5,FALSE)))","v":""},null,null,null,{"$f":"IF(AE26>=1,W26,\"\")","v":""},null,null,{"$f":"IF(AE26>0,(VLOOKUP(G26,Codici!B:F,4,FALSE)),\"\")","v":""},null,null,null,null,null,null,null,{"$f":"IF(AE26>0,(VLOOKUP(G26,Codici!B:F,2,FALSE)),\"\")","v":""},null,"",null,0,"TS2L5-FC16",0,0,0,null,null,null,null,0,null,null,"slot8",{"$f":"'Lotto5 DL560 Gen10 1'!$D$176","v":""},{"$f":"'Lotto5 DL560 Gen10 2'!$D$176","v":""},{"$f":"'Lotto5 DL560 Gen10 3'!$D$176","v":""}]
[null,"",{"$f":"IF(AE27=0,\"\",(VLOOKUP(G27,Codici!B:F,5,FALSE)))","v":""},null,null,null,"",null,null,{"$f":"IF(AE27>0,(VLOOKUP(G27,Codici!B:F,4,FALSE)),\"\")","v":""},null,null,null,null,null,null,null,{"$f":"IF(AE27>0,(VLOOKUP(G27,Codici!B:F,2,FALSE)),\"\")","v":""},null,"",null,0,"TS2L5-15K300",{"$f":"IF('Lotto5 DL560 Gen10 1'!$C$84>=1,('Lotto5 DL560 Gen10 1'!$C$84-2))*$X$15","v":0},{"$f":"IF('Lotto5 DL560 Gen10 2'!$C$84>=1,('Lotto5 DL560 Gen10 2'!$C$84-2))*$Y$15","v":0},{"$f":"IF('Lotto5 DL560 Gen10 3'!$C$84>=1,('Lotto5 DL560 Gen10 3'!$C$84-2))*$Z$15","v":0},null,null,null,null,0]
[null,"",{"$f":"IF(AE28=0,\"\",(VLOOKUP(G28,Codici!B:F,5,FALSE)))","v":""},null,null,null,"",null,null,{"$f":"IF(AE28>0,(VLOOKUP(G28,Codici!B:F,4,FALSE)),\"\")","v":""},null,null,null,null,null,null,null,{"$f":"IF(AE28>0,(VLOOKUP(G28,Codici!B:F,2,FALSE)),\"\")","v":""},null,"",null,0,"TS2L5-10K1200",{"$f":"'Lotto5 DL560 Gen10 1'!$C$86*$X$15","v":0},{"$f":"'Lotto5 DL560 Gen10 2'!$C$86*$Y$15","v":0},{"$f":"'Lotto5 DL560 Gen10 3'!$C$86*$Z$15","v":0},null,null,null,null,0]
[null,"",{"$f":"IF(AE29=0,\"\",(VLOOKUP(G29,Codici!B:F,5,FALSE)))","v":""},null,null,null,{"$f":"IF(AT29>0,W29,\"\")","v":""},null,null,{"$f":"IF(AE29>0,(VLOOKUP(G29,Codici!B:F,4,FALSE)),\"\")","v":""},null,null,null,null,null,null,null,{"$f":"IF(AE29>0,(VLOOKUP(G29,Codici!B:F,2,FALSE)),\"\")","v":""},null,{"$f":"IF(B29=\"\",\"\",R29*B29)","v":""},null,0,"TS2L5-10K1800",{"$f":"'Lotto5 DL560 Gen10 1'!$C$88*$X$15","v":0},{"$f":"'Lotto5 DL560 Gen10 2'!$C$88*$Y$15","v":0},{"$f":"'Lotto5 DL560 Gen10 3'!$C$88*$Z$15","v":0},null,null,null,null,0,null,{"$f":"SUM(X29:Z29)","v":0},{"$f":"SUM(AA29:AC29)","v":0},{"$f":"SUM(AD29:AF29)","v":0},{"$f":"X29*$X$15","v":0},{"$f":"Y29*$Y$15","v":0},{"$f":"Z29*$Z$15","v":0},{"$f":"AA29*$X$36","v":0},{"$f":"AB29*$Y$36","v":0},{"$f":"AC29*$Z$36","v":0},{"$f":"AD29*$X$56","v":0},{"$f":"AE29*$Y$56","v":0},{"$f":"AF29*$Z$56","v":0},null,{"$f":"SUM(AJ29:AS29)","v":0}]
[null,"",{"$f":"IF(AE30=0,\"\",(VLOOKUP(G30,Codici!B:F,5,FALSE)))","v":""},null,null,null,{"$f":"IF(AT30>0,W30,\"\")","v":""},null,null,{"$f":"IF(AE30>0,(VLOOKUP(G30,Codici!B:F,4,FALSE)),\"\")","v":""},null,null,null,null,null,null,null,{"$f":"IF(AE30>0,(VLOOKUP(G30,Codici!B:F,2,FALSE)),\"\")","v":""},null,{"$f":"IF(B30=\"\",\"\",R30*B30)","v":""},null,0,"TS2L5-SSDR960",{"$f":"'Lotto5 DL560 Gen10 1'!$C$99*$X$15","v":0},{"$f":"'Lotto5 DL560 Gen10 2'!$C$99*$Y$15","v":0},{"$f":"'Lotto5 DL560 Gen10 3'!$C$99*$Z$15","v":0},null,null,null,null,0,null,0,0,{"$f":"SUM(AD30:AF30)","v":0},0,0,0,{"$f":"AA30*$X$36","v":0},{"$f":"AB30*$Y$36","v":0},{"$f":"AC30*$Z$36","v":0},{"$f":"AD30*$X$56","v":0},{"$f":"AE30*$Y$56","v":0},{"$f":"AF30*$Z$56","v":0},null,{"$f":"SUM(AJ30:AS30)","v":0}]
[null,"",{"$f":"IF(AE31=0,\"\",(VLOOKUP(G31,Codici!B:F,5,FALSE)))","v":""},null,null,null,{"$f":"IF(AE31>=1,W31,\"\")","v":""},null,null,{"$f":"IF(AE31>0,(VLOOKUP(G31,Codici!B:F,4,FALSE)),\"\")","v":""},null,null,null,null,null,null,null,{"$f":"IF(AE31>0,(VLOOKUP(G31,Codici!B:F,2,FALSE)),\"\")","v":""},null,"",null,0,"TS2L5-SSDR1920",{"$f":"'Lotto5 DL560 Gen10 1'!$C$101*$X$15","v":0},{"$f":"'Lotto5 DL560 Gen10 2'!$C$101*$Y$15","v":0},{"$f":"'Lotto5 DL560 Gen10 3'!$C$101*$Z$15","v":0},null,null,null,null,{"$f":"SUM(X31:AD31)","v":0}]
[null,"",{"$f":"IF(AE32=0,\"\",(VLOOKUP(G32,Codici!B:F,5,FALSE)))","v":""},null,null,null,"",null,null,{"$f":"IF(AE32>0,(VLOOKUP(G32,Codici!B:F,4,FALSE)),\"\")","v":""},null,null,null,null,null,null,null,{"$f":"IF(AE32>0,(VLOOKUP(G32,Codici!B:F,2,FALSE)),\"\")","v":""},null,"",null,0,"TS2L5-4Y",{"$f":"IF('Lotto5 DL560 Gen10 1'!$D$218=W32,('Lotto5 DL560 Gen10 1'!$C$218)*$X$15,0)","v":0},{"$f":"IF('Lotto5 DL560 Gen10 2'!$D$218=W32,('Lotto5 DL560 Gen10 2'!$C$218)*$Y$15,0)","v":0},{"$f":"IF('Lotto5 DL560 Gen10 3'!$D$218=W32,('Lotto5 DL560 Gen10 3'!$C$218)*$Z$15,0)","v":0},null,null,null,null,0]
[null,"",{"$f":"IF(AE33=0,\"\",(VLOOKUP(G33,Codici!B:F,5,FALSE)))","v":""},null,null,null,"",null,null,{"$f":"IF(AE33>0,(VLOOKUP(G33,Codici!B:F,4,FALSE)),\"\")","v":""},null,null,null,null,null,null,null,{"$f":"IF(AE33>0,(VLOOKUP(G33,Codici!B:F,2,FALSE)),\"\")","v":""},null,"",null,0,"TS2L5-5Y",{"$f":"IF('Lotto5 DL560 Gen10 1'!$D$218=W33,('Lotto5 DL560 Gen10 1'!$C$218)*$X$15,0)","v":0},{"$f":"IF('Lotto5 DL560 Gen10 2'!$D$218=W33,('Lotto5 DL560 Gen10 2'!$C$218)*$Y$15,0)","v":0},{"$f":"IF('Lotto5 DL560 Gen10 3'!$D$218=W33,('Lotto5 DL560 Gen10 3'!$C$218)*$Z$15,0)","v":0},null,null,null,null,0]
[null,"",{"$f":"IF(AE34=0,\"\",(VLOOKUP(G34,Codici!B:F,5,FALSE)))","v":""},null,null,null,"",null,null,{"$f":"IF(AE34>0,(VLOOKUP(G34,Codici!B:F,4,FALSE)),\"\")","v":""},null,null,null,null,null,null,null,{"$f":"IF(AE34>0,(VLOOKUP(G34,Codici!B:F,2,FALSE)),\"\")","v":""},null,"",null,0,"10L2-SO-HDD",null,null,null,null,null,null,null,0]
[null,"OPZIONI COMUNI",null,null,null,null,null,null,null,null,null,null,null,null,null,null,null,null,null,null,null,{"$f":"IF(SUM(V36:V50)=0,0,1)","v":0},"Comuni","DL560","DL560 2","DL560 3"]
[null,{"$f":"IF(AT36=0,\"\",AT36)","v":""},{"$f":"IF(AG36=0,\"\",(VLOOKUP(G36,Codici!B:F,5,FALSE)))","v":""},null,null,null,{"$f":"IF(AT36>0,W36,\"\")","v":""},null,null,{"$f":"IF(AG36>0,(VLOOKUP(G36,Codici!B:F,4,FALSE)),\"\")","v":""},null,null,null,null,null,null,null,{"$f":"IF(AG36>0,(VLOOKUP(G36,Codici!B:F,2,FALSE)),\"\")","v":""},null,{"$f":"IF(B36=\"\",\"\",R36*B36)","v":""},null,{"$f":"IF(B36>=\"\",0,1)","v":0},"TS2L5-WIN1",{"$f":"IF('Lotto5 DL560 Gen10 1'!$D$46=W36,1*$X$15,0)","v":0},{"$f":"IF('Lotto5 DL560 Gen10 2'!$D$46=W36,1*$Y$15,0)","v":0},{"$f":"IF('Lotto5 DL560 Gen10 3'!$D$46=W36,1*$Z$15,0)","v":0},null,null,null,null,null,null,{"$f":"SUM(X36:Z36)","v":0},{"$f":"SUM(AA36:AC36)","v":0},{"$f":"SUM(AD36:AF36)","v":0},null,null,null,null,null,null,null,null,null,null,{"$f":"SUM(AG36:AR36)","v":0}]
[null,"",{"$f":"IF(AG37=0,\"\",(VLOOKUP(G37,Codici!B:F,5,FALSE)))","v":""},null,null,null,"",null,null,{"$f":"IF(AG37>0,(VLOOKUP(G37,Codici!B:F,4,FALSE)),\"\")","v":""},null,null,null,null,null,null,null,{"$f":"IF(AG37>0,(VLOOKUP(G37,Codici!B:F,2,FALSE)),\"\")","v":""},null,"",null,0,"TS2L5-WIN2",{"$f":"IF('Lotto5 DL560 Gen10 1'!$D$47=$W$37,'Lotto5 DL560 Gen10 1'!$C$47*$X$15,0)","v":0},{"$f":"IF('Lotto5 DL560 Gen10 2'!$D$47=$W$37,'Lotto5 DL560 Gen10 2'!$C$47*$Y$15,0)","v":0},{"$f":"IF('Lotto5 DL560 Gen10 3'!$D$47=$W$37,'Lotto5 DL560 Gen10 3'!$C$47*$Z$15,0)","v":0},null,null,null,null,null,null,0,0,{"$f":"SUM(AD37:AF37)","v":0},null,null,null,null,null,null,null,null,null,null,{"$f":"SUM(AG37:AR37)","v":0}]
[null,"",{"$f":"IF(AG38=0,\"\",(VLOOKUP(G38,Codici!B:F,5,FALSE)))","v":""},null,null,null,"",null,null,{"$f":"IF(AG38>0,(VLOOKUP(G38,Codici!B:F,4,FALSE)),\"\")","v":""},null,null,null,null,null,null,null,{"$f":"IF(AG38>0,(VLOOKUP(G38,Codici!B:F,2,FALSE)),\"\")","v":""},null,"",null,0,"TS2L5-WINDC1",{"$f":"IF('Lotto5 DL560 Gen10 1'!$D$46=W38,1*$X$15,0)","v":0},{"$f":"IF('Lotto5 DL560 Gen10 2'!$D$46=W38,1*$Y$15,0)","v":0},{"$f":"IF('Lotto5 DL560 Gen10 3'!$D$46=W38,1*$Z$15,0)","v":0},null,null,null,null,null,null,0,0,0,null,null,null,null,null,null,null,null,null,null,0]
[null,"",{"$f":"IF(AG39=0,\"\",(VLOOKUP(G39,Codici!B:F,5,FALSE)))","v":""},null,null,null,"",null,null,{"$f":"IF(AG39>0,(VLOOKUP(G39,Codici!B:F,4,FALSE)),\"\")","v":""},null,null,null,null,null,null,null,{"$f":"IF(AG39>0,(VLOOKUP(G39,Codici!B:F,2,FALSE)),\"\")","v":""},null,{"$f":"IF(B39=\"\",\"\",R39*B39)","v":""},null,0,"TS2L5-WINDC2",{"$f":"IF('Lotto5 DL560 Gen10 1'!$D$47=$W$39,'Lotto5 DL560 Gen10 1'!$C$47*$X$15,0)","v":0},{"$f":"IF('Lotto5 DL560 Gen10 2'!$D$47=$W$39,'Lotto5 DL560 Gen10 2'!$C$47*$Y$15,0)","v":0},{"$f":"IF('Lotto5 DL560 Gen10 3'!$D$47=$W$39,'Lotto5 DL560 Gen10 3'!$C$47*$Z$15,0)","v":0},null,null,null,null,null,null,0,0,0,null,null,null,null,null,null,null,null,null,null,0]
[null,"",{"$f":"IF(AG40=0,\"\",(VLOOKUP(G40,Codici!B:F,5,FALSE)))","v":""},null,null,null,"",null,null,{"$f":"IF(AG40>0,(VLOOKUP(G40,Codici!B:F,4,FALSE)),\"\")","v":""},null,null,null,null,null,null,null,{"$f":"IF(AG40>0,(VLOOKUP(G40,Codici!B:F,2,FALSE)),\"\")","v":""},null,"",null,0,"TS2L5-LINUX",{"$f":"IF('Lotto5 DL560 Gen10 1'!$D$46=$W$40,1*$X$15,0)","v":0},{"$f":"IF('Lotto5 DL560 Gen10 2'!$D$46=$W$40,1*$Y$15,0)","v":0},{"$f":"IF('Lotto5 DL560 Gen10 3'!$D$46=$W$40,1*$Z$15,0)","v":0},null,null,null,null,null,null,0,0,0,null,null,null,null,null,null,null,null,null,null,0]
[null,"",{"$f":"IF(AG41=0,\"\",(VLOOKUP(G41,Codici!B:F,5,FALSE)))","v":""},null,null,null,"",null,null,{"$f":"IF(AG41>0,(VLOOKUP(G41,Codici!B:F,4,FALSE)),\"\")","v":""},null,null,null,null,null,null,null,{"$f":"IF(AG41>0,(VLOOKUP(G41,Codici!B:F,2,FALSE)),\"\")","v":""},null,"",null,0,"TS2L5-CALUSER",{"$f":"IF(($X$36+$X$38)>0,'Lotto5 DL560 Gen10 1'!$C$51*$X$15,0)","v":0},{"$f":"IF(($Y$36+$Y$38)>0,'Lotto5 DL560 Gen10 2'!$C$51*$Y$15,0)","v":0},{"$f":"IF(($Z$36+$Z$38)>0,'Lotto5 DL560 Gen10 3'!$C$51*$Z$15,0)","v":0},null,null,null,null,null,null,0,0,0,null,null,null,null,null,null,null,null,null,null,0]
[null,"",{"$f":"IF(AG42=0,\"\",(VLOOKUP(G42,Codici!B:F,5,FALSE)))","v":""},null,null,null,"",null,null,{"$f":"IF(AG42>0,(VLOOKUP(G42,Codici!B:F,4,FALSE)),\"\")","v":""},null,null,null,null,null,null,null,{"$f":"IF(AG42>0,(VLOOKUP(G42,Codici!B:F,2,FALSE)),\"\")","v":""},null,"",null,0,"TS2L5-CALDEV",{"$f":"IF(($X$36+$X$38)>0,'Lotto5 DL560 Gen10 1'!$C$53*$X$15,0)","v":0},{"$f":"IF(($Y$36+$Y$38)>0,'Lotto5 DL560 Gen10 2'!$C$53*$Y$15,0)","v":0},{"$f":"IF(($Z$36+$Z$38)>0,'Lotto5 DL560 Gen10 3'!$C$53*$Z$15,0)","v":0},null,null,null,null,null,null,0,0,0,null,null,null,null,null,null,null,null,null,null,0]
[null,{"$f":"IF(AT43=0,\"\",AT43)","v":""},{"$f":"IF(AG43=0,\"\",(VLOOKUP(G43,Codici!B:F,5,FALSE)))","v":""},null,null,null,{"$f":"IF(AT43>0,W43,\"\")","v":""},null,null,{"$f":"IF(AG43>0,(VLOOKUP(G43,Codici!B:F,4,FALSE)),\"\")","v":""},null,null,null,null,null,null,null,{"$f":"IF(AG43>0,(VLOOKUP(G43,Codici!B:F,2,FALSE)),\"\")","v":""},null,"",null,0,"TS2L5-WINDC2COR",{"$f":"IF('Lotto5 DL560 Gen10 1'!$D$48=$W$43,'Lotto5 DL560 Gen10 1'!$C$48*$X$15,0)","v":0},{"$f":"IF('Lotto5 DL560 Gen10 2'!$D$48=$W$43,'Lotto5 DL560 Gen10 2'!$C$48*$Y$15,0)","v":0},{"$f":"IF('Lotto5 DL560 Gen10 3'!$D$48=$W$43,'Lotto5 DL560 Gen10 3'!$C$48*$Z$15,0)","v":0},null,null,null,null,null,null,{"$f":"SUM(X43:Z43)","v":0},null,null,null,null,null,null,null,null,null,null,null,null,0]
[null,"",{"$f":"IF(AG44=0,\"\",(VLOOKUP(G44,Codici!B:F,5,FALSE)))","v":""},null,null,null,"",null,null,{"$f":"IF(AG44>0,(VLOOKUP(G44,Codici!B:F,4,FALSE)),\"\")","v":""},null,null,null,null,null,null,null,{"$f":"IF(AG44>0,(VLOOKUP(G44,Codici!B:F,2,FALSE)),\"\")","v":""},null,"",null,0,"TS2L5-WIN2CORE",{"$f":"IF('Lotto5 DL560 Gen10 1'!$D$48=Riepilogo!$W$44,'Lotto5 DL560 Gen10 1'!$C$48*$X$15,0)","v":0},{"$f":"IF('Lotto5 DL560 Gen10 2'!$D$48=Riepilogo!$W$44,'Lotto5 DL560 Gen10 2'!$C$48*$Y$15,0)","v":0},{"$f":"IF('Lotto5 DL560 Gen10 3'!$D$48=Riepilogo!$W$44,'Lotto5 DL560 Gen10 3'!$C$48*$Z$15,0)","v":0},null,null,null,null,null,null,0,0,0,null,null,null,null,null,null,null,null,null,null,0]
[null,{"$f":"IF('RACK, Accessori e Servizi'!J15=0,\"\",'RACK, Accessori e Servizi'!J15)","v":""},{"$f":"IF(AG45=0,\"\",(VLOOKUP(G45,Codici!B:F,5,FALSE)))","v":""},null,null,null,{"$f":"IF('RACK, Accessori e Servizi'!J15>0,'RACK, Accessori e Servizi'!K15,\"\")","v":""},null,null,{"$f":"IF(AG45>0,(VLOOKUP(G45,Codici!B:F,4,FALSE)),\"\")","v":""},null,null,null,null,null,null,null,{"$f":"IF(AG45>0,(VLOOKUP(G45,Codici!B:F,2,FALSE)),\"\")","v":""},null,{"$f":"IF(B45=\"\",\"\",R45*B45)","v":""},null,0,"TS2L5-RACK",null,null,null,null,null,null,null,null,null,{"$f":"'RACK, Accessori e Servizi'!J15","v":0}]
[null,{"$f":"IF('RACK, Accessori e Servizi'!J24=0,\"\",'RACK, Accessori e Servizi'!J24)","v":""},{"$f":"IF(AG46=0,\"\",(VLOOKUP(G46,Codici!B:F,5,FALSE)))","v":""},null,null,null,{"$f":"IF('RACK, Accessori e Servizi'!J24>0,'RACK, Accessori e Servizi'!K24,\"\")","v":""},null,null,{"$f":"IF(AG46>0,(VLOOKUP(G46,Codici!B:F,4,FALSE)),\"\")","v":""},null,null,null,null,null,null,null,{"$f":"IF(AG46>0,(VLOOKUP(G46,Codici!B:F,2,FALSE)),\"\")","v":""},null,"",null,0,"TS2L5-GUI",null,null,null,null,null,null,null,null,null,{"$f":"'RACK, Accessori e Servizi'!J24","v":0}]
[null,{"$f":"IF('RACK, Accessori e Servizi'!J27=0,\"\",'RACK, Accessori e Servizi'!J27)","v":""},{"$f":"IF(AG47=0,\"\",(VLOOKUP(G47,Codici!B:F,5,FALSE)))","v":""},null,null,null,{"$f":"IF('RACK, Accessori e Servizi'!J27>0,'RACK, Accessori e Servizi'!K27,\"\")","v":""},null,null,{"$f":"IF(AG47>0,(VLOOKUP(G47,Codici!B:F,4,FALSE)),\"\")","v":""},null,null,null,null,null,null,null,{"$f":"IF(AG47>0,(VLOOKUP(G47,Codici!B:F,2,FALSE)),\"\")","v":""},null,"",null,0,"TS2L5-KVMIP",null,null,null,null,null,null,null,null,null,{"$f":"'RACK, Accessori e Servizi'!J27","v":0}]
[null,{"$f":"IF('RACK, Accessori e Servizi'!J30=0,\"\",'RACK, Accessori e Servizi'!J30)","v":""},{"$f":"IF(AG48=0,\"\",(VLOOKUP(G48,Codici!B:F,5,FALSE)))","v":""},null,null,null,{"$f":"IF('RACK, Accessori e Servizi'!J30>0,'RACK, Accessori e Servizi'!K30,\"\")","v":""},null,null,{"$f":"IF(AG48>0,(VLOOKUP(G48,Codici!B:F,4,FALSE)),\"\")","v":""},null,null,null,null,null,null,null,{"$f":"IF(AG48>0,(VLOOKUP(G48,Codici!B:F,2,FALSE)),\"\")","v":""},null,"",null,0,"TS2L5-UPS",null,null,null,null,null,null,null,null,null,{"$f":"'RACK, Accessori e Servizi'!J30","v":0}]
[null,null,null,null,null,null,null,null,null,null,null,null,null,null,null,null,null,null,null,null,null,0]
[null,null,null,null,null,null,null,null,null,null,null,null,null,null,null,null,null,null,null,null,null,0,null,{"$f":"COUNTIF($AI$19:$AI$26,W50)*$X$15","v":0},{"$f":"COUNTIF($AJ$19:$AJ$26,W50)*$Y$15","v":0},{"$f":"COUNTIF($AK$19:$AK$26,W50)*$Z$15","v":0},null,null,null,null,null,null,null,null,null,"Moltiplica x il num server"]
[null,"ULTERIORI OPZIONI 20%",null,null,null,null,null,null,null,null,null,null,null,null,null,null,null,null,null,null,null,{"$f":"IF(SUM(V52:V117)=0,0,1)","v":0},null,"DL560","DL560 2","DL560 3",null,null,null,null,null,null,null,null,null,"DL560","DL560 2","DL560 3",null,null,null,null,null,null,null,"SOMMA"]
[null,{"$f":"IF(AT52=0,\"\",AT52)","v":""},{"$f":"IF(AG52=0,\"\",(VLOOKUP(G52,Codici!B:F,5,FALSE)))","v":""},null,null,null,{"$f":"IF(AT52>0,W52,\"\")","v":""},null,null,{"$f":"IF(AG52>0,(VLOOKUP(G52,Codici!B:F,4,FALSE)),\"\")","v":""},null,null,null,null,null,null,null,{"$f":"IF(AG52>0,(VLOOKUP(G52,Codici!B:F,2,FALSE)),\"\")","v":""},null,{"$f":"IF(B52=\"\",\"\",R52*B52)","v":""},null,0,"TS2L5-3MRJ45",{"$f":"IF(X15>=1,'Lotto5 DL560 Gen10 1'!$C$188,0)*$X$15","v":0},{"$f":"IF(Y15>=1,'Lotto5 DL560 Gen10 2'!$C$188,0)*$Y$15","v":0},{"$f":"IF(Z15>=1,'Lotto5 DL560 Gen10 3'!$C$188,0)*$Z$15","v":0},null,null,null,null,null,null,{"$f":"SUM(X52:Z52)","v":0},{"$f":"SUM(AA52:AC52)","v":0},{"$f":"SUM(AD52:AF52)","v":0},{"$f":"X52*$X$15","v":0},{"$f":"Y52*$Y$15","v":0},{"$f":"Z52*$Z$15","v":0},{"$f":"AA52*$X$36","v":0},{"$f":"AB52*$Y$36","v":0},{"$f":"AC52*$Z$36","v":0},null,null,null,null,{"$f":"AG52","v":0}]
[null,"",{"$f":"IF(AG53=0,\"\",(VLOOKUP(G53,Codici!B:F,5,FALSE)))","v":""},null,null,null,{"$f":"IF(AT53>0,W53,\"\")","v":""},null,null,{"$f":"IF(AG53>0,(VLOOKUP(G53,Codici!B:F,4,FALSE)),\"\")","v":""},null,null,null,null,null,null,null,{"$f":"IF(AG53>0,(VLOOKUP(G53,Codici!B:F,2,FALSE)),\"\")","v":""},null,{"$f":"IF(B53=\"\",\"\",R53*B53)","v":""},null,0,"TS2L5-E208IA",{"$f":"IF('Lotto5 DL560 Gen10 1'!$C$77=1,0,1)*$X$15","v":0},{"$f":"IF('Lotto5 DL560 Gen10 2'!$C$77=1,0,1)*$Y$15","v":0},{"$f":"IF('Lotto5 DL560 Gen10 3'!$C$77=1,0,1)*$Z$15","v":0},null,null,null,null,{"$f":"SUM(X53:AD53)","v":0},null,0,0,0,0,0,0,0,0,0,null,null,null,null,{"$f":"AG53","v":0}]
[null,"",{"$f":"IF(AG54=0,\"\",(VLOOKUP(G54,Codici!B:F,5,FALSE)))","v":""},null,null,null,"",null,null,{"$f":"IF(AG54>0,(VLOOKUP(G54,Codici!B:F,4,FALSE)),\"\")","v":""},null,null,null,null,null,null,null,{"$f":"IF(AG54>0,(VLOOKUP(G54,Codici!B:F,2,FALSE)),\"\")","v":""},null,"",null,0,"TS2L5-E208IP",{"$f":"COUNTIF($AI$19:$AI$26,W54)*$X$15","v":0},{"$f":"COUNTIF($AJ$19:$AJ$26,W54)*$Y$15","v":0},{"$f":"COUNTIF($AK$19:$AK$26,W54)*$Z$15","v":0},null,null,null,null,null,null,{"$f":"SUM(X54:Z54)","v":0},{"$f":"SUM(AA54:AC54)","v":0},{"$f":"SUM(AD54:AF54)","v":0},0,0,0,{"$f":"AA54*$X$36","v":0},{"$f":"AB54*$Y$36","v":0},{"$f":"AC54*$Z$36","v":0},null,null,null,null,{"$f":"AG54","v":0}]
[null,"",{"$f":"IF(AG55=0,\"\",(VLOOKUP(G55,Codici!B:F,5,FALSE)))","v":""},null,null,null,"",null,null,{"$f":"IF(AG55>0,(VLOOKUP(G55,Codici!B:F,4,FALSE)),\"\")","v":""},null,null,null,null,null,null,null,{"$f":"IF(AG55>0,(VLOOKUP(G55,Codici!B:F,2,FALSE)),\"\")","v":""},null,"",null,0,"TS2L5-HDDBAY",{"$f":"IF('Lotto5 DL560 Gen10 1'!$C$69+'Lotto5 DL560 Gen10 1'!$C$72=2,1,0)*$X$15","v":0},{"$f":"IF('Lotto5 DL560 Gen10 2'!$C$69+'Lotto5 DL560 Gen10 2'!$C$72=2,1,0)*$Y$15","v":0},{"$f":"IF('Lotto5 DL560 Gen10 3'!$C$69+'Lotto5 DL560 Gen10 3'!$C$72=2,1,0)*$Z$15","v":0},null,null,null,null,null,null,{"$f":"SUM(X55:Z55)","v":0},{"$f":"SUM(AA55:AC55)","v":0},{"$f":"SUM(AD55:AF55)","v":0},{"$f":"X55*$X$15","v":0},{"$f":"Y55*$Y$15","v":0},{"$f":"Z55*$Z$15","v":0},{"$f":"AA55*$X$36","v":0},{"$f":"AB55*$Y$36","v":0},{"$f":"AC55*$Z$36","v":0},null,null,null,null,{"$f":"AG55","v":0}]
[null,{"$f":"IF(AT56=0,\"\",AT56)","v":""},{"$f":"IF(AG56=0,\"\",(VLOOKUP(G56,Codici!B:F,5,FALSE)))","v":""},null,null,null,{"$f":"IF(AT56>0,W56,\"\")","v":""},null,null,{"$f":"IF(AG56>0,(VLOOKUP(G56,Codici!B:F,4,FALSE)),\"\")","v":""},null,null,null,null,null,null,null,{"$f":"IF(AG56>0,(VLOOKUP(G56,Codici!B:F,2,FALSE)),\"\")","v":""},null,{"$f":"IF(B56=\"\",\"\",R56*B56)","v":""},null,{"$f":"IF(B56>=\"\",0,1)","v":0},"TS2L5-SASBAY1",{"$f":"IF('Lotto5 DL560 Gen10 1'!$C$79=\"\",0,1)*$X$15","v":0},{"$f":"IF('Lotto5 DL560 Gen10 2'!$C$79=\"\",0,1)*$Y$15","v":0},{"$f":"IF('Lotto5 DL560 Gen10 3'!$C$79=\"\",0,1)*$Z$15","v":0},null,null,null,null,null,null,{"$f":"SUM(X56:Z56)","v":0},{"$f":"SUM(AA56:AC56)","v":0},{"$f":"SUM(AD56:AF56)","v":0},{"$f":"X56*$X$15","v":0},{"$f":"Y56*$Y$15","v":0},{"$f":"Z56*$Z$15","v":0},{"$f":"AA56*$X$36","v":0},{"$f":"AB56*$Y$36","v":0},{"$f":"AC56*$Z$36","v":0},null,null,null,null,{"$f":"AG56","v":0}]
[null,"",{"$f":"IF(AG57=0,\"\",(VLOOKUP(G57,Codici!B:F,5,FALSE)))","v":""},null,null,null,"",null,null,{"$f":"IF(AG57>0,(VLOOKUP(G57,Codici!B:F,4,FALSE)),\"\")","v":""},null,null,null,null,null,null,null,{"$f":"IF(AG57>0,(VLOOKUP(G57,Codici!B:F,2,FALSE)),\"\")","v":""},null,"",null,0,"TS2L5-M2240",{"$f":"IF('Lotto5 DL560 Gen10 1'!$C$185=0,0,1)*$X$15","v":0},{"$f":"IF('Lotto5 DL560 Gen10 2'!$C$185=0,0,1)*$Y$15","v":0},{"$f":"IF('Lotto5 DL560 Gen10 3'!$C$185=0,0,1)*$Z$15","v":0},null,null,null,null,{"$f":"SUM(X57:AD57)","v":0},null,{"$f":"SUM(X57:Z57)","v":0},{"$f":"SUM(AA57:AC57)","v":0},{"$f":"SUM(AD57:AF57)","v":0},{"$f":"X57*$X$15","v":0},{"$f":"Y57*$Y$15","v":0},{"$f":"Z57*$Z$15","v":0},{"$f":"AA57*$X$36","v":0},{"$f":"AB57*$Y$36","v":0},{"$f":"AC57*$Z$36","v":0},null,null,null,null,{"$f":"AG57","v":0}]
[null,"",{"$f":"IF(AG58=0,\"\",(VLOOKUP(G58,Codici!B:F,5,FALSE)))","v":""},null,null,null,"",null,null,{"$f":"IF(AG58>0,(VLOOKUP(G58,Codici!B:F,4,FALSE)),\"\")","v":""},null,null,null,null,null,null,null,{"$f":"IF(AG58>0,(VLOOKUP(G58,Codici!B:F,2,FALSE)),\"\")","v":""},null,"",null,0,"TS2L5-8NVME",{"$f":"IF('Lotto5 DL560 Gen10 1'!$C$69=0,0,1)*$X$15","v":0},{"$f":"IF('Lotto5 DL560 Gen10 2'!$C$69=0,0,1)*$Y$15","v":0},{"$f":"IF('Lotto5 DL560 Gen10 3'!$C$69=0,0,1)*$Z$15","v":0},null,null,null,null,{"$f":"SUM(X58:AD58)","v":0},null,{"$f":"SUM(X58:Z58)","v":0},{"$f":"SUM(AA58:AC58)","v":0},{"$f":"SUM(AD58:AF58)","v":0},{"$f":"X58*$X$15","v":0},{"$f":"Y58*$Y$15","v":0},{"$f":"Z58*$Z$15","v":0},{"$f":"AA58*$X$36","v":0},{"$f":"AB58*$Y$36","v":0},{"$f":"AC58*$Z$36","v":0},null,null,null,null,{"$f":"AG58","v":0}]
[null,"",{"$f":"IF(AG59=0,\"\",(VLOOKUP(G59,Codici!B:F,5,FALSE)))","v":""},null,null,null,"",null,null,{"$f":"IF(AG59>0,(VLOOKUP(G59,Codici!B:F,4,FALSE)),\"\")","v":""},null,null,null,null,null,null,null,{"$f":"IF(AG59>0,(VLOOKUP(G59,Codici!B:F,2,FALSE)),\"\")","v":""},null,"",null,0,"TS2L5-375NVMEWI",{"$f":"'Lotto5 DL560 Gen10 1'!$C$108*$X$15","v":0},{"$f":"'Lotto5 DL560 Gen10 2'!$C$108*$Y$15","v":0},{"$f":"'Lotto5 DL560 Gen10 3'!$C$108*$Z$15","v":0},null,null,null,null,null,null,0,null,null,0,0,0,null,null,null,null,null,null,null,0]
[null,"",{"$f":"IF(AG60=0,\"\",(VLOOKUP(G60,Codici!B:F,5,FALSE)))","v":""},null,null,null,"",null,null,{"$f":"IF(AG60>0,(VLOOKUP(G60,Codici!B:F,4,FALSE)),\"\")","v":""},null,null,null,null,null,null,null,{"$f":"IF(AG60>0,(VLOOKUP(G60,Codici!B:F,2,FALSE)),\"\")","v":""},null,"",null,0,"TS2L5-750NVMEWI",{"$f":"'Lotto5 DL560 Gen10 1'!$C$110*$X$15","v":0},{"$f":"'Lotto5 DL560 Gen10 2'!$C$110*$Y$15","v":0},{"$f":"'Lotto5 DL560 Gen10 3'!$C$110*$Z$15","v":0},null,null,null,null,null,null,{"$f":"SUM(X60:Z60)","v":0},null,null,{"$f":"X60*$X$15","v":0},{"$f":"Y60*$Y$15","v":0},{"$f":"Z60*$Z$15","v":0},null,null,null,null,null,null,null,{"$f":"AG60","v":0}]
[null,"",{"$f":"IF(AG61=0,\"\",(VLOOKUP(G61,Codici!B:F,5,FALSE)))","v":""},null,null,null,"",null,null,{"$f":"IF(AG61>0,(VLOOKUP(G61,Codici!B:F,4,FALSE)),\"\")","v":""},null,null,null,null,null,null,null,{"$f":"IF(AG61>0,(VLOOKUP(G61,Codici!B:F,2,FALSE)),\"\")","v":""},null,"",null,0,"TS2L5-800NVMEMU",{"$f":"'Lotto5 DL560 Gen10 1'!$C$112*$X$15","v":0},{"$f":"'Lotto5 DL560 Gen10 2'!$C$112*$Y$15","v":0},{"$f":"'Lotto5 DL560 Gen10 3'!$C$112*$Z$15","v":0},null,null,null,null,null,null,0,null,null,0,0,0,null,null,null,null,null,null,null,0]
[null,"",{"$f":"IF(AG62=0,\"\",(VLOOKUP(G62,Codici!B:F,5,FALSE)))","v":""},null,null,null,"",null,null,{"$f":"IF(AG62>0,(VLOOKUP(G62,Codici!B:F,4,FALSE)),\"\")","v":""},null,null,null,null,null,null,null,{"$f":"IF(AG62>0,(VLOOKUP(G62,Codici!B:F,2,FALSE)),\"\")","v":""},null,"",null,0,"TS2L5-2000NVMERI",{"$f":"'Lotto5 DL560 Gen10 1'!$C$114*$X$15","v":0},{"$f":"'Lotto5 DL560 Gen10 2'!$C$114*$Y$15","v":0},{"$f":"'Lotto5 DL560 Gen10 3'!$C$114*$Z$15","v":0},null,null,null,null,null,null,0,null,null,0,0,0,null,null,null,null,null,null,null,0]
[null,"",{"$f":"IF(AG63=0,\"\",(VLOOKUP(G63,Codici!B:F,5,FALSE)))","v":""},null,null,null,"",null,null,{"$f":"IF(AG63>0,(VLOOKUP(G63,Codici!B:F,4,FALSE)),\"\")","v":""},null,null,null,null,null,null,null,{"$f":"IF(AG63>0,(VLOOKUP(G63,Codici!B:F,2,FALSE)),\"\")","v":""},null,"",null,0,"TS2L5-SSD3840RI",{"$f":"'Lotto5 DL560 Gen10 1'!$C$103*$X$15","v":0},{"$f":"'Lotto5 DL560 Gen10 2'!$C$103*$Y$15","v":0},{"$f":"'Lotto5 DL560 Gen10 3'!$C$103*$Z$15","v":0},null,null,null,null,null,null,0,null,null,0,0,0,null,null,null,null,null,null,null,0]
[null,"",{"$f":"IF(AG64=0,\"\",(VLOOKUP(G64,Codici!B:F,5,FALSE)))","v":""},null,null,null,"",null,null,{"$f":"IF(AG64>0,(VLOOKUP(G64,Codici!B:F,4,FALSE)),\"\")","v":""},null,null,null,null,null,null,null,{"$f":"IF(AG64>0,(VLOOKUP(G64,Codici!B:F,2,FALSE)),\"\")","v":""},null,"",null,0,"TS2L5-4000NVMERI",{"$f":"'Lotto5 DL560 Gen10 1'!$C$118*$X$15","v":0},{"$f":"'Lotto5 DL560 Gen10 2'!$C$118*$Y$15","v":0},{"$f":"'Lotto5 DL560 Gen10 3'!$C$118*$Z$15","v":0},null,null,null,null,null,null,0,null,null,0,0,0,null,null,null,null,null,null,null,0]
[null,"",{"$f":"IF(AG65=0,\"\",(VLOOKUP(G65,Codici!B:F,5,FALSE)))","v":""},null,null,null,"",null,null,{"$f":"IF(AG65>0,(VLOOKUP(G65,Codici!B:F,4,FALSE)),\"\")","v":""},null,null,null,null,null,null,null,{"$f":"IF(AG65>0,(VLOOKUP(G65,Codici!B:F,2,FALSE)),\"\")","v":""},null,"",null,0,"TS2L5-1600NVMEMU",{"$f":"'Lotto5 DL560 Gen10 1'!$C$120*$X$15","v":0},{"$f":"'Lotto5 DL560 Gen10 2'!$C$120*$Y$15","v":0},{"$f":"'Lotto5 DL560 Gen10 3'!$C$120*$Z$15","v":0},null,null,null,null,null,null,0,null,null,0,0,0,null,null,null,null,null,null,null,0]
[null,"",{"$f":"IF(AG66=0,\"\",(VLOOKUP(G66,Codici!B:F,5,FALSE)))","v":""},null,null,null,"",null,null,{"$f":"IF(AG66>0,(VLOOKUP(G66,Codici!B:F,4,FALSE)),\"\")","v":""},null,null,null,null,null,null,null,{"$f":"IF(AG66>0,(VLOOKUP(G66,Codici!B:F,2,FALSE)),\"\")","v":""},null,"",null,0,"TS2L5-3200NVMEMU",{"$f":"'Lotto5 DL560 Gen10 1'!$C$122*$X$15","v":0},{"$f":"'Lotto5 DL560 Gen10 2'!$C$122*$Y$15","v":0},{"$f":"'Lotto5 DL560 Gen10 3'!$C$122*$Z$15","v":0},null,null,null,null,null,null,0,null,null,0,0,0,null,null,null,null,null,null,null,0]
[null,"",{"$f":"IF(AG67=0,\"\",(VLOOKUP(G67,Codici!B:F,5,FALSE)))","v":""},null,null,null,"",null,null,{"$f":"IF(AG67>0,(VLOOKUP(G67,Codici!B:F,4,FALSE)),\"\")","v":""},null,null,null,null,null,null,null,{"$f":"IF(AG67>0,(VLOOKUP(G67,Codici!B:F,2,FALSE)),\"\")","v":""},null,"",null,0,"TS2L5-750NVMEWIHH",{"$f":"COUNTIF($AI$19:$AI$26,W67)*$X$15","v":0},{"$f":"COUNTIF($AJ$19:$AJ$26,W67)*$Y$15","v":0},{"$f":"COUNTIF($AK$19:$AK$26,W67)*$Z$15","v":0},null,null,null,null,null,null,{"$f":"SUM(X67:Z67)","v":0},{"$f":"SUM(AA67:AC67)","v":0},{"$f":"SUM(AD67:AF67)","v":0},{"$f":"X67*$X$15","v":0},{"$f":"Y67*$Y$15","v":0},{"$f":"Z67*$Z$15","v":0},{"$f":"AA67*$X$36","v":0},{"$f":"AB67*$Y$36","v":0},{"$f":"AC67*$Z$36","v":0},null,null,null,null,{"$f":"AG67","v":0}]
[null,"",{"$f":"IF(AG68=0,\"\",(VLOOKUP(G68,Codici!B:F,5,FALSE)))","v":""},null,null,null,"",null,null,{"$f":"IF(AG68>0,(VLOOKUP(G68,Codici!B:F,4,FALSE)),\"\")","v":""},null,null,null,null,null,null,null,{"$f":"IF(AG68>0,(VLOOKUP(G68,Codici!B:F,2,FALSE)),\"\")","v":""},null,"",null,0,"TS2L5-1600NVMEMUHH",{"$f":"COUNTIF($AI$19:$AI$26,W68)*$X$15","v":0},0,0,null,null,null,null,null,null,0,0,0,0,0,0,0,0,0,null,null,null,null,0]
[null,"",{"$f":"IF(AG69=0,\"\",(VLOOKUP(G69,Codici!B:F,5,FALSE)))","v":""},null,null,null,"",null,null,{"$f":"IF(AG69>0,(VLOOKUP(G69,Codici!B:F,4,FALSE)),\"\")","v":""},null,null,null,null,null,null,null,{"$f":"IF(AG69>0,(VLOOKUP(G69,Codici!B:F,2,FALSE)),\"\")","v":""},null,"",null,0,"TS2L5-3200NVMEMUHH",{"$f":"COUNTIF($AI$19:$AI$26,W69)*$X$15","v":0},0,0,null,null,null,null,null,null,0,0,0,0,0,0,0,0,0,null,null,null,null,0]
[null,"",{"$f":"IF(AG70=0,\"\",(VLOOKUP(G70,Codici!B:F,5,FALSE)))","v":""},null,null,null,"",null,null,{"$f":"IF(AG70>0,(VLOOKUP(G70,Codici!B:F,4,FALSE)),\"\")","v":""},null,null,null,null,null,null,null,{"$f":"IF(AG70>0,(VLOOKUP(G70,Codici!B:F,2,FALSE)),\"\")","v":""},null,"",null,0,"TS2L5-6400NVMEMUHH",{"$f":"COUNTIF($AI$19:$AI$26,W70)*$X$15","v":0},0,0,null,null,null,null,null,null,0,0,0,0,0,0,0,0,0,null,null,null,null,0]
[null,{"$f":"IF(AT71=0,\"\",AT71)","v":""},{"$f":"IF(AG71=0,\"\",(VLOOKUP(G71,Codici!B:F,5,FALSE)))","v":""},null,null,null,{"$f":"IF(AT71>0,W71,\"\")","v":""},null,null,{"$f":"IF(AG71>0,(VLOOKUP(G71,Codici!B:F,4,FALSE)),\"\")","v":""},null,null,null,null,null,null,null,{"$f":"IF(AG71>0,(VLOOKUP(G71,Codici!B:F,2,FALSE)),\"\")","v":""},null,{"$f":"IF(B71=\"\",\"\",R71*B71)","v":""},null,{"$f":"IF(B71>=\"\",0,1)","v":0},"TS2L5-SSD400MU",{"$f":"'Lotto5 DL560 Gen10 1'!$C$91*$X$15","v":0},{"$f":"'Lotto5 DL560 Gen10 2'!$C$91*$Y$15","v":0},{"$f":"'Lotto5 DL560 Gen10 3'!$C$91*$Z$15","v":0},null,null,null,null,null,null,{"$f":"SUM(X71:Z71)","v":0},null,null,{"$f":"X71*$X$15","v":0},{"$f":"Y71*$Y$15","v":0},{"$f":"Z71*$Z$15","v":0},null,null,null,null,null,null,null,{"$f":"AG71","v":0}]
[null,{"$f":"IF(AT72=0,\"\",AT72)","v":""},{"$f":"IF(AG72=0,\"\",(VLOOKUP(G72,Codici!B:F,5,FALSE)))","v":""},null,null,null,{"$f":"IF(AT72>0,W72,\"\")","v":""},null,null,{"$f":"IF(AG72>0,(VLOOKUP(G72,Codici!B:F,4,FALSE)),\"\")","v":""},null,null,null,null,null,null,null,{"$f":"IF(AG72>0,(VLOOKUP(G72,Codici!B:F,2,FALSE)),\"\")","v":""},null,{"$f":"IF(B72=\"\",\"\",R72*B72)","v":""},null,{"$f":"IF(B72>=\"\",0,1)","v":0},"TS2L5-SSD400WIB",{"$f":"'Lotto5 DL560 Gen10 1'!$C$93*$X$15","v":0},{"$f":"'Lotto5 DL560 Gen10 2'!$C$93*$Y$15","v":0},{"$f":"'Lotto5 DL560 Gen10 3'!$C$93*$Z$15","v":0},null,null,null,null,null,null,{"$f":"SUM(X72:Z72)","v":0},null,null,{"$f":"X72*$X$15","v":0},{"$f":"Y72*$Y$15","v":0},{"$f":"Z72*$Z$15","v":0},null,null,null,null,null,null,null,{"$f":"AG72","v":0}]
[null,{"$f":"IF(AT73=0,\"\",AT73)","v":""},{"$f":"IF(AG73=0,\"\",(VLOOKUP(G73,Codici!B:F,5,FALSE)))","v":""},null,null,null,{"$f":"IF(AT73>0,W73,\"\")","v":""},null,null,{"$f":"IF(AG73>0,(VLOOKUP(G73,Codici!B:F,4,FALSE)),\"\")","v":""},null,null,null,null,null,null,null,{"$f":"IF(AG73>0,(VLOOKUP(G73,Codici!B:F,2,FALSE)),\"\")","v":""},null,{"$f":"IF(B73=\"\",\"\",R73*B73)","v":""},null,{"$f":"IF(B73>=\"\",0,1)","v":0},"TS2L5-SSD800MU",{"$f":"'Lotto5 DL560 Gen10 1'!$C$95*$X$15","v":0},{"$f":"'Lotto5 DL560 Gen10 2'!$C$95*$Y$15","v":0},{"$f":"'Lotto5 DL560 Gen10 3'!$C$95*$Z$15","v":0},null,null,null,null,null,null,{"$f":"SUM(X73:Z73)","v":0},null,null,{"$f":"X73*$X$15","v":0},{"$f":"Y73*$Y$15","v":0},{"$f":"Z73*$Z$15","v":0},null,null,null,null,null,null,null,{"$f":"AG73","v":0}]
[null,{"$f":"IF(AT74=0,\"\",AT74)","v":""},{"$f":"IF(AG74=0,\"\",(VLOOKUP(G74,Codici!B:F,5,FALSE)))","v":""},null,null,null,{"$f":"IF(AT74>0,W74,\"\")","v":""},null,null,{"$f":"IF(AG74>0,(VLOOKUP(G74,Codici!B:F,4,FALSE)),\"\")","v":""},null,null,null,null,null,null,null,{"$f":"IF(AG74>0,(VLOOKUP(G74,Codici!B:F,2,FALSE)),\"\")","v":""},null,{"$f":"IF(B74=\"\",\"\",R74*B74)","v":""},null,{"$f":"IF(B74>=\"\",0,1)","v":0},"TS2L5-SSD960MU",{"$f":"'Lotto5 DL560 Gen10 1'!$C$97*$X$15","v":0},{"$f":"'Lotto5 DL560 Gen10 2'!$C$97*$Y$15","v":0},{"$f":"'Lotto5 DL560 Gen10 3'!$C$97*$Z$15","v":0},null,null,null,null,null,null,{"$f":"SUM(X74:Z74)","v":0},null,null,{"$f":"X74*$X$15","v":0},{"$f":"Y74*$Y$15","v":0},{"$f":"Z74*$Z$15","v":0},null,null,null,null,null,null,null,{"$f":"AG74","v":0}]
[null,"",{"$f":"IF(AG75=0,\"\",(VLOOKUP(G75,Codici!B:F,5,FALSE)))","v":""},null,null,null,{"$f":"IF(AT75>0,W75,\"\")","v":""},null,null,{"$f":"IF(AG75>0,(VLOOKUP(G75,Codici!B:F,4,FALSE)),\"\")","v":""},null,null,null,null,null,null,null,{"$f":"IF(AG75>0,(VLOOKUP(G75,Codici!B:F,2,FALSE)),\"\")","v":""},null,"",null,0,"TS2L5-530T",{"$f":"COUNTIF($AI$19:$AI$26,W75)*$X$15","v":0},{"$f":"COUNTIF($AJ$19:$AJ$26,W75)*$Y$15","v":0},{"$f":"COUNTIF($AK$19:$AK$26,W75)*$Z$15","v":0},null,null,null,null,null,null,0,0,0,{"$f":"X75*$X$15","v":0},{"$f":"Y75*$Y$15","v":0},{"$f":"Z75*$Z$15","v":0},0,0,0,null,null,null,null,{"$f":"AG75","v":0}]
[null,"",{"$f":"IF(AG76=0,\"\",(VLOOKUP(G76,Codici!B:F,5,FALSE)))","v":""},null,null,null,"",null,null,{"$f":"IF(AG76>0,(VLOOKUP(G76,Codici!B:F,4,FALSE)),\"\")","v":""},null,null,null,null,null,null,null,{"$f":"IF(AG76>0,(VLOOKUP(G76,Codici!B:F,2,FALSE)),\"\")","v":""},null,{"$f":"IF(B76=\"\",\"\",R76*B76)","v":""},null,0,"TS2L5-521T",{"$f":"COUNTIF($AI$19:$AI$26,W76)*$X$15","v":0},0,0,null,null,null,null,null,null,0,0,0,0,0,0,0,0,0,null,null,null,null,0]
[null,"",{"$f":"IF(AG77=0,\"\",(VLOOKUP(G77,Codici!B:F,5,FALSE)))","v":""},null,null,null,"",null,null,{"$f":"IF(AG77>0,(VLOOKUP(G77,Codici!B:F,4,FALSE)),\"\")","v":""},null,null,null,null,null,null,null,{"$f":"IF(AG77>0,(VLOOKUP(G77,Codici!B:F,2,FALSE)),\"\")","v":""},null,{"$f":"IF(B77=\"\",\"\",R77*B77)","v":""},null,0,"TS2L5-536FLR",0,0,0,null,null,null,null,null,null,0,0,0,0,0,0,0,0,0,null,null,null,null,0]
[null,"",{"$f":"IF(AG78=0,\"\",(VLOOKUP(G78,Codici!B:F,5,FALSE)))","v":""},null,null,null,"",null,null,{"$f":"IF(AG78>0,(VLOOKUP(G78,Codici!B:F,4,FALSE)),\"\")","v":""},null,null,null,null,null,null,null,{"$f":"IF(AG78>0,(VLOOKUP(G78,Codici!B:F,2,FALSE)),\"\")","v":""},null,{"$f":"IF(B78=\"\",\"\",R78*B78)","v":""},null,0,"TS2L5-562SFP",0,0,0,null,null,null,null,null,null,0,0,0,0,0,0,0,0,0,null,null,null,null,0]
[null,"",{"$f":"IF(AG79=0,\"\",(VLOOKUP(G79,Codici!B:F,5,FALSE)))","v":""},null,null,null,"",null,null,{"$f":"IF(AG79>0,(VLOOKUP(G79,Codici!B:F,4,FALSE)),\"\")","v":""},null,null,null,null,null,null,null,{"$f":"IF(AG79>0,(VLOOKUP(G79,Codici!B:F,2,FALSE)),\"\")","v":""},null,"",null,0,"TS2L5-10OTSR",{"$f":"IF('Lotto5 DL560 Gen10 1'!$C$213>=1,'Lotto5 DL560 Gen10 1'!$C$213,0)*Riepilogo!$X$15","v":0},{"$f":"IF('Lotto5 DL560 Gen10 2'!$C$213>=1,'Lotto5 DL560 Gen10 2'!$C$213,0)*Riepilogo!$Y$15","v":0},{"$f":"IF('Lotto5 DL560 Gen10 3'!$C$213>=1,'Lotto5 DL560 Gen10 3'!$C$213,0)*Riepilogo!$Z$15","v":0},null,null,null,null,null,null,0,0,0,0,0,0,0,0,0,null,null,null,null,0]
[null,"",{"$f":"IF(AG80=0,\"\",(VLOOKUP(G80,Codici!B:F,5,FALSE)))","v":""},null,null,null,"",null,null,{"$f":"IF(AG80>0,(VLOOKUP(G80,Codici!B:F,4,FALSE)),\"\")","v":""},null,null,null,null,null,null,null,{"$f":"IF(AG80>0,(VLOOKUP(G80,Codici!B:F,2,FALSE)),\"\")","v":""},null,"",null,0,"TS2L5-10OTLR",{"$f":"IF('Lotto5 DL560 Gen10 1'!$C$215>=1,'Lotto5 DL560 Gen10 1'!$C$215,0)*Riepilogo!$X$15","v":0},{"$f":"IF('Lotto5 DL560 Gen10 2'!$C$215>=1,'Lotto5 DL560 Gen10 2'!$C$215,0)*Riepilogo!$Y$15","v":0},{"$f":"IF('Lotto5 DL560 Gen10 3'!$C$215>=1,'Lotto5 DL560 Gen10 3'!$C$215,0)*Riepilogo!$Z$15","v":0},null,null,null,null,null,null,0,0,0,0,0,0,0,0,0,null,null,null,null,0]
[null,"",{"$f":"IF(AG81=0,\"\",(VLOOKUP(G81,Codici!B:F,5,FALSE)))","v":""},null,null,null,"",null,null,{"$f":"IF(AG81>0,(VLOOKUP(G81,Codici!B:F,4,FALSE)),\"\")","v":""},null,null,null,null,null,null,null,{"$f":"IF(AG81>0,(VLOOKUP(G81,Codici!B:F,2,FALSE)),\"\")","v":""},null,"",null,0,"TS2L5-GPURSRKIT",{"$f":"IF('Lotto5 DL560 Gen10 1'!$C$147=0,0,1)*$X$15","v":0},{"$f":"IF('Lotto5 DL560 Gen10 2'!$C$147=0,0,1)*$Y$15","v":0},{"$f":"IF('Lotto5 DL560 Gen10 3'!$C$147=0,0,1)*$Z$15","v":0},null,null,null,null,null,null,0,0,0,0,0,0,0,0,0,null,null,null,null,0]
[null,"",{"$f":"IF(AG82=0,\"\",(VLOOKUP(G82,Codici!B:F,5,FALSE)))","v":""},null,null,null,"",null,null,{"$f":"IF(AG82>0,(VLOOKUP(G82,Codici!B:F,4,FALSE)),\"\")","v":""},null,null,null,null,null,null,null,{"$f":"IF(AG82>0,(VLOOKUP(G82,Codici!B:F,2,FALSE)),\"\")","v":""},null,"",null,0,"TS2L5-P2000GPU",{"$f":"COUNTIF($AI$19:$AI$26,W82)*$X$15","v":0},{"$f":"COUNTIF($AJ$19:$AJ$26,W82)*$Y$15","v":0},{"$f":"COUNTIF($AK$19:$AK$26,W82)*$Z$15","v":0},null,null,null,null,null,null,0,0,0,0,0,0,0,0,0,null,null,null,null,0]
[null,"",{"$f":"IF(AG83=0,\"\",(VLOOKUP(G83,Codici!B:F,5,FALSE)))","v":""},null,null,null,"",null,null,{"$f":"IF(AG83>0,(VLOOKUP(G83,Codici!B:F,4,FALSE)),\"\")","v":""},null,null,null,null,null,null,null,{"$f":"IF(AG83>0,(VLOOKUP(G83,Codici!B:F,2,FALSE)),\"\")","v":""},null,{"$f":"IF(B83=\"\",\"\",R83*B83)","v":""},null,0,"TS2L5-841QSFP28",0,{"$f":"COUNTIF($AJ$19:$AJ$26,W83)*$Y$15","v":0},{"$f":"COUNTIF($AK$19:$AK$26,W83)*$Z$15","v":0},null,null,null,null,null,null,0,0,0,0,0,0,0,0,0,null,null,null,null,0]
[null,"",{"$f":"IF(AG84=0,\"\",(VLOOKUP(G84,Codici!B:F,5,FALSE)))","v":""},null,null,null,"",null,null,{"$f":"IF(AG84>0,(VLOOKUP(G84,Codici!B:F,4,FALSE)),\"\")","v":""},null,null,null,null,null,null,null,{"$f":"IF(AG84>0,(VLOOKUP(G84,Codici!B:F,2,FALSE)),\"\")","v":""},null,{"$f":"IF(B84=\"\",\"\",R84*B84)","v":""},null,0,"TS2L5-OP101",0,0,0,null,null,null,null,null,null,{"$f":"SUM(X84:Z84)","v":0},0,0,0,0,0,0,0,0,null,null,null,null,0]
[null,"",{"$f":"IF(AG85=0,\"\",(VLOOKUP(G85,Codici!B:F,5,FALSE)))","v":""},null,null,null,"",null,null,{"$f":"IF(AG85>0,(VLOOKUP(G85,Codici!B:F,4,FALSE)),\"\")","v":""},null,null,null,null,null,null,null,{"$f":"IF(AG85>0,(VLOOKUP(G85,Codici!B:F,2,FALSE)),\"\")","v":""},null,{"$f":"IF(B85=\"\",\"\",R85*B85)","v":""},null,0,"TS2L5-547FLR",{"$f":"IF('Lotto5 DL560 Gen10 1'!$G$152>0,1,0)*$X$15","v":0},{"$f":"IF('Lotto5 DL560 Gen10 2'!$G$152>0,1,0)*$Y$15","v":0},{"$f":"IF('Lotto5 DL560 Gen10 3'!$G$152>0,1,0)*$Z$15","v":0},null,null,null,null,null,null,0,0,0,0,0,0,0,0,0,null,null,null,null,0]
[null,"",{"$f":"IF(AG86=0,\"\",(VLOOKUP(G86,Codici!B:F,5,FALSE)))","v":""},null,null,null,"",null,null,{"$f":"IF(AG86>0,(VLOOKUP(G86,Codici!B:F,4,FALSE)),\"\")","v":""},null,null,null,null,null,null,null,{"$f":"IF(AG86>0,(VLOOKUP(G86,Codici!B:F,2,FALSE)),\"\")","v":""},null,{"$f":"IF(B86=\"\",\"\",R86*B86)","v":""},null,0,"TS2L5-VMWSTD1P5Y",{"$f":"IF('Lotto5 DL560 Gen10 1'!$D$56=Riepilogo!W86,'Lotto5 DL560 Gen10 1'!$C$56,0)*$X$15","v":0},{"$f":"IF('Lotto5 DL560 Gen10 2'!$D$56=Riepilogo!X86,'Lotto5 DL560 Gen10 2'!$C$56,0)*$Y$15","v":0},{"$f":"IF('Lotto5 DL560 Gen10 3'!$D$56=Riepilogo!Y86,'Lotto5 DL560 Gen10 3'!$C$56,0)*$Z$15","v":0},null,null,null,null,null,null,0,0,0,0,0,0,0,0,0,null,null,null,null,0]
[null,"",{"$f":"IF(AG87=0,\"\",(VLOOKUP(G87,Codici!B:F,5,FALSE)))","v":""},null,null,null,"",null,null,{"$f":"IF(AG87>0,(VLOOKUP(G87,Codici!B:F,4,FALSE)),\"\")","v":""},null,null,null,null,null,null,null,{"$f":"IF(AG87>0,(VLOOKUP(G87,Codici!B:F,2,FALSE)),\"\")","v":""},null,{"$f":"IF(B87=\"\",\"\",R87*B87)","v":""},null,0,"TS2L5-VMWEP1P5Y",{"$f":"IF('Lotto5 DL560 Gen10 1'!$D$56=Riepilogo!W87,'Lotto5 DL560 Gen10 1'!$C$56,0)*$X$15","v":0},{"$f":"IF('Lotto5 DL560 Gen10 2'!$D$56=Riepilogo!X87,'Lotto5 DL560 Gen10 2'!$C$56,0)*$Y$15","v":0},{"$f":"IF('Lotto5 DL560 Gen10 3'!$D$56=Riepilogo!Y87,'Lotto5 DL560 Gen10 3'!$C$56,0)*$Z$15","v":0},null,null,null,null,null,null,0,0,0,0,0,0,0,0,0,null,null,null,null,0]
[null,"",{"$f":"IF(AG88=0,\"\",(VLOOKUP(G88,Codici!B:F,5,FALSE)))","v":""},null,null,null,"",null,null,{"$f":"IF(AG88>0,(VLOOKUP(G88,Codici!B:F,4,FALSE)),\"\")","v":""},null,null,null,null,null,null,null,{"$f":"IF(AG88>0,(VLOOKUP(G88,Codici!B:F,2,FALSE)),\"\")","v":""},null,{"$f":"IF(B88=\"\",\"\",R88*B88)","v":""},null,0,"TS2L5-VMWSTD1P3Y",{"$f":"IF('Lotto5 DL560 Gen10 1'!$D$56=Riepilogo!$W$88,'Lotto5 DL560 Gen10 1'!$C$56,0)*$X$15","v":0},{"$f":"IF('Lotto5 DL560 Gen10 2'!$D$56=Riepilogo!$W$88,'Lotto5 DL560 Gen10 2'!$C$56,0)*$Y$15","v":0},{"$f":"IF('Lotto5 DL560 Gen10 3'!$D$56=Riepilogo!$W$88,'Lotto5 DL560 Gen10 3'!$C$56,0)*$Z$15","v":0},null,null,null,null,null,null,0,0,0,0,0,0,0,0,0,null,null,null,null,0]
[null,"",{"$f":"IF(AG89=0,\"\",(VLOOKUP(G89,Codici!B:F,5,FALSE)))","v":""},null,null,null,"",null,null,{"$f":"IF(AG89>0,(VLOOKUP(G89,Codici!B:F,4,FALSE)),\"\")","v":""},null,null,null,null,null,null,null,{"$f":"IF(AG89>0,(VLOOKUP(G89,Codici!B:F,2,FALSE)),\"\")","v":""},null,"",null,0,"TS2L5-VMWEP1P3Y",{"$f":"IF('Lotto5 DL560 Gen10 1'!$D$56=Riepilogo!$W$89,'Lotto5 DL560 Gen10 1'!$C$56,0)*$X$15","v":0},{"$f":"IF('Lotto5 DL560 Gen10 2'!$D$56=Riepilogo!$W$89,'Lotto5 DL560 Gen10 2'!$C$56,0)*$Y$15","v":0},{"$f":"IF('Lotto5 DL560 Gen10 3'!$D$56=Riepilogo!$W$89,'Lotto5 DL560 Gen10 3'!$C$56,0)*$Z$15","v":0},null,null,null,null,null,null,0,0,0,0,0,0,0,0,0,null,null,null,null,0]
[null,"",{"$f":"IF(AG90=0,\"\",(VLOOKUP(G90,Codici!B:F,5,FALSE)))","v":""},null,null,null,"",null,null,{"$f":"IF(AG90>0,(VLOOKUP(G90,Codici!B:F,4,FALSE)),\"\")","v":""},null,null,null,null,null,null,null,{"$f":"IF(AG90>0,(VLOOKUP(G90,Codici!B:F,2,FALSE)),\"\")","v":""},null,"",null,0,"TS2L5-VMWKIT6P3Y",{"$f":"IF('Lotto5 DL560 Gen10 1'!$D$58=Riepilogo!W90,'Lotto5 DL560 Gen10 1'!$C$58,0)*$X$15","v":0},null,null,null,null,null,null,null,null,0,0,0,0,0,0,0,0,0,null,null,null,null,0]
[null,"",{"$f":"IF(AG91=0,\"\",(VLOOKUP(G91,Codici!B:F,5,FALSE)))","v":""},null,null,null,"",null,null,{"$f":"IF(AG91>0,(VLOOKUP(G91,Codici!B:F,4,FALSE)),\"\")","v":""},null,null,null,null,null,null,null,{"$f":"IF(AG91>0,(VLOOKUP(G91,Codici!B:F,2,FALSE)),\"\")","v":""},null,"",null,0,"TS2L5-VMWKIT6P5Y",{"$f":"IF('Lotto5 DL560 Gen10 1'!$D$58=Riepilogo!W91,'Lotto5 DL560 Gen10 1'!$C$58,0)*$X$15","v":0},null,null,null,null,null,null,null,null,0,0,0,0,0,0,0,0,0,null,null,null,null,0]
[null,"",{"$f":"IF(AG92=0,\"\",(VLOOKUP(G92,Codici!B:F,5,FALSE)))","v":""},null,null,null,"",null,null,{"$f":"IF(AG92>0,(VLOOKUP(G92,Codici!B:F,4,FALSE)),\"\")","v":""},null,null,null,null,null,null,null,{"$f":"IF(AG92>0,(VLOOKUP(G92,Codici!B:F,2,FALSE)),\"\")","v":""},null,"",null,0,"TS2L5-VMWVCSTD3Y",{"$f":"IF('Lotto5 DL560 Gen10 1'!$D$60=Riepilogo!W92,'Lotto5 DL560 Gen10 1'!$C$60,0)*$X$15","v":0},null,null,null,null,null,null,null,null,0,0,0,0,0,0,0,0,0,null,null,null,null,0]
[null,"",{"$f":"IF(AG93=0,\"\",(VLOOKUP(G93,Codici!B:F,5,FALSE)))","v":""},null,null,null,"",null,null,{"$f":"IF(AG93>0,(VLOOKUP(G93,Codici!B:F,4,FALSE)),\"\")","v":""},null,null,null,null,null,null,null,{"$f":"IF(AG93>0,(VLOOKUP(G93,Codici!B:F,2,FALSE)),\"\")","v":""},null,"",null,0,"TS2L5-VMWVCSTD5Y",{"$f":"IF('Lotto5 DL560 Gen10 1'!$D$60=Riepilogo!W93,'Lotto5 DL560 Gen10 1'!$C$60,0)*$X$15","v":0},null,null,null,null,null,null,null,null,0,0,0,0,0,0,0,0,0,null,null,null,null,0]
[null,"",{"$f":"IF(AG94=0,\"\",(VLOOKUP(G94,Codici!B:F,5,FALSE)))","v":""},null,null,null,"",null,null,{"$f":"IF(AG94>0,(VLOOKUP(G94,Codici!B:F,4,FALSE)),\"\")","v":""},null,null,null,null,null,null,null,{"$f":"IF(AG94>0,(VLOOKUP(G94,Codici!B:F,2,FALSE)),\"\")","v":""},null,"",null,0,"TS2L5-OV3YILO",{"$f":"IF('Lotto5 DL560 Gen10 1'!$C$66=0,0,1)*$X$15","v":0},{"$f":"IF('Lotto5 DL560 Gen10 2'!$C$66=0,0,1)*$Y$15","v":0},{"$f":"IF('Lotto5 DL560 Gen10 3'!$C$66=0,0,1)*$Z$15","v":0},null,null,null,null,{"$f":"SUM(X94:AD94)","v":0},null,0,0,0,0,0,0,0,0,0,null,null,null,null,0]
[null,"",{"$f":"IF(AG95=0,\"\",(VLOOKUP(G95,Codici!B:F,5,FALSE)))","v":""},null,null,null,"",null,null,{"$f":"IF(AG95>0,(VLOOKUP(G95,Codici!B:F,4,FALSE)),\"\")","v":""},null,null,null,null,null,null,null,{"$f":"IF(AG95>0,(VLOOKUP(G95,Codici!B:F,2,FALSE)),\"\")","v":""},null,"",null,0,"TS2L5-DACQSFPM2",{"$f":"IF('Lotto5 DL560 Gen10 1'!$C$198>=1,'Lotto5 DL560 Gen10 1'!$C$198,0)*Riepilogo!$X$15","v":0},{"$f":"IF('Lotto5 DL560 Gen10 2'!$C$198>=1,'Lotto5 DL560 Gen10 2'!$C$198,0)*Riepilogo!$Y$15","v":0},{"$f":"IF('Lotto5 DL560 Gen10 3'!$C$198>=1,'Lotto5 DL560 Gen10 3'!$C$198,0)*Riepilogo!$Z$15","v":0},null,null,null,null,null,null,0,null,null,0,0,0,null,null,null,null,null,null,null,0]
[null,"",{"$f":"IF(AG96=0,\"\",(VLOOKUP(G96,Codici!B:F,5,FALSE)))","v":""},null,null,null,"",null,null,{"$f":"IF(AG96>0,(VLOOKUP(G96,Codici!B:F,4,FALSE)),\"\")","v":""},null,null,null,null,null,null,null,{"$f":"IF(AG96>0,(VLOOKUP(G96,Codici!B:F,2,FALSE)),\"\")","v":""},null,{"$f":"IF(B96=\"\",\"\",R96*B96)","v":""},null,0,"TS2L5-DAC100M2",{"$f":"IF('Lotto5 DL560 Gen10 1'!$C$201>=1,'Lotto5 DL560 Gen10 1'!$C$201,0)*Riepilogo!$X$15","v":0},{"$f":"IF('Lotto5 DL560 Gen10 2'!$C$201>=1,'Lotto5 DL560 Gen10 2'!$C$201,0)*Riepilogo!$Y$15","v":0},{"$f":"IF('Lotto5 DL560 Gen10 3'!$C$201>=1,'Lotto5 DL560 Gen10 3'!$C$201,0)*Riepilogo!$Z$15","v":0},null,null,null,null,null,null,0,null,null,0,0,0,null,null,null,null,null,null,null,0]
[null,"",{"$f":"IF(AG97=0,\"\",(VLOOKUP(G97,Codici!B:F,5,FALSE)))","v":""},null,null,null,"",null,null,{"$f":"IF(AG97>0,(VLOOKUP(G97,Codici!B:F,4,FALSE)),\"\")","v":""},null,null,null,null,null,null,null,{"$f":"IF(AG97>0,(VLOOKUP(G97,Codici!B:F,2,FALSE)),\"\")","v":""},null,{"$f":"IF(B97=\"\",\"\",R97*B97)","v":""},null,0,"TS2L5-DAC100M3",{"$f":"IF('Lotto5 DL560 Gen10 1'!$C$203>=1,'Lotto5 DL560 Gen10 1'!$C$203,0)*Riepilogo!$X$15","v":0},{"$f":"IF('Lotto5 DL560 Gen10 2'!$C$203>=1,'Lotto5 DL560 Gen10 2'!$C$203,0)*Riepilogo!$Y$15","v":0},{"$f":"IF('Lotto5 DL560 Gen10 3'!$C$203>=1,'Lotto5 DL560 Gen10 3'!$C$203,0)*Riepilogo!$Z$15","v":0},null,null,null,null,null,null,0,null,null,0,0,0,null,null,null,null,null,null,null,0]
[null,"",{"$f":"IF(AG98=0,\"\",(VLOOKUP(G98,Codici!B:F,5,FALSE)))","v":""},null,null,null,"",null,null,{"$f":"IF(AG98>0,(VLOOKUP(G98,Codici!B:F,4,FALSE)),\"\")","v":""},null,null,null,null,null,null,null,{"$f":"IF(AG98>0,(VLOOKUP(G98,Codici!B:F,2,FALSE)),\"\")","v":""},null,{"$f":"IF(B98=\"\",\"\",R98*B98)","v":""},null,0,"TS2L5-DACAOCM3",{"$f":"IF('Lotto5 DL560 Gen10 1'!$C$206>=1,'Lotto5 DL560 Gen10 1'!$C$206,0)*Riepilogo!$X$15","v":0},{"$f":"IF('Lotto5 DL560 Gen10 2'!$C$206>=1,'Lotto5 DL560 Gen10 2'!$C$206,0)*Riepilogo!$Y$15","v":0},{"$f":"IF('Lotto5 DL560 Gen10 3'!$C$206>=1,'Lotto5 DL560 Gen10 3'!$C$206,0)*Riepilogo!$Z$15","v":0},null,null,null,null,null,null,0,null,null,0,0,0,null,null,null,null,null,null,null,0]
[null,"",{"$f":"IF(AG99=0,\"\",(VLOOKUP(G99,Codici!B:F,5,FALSE)))","v":""},null,null,null,"",null,null,{"$f":"IF(AG99>0,(VLOOKUP(G99,Codici!B:F,4,FALSE)),\"\")","v":""},null,null,null,null,null,null,null,{"$f":"IF(AG99>0,(VLOOKUP(G99,Codici!B:F,2,FALSE)),\"\")","v":""},null,{"$f":"IF(B99=\"\",\"\",R99*B99)","v":""},null,{"$f":"IF(B99>=\"\",0,1)","v":0},"TS2L5-DACAOCM5",{"$f":"IF('Lotto5 DL560 Gen10 1'!$C$208>=1,'Lotto5 DL560 Gen10 1'!$C$208,0)*Riepilogo!$X$15","v":0},{"$f":"IF('Lotto5 DL560 Gen10 2'!$C$208>=1,'Lotto5 DL560 Gen10 2'!$C$208,0)*Riepilogo!$Y$15","v":0},{"$f":"IF('Lotto5 DL560 Gen10 3'!$C$208>=1,'Lotto5 DL560 Gen10 3'!$C$208,0)*Riepilogo!$Z$15","v":0},null,null,null,null,null,null,0,null,null,0,0,0,null,null,null,null,null,null,null,0]
[null,"",{"$f":"IF(AG100=0,\"\",(VLOOKUP(G100,Codici!B:F,5,FALSE)))","v":""},null,null,null,"",null,null,{"$f":"IF(AG100>0,(VLOOKUP(G100,Codici!B:F,4,FALSE)),\"\")","v":""},null,null,null,null,null,null,null,{"$f":"IF(AG100>0,(VLOOKUP(G100,Codici!B:F,2,FALSE)),\"\")","v":""},null,{"$f":"IF(B100=\"\",\"\",R100*B100)","v":""},null,{"$f":"IF(B100>=\"\",0,1)","v":0},"TS2L5-DACAOCM7",{"$f":"IF('Lotto5 DL560 Gen10 1'!$C$210>=1,'Lotto5 DL560 Gen10 1'!$C$210,0)*Riepilogo!$X$15","v":0},{"$f":"IF('Lotto5 DL560 Gen10 2'!$C$210>=1,'Lotto5 DL560 Gen10 2'!$C$210,0)*Riepilogo!$Y$15","v":0},{"$f":"IF('Lotto5 DL560 Gen10 3'!$C$210>=1,'Lotto5 DL560 Gen10 3'!$C$210,0)*Riepilogo!$Z$15","v":0},null,null,null,null,null,null,0,null,null,0,0,0,null,null,null,null,null,null,null,0]
[null,"",{"$f":"IF(AG101=0,\"\",(VLOOKUP(G101,Codici!B:F,5,FALSE)))","v":""},null,null,null,"",null,null,{"$f":"IF(AG101>0,(VLOOKUP(G101,Codici!B:F,4,FALSE)),\"\")","v":""},null,null,null,null,null,null,null,{"$f":"IF(AG101>0,(VLOOKUP(G101,Codici!B:F,2,FALSE)),\"\")","v":""},null,"",null,0,"TS2L5-VSANSTD3Y",{"$f":"IF('Lotto5 DL560 Gen10 1'!$D$62=Riepilogo!$W$101,'Lotto5 DL560 Gen10 1'!$C$62,0)*$X$15","v":0},{"$f":"IF('Lotto5 DL560 Gen10 2'!$D$62=Riepilogo!$W$101,'Lotto5 DL560 Gen10 2'!$C$62,0)*$Y$15","v":0},{"$f":"IF('Lotto5 DL560 Gen10 3'!$D$62=Riepilogo!$W$101,'Lotto5 DL560 Gen10 3'!$C$62,0)*$Z$15","v":0},null,null,null,null,null,null,0,null,null,{"$f":"X101*$X$15","v":0},{"$f":"Y101*$Y$15","v":0},{"$f":"Z101*$Z$15","v":0},null,null,null,null,null,null,null,0]
[null,"",{"$f":"IF(AG102=0,\"\",(VLOOKUP(G102,Codici!B:F,5,FALSE)))","v":""},null,null,null,"",null,null,{"$f":"IF(AG102>0,(VLOOKUP(G102,Codici!B:F,4,FALSE)),\"\")","v":""},null,null,null,null,null,null,null,{"$f":"IF(AG102>0,(VLOOKUP(G102,Codici!B:F,2,FALSE)),\"\")","v":""},null,"",null,0,"TS2L5-VSANADV3Y",{"$f":"IF('Lotto5 DL560 Gen10 1'!$D$62=Riepilogo!$W$102,'Lotto5 DL560 Gen10 1'!$C$62,0)*$X$15","v":0},{"$f":"IF('Lotto5 DL560 Gen10 2'!$D$62=Riepilogo!$W$102,'Lotto5 DL560 Gen10 2'!$C$62,0)*$Y$15","v":0},{"$f":"IF('Lotto5 DL560 Gen10 3'!$D$62=Riepilogo!$W$102,'Lotto5 DL560 Gen10 3'!$C$62,0)*$Z$15","v":0},null,null,null,null,null,null,0,null,null,0,0,0,null,null,null,null,null,null,null,0]
[null,"",{"$f":"IF(AG103=0,\"\",(VLOOKUP(G103,Codici!B:F,5,FALSE)))","v":""},null,null,null,"",null,null,{"$f":"IF(AG103>0,(VLOOKUP(G103,Codici!B:F,4,FALSE)),\"\")","v":""},null,null,null,null,null,null,null,{"$f":"IF(AG103>0,(VLOOKUP(G103,Codici!B:F,2,FALSE)),\"\")","v":""},null,{"$f":"IF(B103=\"\",\"\",R103*B103)","v":""},null,0,"TS2L5-DUAL32GB",{"$f":"IF('Lotto5 DL560 Gen10 1'!$C$137=0,0,1)*$X$15","v":0},{"$f":"IF('Lotto5 DL560 Gen10 2'!$C$137=0,0,1)*$Y$15","v":0},{"$f":"IF('Lotto5 DL560 Gen10 3'!$C$137=0,0,1)*$Z$15","v":0},null,null,null,null,null,null,0,null,null,0,0,0,null,null,null,null,null,null,null,0]
[null,"",{"$f":"IF(AG104=0,\"\",(VLOOKUP(G104,Codici!B:F,5,FALSE)))","v":""},null,null,null,"",null,null,{"$f":"IF(AG104>0,(VLOOKUP(G104,Codici!B:F,4,FALSE)),\"\")","v":""},null,null,null,null,null,null,null,{"$f":"IF(AG104>0,(VLOOKUP(G104,Codici!B:F,2,FALSE)),\"\")","v":""},null,"",null,0,"TS2L5-DACX240M3",{"$f":"IF('Lotto5 DL560 Gen10 1'!$C$191>=1,'Lotto5 DL560 Gen10 1'!$C$191,0)*Riepilogo!$X$15","v":0},{"$f":"IF('Lotto5 DL560 Gen10 2'!$C$191>=1,'Lotto5 DL560 Gen10 2'!$C$191,0)*Riepilogo!$Y$15","v":0},{"$f":"IF('Lotto5 DL560 Gen10 3'!$C$191>=1,'Lotto5 DL560 Gen10 3'!$C$191,0)*Riepilogo!$Z$15","v":0},null,null,null,null,null,null,0,null,null,0,0,0,null,null,null,null,null,null,null,0]
[null,"",{"$f":"IF(AG105=0,\"\",(VLOOKUP(G105,Codici!B:F,5,FALSE)))","v":""},null,null,null,"",null,null,{"$f":"IF(AG105>0,(VLOOKUP(G105,Codici!B:F,4,FALSE)),\"\")","v":""},null,null,null,null,null,null,null,{"$f":"IF(AG105>0,(VLOOKUP(G105,Codici!B:F,2,FALSE)),\"\")","v":""},null,"",null,0,"TS2L5-DACX240M5",{"$f":"IF('Lotto5 DL560 Gen10 1'!$C$193>=1,'Lotto5 DL560 Gen10 1'!$C$193,0)*Riepilogo!$X$15","v":0},{"$f":"IF('Lotto5 DL560 Gen10 2'!$C$193>=1,'Lotto5 DL560 Gen10 2'!$C$193,0)*Riepilogo!$Y$15","v":0},{"$f":"IF('Lotto5 DL560 Gen10 3'!$C$193>=1,'Lotto5 DL560 Gen10 3'!$C$193,0)*Riepilogo!$Z$15","v":0},null,null,null,null,null,null,0,null,null,0,0,0,null,null,null,null,null,null,null,0]
[null,{"$f":"IF(AT106=0,\"\",AT106)","v":""},{"$f":"IF(AG106=0,\"\",(VLOOKUP(G106,Codici!B:F,5,FALSE)))","v":""},null,null,null,{"$f":"IF(AT106>0,W106,\"\")","v":""},null,null,{"$f":"IF(AG106>0,(VLOOKUP(G106,Codici!B:F,4,FALSE)),\"\")","v":""},null,null,null,null,null,null,null,{"$f":"IF(AG106>0,(VLOOKUP(G106,Codici!B:F,2,FALSE)),\"\")","v":""},null,{"$f":"IF(B106=\"\",\"\",R106*B106)","v":""},null,{"$f":"IF(B106>=\"\",0,1)","v":0},"TS2L5-DACX240M7",{"$f":"IF('Lotto5 DL560 Gen10 1'!$C$195>=1,'Lotto5 DL560 Gen10 1'!$C$195,0)*Riepilogo!$X$15","v":0},{"$f":"IF('Lotto5 DL560 Gen10 2'!$C$195>=1,'Lotto5 DL560 Gen10 2'!$C$195,0)*Riepilogo!$Y$15","v":0},{"$f":"IF('Lotto5 DL560 Gen10 3'!$C$195>=1,'Lotto5 DL560 Gen10 3'!$C$195,0)*Riepilogo!$Z$15","v":0},null,null,null,null,null,null,{"$f":"SUM(X106:Z106)","v":0},null,null,{"$f":"X106*$X$15","v":0},{"$f":"Y106*$Y$15","v":0},{"$f":"Z106*$Z$15","v":0},null,null,null,null,null,null,null,{"$f":"AG106","v":0}]
[null,{"$f":"IF(AT107=0,\"\",AT107)","v":""},{"$f":"IF(AG107=0,\"\",(VLOOKUP(G107,Codici!B:F,5,FALSE)))","v":""},null,null,null,"",null,null,{"$f":"IF(AG107>0,(VLOOKUP(G107,Codici!B:F,4,FALSE)),\"\")","v":""},null,null,null,null,null,null,null,{"$f":"IF(AG107>0,(VLOOKUP(G107,Codici!B:F,2,FALSE)),\"\")","v":""},null,"",null,0,"TS2L5-RACKPDU32",{"$f":"'RACK, Accessori e Servizi'!J39","v":0},null,null,null,null,null,null,null,null,{"$f":"SUM(X107:Z107)","v":0},{"$f":"SUM(AA107:AC107)","v":0},{"$f":"SUM(AD107:AF107)","v":0},{"$f":"X107*$X$15","v":0},{"$f":"Y107*$Y$15","v":0},{"$f":"Z107*$Z$15","v":0},{"$f":"AA107*$X$36","v":0},{"$f":"AB107*$Y$36","v":0},{"$f":"AC107*$Z$36","v":0},null,null,null,null,{"$f":"AG107","v":0}]
[null,"",{"$f":"IF(AG108=0,\"\",(VLOOKUP(G108,Codici!B:F,5,FALSE)))","v":""},null,null,null,{"$f":"IF(AT108>0,W108,\"\")","v":""},null,null,{"$f":"IF(AG108>0,(VLOOKUP(G108,Codici!B:F,4,FALSE)),\"\")","v":""},null,null,null,null,null,null,null,{"$f":"IF(AG108>0,(VLOOKUP(G108,Codici!B:F,2,FALSE)),\"\")","v":""},null,{"$f":"IF(B108=\"\",\"\",R108*B108)","v":""},null,0,"TS2L5-RACK3PH",{"$f":"'RACK, Accessori e Servizi'!J36","v":0},null,null,null,null,null,null,null,null,0,0,0,0,0,0,0,0,0,null,null,null,null,0]
[null,"",{"$f":"IF(AG109=0,\"\",(VLOOKUP(G109,Codici!B:F,5,FALSE)))","v":""},null,null,null,"",null,null,{"$f":"IF(AG109>0,(VLOOKUP(G109,Codici!B:F,4,FALSE)),\"\")","v":""},null,null,null,null,null,null,null,{"$f":"IF(AG109>0,(VLOOKUP(G109,Codici!B:F,2,FALSE)),\"\")","v":""},null,"",null,0,"TS2L5-PDU32A",{"$f":"'RACK, Accessori e Servizi'!J33","v":0},null,null,null,null,null,null,null,null,0,0,0,0,0,0,0,0,0,null,null,null,null,0]
[null,"",{"$f":"IF(AG110=0,\"\",(VLOOKUP(G110,Codici!B:F,5,FALSE)))","v":""},null,null,null,"",null,null,{"$f":"IF(AG110>0,(VLOOKUP(G110,Codici!B:F,4,FALSE)),\"\")","v":""},null,null,null,null,null,null,null,{"$f":"IF(AG110>0,(VLOOKUP(G110,Codici!B:F,2,FALSE)),\"\")","v":""},null,"",null,0,"TS2L5-NECPUSFF"]
[null,"",{"$f":"IF(AG111=0,\"\",(VLOOKUP(G111,Codici!B:F,5,FALSE)))","v":""},null,null,null,"",null,null,{"$f":"IF(AG111>0,(VLOOKUP(G111,Codici!B:F,4,FALSE)),\"\")","v":""},null,null,null,null,null,null,null,{"$f":"IF(AG111>0,(VLOOKUP(G111,Codici!B:F,2,FALSE)),\"\")","v":""},null,"",null,0,"TS2L5-NECPUSHY"]
[null,"",{"$f":"IF(AG112=0,\"\",(VLOOKUP(G112,Codici!B:F,5,FALSE)))","v":""},null,null,null,"",null,null,{"$f":"IF(AG112>0,(VLOOKUP(G112,Codici!B:F,4,FALSE)),\"\")","v":""},null,null,null,null,null,null,null,{"$f":"IF(AG112>0,(VLOOKUP(G112,Codici!B:F,2,FALSE)),\"\")","v":""},null,"",null,0,"TS2L5-CVLT10"]
[null,"",{"$f":"IF(AG113=0,\"\",(VLOOKUP(G113,Codici!B:F,5,FALSE)))","v":""},null,null,null,"",null,null,{"$f":"IF(AG113>0,(VLOOKUP(G113,Codici!B:F,4,FALSE)),\"\")","v":""},null,null,null,null,null,null,null,{"$f":"IF(AG113>0,(VLOOKUP(G113,Codici!B:F,2,FALSE)),\"\")","v":""},null,"",null,0,"TS2L5-BR1CPU"]
[null,"",{"$f":"IF(AG114=0,\"\",(VLOOKUP(G114,Codici!B:F,5,FALSE)))","v":""},null,null,null,"",null,null,{"$f":"IF(AG114>0,(VLOOKUP(G114,Codici!B:F,4,FALSE)),\"\")","v":""},null,null,null,null,null,null,null,{"$f":"IF(AG114>0,(VLOOKUP(G114,Codici!B:F,2,FALSE)),\"\")","v":""},null,"",null,0,"TS2L5-NECSHY"]
[null,"",{"$f":"IF(AG115=0,\"\",(VLOOKUP(G115,Codici!B:F,5,FALSE)))","v":""},null,null,null,"",null,null,{"$f":"IF(AG115>0,(VLOOKUP(G115,Codici!B:F,4,FALSE)),\"\")","v":""},null,null,null,null,null,null,null,{"$f":"IF(AG115>0,(VLOOKUP(G115,Codici!B:F,2,FALSE)),\"\")","v":""},null,"",null,0,"TS2L5-NECSFF"]
[null,"",{"$f":"IF(AG116=0,\"\",(VLOOKUP(G116,Codici!B:F,5,FALSE)))","v":""},null,null,null,"",null,null,{"$f":"IF(AG116>0,(VLOOKUP(G116,Codici!B:F,4,FALSE)),\"\")","v":""},null,null,null,null,null,null,null,{"$f":"IF(AG116>0,(VLOOKUP(G116,Codici!B:F,2,FALSE)),\"\")","v":""},null,"",null,0,"TS2L5-VSA4TB"]
[null,{"$f":"IF(AT117=0,\"\",AT117)","v":""},{"$f":"IF(AG117=0,\"\",(VLOOKUP(G117,Codici!B:F,5,FALSE)))","v":""},null,null,null,"",null,null,{"$f":"IF(AG117>0,(VLOOKUP(G117,Codici!B:F,4,FALSE)),\"\")","v":""},null,null,null,null,null,null,null,{"$f":"IF(AG117>0,(VLOOKUP(G117,Codici!B:F,2,FALSE)),\"\")","v":""},null,"",null,0,"TS2L5-VSA1TB"]
[null,"TOTALE PRODOTTI CONVENZIONE (I.V.A. Esclusa)",null,null,null,null,null,null,null,null,null,null,null,null,null,null,null,{"$f":"SUM(T15:U50)","v":0},null,null,null,{"$f":"IF(R118>0,1,0)","v":0}]
[null,"TOTALE ULTERIORI OPZIONI (I.V.A. Esclusa)",null,null,null,null,null,null,null,null,null,null,null,null,null,null,null,{"$f":"SUM(T52:U117)","v":0},null,null,null,1]
[null,"TOTALE (I.V.A. Esclusa)",null,null,null,null,null,null,null,null,null,null,null,null,null,null,null,{"$f":"R119+R118","v":0},null,null,null,1]
[null,"I.V.A.",null,null,null,null,null,null,null,null,null,null,null,null,null,null,null,{"$f":"R120*22%","v":0},null,null,null,1]
[null,"TOTALE ORDINE",null,null,null,null,null,null,null,null,null,null,null,null,null,null,null,{"$f":"SUM(R120:U121)","v":0},null,null,null,1]
[null,null,null,null,null,null,null,null,null,null,null,null,null,null,null,null,null,null,null,null,null,1]
[null,null,null,null,null,null,null,null,null,null,null,null,null,null,null,null,null,null,null,null,null,1]
[null,null,null,null,null,null,null,null,null,null,null,null,null,null,null,null,null,null,null,null,null,1]
[null,null,null,{"$f":"IF(G6>0,\"DETTAGLIO CONFIGURAZIONI SERVER LOTTO 5 \",\"\")","v":""},null,null,null,null,null,null,null,null,null,null,null,null,null,null,null,null,null,1]
[null,null,null,null,null,null,null,null,null,null,null,null,null,null,null,null,null,null,null,null,null,1]
[null,null,null,null,null,null,null,null,null,null,null,null,null,null,null,null,null,null,null,null,null,1]
[null,null,null,null,null,null,null,null,null,null,null,null,null,null,null,null,null,null,null,null,null,{"$f":"IF($B$15>=\"\",0,1)","v":0}]
[null,"Proliant DL560 Gen10 Conf.1",null,null,{"$f":"SRV_A","v":0},"Server",null,null,"Proliant DL560 Gen10 Conf.2",null,null,{"$f":"SRV_AA","v":0},"Server",null,null,"Proliant DL560 Gen10  Conf.3",null,null,{"$f":"SRV_AAA","v":0},"Server",null,{"$f":"IF($B$15>=\"\",0,1)","v":0}]
[null,null,null,null,null,null,null,null,null,null,null,null,null,null,null,null,null,null,null,null,null,{"$f":"IF($B$15>=\"\",0,1)","v":0}]
[null,{"$f":"IF(SRV_A>0,\"1\",\"-\")","v":"-"},{"$f":"IF(B132=\"-\",\"-\",CONCATENATE(MID($C$15,1,21),\" - \",$G$15))","v":"-"},null,null,null,null,null,{"$f":"IF(SRV_AA>0,\"1\",\"-\")","v":"-"},{"$f":"IF(I132=\"-\",\"-\",CONCATENATE(MID($C$15,1,21),\" - \",$G$15))","v":"-"},null,null,null,null,null,{"$f":"IF(SRV_AAA>0,\"1\",\"-\")","v":"-"},{"$f":"IF(P132=\"-\",\"-\",CONCATENATE(MID($C$15,1,21),\" - \",$G$15))","v":"-"},null,null,null,null,{"$f":"IF($B$15>=\"\",0,1)","v":0}]
[null,{"$f":"IF(X16=0,\"-\",X16/$E$130)","v":"-"},{"$f":"IF(B133=\"-\",\"-\",CONCATENATE(MID($C$16,1,21),\" - \",$G$16))","v":"-"},null,null,null,null,null,{"$f":"IF(Y16=0,\"-\",Y16/$L$130)","v":"-"},{"$f":"IF(I133=\"-\",\"-\",CONCATENATE(MID(C16,1,21),\" - \",G16))","v":"-"},null,null,null,null,null,{"$f":"IF(Z16=0,\"-\",Z16/$S$130)","v":"-"},{"$f":"IF(P133=\"-\",\"-\",CONCATENATE(MID(C16,1,21),\" - \",G16))","v":"-"},null,null,null,null,{"$f":"Z133","v":0},{"$f":"IF(B133=\"-\",0,B133)","v":0},{"$f":"IF(I133=\"-\",0,I133)","v":0},{"$f":"IF(P133=\"-\",0,P133)","v":0},{"$f":"IF(X133+W133+Y133>0,1,0)","v":0}]
[null,"-",{"$f":"IF(B134=\"-\",\"-\",CONCATENATE(MID($C$17,1,21),\" - \",$G$17))","v":"-"},null,null,null,null,null,"-","-",null,null,null,null,null,"-","-",null,null,null,null,{"$f":"Z134","v":0},{"$f":"IF(B134=\"-\",0,B134)","v":0},{"$f":"IF(I134=\"-\",0,I134)","v":0},{"$f":"IF(P134=\"-\",0,P134)","v":0},{"$f":"IF(X134+W134+Y134>0,1,0)","v":0}]
[null,"-",{"$f":"IF(B135=\"-\",\"-\",CONCATENATE(MID($C$18,1,21),\" - \",$G$18))","v":"-"},null,null,null,null,null,"-","-",null,null,null,null,null,"-","-",null,null,null,null,0,0,0,0,0]
[null,"-",{"$f":"IF(B136=\"-\",\"-\",CONCATENATE(MID(C19,1,21),\" - \",G19))","v":"-"},null,null,null,null,null,"-","-",null,null,null,null,null,"-","-",null,null,null,null,0,0,0,0,0]
[null,"-","-",null,null,null,null,null,"-","-",null,null,null,null,null,"-","-",null,null,null,null,0,0,0,0,0]
[null,"-","-",null,null,null,null,null,"-","-",null,null,null,null,null,"-","-",null,null,null,null,0,0,0,0,0]
[null,"-","-",null,null,null,null,null,"-","-",null,null,null,null,null,"-","-",null,null,null,null,0,0,0,0,0]
[null,"-","-",null,null,null,null,null,"-","-",null,null,null,null,null,"-","-",null,null,null,null,0,0,0,0,0]
[null,"-","-",null,null,null,null,null,"-","-",null,null,null,null,null,"-","-",null,null,null,null,0,0,0,0,0]
[null,"-","-",null,null,null,null,null,"-","-",null,null,null,null,null,"-","-",null,null,null,null,0,0,0,0,0]
[null,"-","-",null,null,null,null,null,"-","-",null,null,null,null,null,"-","-",null,null,null,null,0,0,0,0,0]
[null,"-","-",null,null,null,null,null,"-","-",null,null,null,null,null,"-","-",null,null,null,null,0,0,0,0,0]
[null,"-","-",null,null,null,null,null,"-","-",null,null,null,null,null,"-","-",null,null,null,null,0,0,0,0,0]
[null,"-","-",null,null,null,null,null,"-","-",null,null,null,null,null,"-","-",null,null,null,null,0,0,0,0,0]
[null,"-","-",null,null,null,null,null,"-","-",null,null,null,null,null,"-","-",null,null,null,null,0,0,0,0,0]
[null,"-","-",null,null,null,null,null,"-","-",null,null,null,null,null,"-","-",null,null,null,null,0,{"$f":"IF(B148=\"-\",0,B148)","v":0},{"$f":"IF(I148=\"-\",0,I148)","v":0},{"$f":"IF(P148=\"-\",0,P148)","v":0},{"$f":"IF(X148+W148+Y148>0,1,0)","v":0}]
[null,"-","-",null,null,null,null,null,"-","-",null,null,null,null,null,"-","-",null,null,null,null,0,{"$f":"IF(B149=\"-\",0,B149)","v":0},{"$f":"IF(I149=\"-\",0,I149)","v":0},{"$f":"IF(P149=\"-\",0,P149)","v":0},{"$f":"IF(X149+W149+Y149>0,1,0)","v":0}]
[null,"-","-",null,null,null,null,null,"-","-",null,null,null,null,null,"-","-",null,null,null,null,0,0,0,0,0]
[null,"-","-",null,null,null,null,null,"-","-",null,null,null,null,null,"-","-",null,null,null,null,0,0,0,0,0]
[null,{"$f":"IF(X36=0,\"-\",X36/$E$130)","v":"-"},{"$f":"IF(B152=\"-\",\"-\",CONCATENATE(MID(C36,1,21),\" - \",G36))","v":"-"},null,null,null,null,null,{"$f":"IF(Y36=0,\"-\",Y36/$L$130)","v":"-"},{"$f":"IF(I152=\"-\",\"-\",CONCATENATE(MID(C36,1,21),\" - \",G36))","v":"-"},null,null,null,null,null,{"$f":"IF(Z36=0,\"-\",Z36/$S$130)","v":"-"},{"$f":"IF(P152=\"-\",\"-\",CONCATENATE(MID(C36,1,21),\" - \",G36))","v":"-"},null,null,null,null,0,0,0,0,0]
[null,"-","-",null,null,null,null,null,"-","-",null,null,null,null,null,"-","-",null,null,null,null,0,0,0,0,0]
[null,"-","-",null,null,null,null,null,"-","-",null,null,null,null,null,"-","-",null,null,null,null,0,0,0,0,0]
[null,"-","-",null,null,null,null,null,"-","-",null,null,null,null,null,"-","-",null,null,null,null,0,0,0,0,0]
[null,"-","-",null,null,null,null,null,"-","-",null,null,null,null,null,"-","-",null,null,null,null,0,0,0,0,0]
[null,"-","-",null,null,null,null,null,"-","-",null,null,null,null,null,"-","-",null,null,null,null,{"$f":"Z157","v":0},0,0,0,0]
[null,"-","-",null,null,null,null,null,"-","-",null,null,null,null,null,"-","-",null,null,null,null,0,0,0,0,0]
[null,"-","-",null,null,null,null,null,"-","-",null,null,null,null,null,"-","-",null,null,null,null,0,0,0,0,0]
[null,"-","-",null,null,null,null,null,"-","-",null,null,null,null,null,"-","-",null,null,null,null,0,0,0,0,0]
[null,{"$f":"IF(X52=0,\"-\",X52/$E$130)","v":"-"},{"$f":"IF(B161=\"-\",\"-\",CONCATENATE(MID(C52,1,21),\" - \",G52))","v":"-"},null,null,null,null,null,{"$f":"IF(Y52=0,\"-\",Y52/$L$130)","v":"-"},{"$f":"IF(I161=\"-\",\"-\",CONCATENATE(MID(C52,1,24),\" - \",G52))","v":"-"},null,null,null,null,null,{"$f":"IF(Z52=0,\"-\",Z52/$S$130)","v":"-"},{"$f":"IF(P161=\"-\",\"-\",CONCATENATE(MID(C52,1,24),\" - \",G52))","v":"-"},null,null,null,null,0,0,0,0,0]
[null,{"$f":"IF(X53=0,\"-\",X53/$E$130)","v":"-"},{"$f":"IF(B162=\"-\",\"-\",CONCATENATE(MID(C53,1,21),\" - \",G53))","v":"-"},null,null,null,null,null,{"$f":"IF(Y53=0,\"-\",Y53/$L$130)","v":"-"},{"$f":"IF(I162=\"-\",\"-\",CONCATENATE(MID(C53,1,24),\" - \",G53))","v":"-"},null,null,null,null,null,{"$f":"IF(Z53=0,\"-\",Z53/$S$130)","v":"-"},{"$f":"IF(P162=\"-\",\"-\",CONCATENATE(MID(C53,1,24),\" - \",G53))","v":"-"},null,null,null,null,{"$f":"Z162","v":0},0,0,0,0]
[null,"-","-",null,null,null,null,null,"-","-",null,null,null,null,null,"-","-",null,null,null,null,0,0,0,0,0]
[null,"-","-",null,null,null,null,null,"-","-",null,null,null,null,null,"-","-",null,null,null,null,0,0,0,0,0]
[null,"-","-",null,null,null,null,null,"-","-",null,null,null,null,null,"-","-",null,null,null,null,0,0,0,0,0]
[null,"-","-",null,null,null,null,null,"-","-",null,null,null,null,null,"-","-",null,null,null,null,0,0,0,0,0]
[null,"-","-",null,null,null,null,null,"-","-",null,null,null,null,null,"-","-",null,null,null,null,0,0,0,0,0]
[null,"-","-",null,null,null,null,null,"-","-",null,null,null,null,null,"-","-",null,null,null,null,0,0,0,0,0]
[null,"-","-",null,null,null,null,null,"-","-",null,null,null,null,null,"-","-",null,null,null,null,0,0,0,0,0]
[null,"-","-",null,null,null,null,null,"-","-",null,null,null,null,null,"-","-",null,null,null,null,0,0,0,0,0]
[null,"-","-",null,null,null,null,null,"-","-",null,null,null,null,null,"-","-",null,null,null,null,0,0,0,0,0]
[null,"-","-",null,null,null,null,null,"-","-",null,null,null,null,null,"-","-",null,null,null,null,0,0,0,0,0]
[null,"-","-",null,null,null,null,null,"-","-",null,null,null,null,null,"-","-",null,null,null,null,0,0,0,0,0]
[null,"-","-",null,null,null,null,null,"-","-",null,null,null,null,null,"-","-",null,null,null,null,0,0,0,0,0]
[null,"-","-",null,null,null,null,null,"-","-",null,null,null,null,null,"-","-",null,null,null,null,0,0,0,0,0]
[null,"-","-",null,null,null,null,null,"-","-",null,null,null,null,null,"-","-",null,null,null,null,0,0,0,0,0]
[null,"-","-",null,null,null,null,null,"-","-",null,null,null,null,null,"-","-",null,null,null,null,0,0,0,0,0]
[null,"-","-",null,null,null,null,null,"-","-",null,null,null,null,null,"-","-",null,null,null,null,0,0,0,0,0]
[null,"-","-",null,null,null,null,null,"-","-",null,null,null,null,null,"-",{"$f":"IF(P179=\"-\",\"-\",CONCATENATE(MID(C70,1,24),\" - \",G70))","v":"-"},null,null,null,null,0,0,0,0,0]
[null,"-","-",null,null,null,null,null,"-","-",null,null,null,null,null,"-","-",null,null,null,null,0,0,0,0,0]
[null,"-","-",null,null,null,null,null,"-","-",null,null,null,null,null,"-","-",null,null,null,null,0,0,0,0,0]
[null,"-","-",null,null,null,null,null,"-","-",null,null,null,null,null,"-","-",null,null,null,null,0,0,0,0,0]
[null,"-","-",null,null,null,null,null,"-","-",null,null,null,null,null,"-","-",null,null,null,null,0,0,0,0,0]
[null,"-","-",null,null,null,null,null,"-","-",null,null,null,null,null,"-","-",null,null,null,null,0,0,0,0,0]
[null,"-","-",null,null,null,null,null,"-","-",null,null,null,null,null,"-","-",null,null,null,null,0,0,0,0,0]
[null,"-","-",null,null,null,null,null,"-","-",null,null,null,null,null,"-","-",null,null,null,null,0,0,0,0,0]
[null,"-","-",null,null,null,null,null,"-","-",null,null,null,null,null,"-","-",null,null,null,null,0,0,0,0,0]
[null,"-","-",null,null,null,null,null,"-","-",null,null,null,null,null,"-","-",null,null,null,null,0,0,0,0,0]
[null,"-","-",null,null,null,null,null,"-","-",null,null,null,null,null,"-","-",null,null,null,null,0,0,0,0,0]
[null,"-","-",null,null,null,null,null,"-","-",null,null,null,null,null,"-","-",null,null,null,null,0,0,0,0,0]
[null,"-","-",null,null,null,null,null,"-","-",null,null,null,null,null,"-","-",null,null,null,null,0,0,0,0,0]
[null,"-","-",null,null,null,null,null,"-","-",null,null,null,null,null,"-","-",null,null,null,null,0,0,0,0,0]
[null,"-","-",null,null,null,null,null,"-","-",null,null,null,null,null,"-","-",null,null,null,null,0,0,0,0,0]
[null,"-","-",null,null,null,null,null,"-","-",null,null,null,null,null,"-","-",null,null,null,null,0,0,0,0,0]
[null,"-","-",null,null,null,null,null,"-","-",null,null,null,null,null,"-","-",null,null,null,null,0,0,0,0,0]
[null,"-","-",null,null,null,null,null,"-","-",null,null,null,null,null,"-","-",null,null,null,null,0,0,0,0,0]
[null,"-","-",null,null,null,null,null,"-","-",null,null,null,null,null,"-","-",null,null,null,null,0,0,0,0,0]
[null,"-","-",null,null,null,null,null,"-","-",null,null,null,null,null,"-","-",null,null,null,null,0,0,0,0,0]
[null,"-","-",null,null,null,null,null,"-","-",null,null,null,null,null,"-","-",null,null,null,null,0,0,0,0,0]
[null,"-","-",null,null,null,null,null,"-","-",null,null,null,null,null,"-","-",null,null,null,null,0,0,0,0,0]
[null,"-","-",null,null,null,null,null,"-","-",null,null,null,null,null,"-","-",null,null,null,null,0,0,0,0,0]
[null,"-","-",null,null,null,null,null,"-","-",null,null,null,null,null,"-","-",null,null,null,null,0,0,0,0,0]
[null,"-","-",null,null,null,null,null,"-","-",null,null,null,null,null,"-","-",null,null,null,null,0,0,0,0,0]
[null,"-","-",null,null,null,null,null,"-","-",null,null,null,null,null,"-","-",null,null,null,null,0,0,0,0,0]
[null,"-","-",null,null,null,null,null,"-","-",null,null,null,null,null,"-","-",null,null,null,null,0,0,0,0,0]
[null,"-","-",null,null,null,null,null,"-","-",null,null,null,null,null,"-","-",null,null,null,null,0,0,0,0,0]
[null,"-","-",null,null,null,null,null,"-","-",null,null,null,null,null,"-","-",null,null,null,null,0,0,0,0,0]
[null,"-","-",null,null,null,null,null,"-","-",null,null,null,null,null,"-","-",null,null,null,null,0,0,0,0,0]
[null,"-","-",null,null,null,null,null,"-","-",null,null,null,null,null,"-","-",null,null,null,null,0,0,0,0,0]
[null,"-","-",null,null,null,null,null,"-","-",null,null,null,null,null,"-","-",null,null,null,null,0,0,0,0,0]
[null,"-","-",null,null,null,null,null,"-","-",null,null,null,null,null,"-","-",null,null,null,null,0,0,0,0,0]
[null,"-","-",null,null,null,null,null,"-","-",null,null,null,null,null,"-","-",null,null,null,null,0,0,0,0,0]
[null,"-","-",null,null,null,null,null,"-","-",null,null,null,null,null,"-","-",null,null,null,null,0,{"$f":"IF(B213=\"-\",0,B213)","v":0},{"$f":"IF(I213=\"-\",0,I213)","v":0},{"$f":"IF(P213=\"-\",0,P213)","v":0},{"$f":"IF(X213+W213+Y213>0,1,0)","v":0}]
[null,"-","-",null,null,null,null,null,"-","-",null,null,null,null,null,"-","-",null,null,null,null,0,0,0,0,0]
[null,"-","-",null,null,null,null,null,"-","-",null,null,null,null,null,"-","-",null,null,null,null,0,0,0,0,0]
[null,null,null,null,null,null,null,null,null,null,null,null,null,null,null,null,null,null,null,null,null,{"$f":"IF($B$15>=\"\",0,1)","v":0}]
[null,"Configurazione RAID",null,null,null,null,null,null,"Configurazione RAID",null,null,null,null,null,null,"Configurazione RAID",null,null,null,null,null,0]
[null,null,null,null,null,null,null,null,null,null,null,null,null,null,null,null,null,null,null,null,null,0]
[null,{"$f":"'Lotto5 DL560 Gen10 1'!B127","v":"Specificare la configurazione RAID per l'installazione del Sistema Operativo, se richiesto.\ne/o\ninserire eventuali note."},null,null,null,null,null,null,{"$f":"'Lotto5 DL560 Gen10 2'!B127","v":"Specificare la configurazione RAID per l'installazione del Sistema Operativo, se richiesto.\ne/o\ninserire eventuali note."},null,null,null,null,null,null,{"$f":"'Lotto5 DL560 Gen10 3'!B127","v":"Specificare la configurazione RAID per l'installazione del Sistema Operativo, se richiesto.\ne/o\ninserire eventuali note."},null,null,null,null,null,0]
[null,null,null,null,null,null,null,null,null,null,null,null,null,null,null,null,null,null,null,null,null,0]
[null,null,null,null,null,null,null,null,null,null,null,null,null,null,null,null,null,null,null,null,null,0]
[null,null,null,null,null,null,null,null,null,null,null,null,null,null,null,null,null,null,null,null,null,0]
[null,null,null,null,null,null,null,null,null,null,null,null,null,null,null,null,null,null,null,null,null,0]
[null,null,null,null,null,null,null,null,null,null,null,null,null,null,null,null,null,null,null,null,null,0]
[null,null,null,null,null,null,null,null,null,null,null,null,null,null,null,null,null,null,null,null,null,0]
[null,null,null,null,null,null,null,null,null,null,null,null,null,null,null,null,null,null,null,null,null,0]
[null,null,null,null,null,null,null,null,null,null,null,null,null,null,null,null,null,null,null,null,null,0]
[null,null,null,null,null,null,null,null,null,null,null,null,null,null,null,null,null,null,null,null,null,0]
[null,null,null,null,null,null,null,null,null,null,null,null,null,null,null,null,null,null,null,null,null,0]
[null,null,null,null,null,null,null,null,null,null,null,null,null,null,null,null,null,null,null,null,null,0]
[null,null,null,null,null,null,null,null,null,null,null,null,null,null,null,null,null,null,null,null,null,0]
[null,null,null,null,null,null,null,null,null,null,null,null,null,null,null,null,null,null,null,null,null,0]
[null,null,null,null,null,null,null,null,null,null,null,null,null,null,null,null,null,null,null,null,null,0]
[null,null,null,null,null,null,null,null,null,null,null,null,null,null,null,null,null,null,null,null,null,0]
[null,null,null,null,null,null,null,null,null,null,null,null,null,null,null,null,null,null,null,null,null,0]
[null,null,null,null,null,null,null,null,null,null,null,null,null,null,null,null,null,null,null,null,null,{"$f":"IF($B$15>=\"\",0,1)","v":0},null,null,null,"Calcolo x filtro"]
[null,null,null,null,null,null,null,null,null,null,null,null,null,null,null,null,null,null,null,null,null,1]
[null,null,null,null,null,null,null,null,null,null,null,null,null,null,null,null,null,null,null,null,null,1]
[null,null,null,{"$f":"MID(C237,13,5)","v":""},null,{"$f":"MID(E237,13,5)","v":""},null,"",null,"",null,"",null,"",null,"",null,"",null,"",null,1]
[null,null,null,"AREA RISERVATA AL FORNITORE",null,null,null,null,null,null,null,null,null,null,null,null,null,null,null,null,null,1]
[null,null,null,null,null,null,null,null,null,null,null,null,null,null,null,null,null,null,null,null,null,1]
[null,null,null,null,null,null,null,null,null,null,null,null,null,null,null,null,null,null,null,null,null,1]
[null,null,"VERIFICA STAGING",null,null,null,null,null,null,null,null,null,null,null,"VERIFICA INSTALLATORE",null,null,null,null,null,null,1]
[null,null,null,null,null,null,null,null,null,null,null,null,null,null,null,null,null,null,null,null,null,1]
[null,null,null,null,null,null,null,null,null,null,null,null,null,null,null,null,null,null,null,null,null,1]
[null,null,null,null,null,null,null,null,null,null,null,null,null,null,null,null,null,null,null,null,null,1]
[null,null,null,null,null,null,null,null,null,null,null,null,null,null,null,null,null,null,null,null,null,1]
[null,null,null,null,null,null,null,null,null,null,null,null,null,null,null,null,null,null,null,null,null,1]

{"sheet":"Codici","index":5,"n_rows":113,"n_cols":6,"rows_kept":113,"cut":false,"hidden":true,"merged":[[47,0,48,0],[47,1,48,1],[47,2,48,2],[47,5,48,5],[1,2,3,2],[19,0,20,0],[21,0,22,0],[19,1,20,1],[21,1,22,1],[19,2,20,2],[21,2,22,2],[1,0,3,0],[1,1,3,1],[5,0,6,0],[5,1,6,1],[40,1,41,1],[25,2,26,2],[27,2,28,2],[40,2,41,2],[25,0,26,0],[27,0,28,0],[40,0,41,0],[25,1,26,1],[27,1,28,1],[27,5,28,5],[40,5,41,5],[1,5,3,5],[5,5,6,5],[19,5,20,5],[21,5,22,5],[25,5,26,5]]}
["CODICE CONVERGE","CODICE CONVENZIONE","Prezzo vendita da Converge a CONSIP tot.","Qty Bundle","Description","CODICE CONVERGE"]
["TS2L5-SRV-U","TS2L5-SRV-U",6078,1,"HPE ProLiant DL560 Gen10 Server PRESTAZIONALE\n(2CPU Intel Xeon Gold 5220)","TS2L5-SRV-U"]
[null,null,null,1,"Manutenzione Server Base - via Day 1 contract"]
[null,null,null,1,"HPE Mobile USB DVDRW Drive"]
[]
["TS2L5-CPU-U","TS2L5-CPU-U",3289,2,"HPE DL560 Gen10 Intel Xeon-Gold 5220 (2.2GHz/18-core/125W)","TS2L5-CPU-U"]
[null,null,null,1,"HPE DL5x0 Gen10 CPU Mezzanine Board Kit"]
[]
["TS2H-RAM16-U","TS2L5-RAM16-U",136,1,"HPE 16GB 1Rx4 PC4-2933 Smart Kit","TS2H-RAM16-U"]
["TS2H-RAM32-U","TS2L5-RAM32-U",397,1,"HPE 32GB 2Rx4 PC4-2933 Smart Kit","TS2H-RAM32-U"]
["TS2H-RAM64-U","TS2L5-RAM64-U",705,1,"HPE 64GB 4Rx4 PC4-2933 Smart Kit","TS2H-RAM64-U"]
[]
["TS2H-15K300","TS2L5-15K300",137,1,"HPE 300GB SAS 15K SFF SC DS HDD","TS2H-15K300"]
["TS2H-10K1200","TS2L5-10K1200",146,1,"HPE 1.2TB SAS 10K SFF SC DS HDD","TS2H-10K1200"]
["TS2H-10K1800","TS2L5-10K1800",190,1,"HPE 1.8TB SAS 10K SFF SC 512e DS HDD","TS2H-10K1800"]
["TS2H-SSDR960","TS2L5-SSDR960",664,1,"HPE 960GB SAS RI SFF SC DS SSD","TS2H-SSDR960"]
["TS2H-SSDR1920","TS2L5-SSDR1920",1313,1,"HPE 1.92TB SAS 12G Read Intensive SFF","TS2H-SSDR1920"]
[]
["TS2H-LAN1","TS2L5-LAN1",33,1,"HPE Ethernet 1Gb 2P 332T Adptr","TS2H-LAN1"]
["TS2H-LAN10","TS2L5-LAN10",344,1,"HPE Ethernet 10Gb 2P 530SFP+ Adptr","TS2H-LAN10"]
[null,null,null,2,"HPE BLc 10G SFP+ SR Transceiver"]
["TS2H-CNA10","TS2L5-CNA10",723,1,"HPE CN1100R 2P Converged Network Adapter","TS2H-CNA10"]
[null,null,null,2,"HPE BLc 10G SFP+ SR Transceiver"]
["TS2H-FC16","TS2L5-FC16",356,1,"HPE SN1100Q 16Gb 2p FC HBA","TS2H-FC16"]
[]
["TS2H-4Y","TS2L5-4Y",300,1,"Estensione della manutenzione in garanzia per ulteriori 12 mesi","TS2H-4Y"]
[null,null,null,1,"Onsite Labor CRU, 1Year"]
["TS2H-5Y","TS2L5-5Y",600,1,"Estensione della manutenzione in garanzia per ulteriori 24 mesi","TS2H-5Y"]
[null,null,null,2,"Onsite Labor CRU, 1Year"]
[]
["TS2H-WIN1","TS2L5-WIN1",551,1,"Microsoft Windows Server 2019 Standard Edition ROK 16 Core","TS2H-WIN1"]
["TS2H-WIN2","TS2L5-WIN2",551,1,"Microsoft Windows Server 2019 Standard Edition Additional License 16 Core","TS2H-WIN2"]
["TS2H-CALDEV","TS2L5-CALDEV",21,1,"Microsoft Windows Server 2019 1 Device CAL","TS2H-CALDEV"]
["TS2H-CALUSER","TS2L5-CALUSER",21,1,"Microsoft Windows Server 2019 User CAL","TS2H-CALUSER"]
["TS2H-WIN2CORE","TS2L5-WIN2CORE",54,1,"Microsoft Windows Server 2019 Standard Edition Additional License 2 Core","TS2H-WIN2CORE"]
["TS2H-WINDC1","TS2L5-WINDC1",2159,1,"Microsoft Windows Server 2019 Datacenter Edition ROK 16 Core","TS2H-WINDC1"]
["TS2H-WINDC2","TS2L5-WINDC2",2159,1,"Microsoft Windows Server 2019 Datacenter Edition Additional License 16 Core","TS2H-WINDC2"]
["TS2H-WINDC2COR","TS2L5-WINDC2COR",399,1,"Microsoft Windows Server 2019 Datacenter Edition Additional License 2 Core","TS2H-WINDC2COR"]
["TS2H-LINUX","TS2L5-LINUX",49,1,"CentOS 7.x","TS2H-LINUX"]
[]
["TS2-UPS","TS2L5-UPS",387,1,"UPS MSR 3000VA + staffe","TS2-UPS"]
[null,null,{"$f":"B42*#REF!","v":{"$error":"#REF!"}},1,"Kit 2 Guide universali per UPS"]
["TS2-GUI","TS2L5-GUI",448,1,"Console KVM GUI da rack","TS2-GUI"]
["TS2-RACK","TS2L5-RACK",504,1,"Armadio Rack 42U","TS2-RACK"]
["TS2-KVMIP","TS2L5-KVMIP",495,1,"KVM Switch IP per GUI 16P con cavi","TS2-KVMIP"]
[]
["TS2-3MRJ45","TS2L5-3MRJ45",2,null,"Cavo Rete UTP cat. 5e 3 metri A20","TS2-3MRJ45"]
["TS2H-SASBAY1","TS2L5-SASBAY1",800,1,"Kit per ulteriori 8 HDD (HPE DL560 Gen10 8SFF HDD Bay1) comprensivo di SAS Expander","TS2H-SASBAY1"]
[null,null,null,1,"HPE DL5x0 Gen10 12Gb SAS Expander"]
["TS2H-530T","TS2L5-530T",298,1,"HPE Ethernet 10Gb 2-port 530T Adapter","TS2H-530T"]
["TS2H-521T","TS2L5-521T",298,1,"HPE Ethernet 10Gb 2-port 521T Adapter","TS2H-521T"]
["TS2H-536FLR","TS2L5-536FLR",610,1,"HPE FlexFabric 10Gb 4-port 536FLR-T Adapter","TS2H-536FLR"]
["TS2H-562SFP","TS2L5-562SFP",380,1,"HPE Ethernet 10Gb 2-port 562SFP+ Adapter","TS2H-562SFP"]
["TS2H-10OTSR","TS2L5-10OTSR",230,1,"HPE 10Gb SFP+ SR Transceiver","TS2H-10OTSR"]
["TS2H-10OTLR","TS2L5-10OTLR",481,1,"HPE 10G SFP+ LR Transceiver","TS2H-10OTLR"]
["TS2H-GPURSRKIT","TS2L5-GPURSRKIT",87,1,"HPE DL Gen10 x16 x16 GPU Rsr Kit","TS2H-GPURSRKIT"]
["TS2H-P2000GPU","TS2L5-P2000GPU",690,1,"HPE NVIDIA Quadro P2000 GPU Module","TS2H-P2000GPU"]
["TS2H-841QSFP28","TS2L5-841QSFP28",2699,1,"HPE InfiniBand EDR 100Gb 1-port 841QSFP28 Adapter","TS2H-841QSFP28"]
["TS2H-OP101","TS2L5-OP101",554,1,"HPE 100Gb 1-port OP101 QSFP28 x16 PCIe Gen3 with Intel Omni-Path Architecture Adapter","TS2H-OP101"]
["TS2H-547FLR","TS2L5-547FLR",461,1,"HPE InfiniBand FDR/Ethernet 40/50Gb 2-port 547FLR-QSFP Adapter","TS2H-547FLR"]
["TS2H-VMWSTD1P5Y","TS2L5-VMWSTD1P5Y",1933,1,"VMware vSphere Standard 1 Processor 5yr Software","TS2H-VMWSTD1P5Y"]
["TS2H-VMWEP1P5Y","TS2L5-VMWEP1P5Y",5889,1,"VMware vSphere Enterprise Plus 1 Processor 5yr Software","TS2H-VMWEP1P5Y"]
["TS2H-VMWSTD1P3Y","TS2L5-VMWSTD1P3Y",1506,1,"VMware vSphere Standard 1 Processor 3yr Software","TS2H-VMWSTD1P3Y"]
["TS2H-VMWEP1P3Y","TS2L5-VMWEP1P3Y",4734,1,"VMware vSphere Enterprise Plus 1 Processor 3yr Software","TS2H-VMWEP1P3Y"]
["TS2H-VMWKIT6P3Y","TS2L5-VMWKIT6P3Y",5052,1,"VMware vSphere Essentials Plus Kit 6 Processor 3yr","TS2H-VMWKIT6P3Y"]
["TS2H-VMWKIT6P5Y","TS2L5-VMWKIT6P5Y",6284,1,"VMware vSphere Essentials Plus Kit 6 Processor 5yr","TS2H-VMWKIT6P5Y"]
["TS2H-VMWVCSTD3Y","TS2L5-VMWVCSTD3Y",8240,1,"VMw vCenter Server Std for vSph 3yr SW","TS2H-VMWVCSTD3Y"]
["TS2H-VMWVCSTD5Y","TS2L5-VMWVCSTD5Y",10251,1,"VMw vCenter Server Std for vSph 5yr SW","TS2H-VMWVCSTD5Y"]
["TS2H-OV3YILO","TS2L5-OV3YILO",480,1,"HPE OV 3yr 24x7 Supp Phys 1 Svr Lic","TS2H-OV3YILO"]
["TS2H-DACQSFPM2","TS2L5-DACQSFPM2",147,1,"HPE 2M FDR Quad Small Form Factor Pluggable InfiniBand Copper Cable","TS2H-DACQSFPM2"]
["TS2H-DAC100M2","TS2L5-DAC100M2",117,1,"HPE 2M 100Gb QSFP28 Omni-Path Architecture Copper Cable","TS2H-DAC100M2"]
["TS2H-DAC100M3","TS2L5-DAC100M3",147,1,"HPE 3M 100Gb QSFP28 Omni-Path Architecture Copper Cable","TS2H-DAC100M3"]
["TS2H-DACAOCM3","TS2L5-DACAOCM3",612,1,"HPE 3M 100Gb QSFP28 Omni-Path Architecture Optical Power Class 2 Cable","TS2H-DACAOCM3"]
["TS2H-DACAOCM5","TS2L5-DACAOCM5",619,1,"HPE 5M 100Gb QSFP28 Omni-Path Architecture Optical Power Class 2 Cable","TS2H-DACAOCM5"]
["TS2H-DACAOCM7","TS2L5-DACAOCM7",627,1,"HPE 7M 100Gb QSFP28 Omni-Path Architecture Optical Power Class 2 Cable","TS2H-DACAOCM7"]
["TS2H-VSANSTD3Y","TS2L5-VSANSTD3Y",3611,1,"VMware vSAN Standard OEM  1 Processor 3yr Software A20","TS2H-VSANSTD3Y"]
["TS2H-VSANADV3Y","TS2L5-VSANADV3Y",5543,1,"VMware vSAN Advanced OEM  1 Processor 3yr Software A20","TS2H-VSANADV3Y"]
["TS2H-SSD400MU","TS2L5-SSD400MU",622,1,"HPE 400GB SAS 12G Mixed Use SFF (2.5in) SC DS SSD","TS2H-SSD400MU"]
["TS2H-SSD400WIB","TS2L5-SSD400WIB",959,1,"HPE 400GB SAS 12G Write Intensive SFF (2.5in) SC DS SSD","TS2H-SSD400WIB"]
["TS2H-SSD800MU","TS2L5-SSD800MU",980,1,"HPE 800GB SAS 12G Mixed Use SFF (2.5in) SC DS SSD","TS2H-SSD800MU"]
["TS2H-SSD960MU","TS2L5-SSD960MU",864,1,"HPE 960GB SAS 12G Mixed Use SC 3yr Wty Value SAS DS SSD","TS2H-SSD960MU"]
["TS2H-DUAL32GB","TS2L5-DUAL32GB",306,1,"HPE 32GB Dual microSD USB Flash Drive","TS2H-DUAL32GB"]
["TS2H-E208IA","TS2L5-E208IA",180,1,"HPE Smart Array E208i-a SR Gen10 12G SAS Modular LH Controller ","TS2H-E208IA"]
["TS2H-E208IP","TS2L5-E208IP",180,1,"HPE Smart Array E208i-p SR Gen10 12G SAS PCIe Plug-in Controller","TS2H-E208IP"]
["TS2H-HDDBAY","TS2L5-HDDBAY",191,1,"HPE DL560 Gen10 8SFF HDD Bay1 only","TS2H-HDDBAY"]
["TS2H-M2240","TS2L5-M2240",175,1,"HPE 240GB SATA 6G Mixed Use M.2 2280 3yr Wty DS SSD","TS2H-M2240"]
["TS2H-8NVME","TS2L5-8NVME",1036,1,"HPE DL560 Gen10 NVMe 8 SSD Express Bay Kit","TS2H-8NVME"]
["TS2H-375NVMEWI","TS2L5-375NVMEWI",2398,1,"HPE 375GB NVMe x4 WI SFF SCN DS SSD","TS2H-375NVMEWI"]
["TS2H-750NVMEWI","TS2L5-750NVMEWI",4797,1,"HPE 750GB NVMe x4 WI SFF SCN DS SSD","TS2H-750NVMEWI"]
["TS2H-800NVMEMU","TS2L5-800NVMEMU",900,1,"HPE 800GB NVMe x4 MU SFF SCN\nDS SSD","TS2H-800NVMEMU"]
["TS2H-2000NVMERI","TS2L5-2000NVMERI",1912,1,"HPE 2TB NVMe x4 RI SFF SCN DS SSD","TS2H-2000NVMERI"]
["TS2H-4000NVMERI","TS2L5-4000NVMERI",3748,1,"HPE 4TB NVMe x4 RI SFF SCN DS SSD","TS2H-4000NVMERI"]
["TS2H-1600NVMEMU","TS2L5-1600NVMEMU",1569,1,"HPE 1.6TB NVMe x4 MU SFF SCN DS SSD","TS2H-1600NVMEMU"]
["TS2H-3200NVMEMU","TS2L5-3200NVMEMU",3452,1,"HPE 3.2TB NVMe x4 MU SFF SCN DS SSD","TS2H-3200NVMEMU"]
["TS2H-SSD3840RI","TS2L5-SSD3840RI",2066,1,"HPE 3.84TB SAS RI SFF SC DS SSD","TS2H-SSD3840RI"]
["TS2H-750NVMEWIHH","TS2L5-750NVMEWIHH",4795,1,"HPE 750GB PCIe x4 WI HH DS Card","TS2H-750NVMEWIHH"]
["TS2H-1600NVMEMUHH","TS2L5-1600NVMEMUHH",1571,1,"HPE 1.6TB NVMe x8 MU HH DS Card","TS2H-1600NVMEMUHH"]
["TS2H-3200NVMEMUHH","TS2L5-3200NVMEMUHH",2849,1,"HPE 3.2TB NVMe x8 MU HH DS Card","TS2H-3200NVMEMUHH"]
["TS2H-6400NVMEMUHH","TS2L5-6400NVMEMUHH",6518,1,"HPE 6.4TB NVMe x8 MU HH DS Card","TS2H-6400NVMEMUHH"]
["TS2-RACKPDU32","TS2L5-RACKPDU32",2200,1,"Armadio Rack 42U profonità 120cm con coppia di PDU 32A monofase","TS2-RACKPDU32"]
["TS2-RACK3PH","TS2L5-RACK3PH",2177,1,"Armadio Rack 42U 600 x1200 con coppia di PDU 32A Trifase 12C19+30C13","TS2-RACK3PH"]
["TS2-PDU32A","TS2L5-PDU32A",436,1,"Coppia di PDU Vertical  1Ph-32A-18xC13-6xC19 - 0U Base","TS2-PDU32A"]
["TS2H-NECPUSFF","TS2L5-NECPUSFF",5764,1,"HPE NECS FullFlash CPU sbr 3yr","TS2H-NECPUSFF"]
["TS2H-NECPUSHY","TS2L5-NECPUSHY",4236,1,"HPE NECS Hybrid CPU sbr 3yr","TS2H-NECPUSHY"]
["TS2H-CVLT10","TS2L5-CVLT10",3381,1,"HPE 10-Pack CVLT Bur Virtual Env VM Perp LTU","TS2H-CVLT10"]
["TS2H-BR1CPU","TS2L5-BR1CPU",1107,1,"Backup and Recovery 1 CPU socket E-LTU 3 years for HPE server","TS2H-BR1CPU"]
["TS2H-NECSHY","TS2L5-NECSHY",389,1,"HPE NECS Hybrid CPU core sbr 3yr","TS2H-NECSHY"]
["TS2H-NECSFF","TS2L5-NECSFF",532,1,"HPE NECS FullFlash CPU core sbr  3yr","TS2H-NECSFF"]
["TS2H-VSA4TB","TS2L5-VSA4TB",2157,1,"HPE StoreOnce VSA 4TB Base E-LTU SD","TS2H-VSA4TB"]
["TS2H-VSA1TB","TS2L5-VSA1TB",523,1,"HPE StoreOnce VSA Stackable 1TB ELTU","TS2H-VSA1TB"]
["TS2H-DACX240M3","TS2L5-DACX240M3",81,1,"HPE X240 10G SFP+ SFP+ 3m DAC Cable","TS2H-DACX240M3"]
["TS2H-DACX240M5","TS2L5-DACX240M5",95,1,"HPE X240 10G SFP+ SFP+ 5m DAC Cable","TS2H-DACX240M5"]
["TS2H-DACX240M7","TS2L5-DACX240M7",106,1,"HPE X240 10G SFP+ SFP+ 7m DAC Cable","TS2H-DACX240M7"]

{"sheet":"Operating System","index":6,"n_rows":73,"n_cols":30,"rows_kept":73,"cut":false,"hidden":true,"merged":[[0,1,0,2]]}
["Operating System"]
["DL560"]
["No Operating System",{"$f":"\"\"","v":""},{"$f":"\"\"","v":""},{"$f":"\"\"","v":""},{"$f":"\"\"","v":""},{"$f":"\"\"","v":""},"None",{"$f":"\"\"","v":""},{"$f":"\"\"","v":""},{"$f":"\"\"","v":""},{"$f":"\"\"","v":""},0,"None",{"$f":"\"\"","v":""},{"$f":"\"\"","v":""},{"$f":"\"\"","v":""},{"$f":"\"\"","v":""},0,{"$f":"\"\"","v":""},0,{"$f":"\"\"","v":""},{"$f":"\"\"","v":""},{"$f":"\"\"","v":""},0,{"$f":"\"\"","v":""},0,{"$f":"\"\"","v":""},{"$f":"\"\"","v":""},{"$f":"\"\"","v":""},0]
["Microsoft Windows Server 2019 Standard Edition ROK 16 Core",1,"TS2L5-WIN1","TS2L5-WIN1","P00487-B21",551,"1-pack of Windows Server 2019 User CALs",null,"TS2L5-CALUSER","TS2L5-CALUSER","871175-A21",21,"1-pack of Windows Server 2019 Device CALs",null,"TS2L5-CALDEV","TS2L5-CALDEV","871176-A21",21,"Microsoft Windows Server 2019 Standard Edition Additional License 16 Core",1,"TS2L5-WIN2","TS2L5-WIN2","871159-A21",551,"Microsoft Windows Server 2019 Standard Edition Additional License 2 Core",2,"TS2L5-WIN2CORE","TS2L5-WIN2CORE","871159-A21",54]
["Microsoft Windows Server 2019 Datacenter Edition ROK 16 Core",1,"TS2L5-WINDC1","TS2L5-WINDC1","P00488-B21",2159,"1-pack of Windows Server 2019 User CALs",null,"TS2L5-CALUSER","TS2L5-CALUSER","871175-A21",21,"1-pack of Windows Server 2019 Device CALs",null,"TS2L5-CALDEV","TS2L5-CALDEV","871176-A21",21,"Microsoft Windows Server 2019 Datacenter Edition Additional License 16 Core",1,"TS2L5-WINDC2","TS2L5-WINDC2","871166-A21",2159,"Microsoft Windows Server 2019 Datacenter Edition Additional License 2 Core",2,"TS2L5-WINDC2COR","TS2L5-WINDC2COR","871168-A21",399]
["CentOS 7.0",1,"TS2L5-LINUX","TS2L5-LINUX",null,49,"None",{"$f":"\"\"","v":""},{"$f":"\"\"","v":""},{"$f":"\"\"","v":""},{"$f":"\"\"","v":""},0,"None",{"$f":"\"\"","v":""},{"$f":"\"\"","v":""},{"$f":"\"\"","v":""},{"$f":"\"\"","v":""},0,{"$f":"\"\"","v":""},0,{"$f":"\"\"","v":""},{"$f":"\"\"","v":""},{"$f":"\"\"","v":""},0,{"$f":"\"\"","v":""},0,{"$f":"\"\"","v":""},{"$f":"\"\"","v":""},{"$f":"\"\"","v":""},0]
[]
["DL560 2CPU"]
["No Operating System",{"$f":"\"\"","v":""},{"$f":"\"\"","v":""},{"$f":"\"\"","v":""},{"$f":"\"\"","v":""},{"$f":"\"\"","v":""},"None",{"$f":"\"\"","v":""},{"$f":"\"\"","v":""},{"$f":"\"\"","v":""},{"$f":"\"\"","v":""},0,"None",{"$f":"\"\"","v":""},{"$f":"\"\"","v":""},{"$f":"\"\"","v":""},{"$f":"\"\"","v":""},0,{"$f":"\"\"","v":""},0,{"$f":"\"\"","v":""},{"$f":"\"\"","v":""},{"$f":"\"\"","v":""},0,{"$f":"\"\"","v":""},0,{"$f":"\"\"","v":""},{"$f":"\"\"","v":""},{"$f":"\"\"","v":""},0]
["Microsoft Windows Server 2019 Standard Edition ROK 16 Core",1,"TS2L5-WIN1","TS2L5-WIN1","P00487-B21",551,"1-pack of Windows Server 2019 User CALs",null,"TS2L5-CALUSER","TS2L5-CALUSER","871175-A21",21,"1-pack of Windows Server 2019 Device CALs",null,"TS2L5-CALDEV","TS2L5-CALDEV","871176-A21",21,"Microsoft Windows Server 2019 Standard Edition Additional License 16 Core",3,"TS2L5-WIN2","TS2L5-WIN2","871157-A21",551,"Microsoft Windows Server 2019 Standard Edition Additional License 2 Core",4,"TS2L5-WIN2CORE","TS2L5-WIN2CORE","871159-A21",54]
["Microsoft Windows Server 2019 Datacenter Edition ROK 16 Core",1,"TS2L5-WINDC1","TS2L5-WINDC1","P00488-B21",2159,"1-pack of Windows Server 2019 User CALs",null,"TS2L5-CALUSER","TS2L5-CALUSER","871175-A21",21,"1-pack of Windows Server 2019 Device CALs",null,"TS2L5-CALDEV","TS2L5-CALDEV","871176-A21",21,"Microsoft Windows Server 2019 Datacenter Edition Additional License 16 Core",3,"TS2L5-WINDC2","TS2L5-WINDC2","871166-A21",2159,"Microsoft Windows Server 2019 Datacenter Edition Additional License 2 Core",4,"TS2L5-WINDC2COR","TS2L5-WINDC2COR","871168-A21",399]
["CentOS 7.0",1,"TS2L5-LINUX","TS2L5-LINUX",null,49,"None",{"$f":"\"\"","v":""},{"$f":"\"\"","v":""},{"$f":"\"\"","v":""},{"$f":"\"\"","v":""},0,"None",{"$f":"\"\"","v":""},{"$f":"\"\"","v":""},{"$f":"\"\"","v":""},{"$f":"\"\"","v":""},0,{"$f":"\"\"","v":""},0,{"$f":"\"\"","v":""},{"$f":"\"\"","v":""},{"$f":"\"\"","v":""},0,{"$f":"\"\"","v":""},0,{"$f":"\"\"","v":""},{"$f":"\"\"","v":""},{"$f":"\"\"","v":""},0]
[]
[]
["DL580 ALTERNATIVO"]
["No Operating System",{"$f":"\"\"","v":""},{"$f":"\"\"","v":""},{"$f":"\"\"","v":""},{"$f":"\"\"","v":""},{"$f":"\"\"","v":""},"None",{"$f":"\"\"","v":""},{"$f":"\"\"","v":""},{"$f":"\"\"","v":""},{"$f":"\"\"","v":""},0,"None",{"$f":"\"\"","v":""},{"$f":"\"\"","v":""},{"$f":"\"\"","v":""},{"$f":"\"\"","v":""},0,{"$f":"\"\"","v":""},0,{"$f":"\"\"","v":""},{"$f":"\"\"","v":""},{"$f":"\"\"","v":""},0,{"$f":"\"\"","v":""},0,{"$f":"\"\"","v":""},{"$f":"\"\"","v":""},{"$f":"\"\"","v":""},0]
["Microsoft Windows Server 2016 Standard Edition ROK 16 Core",1,"TS2L5-WIN1","TS2L5-WIN1","871148-B21",556,"Microsoft Windows Server 2016 1 User CAL",null,"TS2L5-CALUSER","TS2L5-CALUSER","871175-A21",22,"Microsoft Windows Server 2016 1 Device CAL",null,"TS2L5-CALDEV","TS2L5-CALDEV","871176-A21",22,"Microsoft Windows Server 2016 Standard Edition Additional License 2 Core",4,"TS2L5-WIN2CORE","TS2L5-WIN2CORE","871159-A21",56,{"$f":"\"\"","v":""},0,{"$f":"\"\"","v":""},{"$f":"\"\"","v":""},{"$f":"\"\"","v":""},0]
["Microsoft Windows Server 2016 Datacenter Edition ROK 16 Core",1,"TS2L5-WINDC1","TS2L5-WINDC1","871153-B21",2174,"Microsoft Windows Server 2016 1 User CAL",null,"TS2L5-CALUSER","TS2L5-CALUSER","871175-A21",22,"Microsoft Windows Server 2016 1 Device CAL",null,"TS2L5-CALDEV","TS2L5-CALDEV","871176-A21",22,"Microsoft Windows Server 2016 Datacenter Edition Additional License 16 Core",1,"TS2L5-WINDC2","TS2L5-WINDC2","871166-A21",2105,{"$f":"\"\"","v":""},0,{"$f":"\"\"","v":""},{"$f":"\"\"","v":""},{"$f":"\"\"","v":""},0]
["CentOS 7.0",1,"TS2L5-LINUX","TS2L5-LINUX",null,50,"None",{"$f":"\"\"","v":""},{"$f":"\"\"","v":""},{"$f":"\"\"","v":""},{"$f":"\"\"","v":""},0,"None",{"$f":"\"\"","v":""},{"$f":"\"\"","v":""},{"$f":"\"\"","v":""},{"$f":"\"\"","v":""},0,{"$f":"\"\"","v":""},0,{"$f":"\"\"","v":""},{"$f":"\"\"","v":""},{"$f":"\"\"","v":""},0,{"$f":"\"\"","v":""},0,{"$f":"\"\"","v":""},{"$f":"\"\"","v":""},{"$f":"\"\"","v":""},0]
[]
["DL580 ALTERNATIVO 2CPU"]
["No Operating System",{"$f":"\"\"","v":""},{"$f":"\"\"","v":""},{"$f":"\"\"","v":""},{"$f":"\"\"","v":""},{"$f":"\"\"","v":""},"None",{"$f":"\"\"","v":""},{"$f":"\"\"","v":""},{"$f":"\"\"","v":""},{"$f":"\"\"","v":""},0,"None",{"$f":"\"\"","v":""},{"$f":"\"\"","v":""},{"$f":"\"\"","v":""},{"$f":"\"\"","v":""},0,{"$f":"\"\"","v":""},0,{"$f":"\"\"","v":""},{"$f":"\"\"","v":""},{"$f":"\"\"","v":""},0,{"$f":"\"\"","v":""},0,{"$f":"\"\"","v":""},{"$f":"\"\"","v":""},{"$f":"\"\"","v":""},0]
["Microsoft Windows Server 2016 Standard Edition ROK 16 Core",1,"TS2L5-WIN1","TS2L5-WIN1","871148-B21",556,"Microsoft Windows Server 2016 1 User CAL",null,"TS2L5-CALUSER","TS2L5-CALUSER","871175-A21",22,"Microsoft Windows Server 2016 1 Device CAL",null,"TS2L5-CALDEV","TS2L5-CALDEV","871176-A21",22,"Microsoft Windows Server 2016 Standard Edition Additional License 16 Core",2,"TS2L5-WIN2","TS2L5-WIN2","871157-A21",526,{"$f":"\"\"","v":""},0,{"$f":"\"\"","v":""},{"$f":"\"\"","v":""},{"$f":"\"\"","v":""},0]
["Microsoft Windows Server 2016 Datacenter Edition ROK 16 Core",1,"TS2L5-WINDC1","TS2L5-WINDC1","871153-B21",2174,"Microsoft Windows Server 2016 1 User CAL",null,"TS2L5-CALUSER","TS2L5-CALUSER","871175-A21",22,"Microsoft Windows Server 2016 1 Device CAL",null,"TS2L5-CALDEV","TS2L5-CALDEV","871176-A21",22,"Microsoft Windows Server 2016 Datacenter Edition Additional License 16 Core",2,"TS2L5-WINDC2","TS2L5-WINDC2","871166-A21",2105,{"$f":"\"\"","v":""},0,{"$f":"\"\"","v":""},{"$f":"\"\"","v":""},{"$f":"\"\"","v":""},0]
["CentOS 7.0",1,"TS2L5-LINUX","TS2L5-LINUX",null,50,"None",{"$f":"\"\"","v":""},{"$f":"\"\"","v":""},{"$f":"\"\"","v":""},{"$f":"\"\"","v":""},0,"None",{"$f":"\"\"","v":""},{"$f":"\"\"","v":""},{"$f":"\"\"","v":""},{"$f":"\"\"","v":""},0,{"$f":"\"\"","v":""},0,{"$f":"\"\"","v":""},{"$f":"\"\"","v":""},{"$f":"\"\"","v":""},0,{"$f":"\"\"","v":""},0,{"$f":"\"\"","v":""},{"$f":"\"\"","v":""},{"$f":"\"\"","v":""},0]
[]
["Dl580 PREST"]
["No Operating System",{"$f":"\"\"","v":""},{"$f":"\"\"","v":""},{"$f":"\"\"","v":""},{"$f":"\"\"","v":""},{"$f":"\"\"","v":""},"None",{"$f":"\"\"","v":""},{"$f":"\"\"","v":""},{"$f":"\"\"","v":""},{"$f":"\"\"","v":""},0,"None",{"$f":"\"\"","v":""},{"$f":"\"\"","v":""},{"$f":"\"\"","v":""},{"$f":"\"\"","v":""},0,{"$f":"\"\"","v":""},0,{"$f":"\"\"","v":""},{"$f":"\"\"","v":""},{"$f":"\"\"","v":""},0,{"$f":"\"\"","v":""},0,{"$f":"\"\"","v":""},{"$f":"\"\"","v":""},{"$f":"\"\"","v":""},0]
["Microsoft Windows Server 2016 Standard Edition ROK 16 Core",1,"TS2L5-WIN1","TS2L5-WIN1","871148-B21",556,"Microsoft Windows Server 2016 1 User CAL",null,"TS2L5-CALUSER","TS2L5-CALUSER","871175-A21",22,"Microsoft Windows Server 2016 1 Device CAL",null,"TS2L5-CALDEV","TS2L5-CALDEV","871176-A21",22,"Microsoft Windows Server 2016 Standard Edition Additional License 16 Core",1,"TS2L5-WIN2","2+Y23:AD23","871157-A21",526,"Microsoft Windows Server 2016 Standard Edition Additional License 2 Core",2,"TS1L2-WIN2CORE","TS1L2-WIN2CORE","871159-A21",56]
["Microsoft Windows Server 2016 Datacenter Edition ROK 16 Core",1,"TS2L5-WINDC1","TS2L5-WINDC1","871153-B21",2174,"Microsoft Windows Server 2016 1 User CAL",null,"TS2L5-CALUSER","TS2L5-CALUSER","871175-A21",22,"Microsoft Windows Server 2016 1 Device CAL",null,"TS2L5-CALDEV","TS2L5-CALDEV","871176-A21",22,"Microsoft Windows Server 2016 Datacenter Edition Additional License 16 Core",1,"TS2L5-WINDC2","TS2L5-WINDC2","871166-A21",2105,"Microsoft Windows Server 2016 Datacenter Edition Additional License 2 Core",2,"S2-871168-A21","S2-871168-A21",{"$f":"\"\"","v":""},530]
["CentOS 7.0",1,"TS2L5-LINUX","TS2L5-LINUX",null,50,"None",{"$f":"\"\"","v":""},{"$f":"\"\"","v":""},{"$f":"\"\"","v":""},{"$f":"\"\"","v":""},0,"None",{"$f":"\"\"","v":""},{"$f":"\"\"","v":""},{"$f":"\"\"","v":""},{"$f":"\"\"","v":""},0,{"$f":"\"\"","v":""},0,{"$f":"\"\"","v":""},{"$f":"\"\"","v":""},{"$f":"\"\"","v":""},0,{"$f":"\"\"","v":""},0,{"$f":"\"\"","v":""},{"$f":"\"\"","v":""},{"$f":"\"\"","v":""},0]
["Dl580 PREST 2CPU"]
["No Operating System",{"$f":"\"\"","v":""},{"$f":"\"\"","v":""},{"$f":"\"\"","v":""},{"$f":"\"\"","v":""},{"$f":"\"\"","v":""},"None",{"$f":"\"\"","v":""},{"$f":"\"\"","v":""},{"$f":"\"\"","v":""},{"$f":"\"\"","v":""},0,"None",{"$f":"\"\"","v":""},{"$f":"\"\"","v":""},{"$f":"\"\"","v":""},{"$f":"\"\"","v":""},0,{"$f":"\"\"","v":""},0,{"$f":"\"\"","v":""},{"$f":"\"\"","v":""},{"$f":"\"\"","v":""},0,{"$f":"\"\"","v":""},0,{"$f":"\"\"","v":""},{"$f":"\"\"","v":""},{"$f":"\"\"","v":""},0]
["Microsoft Windows Server 2016 Standard Edition ROK 16 Core",1,"TS2L5-WIN1","TS2L5-WIN1","871148-B21",556,"Microsoft Windows Server 2016 1 User CAL",null,"TS2L5-CALUSER","TS2L5-CALUSER","871175-A21",22,"Microsoft Windows Server 2016 1 Device CAL",null,"TS2L5-CALDEV","TS2L5-CALDEV","871176-A21",22,"Microsoft Windows Server 2016 Standard Edition Additional License 16 Core",4,"TS2L5-WIN2","TS2L5-WIN2","871157-A21",526,"Microsoft Windows Server 2016 Standard Edition Additional License 2 Core",4,"TS1L2-WIN2CORE","TS1L2-WIN2CORE","871159-A21",56]
["Microsoft Windows Server 2016 Datacenter Edition ROK 16 Core",1,"TS2L5-WINDC1","TS2L5-WINDC1","871153-B21",2174,"Microsoft Windows Server 2016 1 User CAL",null,"TS2L5-CALUSER","TS2L5-CALUSER","871175-A21",22,"Microsoft Windows Server 2016 1 Device CAL",null,"TS2L5-CALDEV","TS2L5-CALDEV","871176-A21",22,"Microsoft Windows Server 2016 Datacenter Edition Additional License 16 Core",4,"TS2L5-WINDC2","TS2L5-WINDC2","871166-A21",2105,{"$f":"\"\"","v":""},0,{"$f":"\"\"","v":""},{"$f":"\"\"","v":""},{"$f":"\"\"","v":""},0]
["CentOS 7.0",1,"TS2L5-LINUX","TS2L5-LINUX",null,50,"None",{"$f":"\"\"","v":""},{"$f":"\"\"","v":""},{"$f":"\"\"","v":""},{"$f":"\"\"","v":""},0,"None",{"$f":"\"\"","v":""},{"$f":"\"\"","v":""},{"$f":"\"\"","v":""},{"$f":"\"\"","v":""},0,{"$f":"\"\"","v":""},0,{"$f":"\"\"","v":""},{"$f":"\"\"","v":""},{"$f":"\"\"","v":""},0,{"$f":"\"\"","v":""},0,{"$f":"\"\"","v":""},{"$f":"\"\"","v":""},{"$f":"\"\"","v":""},0]
[]
[]
[]
[]
["Microsoft Windows Server 2016 Standard Edition ROK 16 Core",null,"TS2L5-WIN1","TS2L5-WIN1","871148-B21",551,"Microsoft Windows Server 2016 1 User CAL",null,"TS2L5-CALUSER","TS2L5-CALUSER","871175-A21",22,"Microsoft Windows Server 2016 1 Device CAL",null,"TS2L5-CALDEV","TS2L5-CALDEV","871176-A21",22]
["Microsoft Windows Server 2016 Standard Edition Additional License 16 Core",null,"TS2L5-WIN2","TS2L5-WIN2","871157-A21",551]
["Microsoft Windows Server 2016 Standard Edition Additional License 2 Core",null,"TS2L5-WIN2CORE","TS2L5-WIN2CORE","871159-A21",54]
[]
["Microsoft Windows Server 2016 Datacenter Edition ROK 16 Core",null,"TS2L5-WINDC1","TS2L5-WINDC1","871153-B21",2159,"Microsoft Windows Server 2016 1 User CAL",null,"TS2L5-CALUSER","TS2L5-CALUSER","871175-A21",22,"Microsoft Windows Server 2016 1 Device CAL",null,"TS2L5-CALDEV","TS2L5-CALDEV","871176-A21",22]
["Microsoft Windows Server 2016 Datacenter Edition Additional License 16 Core",null,"TS2L5-WINDC2","TS2L5-WINDC2","871166-A21",2159]
[]
["CentOS 7.0",null,"TS2L5-LINUX","TS2L5-LINUX",null,49]
[]
[]
[]
["None",{"$f":"\"\"","v":""},{"$f":"\"\"","v":""},{"$f":"\"\"","v":""},{"$f":"\"\"","v":""},0]
["VMware vSphere Standard 1 Processor 3yr Software",1,"TS2L5-VMWSTD1P3Y","TS2L5-VMWSTD1P3Y","BD711A",1506]
["VMware vSphere Enterprise Plus 1 Processor 3yr Software",1,"TS2L5-VMWEP1P3Y","TS2L5-VMWEP1P3Y","BD715A",4734]
["VMware vSphere Standard 1 Processor 5yr Software",1,"TS2L5-VMWSTD1P5Y","TS2L5-VMWSTD1P5Y","BD512A",1933]
["VMware vSphere Enterprise Plus 1 Processor 5yr Software",1,"TS2L5-VMWEP1P5Y","TS2L5-VMWEP1P5Y","BD514A",5889]
["None",0,{"$f":"\"\"","v":""},{"$f":"\"\"","v":""},{"$f":"\"\"","v":""},0]
["VMware vSphere Essentials Plus Kit 6 Processor 3yr",1,"TS2L5-VMWKIT6P3Y","TS2L5-VMWKIT6P3Y","F6M49A",5052]
["VMware vSphere Essentials Plus Kit 6 Processor 5yr",1,"TS2L5-VMWKIT6P5Y","TS2L5-VMWKIT6P5Y","F6M50A",6284]
["None",0,{"$f":"\"\"","v":""},{"$f":"\"\"","v":""},{"$f":"\"\"","v":""},0]
["VMw vCenter Server Std for vSph 3yr SW",1,"TS2L5-VMWVCSTD3Y","TS2L5-VMWVCSTD3Y","P9U41A",8240]
["VMw vCenter Server Std for vSph 5yr SW",1,"TS2L5-VMWVCSTD5Y","TS2L5-VMWVCSTD5Y","P9U42A",10251]
[]
["None",0,{"$f":"\"\"","v":""},{"$f":"\"\"","v":""},{"$f":"\"\"","v":""},0]
["VMware vSAN Standard OEM  1 Processor 3yr Software A20",1,"TS2L5-VSANSTD3Y","TS2L5-VSANSTD3Y","G4Y18AAE",3611]
["VMware vSAN Advanced OEM  1 Processor 3yr Software A20",1,"TS2L5-VSANADV3Y","TS2L5-VSANADV3Y","P9H45AAE",5543]
[]
["None",0,{"$f":"\"\"","v":""},{"$f":"\"\"","v":""},{"$f":"\"\"","v":""},0]
["HPE 32GB Dual microSD USB Flash Drive A20",1,"TS2L5-DUAL32GB","TS2L5-DUAL32GB",null,306]
[]
[]
["_SavePDFon"]
["_SavePDFoff"]

{"sheet":"PCI","index":7,"n_rows":485,"n_cols":16,"rows_kept":485,"cut":false,"hidden":true,"merged":[[413,0,414,9]]}
[]
["HDD Bay2",null,0,{"$f":"\"\"","v":""},{"$f":"\"\"","v":""},{"$f":"\"\"","v":""},0]
[null,null,1,"S2-872235-B21","872235-B21",{"$f":"\"\"","v":""},230]
["HDD Bay1",null,0,{"$f":"\"\"","v":""},{"$f":"\"\"","v":""},0,0]
[null,null,1,"TS2L5-SASBAY1","872233-B21 ;  873444-B21",1,800]
[]
["Secondary Riser",null,0,{"$f":"\"\"","v":""},{"$f":"\"\"","v":""},{"$f":"\"\"","v":""},0]
[null,null,1,"S2-870548-B21","870548-B21",{"$f":"\"\"","v":""},109]
["Secondary Riser (for GPU)",null,0,{"$f":"\"\"","v":""},{"$f":"\"\"","v":""},{"$f":"\"\"","v":""},0]
[null,null,1,"TS2L5-GPURSRKIT","826704-B21",{"$f":"\"\"","v":""},87]
["Tertiary riser",null,0,{"$f":"\"\"","v":""},{"$f":"\"\"","v":""},{"$f":"\"\"","v":""},0]
[null,null,1,"S2-872253-B21","872253-B21",{"$f":"\"\"","v":""},285]
["9-slot Sec Riser",null,0,{"$f":"\"\"","v":""},{"$f":"\"\"","v":""},{"$f":"\"\"","v":""},0]
[null,null,1,"S2-9SlotRiser","872340 830272",{"$f":"\"\"","v":""},671,null,null,null,null,"[TS2L5-536FLR] HPE FlexFabric 10Gb 4-port 536FLR-T Adapter"]
["Additional Card for PCIe Slot 1",null,null,null,null,null,null,null,null,null,null,"[TS2L5-10OTSR] HPE 10Gb SFP+ SR Transceiver"]
["DL560",null,null,null,null,null,null,null,null,null,null,"[TS2L5-10OTLR] HPE 10G SFP+ LR Transceiver"]
["None","","","","","","",0,null,""]
["[TS2L5-LAN1] HPE Ethernet 1Gb 2-port 332T Adapter",1,"TS2L5-LAN1","TS2L5-LAN1","615732-B21",33,"",0,null,"",null,"[TS2L5-GPURSRKIT] HPE DL Gen10 x16 x16 GPU Rsr Kit"]
["[TS2L5-LAN10] HPE Ethernet 10Gb 2-port 530SFP Adapter",1,"TS2L5-LAN10","TS2L5-LAN10","652503-B21",344,"HPE BLc 10G SFP+ SR Transceiver",2,null,"455883-B21",null,"[TS2L5-P2000GPU] HPE NVIDIA Quadro P2000 GPU Module"]
["[TS2L5-CNA10] HPE CN1100R 2P Converged Network Adapter ",1,"TS2L5-CNA10","TS2L5-CNA10"," QW990A",723,"HPE BLc 10G SFP+ SR Transceiver",2,null,"455883-B21"]
["[TS2L5-FC16] HPE StoreFabric SN1100Q 16Gb Dual Port Fibre Channel HBA",1,"TS2L5-FC16","TS2L5-FC16","P9D94A",356,"",0,null,""]
[{"$f":"\"\"","v":""},{"$f":"\"\"","v":""},{"$f":"\"\"","v":""},{"$f":"\"\"","v":""},{"$f":"\"\"","v":""},{"$f":"\"\"","v":""},{"$f":"\"\"","v":""},{"$f":"\"\"","v":""},{"$f":"\"\"","v":""},{"$f":"\"\"","v":""}]
[":._.:.:*~*:._.:*~*:._.:*~*:._.: Componenti 20% .:*~*:._.:*~*:._.:*~*:._.:*~*:._.:",{"$f":"\"\"","v":""},{"$f":"\"\"","v":""},{"$f":"\"\"","v":""},{"$f":"\"\"","v":""},{"$f":"\"\"","v":""},{"$f":"\"\"","v":""},{"$f":"\"\"","v":""},{"$f":"\"\"","v":""},{"$f":"\"\"","v":""},null,"[TS2L5-530T] HPE Ethernet 10Gb 2-port 530T Adapter"]
["[TS2L5-530T] HPE Ethernet 10Gb 2-port 530T Adapter",1,"TS2L5-530T","TS2H-530T","656596-B21",null,null,null,298,{"$f":"\"\"","v":""},null,"[TS2L5-521T] HPE Ethernet 10Gb 2-port 521T Adapter"]
["[TS2L5-521T] HPE Ethernet 10Gb 2-port 521T Adapter",1,"TS2L5-521T","TS2H-521T","867707-B21",null,null,null,298,{"$f":"\"\"","v":""},null,"[TS2L5-562SFP] HPE Ethernet 10Gb 2-port 562SFP+ Adapter"]
["[TS2L5-562SFP] HPE Ethernet 10Gb 2-port 562SFP+ Adapter",1,"TS2L5-562SFP","TS2H-562SFP","727055-B21",null,null,null,380,{"$f":"\"\"","v":""},null,"[TS2L5-841QSFP28] HPE InfiniBand EDR 100Gb 1-port 841QSFP28 Adapter"]
["[TS2L5-841QSFP28] HPE InfiniBand EDR 100Gb 1-port 841QSFP28 Adapter",1,"TS2L5-841QSFP28","TS2H-841QSFP28","872725-B21",null,null,null,2699,{"$f":"\"\"","v":""},null,"[TS2L5-OP101] HPE 100Gb 1-port OP101 QSFP28 x16 PCIe Gen3 with Intel Omni-Path Architecture Adapter"]
["[TS2L5-OP101] HPE 100Gb 1-port OP101 QSFP28 x16 PCIe Gen3 with Intel Omni-Path Architecture Adapter",1,"TS2L5-OP101","TS2H-OP101","829335-B21",null,null,null,554,{"$f":"\"\"","v":""},null,"[TS2L5-547FLR] HPE InfiniBand FDR/Ethernet 40/50Gb 2-port 547FLR-QSFP Adapter"]
["[TS2L5-750NVMEWIHH] HPE 750GB PCIe x4 Lanes Write Intensive HHHL",1,"TS2L5-750NVMEWIHH","TS2H-750NVMEWIHH","878038-B21",null,null,null,4795]
["[TS2L5-1600NVMEMUHH] HPE 1.6TB NVMe x8 Lanes Mixed Use HHHL",1,"TS2L5-1600NVMEMUHH","TS2H-1600NVMEMUHH","P10264-B21",null,null,null,1571]
["[TS2L5-3200NVMEMUHH] HPE 3.2TB NVMe x8 Lanes Mixed Use HHHL",1,"TS2L5-3200NVMEMUHH","TS2H-3200NVMEMUHH","P10266-B21",null,null,null,2849]
["[TS2L5-6400NVMEMUHH] HPE 6.4TB NVMe x8 Lanes Mixed Use HHHL",1,"TS2L5-6400NVMEMUHH","TS2H-6400NVMEMUHH","P10268-B21",null,null,null,6518]
["HPE DL5x0 Gen10 12Gb SAS Expander Card Kit with Cables",1,"TS2L5-SASBAY1","TS2L5-SASBAY1","873444-B21"]
["Additional Card for PCIe Slot 2/3"]
["DL560"]
["None","","","","","","",0,null,""]
["[TS2L5-LAN1] HPE Ethernet 1Gb 2-port 332T Adapter",1,"TS2L5-LAN1","TS2L5-LAN1","615732-B21",33,"",0,null,""]
["[TS2L5-LAN10] HPE Ethernet 10Gb 2-port 530SFP Adapter",1,"TS2L5-LAN10","TS2L5-LAN10","652503-B21",344,"HPE BLc 10G SFP+ SR Transceiver",2,null,"455883-B21"]
["[TS2L5-CNA10] HPE CN1100R 2P Converged Network Adapter ",1,"TS2L5-CNA10","TS2L5-CNA10"," QW990A",723,"HPE BLc 10G SFP+ SR Transceiver",2,null,"455883-B21"]
["[TS2L5-FC16] HPE StoreFabric SN1100Q 16Gb Dual Port Fibre Channel HBA",1,"TS2L5-FC16","TS2L5-FC16","P9D94A",356,"",0,null,""]
[{"$f":"\"\"","v":""},{"$f":"\"\"","v":""},{"$f":"\"\"","v":""},{"$f":"\"\"","v":""},{"$f":"\"\"","v":""},{"$f":"\"\"","v":""},{"$f":"\"\"","v":""},{"$f":"\"\"","v":""},{"$f":"\"\"","v":""},{"$f":"\"\"","v":""}]
[":._.:.:*~*:._.:*~*:._.:*~*:._.: Componenti 20% .:*~*:._.:*~*:._.:*~*:._.:*~*:._.:",{"$f":"\"\"","v":""},{"$f":"\"\"","v":""},{"$f":"\"\"","v":""},{"$f":"\"\"","v":""},{"$f":"\"\"","v":""},{"$f":"\"\"","v":""},{"$f":"\"\"","v":""},{"$f":"\"\"","v":""},{"$f":"\"\"","v":""}]
["[TS2L5-530T] HPE Ethernet 10Gb 2-port 530T Adapter",1,"TS2L5-530T","TS2H-530T","656596-B21",null,null,null,298,{"$f":"\"\"","v":""}]
["[TS2L5-521T] HPE Ethernet 10Gb 2-port 521T Adapter",1,"TS2L5-521T","TS2H-521T","867707-B21",null,null,null,298,{"$f":"\"\"","v":""}]
["[TS2L5-562SFP] HPE Ethernet 10Gb 2-port 562SFP+ Adapter",1,"TS2L5-562SFP","TS2H-562SFP","727055-B21",null,null,null,380,{"$f":"\"\"","v":""}]
["[TS2L5-841QSFP28] HPE InfiniBand EDR 100Gb 1-port 841QSFP28 Adapter",1,"TS2L5-841QSFP28","TS2H-841QSFP28","872725-B21",null,null,null,2699,{"$f":"\"\"","v":""}]
["[TS2L5-OP101] HPE 100Gb 1-port OP101 QSFP28 x16 PCIe Gen3 with Intel Omni-Path Architecture Adapter",1,"TS2L5-OP101","TS2H-OP101","829335-B21",null,null,null,554,{"$f":"\"\"","v":""}]
["[TS2L5-750NVMEWIHH] HPE 750GB PCIe x4 Lanes Write Intensive HHHL",1,"TS2L5-750NVMEWIHH","TS2H-750NVMEWIHH","878038-B21",null,null,null,4795]
["[TS2L5-1600NVMEMUHH] HPE 1.6TB NVMe x8 Lanes Mixed Use HHHL",1,"TS2L5-1600NVMEMUHH","TS2H-1600NVMEMUHH","P10264-B21",null,null,null,1571]
["[TS2L5-3200NVMEMUHH] HPE 3.2TB NVMe x8 Lanes Mixed Use HHHL",1,"TS2L5-3200NVMEMUHH","TS2H-3200NVMEMUHH","P10266-B21",null,null,null,2849]
["[TS2L5-6400NVMEMUHH] HPE 6.4TB NVMe x8 Lanes Mixed Use HHHL",1,"TS2L5-6400NVMEMUHH","TS2H-6400NVMEMUHH","P10268-B21",null,null,null,6518]
[]
["Additional Card for PCIe Slot 3"]
["DL560"]
["None","","","","","","",0,null,""]
["[TS2L5-LAN1] HPE Ethernet 1Gb 2-port 332T Adapter",1,"TS2L5-LAN1","TS2L5-LAN1","615732-B21",33,"",0,null,""]
["[TS2L5-LAN10] HPE Ethernet 10Gb 2-port 530SFP Adapter",1,"TS2L5-LAN10","TS2L5-LAN10","652503-B21",344,"HPE BLc 10G SFP+ SR Transceiver",2,null,"455883-B21"]
["[TS2L5-CNA10] HPE CN1100R 2P Converged Network Adapter ",1,"TS2L5-CNA10","TS2L5-CNA10"," QW990A",723,"HPE BLc 10G SFP+ SR Transceiver",2,null,"455883-B21"]
["[TS2L5-FC16] HPE StoreFabric SN1100Q 16Gb Dual Port Fibre Channel HBA",1,"TS2L5-FC16","TS2L5-FC16","P9D94A",356,"",0,null,""]
[{"$f":"\"\"","v":""},{"$f":"\"\"","v":""},{"$f":"\"\"","v":""},{"$f":"\"\"","v":""},{"$f":"\"\"","v":""},{"$f":"\"\"","v":""},{"$f":"\"\"","v":""},{"$f":"\"\"","v":""},{"$f":"\"\"","v":""},{"$f":"\"\"","v":""}]
[":._.:.:*~*:._.:*~*:._.:*~*:._.: Componenti 20% .:*~*:._.:*~*:._.:*~*:._.:*~*:._.:",{"$f":"\"\"","v":""},{"$f":"\"\"","v":""},{"$f":"\"\"","v":""},{"$f":"\"\"","v":""},{"$f":"\"\"","v":""},{"$f":"\"\"","v":""},{"$f":"\"\"","v":""},{"$f":"\"\"","v":""},{"$f":"\"\"","v":""}]
["[TS2L5-E208IP] HPE Smart Array E208i-p SR Gen10 (8 Internal Lanes/No Cache) 12G SAS PCIe Plug-in Controller",1,"TS2L5-E208IP","TS2H-E208IP","804394-B21",null,null,null,180]
["[TS2L5-530T] HPE Ethernet 10Gb 2-port 530T Adapter",1,"TS2L5-530T","TS2H-530T","656596-B21",null,null,null,298,{"$f":"\"\"","v":""}]
["[TS2L5-521T] HPE Ethernet 10Gb 2-port 521T Adapter",1,"TS2L5-521T","TS2H-521T","867707-B21",null,null,null,298,{"$f":"\"\"","v":""}]
["[TS2L5-562SFP] HPE Ethernet 10Gb 2-port 562SFP+ Adapter",1,"TS2L5-562SFP","TS2H-562SFP","727055-B21",null,null,null,380,{"$f":"\"\"","v":""}]
["[TS2L5-841QSFP28] HPE InfiniBand EDR 100Gb 1-port 841QSFP28 Adapter",1,"TS2L5-841QSFP28","TS2H-841QSFP28","872725-B21",null,null,null,2699,{"$f":"\"\"","v":""}]
["[TS2L5-OP101] HPE 100Gb 1-port OP101 QSFP28 x16 PCIe Gen3 with Intel Omni-Path Architecture Adapter",1,"TS2L5-OP101","TS2H-OP101","829335-B21",null,null,null,554,{"$f":"\"\"","v":""}]
["[TS2L5-750NVMEWIHH] HPE 750GB PCIe x4 Lanes Write Intensive HHHL",1,"TS2L5-750NVMEWIHH","TS2H-750NVMEWIHH","878038-B21",null,null,null,4795]
["[TS2L5-1600NVMEMUHH] HPE 1.6TB NVMe x8 Lanes Mixed Use HHHL",1,"TS2L5-1600NVMEMUHH","TS2H-1600NVMEMUHH","P10264-B21",null,null,null,1571]
["[TS2L5-3200NVMEMUHH] HPE 3.2TB NVMe x8 Lanes Mixed Use HHHL",1,"TS2L5-3200NVMEMUHH","TS2H-3200NVMEMUHH","P10266-B21",null,null,null,2849]
["[TS2L5-6400NVMEMUHH] HPE 6.4TB NVMe x8 Lanes Mixed Use HHHL",1,"TS2L5-6400NVMEMUHH","TS2H-6400NVMEMUHH","P10268-B21",null,null,null,6518]
[]
["Additional Card for PCIe Slot 4/5/6"]
["DL560"]
["None","","","","","","",0,null,""]
[":._.:.:*~*:._.:*~*:._.:*~*:._.: Componenti 20% .:*~*:._.:*~*:._.:*~*:._.:*~*:._.:",{"$f":"\"\"","v":""},{"$f":"\"\"","v":""},{"$f":"\"\"","v":""},{"$f":"\"\"","v":""},{"$f":"\"\"","v":""},{"$f":"\"\"","v":""},{"$f":"\"\"","v":""},{"$f":"\"\"","v":""},{"$f":"\"\"","v":""}]
["[TS2L5-530T] HPE Ethernet 10Gb 2-port 530T Adapter",1,"TS2L5-530T","TS2L5-530T","656596-B21",null,null,null,298]
["[TS2L5-521T] HPE Ethernet 10Gb 2-port 521T Adapter",1,"TS2L5-521T","TS2L5-521T","867707-B21",null,null,null,298]
["[TS2L5-536FLR] HPE FlexFabric 10Gb 4-port 536FLR-T Adapter",1,"TS2L5-536FLR","TS2L5-536FLR","764302-B21",null,null,null,610]
["[TS2L5-562SFP] HPE Ethernet 10Gb 2-port 562SFP+ Adapter",1,"TS2L5-562SFP","TS2L5-562SFP","727055-B21",null,null,null,380]
["[TS2L5-841QSFP28] HPE InfiniBand EDR 100Gb 1-port 841QSFP28 Adapter",1,"TS2L5-841QSFP28","TS2L5-841QSFP28","872725-B21",null,null,null,481]
[]
["Additional Card for PCIe Slot 5"]
["DL560"]
["None","","","","","","",0,null,""]
["[TS2L5-LAN1] HPE Ethernet 1Gb 2-port 332T Adapter",1,"TS2L5-LAN1","TS2L5-LAN1","615732-B21",33,"",0,null,""]
["[TS2L5-LAN10] HPE Ethernet 10Gb 2-port 530SFP Adapter",1,"TS2L5-LAN10","TS2L5-LAN10","652503-B21",344,"HPE BLc 10G SFP+ SR Transceiver",2,null,"455883-B21"]
["[TS2L5-CNA10] HPE CN1100R 2P Converged Network Adapter ",1,"TS2L5-CNA10","TS2L5-CNA10"," QW990A",723,"HPE BLc 10G SFP+ SR Transceiver",2,null,"455883-B21"]
["[TS2L5-FC16] HPE StoreFabric SN1100Q 16Gb Dual Port Fibre Channel HBA",1,"TS2L5-FC16","TS2L5-FC16","P9D94A",356,"",0,null,""]
[{"$f":"\"\"","v":""},{"$f":"\"\"","v":""},{"$f":"\"\"","v":""},{"$f":"\"\"","v":""},{"$f":"\"\"","v":""},{"$f":"\"\"","v":""},{"$f":"\"\"","v":""},{"$f":"\"\"","v":""},{"$f":"\"\"","v":""},{"$f":"\"\"","v":""}]
[":._.:.:*~*:._.:*~*:._.:*~*:._.: Componenti 20% .:*~*:._.:*~*:._.:*~*:._.:*~*:._.:",{"$f":"\"\"","v":""},{"$f":"\"\"","v":""},{"$f":"\"\"","v":""},{"$f":"\"\"","v":""},{"$f":"\"\"","v":""},{"$f":"\"\"","v":""},{"$f":"\"\"","v":""},{"$f":"\"\"","v":""},{"$f":"\"\"","v":""}]
["[TS2L5-P2000GPU] HPE NVIDIA Quadro P2000 GPU Module",1,"TS2L5-P2000GPU","TS2H-P2000GPU","Q0V77A",null,null,null,690]
["[TS2L5-530T] HPE Ethernet 10Gb 2-port 530T Adapter",1,"TS2L5-530T","TS2H-530T","656596-B21",null,null,null,298,{"$f":"\"\"","v":""}]
["[TS2L5-521T] HPE Ethernet 10Gb 2-port 521T Adapter",1,"TS2L5-521T","TS2H-521T","867707-B21",null,null,null,298,{"$f":"\"\"","v":""}]
["[TS2L5-562SFP] HPE Ethernet 10Gb 2-port 562SFP+ Adapter",1,"TS2L5-562SFP","TS2H-562SFP","727055-B21",null,null,null,380,{"$f":"\"\"","v":""}]
["[TS2L5-841QSFP28] HPE InfiniBand EDR 100Gb 1-port 841QSFP28 Adapter",1,"TS2L5-841QSFP28","TS2H-841QSFP28","872725-B21",null,null,null,2699,{"$f":"\"\"","v":""}]
["[TS2L5-OP101] HPE 100Gb 1-port OP101 QSFP28 x16 PCIe Gen3 with Intel Omni-Path Architecture Adapter",1,"TS2L5-OP101","TS2H-OP101","829335-B21",null,null,null,554,{"$f":"\"\"","v":""}]
["[TS2L5-750NVMEWIHH] HPE 750GB PCIe x4 Lanes Write Intensive HHHL",1,"TS2L5-750NVMEWIHH","TS2H-750NVMEWIHH","878038-B21",null,null,null,4795]
["[TS2L5-1600NVMEMUHH] HPE 1.6TB NVMe x8 Lanes Mixed Use HHHL",1,"TS2L5-1600NVMEMUHH","TS2H-1600NVMEMUHH","P10264-B21",null,null,null,1571]
["[TS2L5-3200NVMEMUHH] HPE 3.2TB NVMe x8 Lanes Mixed Use HHHL",1,"TS2L5-3200NVMEMUHH","TS2H-3200NVMEMUHH","P10266-B21",null,null,null,2849]
["[TS2L5-6400NVMEMUHH] HPE 6.4TB NVMe x8 Lanes Mixed Use HHHL",1,"TS2L5-6400NVMEMUHH","TS2H-6400NVMEMUHH","P10268-B21",null,null,null,6518]
[]
["Additional Card for PCIe Slot 6"]
["DL560"]
["None","","","","","","",0,null,""]
["[TS2L5-LAN1] HPE Ethernet 1Gb 2-port 332T Adapter",1,"TS2L5-LAN1","TS2L5-LAN1","615732-B21",33,"",0,null,""]
["[TS2L5-LAN10] HPE Ethernet 10Gb 2-port 530SFP Adapter",1,"TS2L5-LAN10","TS2L5-LAN10","652503-B21",344,"HPE BLc 10G SFP+ SR Transceiver",2,null,"455883-B21"]
["[TS2L5-CNA10] HPE CN1100R 2P Converged Network Adapter ",1,"TS2L5-CNA10","TS2L5-CNA10"," QW990A",723,"HPE BLc 10G SFP+ SR Transceiver",2,null,"455883-B21"]
["[TS2L5-FC16] HPE StoreFabric SN1100Q 16Gb Dual Port Fibre Channel HBA",1,"TS2L5-FC16","TS2L5-FC16","P9D94A",356,"",0,null,""]
[":._.:.:*~*:._.:*~*:._.:*~*:._.: Componenti 20% .:*~*:._.:*~*:._.:*~*:._.:*~*:._.:",{"$f":"\"\"","v":""},{"$f":"\"\"","v":""},{"$f":"\"\"","v":""},{"$f":"\"\"","v":""},{"$f":"\"\"","v":""},{"$f":"\"\"","v":""},{"$f":"\"\"","v":""},{"$f":"\"\"","v":""},{"$f":"\"\"","v":""}]
["[TS2L5-530T] HPE Ethernet 10Gb 2-port 530T Adapter",1,"TS2L5-530T","TS2L5-530T","656596-B21",null,null,null,298]
["[TS2L5-521T] HPE Ethernet 10Gb 2-port 521T Adapter",1,"TS2L5-521T","TS2L5-521T","867707-B21",null,null,null,298]
["[TS2L5-536FLR] HPE FlexFabric 10Gb 4-port 536FLR-T Adapter",1,"TS2L5-536FLR","TS2L5-536FLR","764302-B21",null,null,null,610]
["[TS2L5-562SFP] HPE Ethernet 10Gb 2-port 562SFP+ Adapter",1,"TS2L5-562SFP","TS2L5-562SFP","727055-B21",null,null,null,380]
["[TS2L5-841QSFP28] HPE InfiniBand EDR 100Gb 1-port 841QSFP28 Adapter",1,"TS2L5-841QSFP28","TS2L5-841QSFP28","872725-B21",null,null,null,481]
[]
["Additional Card for PCIe Slot 7/8"]
["DL560"]
["None","","","","","","",0,null,""]
["[TS2L5-LAN1] HPE Ethernet 1Gb 2-port 332T Adapter",1,"TS2L5-LAN1","TS2L5-LAN1","615732-B21",33,"",0,null,""]
["[TS2L5-LAN10] HPE Ethernet 10Gb 2-port 530SFP Adapter",1,"TS2L5-LAN10","TS2L5-LAN10","652503-B21",344,"HPE BLc 10G SFP+ SR Transceiver",2,null,"455883-B21"]
["[TS2L5-CNA10] HPE CN1100R 2P Converged Network Adapter ",1,"TS2L5-CNA10","TS2L5-CNA10"," QW990A",723,"HPE BLc 10G SFP+ SR Transceiver",2,null,"455883-B21"]
["[TS2L5-FC16] HPE StoreFabric SN1100Q 16Gb Dual Port Fibre Channel HBA",1,"TS2L5-FC16","TS2L5-FC16","P9D94A",356,"",0,null,""]
[":._.:.:*~*:._.:*~*:._.:*~*:._.: Componenti 20% .:*~*:._.:*~*:._.:*~*:._.:*~*:._.:",{"$f":"\"\"","v":""},{"$f":"\"\"","v":""},{"$f":"\"\"","v":""},{"$f":"\"\"","v":""},{"$f":"\"\"","v":""},{"$f":"\"\"","v":""},{"$f":"\"\"","v":""},{"$f":"\"\"","v":""},{"$f":"\"\"","v":""}]
["[TS2L5-530T] HPE Ethernet 10Gb 2-port 530T Adapter",1,"TS2L5-530T","TS2L5-530T","656596-B21",null,null,null,298]
["[TS2L5-521T] HPE Ethernet 10Gb 2-port 521T Adapter",1,"TS2L5-521T","TS2L5-521T","867707-B21",null,null,null,298]
["[TS2L5-536FLR] HPE FlexFabric 10Gb 4-port 536FLR-T Adapter",1,"TS2L5-536FLR","TS2L5-536FLR","764302-B21",null,null,null,610]
["[TS2L5-562SFP] HPE Ethernet 10Gb 2-port 562SFP+ Adapter",1,"TS2L5-562SFP","TS2L5-562SFP","727055-B21",null,null,null,380]
["[TS2L5-841QSFP28] HPE InfiniBand EDR 100Gb 1-port 841QSFP28 Adapter",1,"TS2L5-841QSFP28","TS2L5-841QSFP28","872725-B21",null,null,null,481]
[]
["NVME Bay"]
[null,null,0,{"$f":"\"\"","v":""},{"$f":"\"\"","v":""},0,0]
[null,null,1,"TS2L5-8NVME","872225-B21 ;  874633-B21",2,1036]
[]
[null,null,0,{"$f":"\"\"","v":""},{"$f":"\"\"","v":""},{"$f":"\"\"","v":""},0]
[null,null,1,"TS2L5-M2240","875488-B21",{"$f":"\"\"","v":""},175]
[]
[]
[]
[]
["HPE Smart Array P816i-a SR Gen10",1,{"$f":"\"\"","v":""},{"$f":"\"\"","v":""},"869083-B21",{"$f":"\"\"","v":""},"HPE 96W Smart Storage Battery with 145mm Cable Kit",1,{"$f":"\"\"","v":""},"P01366-B21"]
["HPE Smart Array E208i-a SR Gen10 (8 Internal Lanes/No Cache) 12G SAS Modular LH Controller",1,"TS2L5-E208IA","TS2H-E208IA","869079-B21",180,{"$f":"\"\"","v":""},{"$f":"\"\"","v":""},{"$f":"\"\"","v":""},{"$f":"\"\"","v":""}]
[]
[]
["HPE Ethernet 1Gb 4-port 331FLR Adapter",1,{"$f":"\"\"","v":""},"629135-B22",{"$f":"\"\"","v":""},{"$f":"\"\"","v":""},{"$f":"\"\"","v":""},{"$f":"\"\"","v":""},0,{"$f":"\"\"","v":""}]
["[TS2L5-547FLR] HPE InfiniBand FDR/Ethernet 40/50Gb 2-port 547FLR-QSFP Adapter",1,"TS2L5-547FLR","TS2H-547FLR","879482-B21",null,null,null,461,{"$f":"\"\"","v":""}]
[]
[]
[]
[]
[]
[]
[]
[]
[]
[]
[]
[]
[]
[]
[]
[]
[]
[]
[]
[]
[]
[]
[]
[]
[]
[]
[]
[]
[]
[]
[]
[]
[]
[]
[]
[]
[]
[]
[]
[]
[]
[]
[]
[]
[]
[]
[]
[]
[]
[]
[]
[]
[]
[]
[]
[]
[]
[]
[]
[]
[]
[]
[]
[]
[]
[]
[]
[]
[]
[]
[]
[]
[]
[]
[]
[]
[]
[]
[]
[]
[]
[]
[]
[]
[]
[]
[]
[]
[]
[]
[]
[]
[]
[]
[]
[]
[]
[]
[]
[]
[]
[]
[]
[]
[]
[]
[]
[]
[]
[]
[]
[]
[]
[]
[]
[]
[]
[]
[]
[]
[]
[]
[]
[]
[]
[]
[]
[]
[]
[]
[]
[]
[]
[]
[]
[]
[]
[]
[]
[]
[]
[]
[]
[]
[]
[]
[]
[]
[]
[]
[]
[]
[]
[]
[]
[]
["Additional Card for PCIe Slot 9 OCCUPATO"]
["DL580"]
["None","","","","","","",0,null,""]
["HPE Ethernet 1Gb 2P 332T Adptr",1,"10L2-LAN1GB","S10L1-DL560-LAN1","615732-B21",35,"",0,null,""]
["HPE Ethernet 10Gb 2P 530SFP+ Adptr",1,"10L2-LAN10GB","S10L1-DL560-LAN10","652503-B21",716,"HPE BLc 10G SFP+ SR Transceiver",2,null,"455883-B21"]
["HPE StoreFabric CN1200E 10Gb CNA",1,"10L2-CNA10","S10L1-DL560-CNA10","E7Y06A",778,"HPE BLc 10G SFP+ SR Transceiver",2,null,"455883-B21"]
["HPE 82Q 8Gb Dual Port PCI-e FC HBA",1,"10L2-FC","S10L1-DL560-FC","AJ764A",889,null,0,null,""]
[]
["Additional Card for PCIe Slot 8",null,null,null,null,null,null,null,null,null,null,1671,{"$f":"L311/100","v":16.71},{"$f":"M311*25","v":417.75},{"$f":"N311+L311","v":2088.75},2100]
["DL580"]
["None","","","","","","",0,null,""]
["HPE Ethernet 1Gb 2-port 332T Adapter",1,"TS2L5-1GB","TS2L5-1GB","615732-B21",29,"",0,null,""]
["HPE Ethernet 10Gb 2-port 530SFP Adapter",1,"TS2L5-10GB","TS2L5-10GB","652503-B21",259,"HPE BLc 10G SFP+ SR Transceiver",2,null,"455883-B21"]
["HPE StoreFabric CN1200E 10Gb Converged Network Adapter",1,"TS2L5-CNA","TS2L5-CNA","E7Y06A",720,"HPE BLc 10G SFP+ SR Transceiver",2,null,"455883-B21"]
["HPE Ethernet 10Gb 2P 530T Adapter",1,"TS1-656596","TS1-656596","656596-B21",null,null,null,298]
["HPE Ethernet 10Gb 2-port 521T Adapter",1,"TS1-867707","TS1-867707","867707-B21",null,null,null,298]
["HPE 82Q 8Gb 2-port PCIe Fibre Channel Host Bus Adapter",1,"TS2L5-FC","TS2L5-FC","AJ764A",356,null,0,null,""]
["HPE StoreFabric SN1100Q 16Gb Dual Port Fibre Channel Host Bus Adapter",1,"S2-P9D94A","S2-P9D94A","P9D94A",0,"",0,584,""]
[]
["Additional Card for PCIe Slot 7"]
["DL580"]
["None","","","","","","",0,null,""]
["HPE Ethernet 1Gb 2-port 332T Adapter",1,"TS2L5-1GB","TS2L5-1GB-ALT","615732-B21",29,"",0,null,""]
["HPE Ethernet 10Gb 2-port 530SFP Adapter",1,"TS2L5-10GB","TS2L5-10GB-ALT","652503-B21",259,"HPE BLc 10G SFP+ SR Transceiver",2,null,"455883-B21"]
["HPE StoreFabric CN1200E 10Gb Converged Network Adapter",1,"TS2L5-CNA","TS2L5-CNA-ALT","E7Y06A",720,"HPE BLc 10G SFP+ SR Transceiver",2,null,"455883-B21"]
["HPE Ethernet 10Gb 2P 530T Adapter",1,"TS1-656596","TS1-656596","656596-B21",null,null,null,298]
["HPE Ethernet 10Gb 2-port 521T Adapter",1,"TS1-867707","TS1-867707","867707-B21",null,null,null,298]
["HPE 82Q 8Gb 2-port PCIe Fibre Channel Host Bus Adapter",1,"TS2L5-FC","TS2L5-FC","AJ764A",356,null,0,null,""]
["HPE StoreFabric SN1100Q 16Gb Dual Port Fibre Channel Host Bus Adapter",1,"S2-P9D94A","S2-P9D94A-ALT","P9D94A",0,"",0,584,""]
[]
["Additional Card for PCIe Slot 6"]
["DL580 Slot 48HDD"]
["None","","","","","","",0,null,""]
["HPE Ethernet 1Gb 2-port 332T Adapter",1,"TS2L5-1GB","TS2L5-1GB-ALT","615732-B21",29,"",0,null,""]
["HPE DL580 Gen10 12G 24-port SAS Expander",1,"","","881101-B21"]
["HPE Smart Array P408i-p SR Gen10 Ctrlr",1,"","","830824-B21"]
["HPE Ethernet 10Gb 2-port 530SFP Adapter",1,"TS2L5-10GB","TS2L5-10GB-ALT","652503-B21",259,"HPE BLc 10G SFP+ SR Transceiver",2,null,"455883-B21"]
["HPE StoreFabric CN1200E 10Gb Converged Network Adapter",1,"TS2L5-CNA","TS2L5-CNA-ALT","E7Y06A",720,"HPE BLc 10G SFP+ SR Transceiver",2,null,"455883-B21"]
["HPE Ethernet 10Gb 2P 530T Adapter",1,"TS1-656596","TS1-656596","656596-B21",null,null,null,298]
["HPE Ethernet 10Gb 2-port 521T Adapter",1,"TS1-867707","TS1-867707","867707-B21",null,null,null,298]
["HPE 82Q 8Gb 2-port PCIe Fibre Channel Host Bus Adapter",1,"TS2L5-FC","TS2L5-FC","AJ764A",356,null,0,null,""]
["HPE StoreFabric SN1100Q 16Gb Dual Port Fibre Channel Host Bus Adapter",1,"S2-P9D94A","S2-P9D94A-ALT","P9D94A",0,"",0,584,""]
[]
["Additional Card for PCIe Slot 5"]
["DL580"]
["None","","","","","","",0,null,""]
["HPE Ethernet 1Gb 2-port 332T Adapter",1,"TS2L5-1GB","TS2L5-1GB","615732-B21",29,"",0,null,""]
["HPE Ethernet 10Gb 2-port 530SFP Adapter",1,"TS2L5-10GB","TS2L5-10GB","652503-B21",259,"HPE BLc 10G SFP+ SR Transceiver",2,null,"455883-B21"]
["HPE StoreFabric CN1200E 10Gb Converged Network Adapter",1,"TS2L5-CNA","TS2L5-CNA","E7Y06A",720,"HPE BLc 10G SFP+ SR Transceiver",2,null,"455883-B21"]
["HPE Ethernet 10Gb 2P 530T Adapter",1,"TS1-656596","TS1-656596","656596-B21",null,null,null,298]
["HPE Ethernet 10Gb 2-port 521T Adapter",1,"TS1-867707","TS1-867707","867707-B21",null,null,null,298]
["HPE 82Q 8Gb 2-port PCIe Fibre Channel Host Bus Adapter",1,"TS2L5-FC","TS2L5-FC","AJ764A",356,null,0,null,""]
["HPE StoreFabric SN1100Q 16Gb Dual Port Fibre Channel Host Bus Adapter",1,"S2-P9D94A","S2-P9D94A","P9D94A",0,"",0,584,""]
[]
["Additional Card for PCIe Slot 4"]
["DL580"]
["None","","","","","","",0,null,""]
["HPE Ethernet 1Gb 2-port 332T Adapter",1,"TS2L5-1GB","TS2L5-1GB","615732-B21",29,"",0,null,""]
["HPE Ethernet 10Gb 2-port 530SFP Adapter",1,"TS2L5-10GB","TS2L5-10GB","652503-B21",259,"HPE BLc 10G SFP+ SR Transceiver",2,null,"455883-B21"]
["HPE StoreFabric CN1200E 10Gb Converged Network Adapter",1,"TS2L5-CNA","TS2L5-CNA","E7Y06A",720,"HPE BLc 10G SFP+ SR Transceiver",2,null,"455883-B21"]
["HPE Ethernet 10Gb 2P 530T Adapter",1,"TS1-656596","TS1-656596","656596-B21",null,null,null,298]
["HPE Ethernet 10Gb 2-port 521T Adapter",1,"TS1-867707","TS1-867707","867707-B21",null,null,null,298]
["HPE 82Q 8Gb 2-port PCIe Fibre Channel Host Bus Adapter",1,"TS2L5-FC","TS2L5-FC","AJ764A",356,null,0,null,""]
["HPE StoreFabric SN1100Q 16Gb Dual Port Fibre Channel Host Bus Adapter",1,"S2-P9D94A","S2-P9D94A","P9D94A",0,"",0,584,""]
["NVIDIA Tesla V100 PCIe 16GB Module",1,"TS1-Q2N68A","TS1-Q2N68A","Q2N68A",null,null,null,10583]
["NVIDIA Tesla P40 24GB Module",1,"TS1-Q0V80A","TS1-Q0V80A","Q0V80A",null,null,null,7552]
["NVIDIA Quadro P6000 GPU Module",1,"TS1-Q0V76A","TS1-Q0V76A","Q0V76A",0,"",0,5310,""]
[]
["Additional Card for PCIe Slot 3"]
["DL580"]
["None","","","","","","",0,null,""]
["HPE Ethernet 1Gb 2-port 332T Adapter",1,"TS2L5-1GB","TS2L5-1GB-ALT","615732-B21",29,"",0,null,""]
["HPE Ethernet 10Gb 2-port 530SFP Adapter",1,"TS2L5-10GB","TS2L5-10GB-ALT","652503-B21",259,"HPE BLc 10G SFP+ SR Transceiver",2,null,"455883-B21"]
["HPE StoreFabric CN1200E 10Gb Converged Network Adapter",1,"TS2L5-CNA","TS2L5-CNA-ALT","E7Y06A",720,"HPE BLc 10G SFP+ SR Transceiver",2,null,"455883-B21"]
["HPE Ethernet 10Gb 2P 530T Adapter",1,"TS1-656596","TS1-656596","656596-B21",null,null,null,298]
["HPE Ethernet 10Gb 2-port 521T Adapter",1,"TS1-867707","TS1-867707","867707-B21",null,null,null,298]
["HPE 82Q 8Gb 2-port PCIe Fibre Channel Host Bus Adapter",1,"TS2L5-FC","TS2L5-FC","AJ764A",356,null,0,null,""]
["HPE StoreFabric SN1100Q 16Gb Dual Port Fibre Channel Host Bus Adapter",1,"S2-P9D94A","S2-P9D94A-ALT","P9D94A",0,"",0,584,""]
[]
["Additional Card for PCIe Slot 2"]
["DL580"]
["None","","","","","","",0,null,""]
["HPE Ethernet 1Gb 2-port 332T Adapter",1,"TS2L5-1GB","TS2L5-1GB-ALT","615732-B21",29,"",0,null,""]
["HPE Ethernet 10Gb 2-port 530SFP Adapter",1,"TS2L5-10GB","TS2L5-10GB-ALT","652503-B21",259,"HPE BLc 10G SFP+ SR Transceiver",2,null,"455883-B21"]
["HPE StoreFabric CN1200E 10Gb Converged Network Adapter",1,"TS2L5-CNA","TS2L5-CNA-ALT","E7Y06A",720,"HPE BLc 10G SFP+ SR Transceiver",2,null,"455883-B21"]
["HPE Ethernet 10Gb 2P 530T Adapter",1,"TS1-656596","TS1-656596","656596-B21",null,null,null,298]
["HPE Ethernet 10Gb 2-port 521T Adapter",1,"TS1-867707","TS1-867707","867707-B21",null,null,null,298]
["HPE 82Q 8Gb 2-port PCIe Fibre Channel Host Bus Adapter",1,"TS2L5-FC","TS2L5-FC","AJ764A",356,null,0,null,""]
["HPE StoreFabric SN1100Q 16Gb Dual Port Fibre Channel Host Bus Adapter",1,"S2-P9D94A","S2-P9D94A-ALT","P9D94A",0,"",0,584,""]
[]
["Additional Card for PCIe Slot 1"]
["DL580"]
["None","","","","","","",0,null,""]
["HPE Ethernet 1Gb 2-port 332T Adapter",1,"TS2L5-1GB","TS2L5-1GB-ALT","615732-B21",29,"",0,null,""]
["HPE Ethernet 10Gb 2-port 530SFP Adapter",1,"TS2L5-10GB","TS2L5-10GB-ALT","652503-B21",259,"HPE BLc 10G SFP+ SR Transceiver",2,null,"455883-B21"]
["HPE StoreFabric CN1200E 10Gb Converged Network Adapter",1,"TS2L5-CNA","TS2L5-CNA-ALT","E7Y06A",720,"HPE BLc 10G SFP+ SR Transceiver",2,null,"455883-B21"]
["HPE Ethernet 10Gb 2P 530T Adapter",1,"TS1-656596","TS1-656596","656596-B21",null,null,null,298]
["HPE Ethernet 10Gb 2-port 521T Adapter",1,"TS1-867707","TS1-867707","867707-B21",null,null,null,298]
["HPE 82Q 8Gb 2-port PCIe Fibre Channel Host Bus Adapter",1,"TS2L5-FC","TS2L5-FC","AJ764A",356,null,0,null,""]
["HPE StoreFabric SN1100Q 16Gb Dual Port Fibre Channel Host Bus Adapter",1,"S2-P9D94A","S2-P9D94A-ALT","P9D94A",0,"",0,584,""]
[]
["Aggiungere Coppia di Processori"]
[]
["Non Disponibile"]
["Aggiungere Secondary Riser"]
["Aggiungere Tertiary riser"]
[]
["Aggiungere 9 slot Secondary Riser"]
[]
[]
[]
["Slot dl560 con 20%"]
[]
["Additional Card for PCIe Slot 1"]
["DL560"]
["None","","","","","","",0,null,""]
["HPE Ethernet 1Gb 2-port 332T Adapter",1,"TS2L5-1GB","TS2L5-1GB","615732-B21",32,"",0,null,""]
["HPE Ethernet 10Gb 2-port 530SFP Adapter",1,"TS2L5-10GB","TS2L5-10GB","652503-B21",357,"HPE BLc 10G SFP+ SR Transceiver",2,null,"455883-B21"]
["HPE Ethernet 10Gb 2P 530T Adapter",1,"TS1-656596","TS1-656596","656596-B21",null,null,null,298]
["HPE Ethernet 10Gb 2-port 521T Adapter",1,"TS1-867707","TS1-867707","867707-B21",null,null,null,298]
["HPE StoreFabric CN1200E 10Gb Converged Network Adapter",1,"TS2L5-CNA","TS2L5-CNA","E7Y06A",723,"HPE BLc 10G SFP+ SR Transceiver",2,null,"455883-B21"]
["HPE StoreFabric SN1100Q 16Gb Dual Port Fibre Channel Host Bus Adapter",1,"TS2L5-FC","TS2L5-FC","AJ764A",356,null,0,null,""]
[]
["Additional Card for PCIe Slot 2/3"]
["DL560"]
["None","","","","","","",0,null,""]
["HPE Ethernet 1Gb 2-port 332T Adapter",1,"TS2L5-1GB","TS2L5-1GB","615732-B21",32,"",0,null,""]
["HPE Ethernet 10Gb 2-port 530SFP Adapter",1,"TS2L5-10GB","TS2L5-10GB","652503-B21",357,"HPE BLc 10G SFP+ SR Transceiver",2,null,"455883-B21"]
["HPE StoreFabric CN1200E 10Gb Converged Network Adapter",1,"TS2L5-CNA","TS2L5-CNA","E7Y06A",null,"HPE BLc 10G SFP+ SR Transceiver",2,null,"455883-B21"]
["HPE Ethernet 10Gb 2P 530T Adapter",1,"TS1-656596","TS1-656596","656596-B21",null,null,null,298]
["HPE Ethernet 10Gb 2-port 521T Adapter",1,"TS1-867707","TS1-867707","867707-B21",723,null,null,298]
["HPE StoreFabric SN1100Q 16Gb Dual Port Fibre Channel Host Bus Adapter",1,"TS2L5-FC","TS2L5-FC","AJ764A",356,null,0,null,""]
[]
["Additional Card for PCIe Slot 3"]
["DL560"]
["None","","","","","","",0,null,""]
["HPE Ethernet 1Gb 2-port 332T Adapter",1,"TS2L5-1GB","TS2L5-1GB","615732-B21",32,"",0,null,""]
["HPE Ethernet 10Gb 2-port 530SFP Adapter",1,"TS2L5-10GB","TS2L5-10GB","652503-B21",357,"HPE BLc 10G SFP+ SR Transceiver",2,null,"455883-B21"]
["HPE Ethernet 10Gb 2P 530T Adapter",1,"TS1-656596","TS1-656596","656596-B21",null,null,null,298]
["HPE Ethernet 10Gb 2-port 521T Adapter",1,"TS1-867707","TS1-867707","867707-B21",null,null,null,298]
["HPE StoreFabric CN1200E 10Gb Converged Network Adapter",1,"TS2L5-CNA","TS2L5-CNA","E7Y06A",723,"HPE BLc 10G SFP+ SR Transceiver",2,null,"455883-B21"]
["HPE StoreFabric SN1100Q 16Gb Dual Port Fibre Channel Host Bus Adapter",1,"TS2L5-FC","TS2L5-FC","AJ764A",356,null,0,null,""]
[]
["Additional Card for PCIe Slot 4/5/6"]
["DL560"]
["None","","","","","","",0,null,""]
["HPE Ethernet 1Gb 2-port 332T Adapter",1,"TS2L5-1GB","TS2L5-1GB","615732-B21",32,"",0,null,""]
["HPE Ethernet 10Gb 2-port 530SFP Adapter",1,"TS2L5-10GB","TS2L5-10GB","652503-B21",357,"HPE BLc 10G SFP+ SR Transceiver",2,null,"455883-B21"]
["HPE Ethernet 10Gb 2P 530T Adapter",1,"TS1-656596","TS1-656596","656596-B21",null,null,null,298]
["HPE Ethernet 10Gb 2-port 521T Adapter",1,"TS1-867707","TS1-867707","867707-B21",null,null,null,298]
["HPE StoreFabric CN1200E 10Gb Converged Network Adapter",1,"TS2L5-CNA","TS2L5-CNA","E7Y06A",723,"HPE BLc 10G SFP+ SR Transceiver",2,null,"455883-B21"]
["HPE StoreFabric SN1100Q 16Gb Dual Port Fibre Channel Host Bus Adapter",1,"TS2L5-FC","TS2L5-FC","AJ764A",356,null,0,null,""]
[]
["Additional Card for PCIe Slot 5"]
["DL560"]
["None","","","","","","",0,null,""]
["NVIDIA Quadro P2000 GPU Module",1,"TS1-Q0V77A","TS1-Q0V77A","Q0V77A",null,null,null,518]
["HPE Ethernet 1Gb 2-port 332T Adapter",1,"TS2L5-1GB","TS2L5-1GB","615732-B21",32,"",0,null,""]
["HPE Ethernet 10Gb 2-port 530SFP Adapter",1,"TS2L5-10GB","TS2L5-10GB","652503-B21",357,"HPE BLc 10G SFP+ SR Transceiver",2,null,"455883-B21"]
["HPE Ethernet 10Gb 2P 530T Adapter",1,"TS1-656596","TS1-656596","656596-B21",null,null,null,298]
["HPE Ethernet 10Gb 2-port 521T Adapter",1,"TS1-867707","TS1-867707","867707-B21",null,null,null,298]
["HPE StoreFabric CN1200E 10Gb Converged Network Adapter",1,"TS2L5-CNA","TS2L5-CNA","E7Y06A",723,"HPE BLc 10G SFP+ SR Transceiver",2,null,"455883-B21"]
["HPE StoreFabric SN1100Q 16Gb Dual Port Fibre Channel Host Bus Adapter",1,"TS2L5-FC","TS2L5-FC","AJ764A",356,null,0,null,""]
[]
["Additional Card for PCIe Slot 6"]
["DL560"]
["None","","","","","","",0,null,""]
["HPE Ethernet 1Gb 2-port 332T Adapter",1,"TS2L5-1GB","TS2L5-1GB","615732-B21",32,"",0,null,""]
["HPE Ethernet 10Gb 2-port 530SFP Adapter",1,"TS2L5-10GB","TS2L5-10GB","652503-B21",357,"HPE BLc 10G SFP+ SR Transceiver",2,null,"455883-B21"]
["HPE Ethernet 10Gb 2P 530T Adapter",1,"TS1-656596","TS1-656596","656596-B21",null,null,null,298]
["HPE Ethernet 10Gb 2-port 521T Adapter",1,"TS1-867707","TS1-867707","867707-B21",null,null,null,298]
["HPE StoreFabric CN1200E 10Gb Converged Network Adapter",1,"TS2L5-CNA","TS2L5-CNA","E7Y06A",723,"HPE BLc 10G SFP+ SR Transceiver",2,null,"455883-B21"]
["HPE StoreFabric SN1100Q 16Gb Dual Port Fibre Channel Host Bus Adapter",1,"TS2L5-FC","TS2L5-FC","AJ764A",356,null,0,null,""]
[]
["Additional Card for PCIe Slot 7/8"]
["DL560"]
["None","","","","","","",0,null,""]
["HPE Ethernet 1Gb 2-port 332T Adapter",1,"TS2L5-1GB","TS2L5-1GB","615732-B21",32,"",0,null,""]
["HPE Ethernet 10Gb 2-port 530SFP Adapter",1,"TS2L5-10GB","TS2L5-10GB","652503-B21",357,"HPE BLc 10G SFP+ SR Transceiver",2,null,"455883-B21"]
["HPE Ethernet 10Gb 2P 530T Adapter",1,"TS1-656596","TS1-656596","656596-B21",null,null,null,298]
["HPE Ethernet 10Gb 2-port 521T Adapter",1,"TS1-867707","TS1-867707","867707-B21",null,null,null,298]
["HPE StoreFabric CN1200E 10Gb Converged Network Adapter",1,"TS2L5-CNA","TS2L5-CNA","E7Y06A",723,"HPE BLc 10G SFP+ SR Transceiver",2,null,"455883-B21"]
["HPE StoreFabric SN1100Q 16Gb Dual Port Fibre Channel Host Bus Adapter",1,"TS2L5-FC","TS2L5-FC","AJ764A",356,null,0,null,""]

{"sheet":"Processor","index":8,"n_rows":23,"n_cols":12,"rows_kept":23,"cut":false,"hidden":true,"merged":[]}
["Additional Processor"]
["Server DL560",null,"CPU-A"]
["No Additional Processor",0,{"$f":"\"\"","v":""},null,{"$f":"\"\"","v":""},{"$f":"\"\"","v":""},{"$f":"\"\"","v":""},{"$f":"\"\"","v":""}]
["HPE DL560 Gen10 Intel Xeon-Gold 5220 (2.2GHz/18-core/125W) Processor Kit",2,"TS2L5-CPU-U","TS2L5-CPU-U","P02983-B21","HPE DL5x0 Gen10 CPU Version 2 Mezzanine Board Kit",1,"P07991-B21",null,null,null,3289]
[]
["Server DL580",null,"CPU-B"]
["No Additional Processor",0,{"$f":"\"\"","v":""},null,{"$f":"\"\"","v":""},{"$f":"\"\"","v":""},{"$f":"\"\"","v":""},{"$f":"\"\"","v":""},null,null,null,{"$f":"\"\"","v":""}]
["HPE DL580 Gen10 Intel® Xeon-Gold 5118 (2.3GHz/12-core/105W) FIO Processor Kit",2,"TS1L2-CPU-ALT-U","TS1L2-CPU-ALT-U","878126-L21","ProLiant HPE DL5x0 Gen10 CPU Mezzanine Board Kit ",1,"872222-B21",null,null,null,2584]
[]
["Server DL580 Prestazionale"]
["No Additional Processor",0,{"$f":"\"\"","v":""},null,null,{"$f":"\"\"","v":""},{"$f":"\"\"","v":""},{"$f":"\"\"","v":""},null,null,null,{"$f":"\"\"","v":""}]
["HPE DL580 Gen10 Intel® Xeon-Gold 6140M (2.3GHz/18-core/140W) FIO Processor Kit",2,"TS1L2-CPU-580-U","TS1L2-CPU-580-U","878138-L21","ProLiant HPE DL5x0 Gen10 CPU Mezzanine Board Kit ",1,"872222-B21",null,null,null,5056]
[]
[]
[]
[]
[]
[]
["HPE OneView Advanced standalone licenses"]
["None",0,{"$f":"\"\"","v":""},{"$f":"\"\"","v":""},{"$f":"\"\"","v":""},0,{"$f":"\"\"","v":""},{"$f":"\"\"","v":""},{"$f":"\"\"","v":""},{"$f":"\"\"","v":""},{"$f":"\"\"","v":""},{"$f":"\"\"","v":""}]
["HPE OneView Advanced with iLO Advanced incl 3yr 24x7 Supp Phys 1 Svr Lic",1,"TS2L5-OV3YILO","TS2L5-OV3YILO","E5Y34A",480]
[]
[" "]

{"sheet":"Memory","index":9,"n_rows":89,"n_cols":27,"rows_kept":89,"cut":false,"hidden":true,"merged":[[41,7,41,9],[41,1,41,6],[41,10,41,15]]}
[null,"Total Memory"]
[]
[null,"HPE 16GB (1x16GB) Dual Rank x4 DDR4-2400 Registered Memory Kit",1,"TS2L4-16GB-2400","TS2L4-16GB-580","836220-B21",172,"DL580 Gen9"]
[null,"HP 32GB (1x32GB) Dual Rank x4 DDR4-2400 Registered Memory Kit",1,"TS2L4-32GB-2400","TS2L4-32GB-580","805351-B21",344,"DL580 Gen9"]
[null,"HPE 64GB (1x64GB) Quad Rank x4 DDR4-2400 Load Reduced Memory Kit",1,"TS2L4-64GB-2400","TS2L4-64GB-580","805358-B21",750,"DL580 Gen9"]
[null,"HPE 16GB 1Rx4 PC4-2933 Smart Kit",1,"TS2L5-RAM16-U","TS2L5-RAM16-U","815098-B21",136]
[null,"HPE 32GB 2Rx4 PC4-2933 Smart Kit",1,"TS2L5-RAM32-U","TS2L5-RAM32-U","815100-B21",397,{"$f":"G7*4","v":1588}]
[null,"HPE 64GB 4Rx4 PC4-2933 Smart Kit",1,"TS2L5-RAM64-U","TS2L5-RAM64-U","815101-B21",705]
[]
[]
["2CPU","MEMORY A"]
[".:*~*:._.:*~*:._.:*~*:._.:Moduli da 32GB.:*~*:._.:*~*:._.:*~*:._.:",{"$f":"$B$7","v":"HPE 32GB 2Rx4 PC4-2933 Smart Kit"},4,{"$f":"\"\"","v":""},"TS2L5-RAM32-U","815100-B21",0,{"$f":"$B$7","v":"HPE 32GB 2Rx4 PC4-2933 Smart Kit"},4,{"$f":"$F$7","v":"815100-B21"},{"$f":"\"\"","v":""},{"$f":"\"\"","v":""},{"$f":"\"\"","v":""},{"$f":"\"\"","v":""},{"$f":"\"\"","v":""},{"$f":"\"\"","v":""}]
["128        (DIMM 32GB)","HPE 32GB 2Rx4 PC4-2933 Smart Kit",4,{"$f":"\"\"","v":""},"TS2L5-RAM32-U","815100-B21",0,"HPE 32GB 2Rx4 PC4-2933 Smart Kit",4,"815100-B21",{"$f":"\"\"","v":""},{"$f":"\"\"","v":""},{"$f":"\"\"","v":""},{"$f":"\"\"","v":""},{"$f":"\"\"","v":""},{"$f":"\"\"","v":""}]
["192        (DIMM 32GB)","HPE 32GB 2Rx4 PC4-2933 Smart Kit",6,"TS2L5-RAM32-U","TS2L5-RAM32-U","815100-B21",{"$f":"($G$7*C14)-$H$7","v":794},"HPE 32GB 2Rx4 PC4-2933 Smart Kit",4,"815100-B21",{"$f":"\"\"","v":""},{"$f":"\"\"","v":""},{"$f":"\"\"","v":""},{"$f":"\"\"","v":""},{"$f":"\"\"","v":""},{"$f":"\"\"","v":""}]
["256        (DIMM 32GB)","HPE 32GB 2Rx4 PC4-2933 Smart Kit",8,"TS2L5-RAM32-U","TS2L5-RAM32-U","815100-B21",{"$f":"($G$7*C15)-$H$7","v":1588},"HPE 32GB 2Rx4 PC4-2933 Smart Kit",4,"815100-B21",{"$f":"\"\"","v":""},{"$f":"\"\"","v":""},{"$f":"\"\"","v":""},{"$f":"\"\"","v":""},{"$f":"\"\"","v":""},{"$f":"\"\"","v":""}]
["384        (DIMM 32GB)","HPE 32GB 2Rx4 PC4-2933 Smart Kit",12,"TS2L5-RAM32-U","TS2L5-RAM32-U","815100-B21",3176,"HPE 32GB 2Rx4 PC4-2933 Smart Kit",4,"815100-B21",{"$f":"\"\"","v":""},{"$f":"\"\"","v":""},{"$f":"\"\"","v":""},{"$f":"\"\"","v":""},{"$f":"\"\"","v":""},{"$f":"\"\"","v":""}]
["512        (DIMM 32GB)","HPE 32GB 2Rx4 PC4-2933 Smart Kit",16,"TS2L5-RAM32-U","TS2L5-RAM32-U","815100-B21",4764,"HPE 32GB 2Rx4 PC4-2933 Smart Kit",4,"815100-B21",{"$f":"\"\"","v":""},{"$f":"\"\"","v":""},{"$f":"\"\"","v":""},{"$f":"\"\"","v":""},{"$f":"\"\"","v":""},{"$f":"\"\"","v":""}]
["768        (DIMM 32GB)","HPE 32GB 2Rx4 PC4-2933 Smart Kit",24,"TS2L5-RAM32-U","TS2L5-RAM32-U","815100-B21",7940,"HPE 32GB 2Rx4 PC4-2933 Smart Kit",4,"815100-B21",{"$f":"\"\"","v":""},{"$f":"\"\"","v":""},{"$f":"\"\"","v":""},{"$f":"\"\"","v":""},{"$f":"\"\"","v":""},{"$f":"\"\"","v":""}]
[".:*~*:._.:*~*:._.:*~*:._.:Moduli da 64GB.:*~*:._.:*~*:._.:*~*:._.:",{"$f":"\"\"","v":""},{"$f":"\"\"","v":""},{"$f":"\"\"","v":""},{"$f":"\"\"","v":""},{"$f":"\"\"","v":""},{"$f":"\"\"","v":""},{"$f":"\"\"","v":""},{"$f":"\"\"","v":""},{"$f":"\"\"","v":""},"HPE 64GB 4Rx4 PC4-2933 Smart Kit",8,"TS2L5-RAM64-U","TS2L5-RAM64-U","815101-B21",{"$f":"$G$8*L19","v":5640}]
["512        (DIMM 64GB)",{"$f":"\"\"","v":""},{"$f":"\"\"","v":""},{"$f":"\"\"","v":""},{"$f":"\"\"","v":""},{"$f":"\"\"","v":""},{"$f":"\"\"","v":""},{"$f":"\"\"","v":""},{"$f":"\"\"","v":""},{"$f":"\"\"","v":""},"HPE 64GB 4Rx4 PC4-2933 Smart Kit",8,"TS2L5-RAM64-U","TS2L5-RAM64-U","815101-B21",5640]
["768        (DIMM 64GB)",{"$f":"\"\"","v":""},{"$f":"\"\"","v":""},{"$f":"\"\"","v":""},{"$f":"\"\"","v":""},{"$f":"\"\"","v":""},{"$f":"\"\"","v":""},{"$f":"\"\"","v":""},{"$f":"\"\"","v":""},{"$f":"\"\"","v":""},"HPE 64GB 4Rx4 PC4-2933 Smart Kit",12,"TS2L5-RAM64-U","TS2L5-RAM64-U","815101-B21",8460]
["1024      (DIMM 64GB)",{"$f":"\"\"","v":""},{"$f":"\"\"","v":""},{"$f":"\"\"","v":""},{"$f":"\"\"","v":""},{"$f":"\"\"","v":""},{"$f":"\"\"","v":""},{"$f":"\"\"","v":""},{"$f":"\"\"","v":""},{"$f":"\"\"","v":""},"HPE 64GB 4Rx4 PC4-2933 Smart Kit",16,"TS2L5-RAM64-U","TS2L5-RAM64-U","815101-B21",{"$f":"$G$8*L22","v":11280}]
["1536      (DIMM 64GB)",{"$f":"\"\"","v":""},{"$f":"\"\"","v":""},{"$f":"\"\"","v":""},{"$f":"\"\"","v":""},{"$f":"\"\"","v":""},{"$f":"\"\"","v":""},{"$f":"\"\"","v":""},{"$f":"\"\"","v":""},{"$f":"\"\"","v":""},"HPE 64GB 4Rx4 PC4-2933 Smart Kit",24,"TS2L5-RAM64-U","TS2L5-RAM64-U","815101-B21",{"$f":"$G$8*L23","v":16920}]
["4CPU"]
[".:*~*:._.:*~*:._.:*~*:._.:Moduli da 32GB.:*~*:._.:*~*:._.:*~*:._.:",{"$f":"$B$7","v":"HPE 32GB 2Rx4 PC4-2933 Smart Kit"},4,{"$f":"\"\"","v":""},{"$f":"\"\"","v":""},"815100-B21",0,{"$f":"$B$7","v":"HPE 32GB 2Rx4 PC4-2933 Smart Kit"},4,{"$f":"$F$7","v":"815100-B21"},{"$f":"\"\"","v":""},{"$f":"\"\"","v":""},{"$f":"\"\"","v":""},{"$f":"\"\"","v":""},{"$f":"\"\"","v":""},{"$f":"\"\"","v":""}]
["128        (DIMM 32GB)","HPE 32GB 2Rx4 PC4-2933 Smart Kit",4,{"$f":"\"\"","v":""},{"$f":"\"\"","v":""},"815100-B21",0,"HPE 32GB 2Rx4 PC4-2933 Smart Kit",4,"815100-B21",{"$f":"\"\"","v":""},{"$f":"\"\"","v":""},{"$f":"\"\"","v":""},{"$f":"\"\"","v":""},{"$f":"\"\"","v":""},{"$f":"\"\"","v":""}]
["256        (DIMM 32GB)","HPE 32GB 2Rx4 PC4-2933 Smart Kit",8,"TS2L5-RAM32-U","TS2L5-RAM32-U","815100-B21",{"$f":"($G$7*C27)-$H$7","v":1588},"HPE 32GB 2Rx4 PC4-2933 Smart Kit",4,{"$f":"$F$7","v":"815100-B21"},{"$f":"\"\"","v":""},{"$f":"\"\"","v":""},{"$f":"\"\"","v":""},{"$f":"\"\"","v":""},{"$f":"\"\"","v":""},{"$f":"\"\"","v":""}]
["384        (DIMM 32GB)","HPE 32GB 2Rx4 PC4-2933 Smart Kit",12,"TS2L5-RAM32-U","TS2L5-RAM32-U","815100-B21",{"$f":"($G$7*C28)-$H$7","v":3176},"HPE 32GB 2Rx4 PC4-2933 Smart Kit",4,"815100-B21",{"$f":"\"\"","v":""},{"$f":"\"\"","v":""},{"$f":"\"\"","v":""},{"$f":"\"\"","v":""},{"$f":"\"\"","v":""},{"$f":"\"\"","v":""}]
["512        (DIMM 32GB)","HPE 32GB 2Rx4 PC4-2933 Smart Kit",16,"TS2L5-RAM32-U","TS2L5-RAM32-U","815100-B21",4764,"HPE 32GB 2Rx4 PC4-2933 Smart Kit",4,"815100-B21",{"$f":"\"\"","v":""},{"$f":"\"\"","v":""},{"$f":"\"\"","v":""},{"$f":"\"\"","v":""},{"$f":"\"\"","v":""},{"$f":"\"\"","v":""}]
["768        (DIMM 32GB)","HPE 32GB 2Rx4 PC4-2933 Smart Kit",24,"TS2L5-RAM32-U","TS2L5-RAM32-U","815100-B21",7940,"HPE 32GB 2Rx4 PC4-2933 Smart Kit",4,"815100-B21",{"$f":"\"\"","v":""},{"$f":"\"\"","v":""},{"$f":"\"\"","v":""},{"$f":"\"\"","v":""},{"$f":"\"\"","v":""},{"$f":"\"\"","v":""}]
["1024      (DIMM 32GB)","HPE 32GB 2Rx4 PC4-2933 Smart Kit",32,"TS2L5-RAM32-U","TS2L5-RAM32-U","815100-B21",11116,"HPE 32GB 2Rx4 PC4-2933 Smart Kit",4,"815100-B21",{"$f":"\"\"","v":""},{"$f":"\"\"","v":""},{"$f":"\"\"","v":""},{"$f":"\"\"","v":""},{"$f":"\"\"","v":""},{"$f":"\"\"","v":""}]
["1536      (DIMM 32GB)","HPE 32GB 2Rx4 PC4-2933 Smart Kit",48,"TS2L5-RAM32-U","TS2L5-RAM32-U","815100-B21",17468,"HPE 32GB 2Rx4 PC4-2933 Smart Kit",4,"815100-B21",{"$f":"\"\"","v":""},{"$f":"\"\"","v":""},{"$f":"\"\"","v":""},{"$f":"\"\"","v":""},{"$f":"\"\"","v":""},{"$f":"\"\"","v":""}]
[".:*~*:._.:*~*:._.:*~*:._.:Moduli da 64GB.:*~*:._.:*~*:._.:*~*:._.:",{"$f":"\"\"","v":""},{"$f":"\"\"","v":""},{"$f":"\"\"","v":""},{"$f":"\"\"","v":""},{"$f":"\"\"","v":""},{"$f":"\"\"","v":""},{"$f":"\"\"","v":""},{"$f":"\"\"","v":""},{"$f":"\"\"","v":""},"HPE 64GB 4Rx4 PC4-2933 Smart Kit",8,"TS2L5-RAM64","TS2L5-RAM64","815101-B21",{"$f":"$G$8*L33","v":5640}]
["512        (DIMM 64GB)",{"$f":"\"\"","v":""},{"$f":"\"\"","v":""},{"$f":"\"\"","v":""},{"$f":"\"\"","v":""},{"$f":"\"\"","v":""},{"$f":"\"\"","v":""},{"$f":"\"\"","v":""},{"$f":"\"\"","v":""},{"$f":"\"\"","v":""},"HPE 64GB 4Rx4 PC4-2933 Smart Kit",8,"TS2L5-RAM64","TS2L5-RAM64","815101-B21",5640]
["768        (DIMM 64GB)",{"$f":"\"\"","v":""},{"$f":"\"\"","v":""},{"$f":"\"\"","v":""},{"$f":"\"\"","v":""},{"$f":"\"\"","v":""},{"$f":"\"\"","v":""},{"$f":"\"\"","v":""},{"$f":"\"\"","v":""},{"$f":"\"\"","v":""},"HPE 64GB 4Rx4 PC4-2933 Smart Kit",12,"TS2L5-RAM64","TS2L5-RAM64","815101-B21",8460]
["1024      (DIMM 64GB)",{"$f":"\"\"","v":""},{"$f":"\"\"","v":""},{"$f":"\"\"","v":""},{"$f":"\"\"","v":""},{"$f":"\"\"","v":""},{"$f":"\"\"","v":""},{"$f":"\"\"","v":""},{"$f":"\"\"","v":""},{"$f":"\"\"","v":""},"HPE 64GB 4Rx4 PC4-2933 Smart Kit",16,"TS2L5-RAM64","TS2L5-RAM64","815101-B21",{"$f":"$G$8*L36","v":11280}]
["1536      (DIMM 64GB)",{"$f":"\"\"","v":""},{"$f":"\"\"","v":""},{"$f":"\"\"","v":""},{"$f":"\"\"","v":""},{"$f":"\"\"","v":""},{"$f":"\"\"","v":""},{"$f":"\"\"","v":""},{"$f":"\"\"","v":""},{"$f":"\"\"","v":""},"HPE 64GB 4Rx4 PC4-2933 Smart Kit",24,"TS2L5-RAM64","TS2L5-RAM64","815101-B21",{"$f":"$G$8*L37","v":16920}]
["2048      (DIMM 64GB)",{"$f":"\"\"","v":""},{"$f":"\"\"","v":""},{"$f":"\"\"","v":""},{"$f":"\"\"","v":""},{"$f":"\"\"","v":""},{"$f":"\"\"","v":""},{"$f":"\"\"","v":""},{"$f":"\"\"","v":""},{"$f":"\"\"","v":""},"HPE 64GB 4Rx4 PC4-2933 Smart Kit",32,"TS2L5-RAM64","TS2L5-RAM64","815101-B21",{"$f":"$G$8*L38","v":22560}]
["3072      (DIMM 64GB)",{"$f":"\"\"","v":""},{"$f":"\"\"","v":""},{"$f":"\"\"","v":""},{"$f":"\"\"","v":""},{"$f":"\"\"","v":""},{"$f":"\"\"","v":""},{"$f":"\"\"","v":""},{"$f":"\"\"","v":""},{"$f":"\"\"","v":""},"HPE 64GB 4Rx4 PC4-2933 Smart Kit",48,"TS2L5-RAM64","TS2L5-RAM64","815101-B21",{"$f":"$G$8*L39","v":33840}]
[]
[null,"MEMORY B"]
["2CPU","UPGRADE 16GB",null,null,null,null,null,"MEMORIA BASE",null,null,"UPGRADE 32GB",null,null,null,null,null,null,null,null,"Memoria Totale","Prezzo Totale Memorie","Memory Cartridge Totali","DIMM Slot",32,16,16]
[64,{"$f":"\"\"","v":""},{"$f":"\"\"","v":""},{"$f":"\"\"","v":""},{"$f":"\"\"","v":""},{"$f":"\"\"","v":""},{"$f":"\"\"","v":""},{"$f":"$B$7","v":"HPE 32GB 2Rx4 PC4-2933 Smart Kit"},"2",{"$f":"$F$7","v":"815100-B21"},{"$f":"\"\"","v":""},{"$f":"\"\"","v":""},{"$f":"\"\"","v":""},{"$f":"\"\"","v":""},{"$f":"\"\"","v":""},{"$f":"\"\"","v":""},null,null,null,null,null,null,null,{"$f":"IF(L43=\"\",0,L43)","v":0},{"$f":"IF(I43=\"\",0,I43)","v":"2"},{"$f":"IF(C43=\"\",0,C43)","v":0},{"$f":"SUM(X43:Z43)","v":0}]
[128,"HPE 32GB (1x32GB) Dual Rank x4 DDR4-2666 CAS-19-19-19 Registered Smart Memory Kit",2,"TS2L4-32GB","TS2L4-32GB","815100-B21",{"$f":"$G$7*C44","v":794},{"$f":"$B$7","v":"HPE 32GB 2Rx4 PC4-2933 Smart Kit"},"2",{"$f":"$F$7","v":"815100-B21"},{"$f":"\"\"","v":""},{"$f":"\"\"","v":""},{"$f":"\"\"","v":""},{"$f":"\"\"","v":""},{"$f":"\"\"","v":""},{"$f":"\"\"","v":""},null,null,null,null,null,null,null,0,"2",2,2]
[192,"HPE 32GB (1x32GB) Dual Rank x4 DDR4-2666 CAS-19-19-19 Registered Smart Memory Kit",4,"TS2L4-32GB","TS2L4-32GB","815100-B21",1588,"HPE 32GB 2Rx4 PC4-2933 Smart Kit","2","815100-B21",{"$f":"\"\"","v":""},{"$f":"\"\"","v":""},{"$f":"\"\"","v":""},{"$f":"\"\"","v":""},{"$f":"\"\"","v":""},{"$f":"\"\"","v":""},null,null,null,null,null,null,null,0,"2",4,4]
[256,"HPE 32GB (1x32GB) Dual Rank x4 DDR4-2666 CAS-19-19-19 Registered Smart Memory Kit",6,"TS2L4-32GB","TS2L4-32GB","815100-B21",2382,"HPE 32GB 2Rx4 PC4-2933 Smart Kit","2","815100-B21",{"$f":"\"\"","v":""},{"$f":"\"\"","v":""},{"$f":"\"\"","v":""},{"$f":"\"\"","v":""},{"$f":"\"\"","v":""},{"$f":"\"\"","v":""},null,null,null,null,null,null,null,0,"2",6,6]
[384,"HPE 32GB (1x32GB) Dual Rank x4 DDR4-2666 CAS-19-19-19 Registered Smart Memory Kit",10,"TS2L4-32GB","TS2L4-32GB","815100-B21",3970,"HPE 32GB 2Rx4 PC4-2933 Smart Kit","2","815100-B21",{"$f":"\"\"","v":""},{"$f":"\"\"","v":""},{"$f":"\"\"","v":""},{"$f":"\"\"","v":""},{"$f":"\"\"","v":""},{"$f":"\"\"","v":""},null,null,null,null,null,null,null,0,"2",10,10]
[512,"HPE 32GB (1x32GB) Dual Rank x4 DDR4-2666 CAS-19-19-19 Registered Smart Memory Kit",14,"TS2L4-32GB","TS2L4-32GB","815100-B21",5558,"HPE 32GB 2Rx4 PC4-2933 Smart Kit","2","815100-B21",{"$f":"\"\"","v":""},{"$f":"\"\"","v":""},{"$f":"\"\"","v":""},{"$f":"\"\"","v":""},{"$f":"\"\"","v":""},{"$f":"\"\"","v":""},null,null,null,null,null,null,null,0,"2",14,14]
[768,"HPE 32GB (1x32GB) Dual Rank x4 DDR4-2666 CAS-19-19-19 Registered Smart Memory Kit",22,"TS2L4-32GB","TS2L4-32GB","815100-B21",8734,"HPE 32GB 2Rx4 PC4-2933 Smart Kit","2","815100-B21",{"$f":"\"\"","v":""},{"$f":"\"\"","v":""},{"$f":"\"\"","v":""},{"$f":"\"\"","v":""},{"$f":"\"\"","v":""},{"$f":"\"\"","v":""},null,null,null,null,null,null,null,0,"2",22,22]
[1024,{"$f":"\"\"","v":""},{"$f":"\"\"","v":""},{"$f":"\"\"","v":""},{"$f":"\"\"","v":""},{"$f":"\"\"","v":""},{"$f":"\"\"","v":""},{"$f":"\"\"","v":""},{"$f":"\"\"","v":""},{"$f":"\"\"","v":""},"HPE 64GB (1x64GB) Quad Rank x4 DDR4-2666 CAS-19-19-19 Load Reduced Smart Memory Kit",16,"TS1L2-64GB","TS1L2-64GB","815101-B21",{"$f":"$G$8*L50","v":11280},null,null,null,null,null,null,null,16,0,0,16]
[1536,{"$f":"\"\"","v":""},{"$f":"\"\"","v":""},{"$f":"\"\"","v":""},{"$f":"\"\"","v":""},{"$f":"\"\"","v":""},{"$f":"\"\"","v":""},{"$f":"\"\"","v":""},{"$f":"\"\"","v":""},{"$f":"\"\"","v":""},"HPE 64GB (1x64GB) Quad Rank x4 DDR4-2666 CAS-19-19-19 Load Reduced Smart Memory Kit",24,"TS1L2-64GB","TS1L2-64GB","815101-B21",{"$f":"$G$8*L51","v":16920},null,null,null,null,null,null,null,24,0,0,24]
["4CPU"]
[128,"HPE 32GB (1x32GB) Dual Rank x4 DDR4-2666 CAS-19-19-19 Registered Smart Memory Kit",2,"TS2L4-32GB","TS2L4-32GB","815100-B21",{"$f":"$G$7*C53","v":794},{"$f":"$B$7","v":"HPE 32GB 2Rx4 PC4-2933 Smart Kit"},"2",{"$f":"$F$7","v":"815100-B21"},{"$f":"\"\"","v":""},{"$f":"\"\"","v":""},{"$f":"\"\"","v":""},{"$f":"\"\"","v":""},{"$f":"\"\"","v":""},{"$f":"\"\"","v":""},null,null,null,null,null,null,null,{"$f":"IF(L53=\"\",0,L53)","v":0},{"$f":"IF(I53=\"\",0,I53)","v":"2"},{"$f":"IF(C53=\"\",0,C53)","v":2},{"$f":"SUM(X53:Z53)","v":2}]
[256,"HPE 32GB (1x32GB) Dual Rank x4 DDR4-2666 CAS-19-19-19 Registered Smart Memory Kit",6,"TS2L4-32GB","TS2L4-32GB","815100-B21",2382,{"$f":"$B$7","v":"HPE 32GB 2Rx4 PC4-2933 Smart Kit"},"2",{"$f":"$F$7","v":"815100-B21"},{"$f":"\"\"","v":""},{"$f":"\"\"","v":""},{"$f":"\"\"","v":""},{"$f":"\"\"","v":""},{"$f":"\"\"","v":""},{"$f":"\"\"","v":""},null,null,null,null,null,null,null,0,"2",6,6]
[384,"HPE 32GB (1x32GB) Dual Rank x4 DDR4-2666 CAS-19-19-19 Registered Smart Memory Kit",10,"TS2L4-32GB","TS2L4-32GB","815100-B21",3970,"HPE 32GB 2Rx4 PC4-2933 Smart Kit","2","815100-B21",{"$f":"\"\"","v":""},{"$f":"\"\"","v":""},{"$f":"\"\"","v":""},{"$f":"\"\"","v":""},{"$f":"\"\"","v":""},{"$f":"\"\"","v":""},null,null,null,null,null,null,null,0,"2",10,10]
[512,"HPE 32GB (1x32GB) Dual Rank x4 DDR4-2666 CAS-19-19-19 Registered Smart Memory Kit",14,"TS2L4-32GB","TS2L4-32GB","815100-B21",5558,"HPE 32GB 2Rx4 PC4-2933 Smart Kit","2","815100-B21",{"$f":"\"\"","v":""},{"$f":"\"\"","v":""},{"$f":"\"\"","v":""},{"$f":"\"\"","v":""},{"$f":"\"\"","v":""},{"$f":"\"\"","v":""},null,null,null,null,null,null,null,0,"2",14,14]
[768,"HPE 32GB (1x32GB) Dual Rank x4 DDR4-2666 CAS-19-19-19 Registered Smart Memory Kit",22,"TS2L4-32GB","TS2L4-32GB","815100-B21",8734,"HPE 32GB 2Rx4 PC4-2933 Smart Kit","2","815100-B21",{"$f":"\"\"","v":""},{"$f":"\"\"","v":""},{"$f":"\"\"","v":""},{"$f":"\"\"","v":""},{"$f":"\"\"","v":""},{"$f":"\"\"","v":""},null,null,null,null,null,null,null,0,"2",22,22]
[1024,"HPE 32GB (1x32GB) Dual Rank x4 DDR4-2666 CAS-19-19-19 Registered Smart Memory Kit",30,"TS2L4-32GB","TS2L4-32GB","815100-B21",11910,"HPE 32GB 2Rx4 PC4-2933 Smart Kit","2","815100-B21",{"$f":"\"\"","v":""},{"$f":"\"\"","v":""},{"$f":"\"\"","v":""},{"$f":"\"\"","v":""},{"$f":"\"\"","v":""},{"$f":"\"\"","v":""},null,null,null,null,null,null,null,0,"2",30,30]
[1536,"HPE 32GB (1x32GB) Dual Rank x4 DDR4-2666 CAS-19-19-19 Registered Smart Memory Kit",46,"TS2L4-32GB","TS2L4-32GB","815100-B21",18262,"HPE 32GB 2Rx4 PC4-2933 Smart Kit","2","815100-B21",{"$f":"\"\"","v":""},{"$f":"\"\"","v":""},{"$f":"\"\"","v":""},{"$f":"\"\"","v":""},{"$f":"\"\"","v":""},{"$f":"\"\"","v":""},null,null,null,null,null,null,null,0,"2",46,46]
[2048,{"$f":"\"\"","v":""},{"$f":"\"\"","v":""},{"$f":"\"\"","v":""},{"$f":"\"\"","v":""},{"$f":"\"\"","v":""},{"$f":"\"\"","v":""},{"$f":"\"\"","v":""},{"$f":"\"\"","v":""},{"$f":"\"\"","v":""},"HPE 64GB (1x64GB) Quad Rank x4 DDR4-2666 CAS-19-19-19 Load Reduced Smart Memory Kit",32,"TS1L2-64GB","TS1L2-64GB","815101-B21",{"$f":"$G$8*L60","v":22560},null,null,null,null,null,null,null,32,0,0,32]
[3072,{"$f":"\"\"","v":""},{"$f":"\"\"","v":""},{"$f":"\"\"","v":""},{"$f":"\"\"","v":""},{"$f":"\"\"","v":""},{"$f":"\"\"","v":""},{"$f":"\"\"","v":""},{"$f":"\"\"","v":""},{"$f":"\"\"","v":""},"HPE 64GB (1x64GB) Quad Rank x4 DDR4-2666 CAS-19-19-19 Load Reduced Smart Memory Kit",48,"TS1L2-64GB","TS1L2-64GB","815101-B21",{"$f":"$G$8*L61","v":33840},null,null,null,null,null,null,null,48,0,0,48]
[]
["1CPU","MEMORY C",null,null,null,null,null,null,null,null,null,null,null,null,null,null,null,null,null,"Memoria Totale","Prezzo Totale Memorie","Memory Cartridge Totali","DIMM Slot",32,16,16]
[{"$f":"32*I64","v":128},{"$f":"\"\"","v":""},{"$f":"\"\"","v":""},{"$f":"\"\"","v":""},{"$f":"\"\"","v":""},null,{"$f":"\"\"","v":""},"HPE 32GB (1x32GB) Dual Rank x4 DDR4-2666 CAS-19-19-19 Registered Smart Memory Kit",4,"815100-B21",{"$f":"\"\"","v":""},{"$f":"\"\"","v":""},{"$f":"\"\"","v":""},{"$f":"\"\"","v":""},{"$f":"\"\"","v":""},{"$f":"\"\"","v":""},null,null,null,null,null,null,null,{"$f":"IF(L64=\"\",0,L64)","v":0},{"$f":"IF(I64=\"\",0,I64)","v":4},{"$f":"IF(C64=\"\",0,C64)","v":0},{"$f":"SUM(X64:Z64)","v":4}]
[{"$f":"(32*I65)+(C65*32)","v":256},"HPE 32GB (1x32GB) Dual Rank x4 DDR4-2666 CAS-19-19-19 Registered Smart Memory Kit",4,"TS2L4-32GB","TS2L4-32GB","815100-B21",{"$f":"$G$4*C65","v":1376},"HPE 32GB (1x32GB) Dual Rank x4 DDR4-2666 CAS-19-19-19 Registered Smart Memory Kit",4,"815100-B21",{"$f":"\"\"","v":""},{"$f":"\"\"","v":""},{"$f":"\"\"","v":""},{"$f":"\"\"","v":""},{"$f":"\"\"","v":""},{"$f":"\"\"","v":""},null,null,null,null,null,null,null,{"$f":"IF(L65=\"\",0,L65)","v":0},{"$f":"IF(I65=\"\",0,I65)","v":4},{"$f":"IF(C65=\"\",0,C65)","v":4},{"$f":"SUM(X65:Z65)","v":8}]
[{"$f":"(32*I66)+(C66*32)","v":512},"HPE 32GB (1x32GB) Dual Rank x4 DDR4-2666 CAS-19-19-19 Registered Smart Memory Kit",12,"TS2L4-32GB","TS2L4-32GB","815100-B21",{"$f":"$G$4*C66","v":4128},"HPE 32GB (1x32GB) Dual Rank x4 DDR4-2666 CAS-19-19-19 Registered Smart Memory Kit",4,"815100-B21",{"$f":"\"\"","v":""},{"$f":"\"\"","v":""},{"$f":"\"\"","v":""},{"$f":"\"\"","v":""},{"$f":"\"\"","v":""},{"$f":"\"\"","v":""},null,null,null,null,null,null,null,0,4,12,16]
[{"$f":"(32*I67)+(C67*32)","v":640},"HPE 32GB (1x32GB) Dual Rank x4 DDR4-2666 CAS-19-19-19 Registered Smart Memory Kit",16,"TS2L4-32GB","TS2L4-32GB","815100-B21",{"$f":"$G$4*C67","v":5504},"HPE 32GB (1x32GB) Dual Rank x4 DDR4-2666 CAS-19-19-19 Registered Smart Memory Kit",4,"815100-B21",{"$f":"\"\"","v":""},{"$f":"\"\"","v":""},{"$f":"\"\"","v":""},{"$f":"\"\"","v":""},{"$f":"\"\"","v":""},{"$f":"\"\"","v":""},null,null,null,null,null,null,null,{"$f":"IF(L67=\"\",0,L67)","v":0},{"$f":"IF(I67=\"\",0,I67)","v":4},{"$f":"IF(C67=\"\",0,C67)","v":16},{"$f":"SUM(X67:Z67)","v":20}]
[{"$f":"(32*I68)+(C68*32)","v":768},"HPE 32GB (1x32GB) Dual Rank x4 DDR4-2666 CAS-19-19-19 Registered Smart Memory Kit",20,"TS2L4-32GB","TS2L4-32GB","815100-B21",{"$f":"$G$4*C68","v":6880},"HPE 32GB (1x32GB) Dual Rank x4 DDR4-2666 CAS-19-19-19 Registered Smart Memory Kit",4,"815100-B21",{"$f":"\"\"","v":""},{"$f":"\"\"","v":""},{"$f":"\"\"","v":""},{"$f":"\"\"","v":""},{"$f":"\"\"","v":""},{"$f":"\"\"","v":""},null,null,null,null,null,null,null,0,4,20,24]
[{"$f":"(L69*64)","v":1024},{"$f":"\"\"","v":""},{"$f":"\"\"","v":""},{"$f":"\"\"","v":""},{"$f":"\"\"","v":""},{"$f":"\"\"","v":""},{"$f":"\"\"","v":""},{"$f":"\"\"","v":""},{"$f":"\"\"","v":""},{"$f":"\"\"","v":""},"HPE 64GB (1x64GB) Quad Rank x4 DDR4-2666 CAS-19-19-19 Load Reduced Smart Memory Kit",16,"TS1L2-64GB","TS1L2-64GB","815101-B21",{"$f":"$G$8*L69","v":11280},null,null,null,null,null,null,null,16,0,0,16]
[{"$f":"(L70*64)","v":1280},{"$f":"\"\"","v":""},{"$f":"\"\"","v":""},{"$f":"\"\"","v":""},{"$f":"\"\"","v":""},{"$f":"\"\"","v":""},{"$f":"\"\"","v":""},{"$f":"\"\"","v":""},{"$f":"\"\"","v":""},{"$f":"\"\"","v":""},"HPE 64GB (1x64GB) Quad Rank x4 DDR4-2666 CAS-19-19-19 Load Reduced Smart Memory Kit",20,"TS1L2-64GB","TS1L2-64GB","815101-B21",{"$f":"$G$8*L70","v":14100},null,null,null,null,null,null,null,20,0,0,20]
[{"$f":"(L71*64)","v":1536},{"$f":"\"\"","v":""},{"$f":"\"\"","v":""},{"$f":"\"\"","v":""},{"$f":"\"\"","v":""},{"$f":"\"\"","v":""},{"$f":"\"\"","v":""},{"$f":"\"\"","v":""},{"$f":"\"\"","v":""},{"$f":"\"\"","v":""},"HPE 64GB (1x64GB) Quad Rank x4 DDR4-2666 CAS-19-19-19 Load Reduced Smart Memory Kit",24,"TS1L2-64GB","TS1L2-64GB","815101-B21",{"$f":"$G$8*L71","v":16920},null,null,null,null,null,null,null,{"$f":"IF(L71=\"\",0,L71)","v":24},{"$f":"IF(I71=\"\",0,I71)","v":0},{"$f":"IF(C71=\"\",0,C71)","v":0},{"$f":"SUM(X71:Z71)","v":24}]
["2CPU"]
[{"$f":"(32*I73)+(C73*32)","v":256},"HPE 32GB (1x32GB) Dual Rank x4 DDR4-2666 CAS-19-19-19 Registered Smart Memory Kit",4,"TS2L4-32GB","TS2L4-32GB","815100-B21",{"$f":"$G$4*C73","v":1376},"HPE 32GB (1x32GB) Dual Rank x4 DDR4-2666 CAS-19-19-19 Registered Smart Memory Kit",4,"815100-B21",{"$f":"\"\"","v":""},{"$f":"\"\"","v":""},{"$f":"\"\"","v":""},{"$f":"\"\"","v":""},{"$f":"\"\"","v":""},{"$f":"\"\"","v":""},null,null,null,null,null,null,null,{"$f":"IF(L73=\"\",0,L73)","v":0},{"$f":"IF(I73=\"\",0,I73)","v":4},{"$f":"IF(C73=\"\",0,C73)","v":4},{"$f":"SUM(X73:Z73)","v":8}]
[512,"HPE 32GB (1x32GB) Dual Rank x4 DDR4-2666 CAS-19-19-19 Registered Smart Memory Kit",12,"TS2L4-32GB","TS2L4-32GB","815100-B21",4128,"HPE 32GB (1x32GB) Dual Rank x4 DDR4-2666 CAS-19-19-19 Registered Smart Memory Kit",4,"815100-B21",{"$f":"\"\"","v":""},{"$f":"\"\"","v":""},{"$f":"\"\"","v":""},{"$f":"\"\"","v":""},{"$f":"\"\"","v":""},{"$f":"\"\"","v":""},null,null,null,null,null,null,null,0,4,12,16]
[640,"HPE 32GB (1x32GB) Dual Rank x4 DDR4-2666 CAS-19-19-19 Registered Smart Memory Kit",16,"TS2L4-32GB","TS2L4-32GB","815100-B21",5504,"HPE 32GB (1x32GB) Dual Rank x4 DDR4-2666 CAS-19-19-19 Registered Smart Memory Kit",4,"815100-B21",{"$f":"\"\"","v":""},{"$f":"\"\"","v":""},{"$f":"\"\"","v":""},{"$f":"\"\"","v":""},{"$f":"\"\"","v":""},{"$f":"\"\"","v":""},null,null,null,null,null,null,null,0,4,16,20]
[768,"HPE 32GB (1x32GB) Dual Rank x4 DDR4-2666 CAS-19-19-19 Registered Smart Memory Kit",20,"TS2L4-32GB","TS2L4-32GB","815100-B21",6880,"HPE 32GB (1x32GB) Dual Rank x4 DDR4-2666 CAS-19-19-19 Registered Smart Memory Kit",4,"815100-B21",{"$f":"\"\"","v":""},{"$f":"\"\"","v":""},{"$f":"\"\"","v":""},{"$f":"\"\"","v":""},{"$f":"\"\"","v":""},{"$f":"\"\"","v":""},null,null,null,null,null,null,null,0,4,20,24]
[1024,"HPE 32GB (1x32GB) Dual Rank x4 DDR4-2666 CAS-19-19-19 Registered Smart Memory Kit",28,"TS2L4-32GB","TS2L4-32GB","815100-B21",9632,"HPE 32GB (1x32GB) Dual Rank x4 DDR4-2666 CAS-19-19-19 Registered Smart Memory Kit",4,"815100-B21",{"$f":"\"\"","v":""},{"$f":"\"\"","v":""},{"$f":"\"\"","v":""},{"$f":"\"\"","v":""},{"$f":"\"\"","v":""},{"$f":"\"\"","v":""},null,null,null,null,null,null,null,0,4,28,32]
[1280,"HPE 32GB (1x32GB) Dual Rank x4 DDR4-2666 CAS-19-19-19 Registered Smart Memory Kit",36,"TS2L4-32GB","TS2L4-32GB","815100-B21",12384,"HPE 32GB (1x32GB) Dual Rank x4 DDR4-2666 CAS-19-19-19 Registered Smart Memory Kit",4,"815100-B21",{"$f":"\"\"","v":""},{"$f":"\"\"","v":""},{"$f":"\"\"","v":""},{"$f":"\"\"","v":""},{"$f":"\"\"","v":""},{"$f":"\"\"","v":""},null,null,null,null,null,null,null,0,4,36,40]
[1536,"HPE 32GB (1x32GB) Dual Rank x4 DDR4-2666 CAS-19-19-19 Registered Smart Memory Kit",44,"TS2L4-32GB","TS2L4-32GB","815100-B21",15136,"HPE 32GB (1x32GB) Dual Rank x4 DDR4-2666 CAS-19-19-19 Registered Smart Memory Kit",4,"815100-B21",{"$f":"\"\"","v":""},{"$f":"\"\"","v":""},{"$f":"\"\"","v":""},{"$f":"\"\"","v":""},{"$f":"\"\"","v":""},{"$f":"\"\"","v":""},null,null,null,null,null,null,null,{"$f":"IF(L79=\"\",0,L79)","v":0},{"$f":"IF(I79=\"\",0,I79)","v":4},{"$f":"IF(C79=\"\",0,C79)","v":44},{"$f":"SUM(X79:Z79)","v":48}]
[{"$f":"(L80*64)","v":2048},{"$f":"\"\"","v":""},{"$f":"\"\"","v":""},{"$f":"\"\"","v":""},{"$f":"\"\"","v":""},{"$f":"\"\"","v":""},{"$f":"\"\"","v":""},{"$f":"\"\"","v":""},{"$f":"\"\"","v":""},{"$f":"\"\"","v":""},"HPE 64GB (1x64GB) Quad Rank x4 DDR4-2666 CAS-19-19-19 Load Reduced Smart Memory Kit",32,"TS1L2-64GB","TS1L2-64GB","815101-B21",{"$f":"$G$8*L80","v":22560},null,null,null,null,null,null,null,{"$f":"IF(L80=\"\",0,L80)","v":32},{"$f":"IF(I80=\"\",0,I80)","v":0},{"$f":"IF(C80=\"\",0,C80)","v":0},{"$f":"SUM(X80:Z80)","v":32}]
[{"$f":"(L81*64)","v":3072},{"$f":"\"\"","v":""},{"$f":"\"\"","v":""},{"$f":"\"\"","v":""},{"$f":"\"\"","v":""},{"$f":"\"\"","v":""},{"$f":"\"\"","v":""},{"$f":"\"\"","v":""},{"$f":"\"\"","v":""},{"$f":"\"\"","v":""},"HPE 64GB (1x64GB) Quad Rank x4 DDR4-2666 CAS-19-19-19 Load Reduced Smart Memory Kit",48,"TS1L2-64GB","TS1L2-64GB","815101-B21",{"$f":"$G$8*L81","v":33840},null,null,null,null,null,null,null,{"$f":"IF(L81=\"\",0,L81)","v":48},{"$f":"IF(I81=\"\",0,I81)","v":0},{"$f":"IF(C81=\"\",0,C81)","v":0},{"$f":"SUM(X81:Z81)","v":48}]
[]
[]
[]
[]
[]
[]
[]
[null,null,null,null,null,null,null,null,null,null,null,null,"44GB8"]

{"sheet":"HDD","index":10,"n_rows":190,"n_cols":15,"rows_kept":190,"cut":false,"hidden":true,"merged":[]}
["Hard Drives"]
["DL560"]
["HP 300GB 12G SAS 15K 2.5in SC ENT HDD",null,"10L2-HDD300GB","S10L2-DL560-HDD300","759208-B21",140]
["HP 1TB 6G SAS 7.2K 2.5in SC MDL HDD",null,"10L2-HDD1TB","S10L2-DL560-HDD1000","652749-B21",278]
[null,"DL560","DL560 2","DL560 3"]
["HDD max",8,8,8]
["HDD 300GB Base",2,2,2,"Hot Spare for 300GB HDD",{"$f":"'Lotto5 DL560 Gen10 1'!$C$130","v":"No"},{"$f":"IF(F7=\"Yes\",1,0)","v":0},{"$f":"#REF!","v":{"$error":"#REF!"}},{"$f":"IF(H7=\"Yes\",1,0)","v":{"$error":"#REF!"}},{"$f":"#REF!","v":{"$error":"#REF!"}},{"$f":"IF(J7=\"Yes\",1,0)","v":{"$error":"#REF!"}}]
["HDD 300GB Selected",{"$f":"'Lotto5 DL560 Gen10 1'!#REF!","v":{"$error":"#REF!"}},{"$f":"#REF!","v":{"$error":"#REF!"}},{"$f":"#REF!","v":{"$error":"#REF!"}}]
["HP 300GB 12G SAS 15K 2.5in SC ENT HDD",0,0,0]
[null,1,1,1]
[null,2,2,2]
[null,3,3,3]
[null,4,4,4]
[null,5,5,5]
[null,6,6,6]
["HDD max",8,8,8]
["HDD 300GB",{"$f":"B7+B8","v":{"$error":"#REF!"}},{"$f":"C7+C8","v":{"$error":"#REF!"}},{"$f":"D7+D8","v":{"$error":"#REF!"}}]
["HDD 1TB Selected",{"$f":"'Lotto5 DL560 Gen10 1'!#REF!","v":{"$error":"#REF!"}},{"$f":"#REF!","v":{"$error":"#REF!"}},{"$f":"#REF!","v":{"$error":"#REF!"}},"Hot Spare for 1TB HDD",{"$f":"'Lotto5 DL560 Gen10 1'!$C$134","v":"No"},{"$f":"IF(F18=\"Yes\",1,0)","v":0},{"$f":"#REF!","v":{"$error":"#REF!"}},{"$f":"IF(H18=\"Yes\",1,0)","v":{"$error":"#REF!"}},{"$f":"#REF!","v":{"$error":"#REF!"}},{"$f":"IF(J18=\"Yes\",1,0)","v":{"$error":"#REF!"}}]
["HP 1TB 6G SAS 7.2K 2.5in SC MDL HDD",{"$f":"B$6-B$7-B$8","v":{"$error":"#REF!"}},{"$f":"C$6-C$7-C$8","v":{"$error":"#REF!"}},{"$f":"D$6-D$7-D$8","v":{"$error":"#REF!"}}]
[null,{"$f":"IF(B19-1<1,0,B19-1)","v":{"$error":"#REF!"}},{"$error":"#REF!"},{"$error":"#REF!"}]
[null,{"$error":"#REF!"},{"$error":"#REF!"},{"$error":"#REF!"}]
[null,{"$error":"#REF!"},{"$error":"#REF!"},{"$error":"#REF!"}]
[null,{"$error":"#REF!"},{"$error":"#REF!"},{"$error":"#REF!"}]
[null,{"$error":"#REF!"},{"$error":"#REF!"},{"$error":"#REF!"}]
[null,{"$error":"#REF!"},{"$error":"#REF!"},{"$error":"#REF!"}]
[null,{"$error":"#REF!"}]
[null,{"$error":"#REF!"}]
[]
["Hot Spare","Yes"]
[null,"No"]
[]
["RAID Configuration",null,null,"HDD 300GB DL560",null,"HDD 1TB DL560",null,"HDD 300GB DL560 2",null,"HDD 1TB DL560 2",null,"HDD 300GB DL560 3",null,"HDD 1TB DL560 3"]
["RAID Personalizzato",{"$f":"IF($B$109<=8,0,\"\")","v":0},{"$f":"\"\"","v":""},{"$f":"IF($G$7=0,A33,\"\")","v":"RAID Personalizzato"},{"$f":"IF($G$7=0,C33,\"\")","v":""},{"$f":"IF($G$18=0,A33,\"\")","v":"RAID Personalizzato"},{"$f":"IF($G$18=0,C33,\"\")","v":""},{"$f":"IF(I7=0,$A$33,\"\")","v":{"$error":"#REF!"}},{"$f":"IF(I7=0,$C$33,\"\")","v":{"$error":"#REF!"}},{"$f":"IF(I18=0,$A$33,\"\")","v":{"$error":"#REF!"}},{"$f":"IF(I18=0,$C$33,\"\")","v":{"$error":"#REF!"}},{"$f":"IF(K7=0,$A$33,\"\")","v":{"$error":"#REF!"}},{"$f":"IF(K7=0,$C$33,\"\")","v":{"$error":"#REF!"}},{"$f":"IF(K18=0,$A$33,\"\")","v":{"$error":"#REF!"}},{"$f":"IF(K18=0,$C$33,\"\")","v":{"$error":"#REF!"}}]
["RAID non Configurato (1-8 HDDs)",1,{"$f":"\"\"","v":""},{"$f":"IF($G$7=0,A34,\"\")","v":"RAID non Configurato (1-8 HDDs)"},{"$f":"IF($G$7=0,C34,\"\")","v":""},{"$f":"IF($G$18=0,A34,\"\")","v":"RAID non Configurato (1-8 HDDs)"},{"$f":"IF($G$18=0,C34,\"\")","v":""},{"$f":"IF(I7=0,$A$34,\"\")","v":{"$error":"#REF!"}},{"$f":"IF(I7=0,$C$34,\"\")","v":{"$error":"#REF!"}},{"$f":"IF(I18=0,$A$34,\"\")","v":{"$error":"#REF!"}},{"$f":"IF(I18=0,$C$34,\"\")","v":{"$error":"#REF!"}},{"$f":"IF(K7=0,$A$34,\"\")","v":{"$error":"#REF!"}},{"$f":"IF(K7=0,$C$34,\"\")","v":{"$error":"#REF!"}},{"$f":"IF(K18=0,$A$34,\"\")","v":{"$error":"#REF!"}},{"$f":"IF(K18=0,$C$34,\"\")","v":{"$error":"#REF!"}}]
["RAID 0 (1-8 HDDs)",1,{"$f":"\"\"","v":""},{"$f":"IF($G$7=0,A35,\"\")","v":"RAID 0 (1-8 HDDs)"},{"$f":"IF($G$7=0,C35,\"\")","v":""},{"$f":"IF($G$18=0,A35,\"\")","v":"RAID 0 (1-8 HDDs)"},{"$f":"IF($G$18=0,C35,\"\")","v":""},{"$f":"IF(I7=0,$A$35,\"\")","v":{"$error":"#REF!"}},{"$f":"IF(I7=0,$C$35,\"\")","v":{"$error":"#REF!"}},{"$f":"IF(I18=0,$A$35,\"\")","v":{"$error":"#REF!"}},{"$f":"IF(I18=0,$C$35,\"\")","v":{"$error":"#REF!"}},{"$f":"IF(K7=0,$A$35,\"\")","v":{"$error":"#REF!"}},{"$f":"IF(K7=0,$C$35,\"\")","v":{"$error":"#REF!"}},{"$f":"IF(K18=0,$A$35,\"\")","v":{"$error":"#REF!"}},{"$f":"IF(K18=0,$C$35,\"\")","v":{"$error":"#REF!"}}]
["RAID 1  (2 HDDs)",1,{"$f":"\"\"","v":""},{"$f":"IF($B$7+$B$8-$G$7=2,A36,\"\")","v":{"$error":"#REF!"}},{"$f":"IF($B$7+$B$8-$G$7=2,C36,\"\")","v":{"$error":"#REF!"}},{"$f":"IF($B$18-$G$18=2,A36,\"\")","v":{"$error":"#REF!"}},{"$f":"IF($B$18-$G$18=2,C36,\"\")","v":{"$error":"#REF!"}},{"$f":"IF($C$7+$C$8-I7=2,$A$36,\"\")","v":{"$error":"#REF!"}},{"$f":"IF($C$7+$C$8-I7=2,$C$36,\"\")","v":{"$error":"#REF!"}},{"$f":"IF($C$18-I18=2,A36,\"\")","v":{"$error":"#REF!"}},{"$f":"IF($C$18-I18=2,$C$36,\"\")","v":{"$error":"#REF!"}},{"$f":"IF($C$7+$C$8-K7=2,$A$36,\"\")","v":{"$error":"#REF!"}},{"$f":"IF($C$7+$C$8-K7=2,$C$36,\"\")","v":{"$error":"#REF!"}},{"$f":"IF($C$18-M18=2,E36,\"\")","v":{"$error":"#REF!"}},{"$f":"IF($D$18-K18=2,$C$36,\"\")","v":{"$error":"#REF!"}}]
["RAID 5 (da 3 a 10 HDDs)",1,{"$f":"\"\"","v":""},{"$f":"IF($B$7+$B$8-$G$7>=3,A37,\"\")","v":{"$error":"#REF!"}},{"$f":"IF($B$7+$B$8-$G$7>=3,C37,\"\")","v":{"$error":"#REF!"}},{"$f":"IF($B$18-$G$18>=3,A37,\"\")","v":{"$error":"#REF!"}},{"$f":"IF($B$18-$G$18>=3,C37,\"\")","v":{"$error":"#REF!"}},{"$f":"IF($C$7+$C$8-I7>=3,$A$37,\"\")","v":{"$error":"#REF!"}},{"$f":"IF($C$7+$C$8-I7>=3,$C$37,\"\")","v":{"$error":"#REF!"}},{"$f":"IF($C$18-I18>=3,$A$37,\"\")","v":{"$error":"#REF!"}},{"$f":"IF($C$18-I18>=3,$C$37,\"\")","v":{"$error":"#REF!"}},{"$f":"IF($D$7+$D$8-K7>=3,$A$37,\"\")","v":{"$error":"#REF!"}},{"$f":"IF($D$7+$D$8-K7>=3,$C$37,\"\")","v":{"$error":"#REF!"}},{"$f":"IF($D$18-K18>=3,$A$37,\"\")","v":{"$error":"#REF!"}},{"$f":"IF($D$18-K18>=3,$C$37,\"\")","v":{"$error":"#REF!"}}]
["RAID 10 (4-8 HDDs in pairs) ",1,{"$f":"\"\"","v":""},{"$f":"IF($B$7+$B$8-$G$7=4,A38,\"\")","v":{"$error":"#REF!"}},{"$f":"IF($B$7+$B$8-$G$7=4,C38,\"\")","v":{"$error":"#REF!"}},{"$f":"IF($B$18-$G$18=4,A38,\"\")","v":{"$error":"#REF!"}},{"$f":"IF($B$18-$G$18=4,C38,\"\")","v":{"$error":"#REF!"}},{"$f":"IF($C$7+$C$8-I7=4,$A$38,\"\")","v":{"$error":"#REF!"}},{"$f":"IF($C$7+$C$8-I7=4,$C$38,\"\")","v":{"$error":"#REF!"}},{"$f":"IF($C$18-I18=4,$A$38,\"\")","v":{"$error":"#REF!"}},{"$f":"IF($C$18-I18=4,$C$38,\"\")","v":{"$error":"#REF!"}},{"$f":"IF($D$7+$D$8-K7=4,$A$38,\"\")","v":{"$error":"#REF!"}},{"$f":"IF($D$7+$D$8-K7=4,$C$38,\"\")","v":{"$error":"#REF!"}},{"$f":"IF($D$18-K18=4,$A$38,\"\")","v":{"$error":"#REF!"}},{"$f":"IF($D$18-K18=4,$C$38,\"\")","v":{"$error":"#REF!"}}]
["RAID 1+RAID 1 (2 + 2 HDDs) ",1,{"$f":"\"\"","v":""},{"$f":"IF($B$7+$B$8-$G$7=4,A39,\"\")","v":{"$error":"#REF!"}},{"$f":"IF($B$7+$B$8-$G$7=4,C39,\"\")","v":{"$error":"#REF!"}},{"$f":"IF($B$18-$G$18=4,A39,\"\")","v":{"$error":"#REF!"}},{"$f":"IF($B$18-$G$18=4,C39,\"\")","v":{"$error":"#REF!"}},{"$f":"IF($C$7+$C$8-I7=4,$A$39,\"\")","v":{"$error":"#REF!"}},{"$f":"IF($C$7+$C$8-I7=4,$C$39,\"\")","v":{"$error":"#REF!"}},{"$f":"IF($C$18-I18=4,A39,\"\")","v":{"$error":"#REF!"}},{"$f":"IF($C$18-I18=4,$C$39,\"\")","v":{"$error":"#REF!"}},{"$f":"IF($D$7+$D$8-K7=4,$A$39,\"\")","v":{"$error":"#REF!"}},{"$f":"IF($D$7+$D$8-K7=4,$C$39,\"\")","v":{"$error":"#REF!"}},{"$f":"IF($D$18-K18=4,A39,\"\")","v":{"$error":"#REF!"}},{"$f":"IF($D$18-K18=4,$C$39,\"\")","v":{"$error":"#REF!"}}]
["RAID 1+RAID 5 (2 + 3-8 HDDs)",1,{"$f":"\"\"","v":""},{"$f":"IF($B$7+$B$8-$G$7>=5,A40,\"\")","v":{"$error":"#REF!"}},{"$f":"IF($B$7+$B$8-$G$7>=5,C40,\"\")","v":{"$error":"#REF!"}},{"$f":"IF($B$18-$G$18>=5,A40,\"\")","v":{"$error":"#REF!"}},{"$f":"IF($B$18-$G$18>=5,C40,\"\")","v":{"$error":"#REF!"}},{"$f":"IF($C$7+$C$8-I7>=5,$A$40,\"\")","v":{"$error":"#REF!"}},{"$f":"IF($C$7+$C$8-I7>=5,$C$40,\"\")","v":{"$error":"#REF!"}},{"$f":"IF($C$18-I18>=5,$A$40,\"\")","v":{"$error":"#REF!"}},{"$f":"IF($C$18-I18>=5,$C$40,\"\")","v":{"$error":"#REF!"}},{"$f":"IF($D$7+$D$8-K7>=5,$A$40,\"\")","v":{"$error":"#REF!"}},{"$f":"IF($D$7+$D$8-K7>=5,$C$40,\"\")","v":{"$error":"#REF!"}},{"$f":"IF($D$18-K18>=5,$A$40,\"\")","v":{"$error":"#REF!"}},{"$f":"IF($D$18-K18>=5,$C$40,\"\")","v":{"$error":"#REF!"}}]
["RAID 1 + RAID 10 (2 + 4 HDDs in pairs) ",1,{"$f":"\"\"","v":""},{"$f":"IF($B$7+$B$8-$G$7=6,A41,\"\")","v":{"$error":"#REF!"}},{"$f":"IF($B$7+$B$8-$G$7=6,C41,\"\")","v":{"$error":"#REF!"}},{"$f":"IF($B$18-$G$18=6,A41,\"\")","v":{"$error":"#REF!"}},{"$f":"IF($B$18-$G$18=6,C41,\"\")","v":{"$error":"#REF!"}},{"$f":"IF($C$7+$C$8-I7=6,$A$41,\"\")","v":{"$error":"#REF!"}},{"$f":"IF($C$7+$C$8-I7=6,$C$41,\"\")","v":{"$error":"#REF!"}},{"$f":"IF($C$18-I18=6,A41,\"\")","v":{"$error":"#REF!"}},{"$f":"IF($C$18-I18=6,$C$41,\"\")","v":{"$error":"#REF!"}},{"$f":"IF($D$7+$D$8-M7=6,$A$41,\"\")","v":{"$error":"#REF!"}},{"$f":"IF($D$7+$D$8-M7=6,$C$41,\"\")","v":{"$error":"#REF!"}},{"$f":"IF($D$18-K18=6,A41,\"\")","v":{"$error":"#REF!"}},{"$f":"IF($D$18-K18=6,$C$41,\"\")","v":{"$error":"#REF!"}}]
[]
["R730xd"]
["HP 300GB 12G SAS 15K 2.5in SC ENT HDD",null,"10L2-HDD300GB","S10L2-DL580-HDD300","759208-B21",140]
[]
[]
[]
["HP 1TB 6G SAS 7.2K 2.5in SC MDL HDD",null,"10L2-HDD1TB","S10L2-DL580-HDD1000","652749-B21",278]
[null,{"$f":"#REF!","v":{"$error":"#REF!"}},{"$f":"#REF!","v":{"$error":"#REF!"}},{"$f":"#REF!","v":{"$error":"#REF!"}}]
["HDD max",10,10,10]
["HDD 300GB Base",2,2,2]
["Hot Spare for 300GB HDD",{"$f":"IF(B49=\"Yes\",1,0)","v":{"$error":"#REF!"}},{"$f":"IF(C49=\"Yes\",1,0)","v":{"$error":"#REF!"}},{"$f":"IF(D49=\"Yes\",1,0)","v":{"$error":"#REF!"}}]
["HDD 300GB Selected",{"$f":"#REF!","v":{"$error":"#REF!"}},{"$f":"#REF!","v":{"$error":"#REF!"}},{"$f":"#REF!","v":{"$error":"#REF!"}}]
["HP 300GB 12G SAS 15K 2.5in SC ENT HDD",0,0,0]
[null,1,1,1]
[null,2,2,2]
[null,3,3,3]
[null,4,4,4]
[null,5,5,5]
[null,6,6,6]
[null,7,7,7]
[null,8,8,8]
[]
[]
[]
[]
[]
[]
[null,{"$f":"#REF!","v":{"$error":"#REF!"}},{"$f":"#REF!","v":{"$error":"#REF!"}},{"$f":"#REF!","v":{"$error":"#REF!"}}]
["HDD max",10,10,10]
["HDD 300GB",{"$f":"B51+B53","v":{"$error":"#REF!"}},{"$f":"C51+C53","v":{"$error":"#REF!"}},{"$f":"D51+D53","v":{"$error":"#REF!"}}]
["Hot Spare for 1TB HDD",{"$f":"IF(B69=\"Yes\",1,0)","v":{"$error":"#REF!"}},{"$f":"IF(C69=\"Yes\",1,0)","v":{"$error":"#REF!"}},{"$f":"IF(D69=\"Yes\",1,0)","v":{"$error":"#REF!"}}]
["HDD 1TB Selected",{"$f":"#REF!","v":{"$error":"#REF!"}},{"$f":"#REF!","v":{"$error":"#REF!"}},{"$f":"#REF!","v":{"$error":"#REF!"}}]
["HP 1TB 6G SAS 7.2K 2.5in SC MDL HDD",{"$f":"$B$70-$B$71-$B$73","v":{"$error":"#REF!"}},{"$f":"$C$70-$C$71-$C$73","v":{"$error":"#REF!"}},{"$f":"$D$70-$D$71-$D$73","v":{"$error":"#REF!"}}]
[null,{"$f":"IF(B74-1<1,0,B74-1)","v":{"$error":"#REF!"}},{"$error":"#REF!"},{"$f":"IF(D74-1<1,0,D74-1)","v":{"$error":"#REF!"}}]
[null,{"$error":"#REF!"},{"$error":"#REF!"},{"$error":"#REF!"}]
[null,{"$error":"#REF!"},{"$error":"#REF!"},{"$error":"#REF!"}]
[null,{"$error":"#REF!"},{"$error":"#REF!"},{"$error":"#REF!"}]
[null,{"$error":"#REF!"},{"$error":"#REF!"},{"$error":"#REF!"}]
[null,{"$error":"#REF!"},{"$error":"#REF!"},{"$error":"#REF!"}]
[null,{"$error":"#REF!"},{"$error":"#REF!"},{"$error":"#REF!"}]
[null,{"$error":"#REF!"},{"$error":"#REF!"},{"$error":"#REF!"}]
[]
[]
[]
[]
[]
[]
[]
[]
[]
["RAID Configuration",null,null,"HDD 300GB R730xd",null,"HDD 1TB R730xd",null,"HDD 300GB R730xd 2",null,"HDD 1TB R730xd 2",null,"HDD 300GB R730xd 3",null,"HDD 1TB R730xd 3"]
["RAID Personalizzato",{"$f":"IF($B$109<=8,0,\"\")","v":0},"[780-BBJC]",{"$f":"IF($B$52=0,A93,\"\")","v":{"$error":"#REF!"}},{"$f":"IF($B$52=0,C93,\"\")","v":{"$error":"#REF!"}},{"$f":"IF($B$72=0,A93,\"\")","v":{"$error":"#REF!"}},{"$f":"IF($B$72=0,C93,\"\")","v":{"$error":"#REF!"}},{"$f":"IF($C$52=0,A93,\"\")","v":{"$error":"#REF!"}},{"$f":"IF($C$52=0,C93,\"\")","v":{"$error":"#REF!"}},{"$f":"IF($C$72=0,A93,\"\")","v":{"$error":"#REF!"}},{"$f":"IF($C$72=0,C93,\"\")","v":{"$error":"#REF!"}},{"$f":"IF($D$52=0,A93,\"\")","v":{"$error":"#REF!"}},{"$f":"IF($D$52=0,C93,\"\")","v":{"$error":"#REF!"}},{"$f":"IF($D$72=0,A93,\"\")","v":{"$error":"#REF!"}},{"$f":"IF($D$72=0,C93,\"\")","v":{"$error":"#REF!"}}]
["RAID non Configurato (1-8 HDDs)",1,"[780-BBJD] ",{"$f":"IF($B$52=0,A94,\"\")","v":{"$error":"#REF!"}},{"$f":"IF($B$52=0,C94,\"\")","v":{"$error":"#REF!"}},{"$f":"IF($B$72=0,A94,\"\")","v":{"$error":"#REF!"}},{"$f":"IF($B$72=0,C94,\"\")","v":{"$error":"#REF!"}},{"$f":"IF($C$52=0,A94,\"\")","v":{"$error":"#REF!"}},{"$f":"IF($C$52=0,C94,\"\")","v":{"$error":"#REF!"}},{"$f":"IF($C$72=0,A94,\"\")","v":{"$error":"#REF!"}},{"$f":"IF($C$72=0,C94,\"\")","v":{"$error":"#REF!"}},{"$f":"IF($D$52=0,A94,\"\")","v":{"$error":"#REF!"}},{"$f":"IF($D$52=0,C94,\"\")","v":{"$error":"#REF!"}},{"$f":"IF($D$72=0,A94,\"\")","v":{"$error":"#REF!"}},{"$f":"IF($D$72=0,C94,\"\")","v":{"$error":"#REF!"}}]
["RAID 0 (1-8 HDDs)",1,"[780-BBJF]",{"$f":"IF($B$52=0,A95,\"\")","v":{"$error":"#REF!"}},{"$f":"IF($B$52=0,C95,\"\")","v":{"$error":"#REF!"}},{"$f":"IF($B$72=0,A95,\"\")","v":{"$error":"#REF!"}},{"$f":"IF($B$72=0,C95,\"\")","v":{"$error":"#REF!"}},{"$f":"IF($C$52=0,A95,\"\")","v":{"$error":"#REF!"}},{"$f":"IF($C$52=0,C95,\"\")","v":{"$error":"#REF!"}},{"$f":"IF($C$72=0,A95,\"\")","v":{"$error":"#REF!"}},{"$f":"IF($C$72=0,C95,\"\")","v":{"$error":"#REF!"}},{"$f":"IF($D$52=0,A95,\"\")","v":{"$error":"#REF!"}},{"$f":"IF($D$52=0,C95,\"\")","v":{"$error":"#REF!"}},{"$f":"IF($D$72=0,A95,\"\")","v":{"$error":"#REF!"}},{"$f":"IF($D$72=0,C95,\"\")","v":{"$error":"#REF!"}}]
["RAID 1  (2 HDDs)",1,"[780-BBJK]",{"$f":"IF($B$51+$B$53-$B$52=2,A96,\"\")","v":{"$error":"#REF!"}},{"$f":"IF($B$51+$B$53-$B$52=2,C96,\"\")","v":{"$error":"#REF!"}},{"$f":"IF($B$73-$B$72=2,A96,\"\")","v":{"$error":"#REF!"}},{"$f":"IF($B$73-$B$72=2,C96,\"\")","v":{"$error":"#REF!"}},{"$f":"IF($C$51+$C$53-$C$52=2,A96,\"\")","v":{"$error":"#REF!"}},{"$f":"IF($C$51+$C$53-$C$52=2,C96,\"\")","v":{"$error":"#REF!"}},{"$f":"IF($C$73-$C$72=2,A96,\"\")","v":{"$error":"#REF!"}},{"$f":"IF($C$73-$C$72=2,C96,\"\")","v":{"$error":"#REF!"}},{"$f":"IF($D$51+$D$53-$D$52=2,A96,\"\")","v":{"$error":"#REF!"}},{"$f":"IF($D$51+$D$53-$D$52=2,C96,\"\")","v":{"$error":"#REF!"}},{"$f":"IF($D$73-$D$72=2,A96,\"\")","v":{"$error":"#REF!"}},{"$f":"IF($D$73-$D$72=2,C96,\"\")","v":{"$error":"#REF!"}}]
["RAID 5 (da 3 a 10 HDDs)",1,"[780-BBJL]",{"$f":"IF($B$51+$B$53-$B$52>=3,A97,\"\")","v":{"$error":"#REF!"}},{"$f":"IF($B$51+$B$53-$B$52>=3,C97,\"\")","v":{"$error":"#REF!"}},{"$f":"IF($B$73-$B$72>=3,A97,\"\")","v":{"$error":"#REF!"}},{"$f":"IF($B$73-$B$72>=3,C97,\"\")","v":{"$error":"#REF!"}},{"$f":"IF($C$51+$C$53-$C$52>=3,A97,\"\")","v":{"$error":"#REF!"}},{"$f":"IF($C$51+$C$53-$C$52>=3,C97,\"\")","v":{"$error":"#REF!"}},{"$f":"IF($C$73-$C$72>=3,A97,\"\")","v":{"$error":"#REF!"}},{"$f":"IF($C$73-$C$72>=3,C97,\"\")","v":{"$error":"#REF!"}},{"$f":"IF($D$51+$D$53-$D$52>=3,A97,\"\")","v":{"$error":"#REF!"}},{"$f":"IF($D$51+$D$53-$D$52>=3,C97,\"\")","v":{"$error":"#REF!"}},{"$f":"IF($D$73-$D$72>=3,A97,\"\")","v":{"$error":"#REF!"}},{"$f":"IF($D$73-$D$72>=3,C97,\"\")","v":{"$error":"#REF!"}}]
["RAID 10 (4-8 HDDs in pairs) ",1,"[780-BBJN]",{"$f":"IF($B$51+$B$53-$B$52=4,A98,\"\")","v":{"$error":"#REF!"}},{"$f":"IF($B$51+$B$53-$B$52=4,C98,\"\")","v":{"$error":"#REF!"}},{"$f":"IF($B$73-$B$72=4,A98,\"\")","v":{"$error":"#REF!"}},{"$f":"IF($B$73-$B$72=4,C98,\"\")","v":{"$error":"#REF!"}},{"$f":"IF($C$51+$C$53-$C$52=4,A98,\"\")","v":{"$error":"#REF!"}},{"$f":"IF($C$51+$C$53-$C$52=4,C98,\"\")","v":{"$error":"#REF!"}},{"$f":"IF($C$73-$C$72=4,A98,\"\")","v":{"$error":"#REF!"}},{"$f":"IF($C$73-$C$72=4,C98,\"\")","v":{"$error":"#REF!"}},{"$f":"IF($D$51+$D$53-$D$52=4,A98,\"\")","v":{"$error":"#REF!"}},{"$f":"IF($D$51+$D$53-$D$52=4,C98,\"\")","v":{"$error":"#REF!"}},{"$f":"IF($D$73-$D$72=4,A98,\"\")","v":{"$error":"#REF!"}},{"$f":"IF($D$73-$D$72=4,C98,\"\")","v":{"$error":"#REF!"}}]
["RAID 1+RAID 1 (2 + 2 HDDs) ",1,"[780-BBJO]",{"$f":"IF($B$51+$B$53-$B$52=4,A99,\"\")","v":{"$error":"#REF!"}},{"$f":"IF($B$51+$B$53-$B$52=4,C99,\"\")","v":{"$error":"#REF!"}},{"$f":"IF($B$73-$B$72=4,A99,\"\")","v":{"$error":"#REF!"}},{"$f":"IF($B$73-$B$72=4,C99,\"\")","v":{"$error":"#REF!"}},{"$f":"IF($C$51+$C$53-$C$52=4,A99,\"\")","v":{"$error":"#REF!"}},{"$f":"IF($C$51+$C$53-$C$52=4,C99,\"\")","v":{"$error":"#REF!"}},{"$f":"IF($C$73-$C$72=4,A99,\"\")","v":{"$error":"#REF!"}},{"$f":"IF($C$73-$C$72=4,C99,\"\")","v":{"$error":"#REF!"}},{"$f":"IF($D$51+$D$53-$D$52=4,A99,\"\")","v":{"$error":"#REF!"}},{"$f":"IF($D$51+$D$53-$D$52=4,C99,\"\")","v":{"$error":"#REF!"}},{"$f":"IF($D$73-$D$72=4,A99,\"\")","v":{"$error":"#REF!"}},{"$f":"IF($D$73-$D$72=4,C99,\"\")","v":{"$error":"#REF!"}}]
["RAID 1+RAID 5 (2 + 3-8 HDDs)",1,"[780-BBJP]",{"$f":"IF($B$51+$B$53-$B$52>=5,A100,\"\")","v":{"$error":"#REF!"}},{"$f":"IF($B$51+$B$53-$B$52>=5,C100,\"\")","v":{"$error":"#REF!"}},{"$f":"IF($B$73-$B$72>=5,A100,\"\")","v":{"$error":"#REF!"}},{"$f":"IF($B$73-$B$72>=5,C100,\"\")","v":{"$error":"#REF!"}},{"$f":"IF($C$51+$C$53-$C$52>=5,A100,\"\")","v":{"$error":"#REF!"}},{"$f":"IF($C$51+$C$53-$C$52>=5,C100,\"\")","v":{"$error":"#REF!"}},{"$f":"IF($C$73-$C$72>=5,A100,\"\")","v":{"$error":"#REF!"}},{"$f":"IF($C$73-$C$72>=5,C100,\"\")","v":{"$error":"#REF!"}},{"$f":"IF($D$51+$D$53-$D$52>=5,A100,\"\")","v":{"$error":"#REF!"}},{"$f":"IF($D$51+$D$53-$D$52>=5,C100,\"\")","v":{"$error":"#REF!"}},{"$f":"IF($D$73-$D$72>=5,A100,\"\")","v":{"$error":"#REF!"}},{"$f":"IF($D$73-$D$72>=5,C100,\"\")","v":{"$error":"#REF!"}}]
["RAID 1 + RAID 10 (2 + 4 HDDs in pairs) ",1,"[780-BBJQ] ",{"$f":"IF($B$51+$B$53-$B$52=6,A101,\"\")","v":{"$error":"#REF!"}},{"$f":"IF($B$51+$B$53-$B$52=6,C101,\"\")","v":{"$error":"#REF!"}},{"$f":"IF($B$73-$B$72=6,A101,\"\")","v":{"$error":"#REF!"}},{"$f":"IF($B$73-$B$72=6,C101,\"\")","v":{"$error":"#REF!"}},{"$f":"IF($C$51+$C$53-$C$52=6,A101,\"\")","v":{"$error":"#REF!"}},{"$f":"IF($C$51+$C$53-$C$52=6,C101,\"\")","v":{"$error":"#REF!"}},{"$f":"IF($C$73-$C$72=6,A101,\"\")","v":{"$error":"#REF!"}},{"$f":"IF($C$73-$C$72=6,C101,\"\")","v":{"$error":"#REF!"}},{"$f":"IF($D$51+$D$53-$D$52=6,A101,\"\")","v":{"$error":"#REF!"}},{"$f":"IF($D$51+$D$53-$D$52=6,C101,\"\")","v":{"$error":"#REF!"}},{"$f":"IF($D$73-$D$72=6,A101,\"\")","v":{"$error":"#REF!"}},{"$f":"IF($D$73-$D$72=6,C101,\"\")","v":{"$error":"#REF!"}}]
[]
[]
[]
[]
[]
[]
["T630"]
["300GB 10K RPM SAS 12Gbps 2.5in Hot-plug Hard Drive,CusKit",null,"10L1-HDD300GB-T","S10L1-T630-HDD300","[400-AJOQ]",91]
["1TB 7.2K RPM NLSAS 6Gbps 2.5in Hot-plug Hard Drive,13G,CusKit",null,"10L1-HDD1TB","S10L1-T630-HDD1000","[400-AEFF]",296]
[]
["HDD max",32]
["HDD 300GB Base",2]
["HDD 300GB Selected",{"$f":"#REF!","v":{"$error":"#REF!"}}]
["300GB 10K RPM SAS 12Gbps 2.5in Hot-plug Hard Drive,CusKit",0,null,"Hot Spare for 300GB HDD",{"$f":"#REF!","v":{"$error":"#REF!"}},{"$f":"IF(E115=\"Yes\",1,0)","v":{"$error":"#REF!"}}]
[null,1]
[null,2]
[null,3]
[null,4]
[null,5]
[null,6]
[null,7]
[null,8]
[null,9]
[null,10]
[null,11]
[null,12]
[null,13]
[null,14]
[null,15]
[null,16]
[null,17]
[null,18]
[null,19]
[null,20]
[null,21]
[null,22]
[null,23]
[null,24]
[null,25]
[null,26]
[null,27]
[null,28]
[null,29]
[null,30]
["HDD max",32]
["HDD 300GB",{"$f":"B113+B114","v":{"$error":"#REF!"}}]
["HDD 1TB Selected",{"$f":"#REF!","v":{"$error":"#REF!"}},null,"Hot Spare for 1TB HDD",{"$f":"#REF!","v":{"$error":"#REF!"}},{"$f":"IF(E148=\"Yes\",1,0)","v":{"$error":"#REF!"}}]
["1TB 7.2K RPM NLSAS 6Gbps 2.5in Hot-plug Hard Drive,13G,CusKit",{"$f":"$B$146-$B$147-$B$148","v":{"$error":"#REF!"}}]
[null,{"$f":"IF(B149-1<1,0,B149-1)","v":{"$error":"#REF!"}}]
[null,{"$error":"#REF!"}]
[null,{"$error":"#REF!"}]
[null,{"$error":"#REF!"}]
[null,{"$error":"#REF!"}]
[null,{"$error":"#REF!"}]
[null,{"$error":"#REF!"}]
[null,{"$error":"#REF!"}]
[null,{"$f":"IF(B157-1<1,0,B157-1)","v":{"$error":"#REF!"}}]
[null,{"$error":"#REF!"}]
[null,{"$error":"#REF!"}]
[null,{"$error":"#REF!"}]
[null,{"$error":"#REF!"}]
[null,{"$error":"#REF!"}]
[null,{"$error":"#REF!"}]
[null,{"$error":"#REF!"}]
[null,{"$error":"#REF!"}]
[null,{"$error":"#REF!"}]
[null,{"$error":"#REF!"}]
[null,{"$error":"#REF!"}]
[null,{"$error":"#REF!"}]
[null,{"$error":"#REF!"}]
[null,{"$error":"#REF!"}]
[null,{"$error":"#REF!"}]
[null,{"$error":"#REF!"}]
[null,{"$error":"#REF!"}]
[null,{"$error":"#REF!"}]
[null,{"$error":"#REF!"}]
[null,{"$error":"#REF!"}]
[null,{"$error":"#REF!"}]
[]
["RAID Configuration",null,null,"HDD 300GB",null,"HDD 1TB"]
["C1 - No RAID for H330 (1-8 HDDs)",{"$f":"IF($B$109<=8,0,\"\")","v":0},"[780-BBJC]",{"$f":"IF($F$115=0,A182,\"\")","v":{"$error":"#REF!"}},{"$f":"IF($F$115=0,C182,\"\")","v":{"$error":"#REF!"}},{"$f":"IF($F$148=0,A182,\"\")","v":{"$error":"#REF!"}},{"$f":"IF($F$148=0,C182,\"\")","v":{"$error":"#REF!"}}]
["C10 - Unconfigured RAID for H330 (1-8 HDDs)",1,"[780-BBJD] ",{"$f":"IF($F$115=0,A183,\"\")","v":{"$error":"#REF!"}},{"$f":"IF($F$115=0,C183,\"\")","v":{"$error":"#REF!"}},{"$f":"IF($F$148=0,A183,\"\")","v":{"$error":"#REF!"}},{"$f":"IF($F$148=0,C183,\"\")","v":{"$error":"#REF!"}}]
["C2 - RAID 0 for H330 (1-8 HDDs)",1,"[780-BBJF]",{"$f":"IF($F$115=0,A184,\"\")","v":{"$error":"#REF!"}},{"$f":"IF($F$115=0,C184,\"\")","v":{"$error":"#REF!"}},{"$f":"IF($F$148=0,A184,\"\")","v":{"$error":"#REF!"}},{"$f":"IF($F$148=0,C184,\"\")","v":{"$error":"#REF!"}}]
["C3 - RAID 1 for H330 (2 HDDs)",1,"[780-BBJK]",{"$f":"IF($B$113+$B$114-$F$115=2,A185,\"\")","v":{"$error":"#REF!"}},{"$f":"IF($B$113+$B$114-$F$115=2,C185,\"\")","v":{"$error":"#REF!"}},{"$f":"IF($B$148-$F$148=2,A185,\"\")","v":{"$error":"#REF!"}},{"$f":"IF($B$148-$F$148=2,C185,\"\")","v":{"$error":"#REF!"}}]
["C4 - RAID 5 for H330 (3-8 HDDs)",1,"[780-BBJL]",{"$f":"IF($B$113+$B$114-$F$115>=3,A186,\"\")","v":{"$error":"#REF!"}},{"$f":"IF($B$113+$B$114-$F$115>=3,C186,\"\")","v":{"$error":"#REF!"}},{"$f":"IF($B$148-$F$148>=3,A186,\"\")","v":{"$error":"#REF!"}},{"$f":"IF($B$148-$F$148>=3,C186,\"\")","v":{"$error":"#REF!"}}]
["C6 - RAID 10 forH330 (4-8 HDDs in pairs) ",1,"[780-BBJN]",{"$f":"IF($B$113+$B$114-$F$115=4,A187,\"\")","v":{"$error":"#REF!"}},{"$f":"IF($B$113+$B$114-$F$115=4,C187,\"\")","v":{"$error":"#REF!"}},{"$f":"IF($B$148-$F$148=4,A187,\"\")","v":{"$error":"#REF!"}},{"$f":"IF($B$148-$F$148=4,C187,\"\")","v":{"$error":"#REF!"}}]
["C7 - RAID 1+RAID 1 for H330 (2 + 2 HDDs) ",1,"[780-BBJO]",{"$f":"IF($B$113+$B$114-$F$115=4,A188,\"\")","v":{"$error":"#REF!"}},{"$f":"IF($B$113+$B$114-$F$115=4,C188,\"\")","v":{"$error":"#REF!"}},{"$f":"IF($B$148-$F$148=4,A188,\"\")","v":{"$error":"#REF!"}},{"$f":"IF($B$148-$F$148=4,C188,\"\")","v":{"$error":"#REF!"}}]
["C8 - RAID 1+RAID 5 for H330 (2 + 3-8 HDDs)",1,"[780-BBJP]",{"$f":"IF($B$113+$B$114-$F$115>=5,A189,\"\")","v":{"$error":"#REF!"}},{"$f":"IF($B$113+$B$114-$F$115>=5,C189,\"\")","v":{"$error":"#REF!"}},{"$f":"IF($B$148-$F$148>=5,A189,\"\")","v":{"$error":"#REF!"}},{"$f":"IF($B$148-$F$148>=5,C189,\"\")","v":{"$error":"#REF!"}}]
["C9 - RAID 1+RAID 10 for H330 (2 + 4 HDDs in pairs) ",1,"[780-BBJQ] ",{"$f":"IF($B$113+$B$114-$F$115=6,A190,\"\")","v":{"$error":"#REF!"}},{"$f":"IF($B$113+$B$114-$F$115=6,C190,\"\")","v":{"$error":"#REF!"}},{"$f":"IF($B$148-$F$148=6,A190,\"\")","v":{"$error":"#REF!"}},{"$f":"IF($B$148-$F$148=6,C190,\"\")","v":{"$error":"#REF!"}}]

{"sheet":"Servizi Opzionali","index":11,"n_rows":81,"n_cols":13,"rows_kept":81,"cut":false,"hidden":true,"merged":[]}
["Warranty Upgrades",null,null,null,null,null,"Protezione dei dati - Keep Your Hard Drive "]
["DL560"]
["None",{"$f":"\"\"","v":""},{"$f":"\"\"","v":""},{"$f":"\"\"","v":""},{"$f":"\"\"","v":""},{"$f":"\"\"","v":""},null,null,{"$f":"IF(($A$22=$A$12),\"\",IF($A$8=$A$3,I13,IF($A$8=$A$4,I14,IF($A$8=$A$5,I15))))","v":""},{"$f":"IF(($A$22=$A$12),\"\",IF($A$8=$A$3,J13,IF($A$8=$A$4,J14,IF($A$8=$A$5,J15))))","v":""},{"$f":"IF(($A$22=$A$12),\"\",IF($A$8=$A$3,K13,IF($A$8=$A$4,K14,IF($A$8=$A$5,K15))))","v":""},{"$f":"IF(($A$22=$A$12),\"\",IF($A$8=$A$3,L13,IF($A$8=$A$4,L14,IF($A$8=$A$5,L15))))","v":""},{"$f":"IF(($A$22=$A$12),\"\",IF($A$8=$A$3,M13,IF($A$8=$A$4,M14,IF($A$8=$A$5,M15))))","v":""}]
["4Yr Warranty upgrade ",1,"10L2-SO-12M","S10L2-DL560-S-12M",{"$f":"\"\"","v":""},350]
["5Yr Warranty upgrade ",1,"10L2-SO-24M","S10L2-DL560-S-24M",{"$f":"\"\"","v":""},700]
[]
["Estensione Garanzia Selezionata"]
[{"$f":"'Lotto5 DL560 Gen10 1'!$B$218","v":"None"},null,"DL560"]
[{"$f":"#REF!","v":{"$error":"#REF!"}},null,"DL560 2"]
[{"$f":"#REF!","v":{"$error":"#REF!"}},null,"DL560 3"]
[]
["None",{"$f":"\"\"","v":""},{"$f":"\"\"","v":""},{"$f":"\"\"","v":""},{"$f":"\"\"","v":""},{"$f":"\"\"","v":""},null,"None"]
[{"$f":"IF($A$8=$A$3,H13,IF($A$8=$A$4,H14,IF($A$8=$A$5,H15)))","v":"3Yr Data Protection - Keep Your Hard Drive"},1,"10L2-SO-HDD","S10L2-DL560-S-HDD",{"$f":"IF($A$8=$A$3,L13,IF($A$8=$A$4,L14,IF($A$8=$A$5,L15)))","v":""},300,null,"3Yr Data Protection - Keep Your Hard Drive",1,"10L2-SO-HDD","S10L2-DL560-S-HDD",{"$f":"\"\"","v":""},300]
["None",{"$f":"\"\"","v":""},{"$f":"\"\"","v":""},{"$f":"\"\"","v":""},{"$f":"\"\"","v":""},{"$f":"\"\"","v":""},null,"4Yr Data Protection - Keep Your Hard Drive",{"$f":"I13","v":1},{"$f":"J13","v":"10L2-SO-HDD"},{"$f":"K13","v":"S10L2-DL560-S-HDD"},{"$f":"\"\"","v":""},{"$f":"M13","v":300}]
[{"$f":"IF(A9=A3,H13,IF(A9=A4,H14,IF(A9=A5,H15)))","v":{"$error":"#REF!"}},1,"10L2-SO-HDD","S10L2-DL560-S-HDD",{"$f":"IF(A9=A3,L13,IF(A9=A4,L14,IF(A9=A5,L15)))","v":{"$error":"#REF!"}},300,null,"5Yr Data Protection - Keep Your Hard Drive",{"$f":"I13","v":1},{"$f":"J13","v":"10L2-SO-HDD"},{"$f":"K13","v":"S10L2-DL560-S-HDD"},{"$f":"\"\"","v":""},{"$f":"M13","v":300}]
["None",{"$f":"\"\"","v":""},{"$f":"\"\"","v":""},{"$f":"\"\"","v":""},{"$f":"\"\"","v":""},{"$f":"\"\"","v":""}]
[{"$f":"IF(A10=A3,H13,IF(A10=A4,H14,IF(A10=A5,H15)))","v":{"$error":"#REF!"}},1,"10L2-SO-HDD","S10L2-DL560-S-HDD",{"$f":"IF(A10=A3,L13,IF(A10=A4,L14,IF(A10=A5,L15)))","v":{"$error":"#REF!"}},300]
[]
[]
[]
["Protezione dei dati Selezionata"]
[{"$f":"'Lotto5 DL560 Gen10 1'!B221","v":"None"}]
[]
["Servizio Specialistico di System and Network Management per sistema opertivo Windows, erogato on site.",1,"10L2-SO-WIN","S10L1-R630-S-WIN",null,200]
["Servizio Specialistico di System and Network Management per sistema opertivo Linux, erogato on site.",1,"10L2-SO-LINUX","S10L1-R630-S-LINUX",null,200]
[]
["None",{"$f":"\"\"","v":""},{"$f":"\"\"","v":""},{"$f":"\"\"","v":""},{"$f":"\"\"","v":""},{"$f":"\"\"","v":""}]
[{"$f":"IF('Lotto5 DL560 Gen10 1'!$C$16>=5,H28,\"None\")","v":"None"},{"$f":"IF('Lotto5 DL560 Gen10 1'!$C$16>=5,I28,\"\")","v":""},{"$f":"IF('Lotto5 DL560 Gen10 1'!$C$16>=5,J28,\"\")","v":""},{"$f":"IF('Lotto5 DL560 Gen10 1'!$C$16>=5,K28,\"\")","v":""},{"$f":"IF('Lotto5 DL560 Gen10 1'!$C$16>=5,L28,\"\")","v":""},{"$f":"IF('Lotto5 DL560 Gen10 1'!$C$16>=5,M28,\"\")","v":""},null,"Servizi di manutenzione preventiva",1,"10L1-SO-PREV","S10L1-T630-S-PREV",null,200]
[]
["Warranty Upgrades",null,null,null,null,null,"Protezione dei dati - Keep Your Hard Drive "]
["DL580"]
["None",{"$f":"\"\"","v":""},{"$f":"\"\"","v":""},{"$f":"\"\"","v":""},{"$f":"\"\"","v":""},{"$f":"\"\"","v":""},null,null,{"$f":"IF(($A$22=$A$12),\"\",IF($A$8=$A$3,I42,IF($A$8=$A$4,I43,IF($A$8=$A$5,I44))))","v":""},{"$f":"IF(($A$22=$A$12),\"\",IF($A$8=$A$3,J42,IF($A$8=$A$4,J43,IF($A$8=$A$5,J44))))","v":""},{"$f":"IF(($A$22=$A$12),\"\",IF($A$8=$A$3,K42,IF($A$8=$A$4,K43,IF($A$8=$A$5,K44))))","v":""},{"$f":"IF(($A$22=$A$12),\"\",IF($A$8=$A$3,L42,IF($A$8=$A$4,L43,IF($A$8=$A$5,L44))))","v":""},{"$f":"IF(($A$22=$A$12),\"\",IF($A$8=$A$3,M42,IF($A$8=$A$4,M43,IF($A$8=$A$5,M44))))","v":""}]
["Estensione della manutenzione in garanzia per ulteriori 12 mesi",1,"TS2L5-4Y","TS2L5-4Y","HA537A1",300]
["Estensione della manutenzione in garanzia per ulteriori 24 mesi",1,"TS2L5-5Y","TS2L5-5Y","HA538A1",600]
[]
["Estensione Garanzia Selezionata"]
[{"$f":"#REF!","v":{"$error":"#REF!"}},null,"DL580 "]
[{"$f":"#REF!","v":{"$error":"#REF!"}},null,"DL580 2"]
[{"$f":"#REF!","v":{"$error":"#REF!"}},null,"DL580 3"]
[]
["None",{"$f":"\"\"","v":""},{"$f":"\"\"","v":""},{"$f":"\"\"","v":""},{"$f":"\"\"","v":""},{"$f":"\"\"","v":""},null,"None"]
[{"$f":"IF($A$37=$A$32,H42,IF($A$37=$A$33,H43,IF($A$37=$A$34,H44)))","v":{"$error":"#REF!"}},1,"10L2-SO-HDD","S10L2-DL580-S-HDD",{"$f":"IF($A$37=$A$32,L42,IF($A$37=$A$33,L43,IF($A$37=$A$34,L44)))","v":{"$error":"#REF!"}},300,null,"3Yr Data Protection - Keep Your Hard Drive",1,"10L2-SO-HDD","S10L2-DL580-S-HDD","[733-10057]",300]
["None",{"$f":"\"\"","v":""},{"$f":"\"\"","v":""},{"$f":"\"\"","v":""},{"$f":"\"\"","v":""},{"$f":"\"\"","v":""},null,"4Yr Data Protection - Keep Your Hard Drive",{"$f":"I42","v":1},{"$f":"J42","v":"10L2-SO-HDD"},{"$f":"K42","v":"S10L2-DL580-S-HDD"},"[733-10058]",{"$f":"M42","v":300}]
[{"$f":"IF(A38=A32,H42,IF(A38=A33,H43,IF(A38=A34,H44)))","v":{"$error":"#REF!"}},1,"10L2-SO-HDD","S10L2-DL580-S-HDD",{"$f":"IF(A38=A32,L42,IF(A38=A33,L43,IF(A38=A34,L44)))","v":{"$error":"#REF!"}},300,null,"5Yr Data Protection - Keep Your Hard Drive",{"$f":"I42","v":1},{"$f":"J42","v":"10L2-SO-HDD"},{"$f":"K42","v":"S10L2-DL580-S-HDD"},"[733-10059]",{"$f":"M42","v":300}]
["None",{"$f":"\"\"","v":""},{"$f":"\"\"","v":""},{"$f":"\"\"","v":""},{"$f":"\"\"","v":""},{"$f":"\"\"","v":""}]
[{"$f":"IF(A39=A32,H42,IF(A39=A33,H43,IF(A39=A34,H44)))","v":{"$error":"#REF!"}},1,"10L2-SO-HDD","S10L2-DL580-S-HDD",{"$f":"IF(A39=A32,L42,IF(A39=A33,L43,IF(A39=A34,L44)))","v":{"$error":"#REF!"}},300]
[]
[]
[]
["Protezione dei dati Selezionata"]
[{"$f":"#REF!","v":{"$error":"#REF!"}}]
[]
["Servizio Specialistico di System and Network Management per sistema opertivo Windows, erogato on site.",1,"10L2-SO-WIN","S10L1-R730xd-S-WIN",null,200]
["Servizio Specialistico di System and Network Management per sistema opertivo Linux, erogato on site.",1,"10L2-SO-LINUX","S10L1-R730xd-S-LINUX",null,200]
[]
["None",{"$f":"\"\"","v":""},{"$f":"\"\"","v":""},{"$f":"\"\"","v":""},{"$f":"\"\"","v":""},{"$f":"\"\"","v":""}]
[{"$f":"IF(#REF!>=5,H57,\"None\")","v":{"$error":"#REF!"}},{"$f":"IF(#REF!>=5,I57,\"\")","v":{"$error":"#REF!"}},{"$f":"IF(#REF!>=5,J57,\"\")","v":{"$error":"#REF!"}},{"$f":"IF(#REF!>=5,K57,\"\")","v":{"$error":"#REF!"}},{"$f":"IF(#REF!>=5,L57,\"\")","v":{"$error":"#REF!"}},{"$f":"IF(#REF!>=5,M57,\"\")","v":{"$error":"#REF!"}},null,"Servizi di manutenzione preventiva",1,"10L2-SO-PREV","S10L2-DL580-S-PREV",null,200]
[]
[]
["Warranty Upgrades",null,null,null,null,null,"Protezione dei dati - Keep Your Hard Drive "]
["T630"]
["None",{"$f":"\"\"","v":""},{"$f":"\"\"","v":""},{"$f":"\"\"","v":""},{"$f":"\"\"","v":""},{"$f":"\"\"","v":""},null,null,{"$f":"IF(($A$22=$A$12),\"\",IF($A$8=$A$3,I70,IF($A$8=$A$4,I71,IF($A$8=$A$5,I72))))","v":""},{"$f":"IF(($A$22=$A$12),\"\",IF($A$8=$A$3,J70,IF($A$8=$A$4,J71,IF($A$8=$A$5,J72))))","v":""},{"$f":"IF(($A$22=$A$12),\"\",IF($A$8=$A$3,K70,IF($A$8=$A$4,K71,IF($A$8=$A$5,K72))))","v":""},{"$f":"IF(($A$22=$A$12),\"\",IF($A$8=$A$3,L70,IF($A$8=$A$4,L71,IF($A$8=$A$5,L72))))","v":""},{"$f":"IF(($A$22=$A$12),\"\",IF($A$8=$A$3,M70,IF($A$8=$A$4,M71,IF($A$8=$A$5,M72))))","v":""}]
["4Yr Warranty upgrade ",1,"10L1-SO-12M-T","S10L1-T630-S-12M",{"$f":"\"\"","v":""},175]
["5Yr Warranty upgrade ",1,"10L1-SO-24M-T","S10L1-T630-S-24M",{"$f":"\"\"","v":""},350]
[]
["Estensione Garanzia Selezionata"]
[{"$f":"#REF!","v":{"$error":"#REF!"}}]
[]
["None",{"$f":"\"\"","v":""},{"$f":"\"\"","v":""},{"$f":"\"\"","v":""},{"$f":"\"\"","v":""},{"$f":"\"\"","v":""},null,"None"]
[{"$f":"IF($A$67=$A$62,H70,IF($A$67=$A$63,H71,IF($A$67=$A$64,H72)))","v":{"$error":"#REF!"}},1,"10L1-SO-HDD","S10L1-T630-S-HDD",{"$f":"IF($A$67=$A$62,L70,IF($A$67=$A$63,L71,IF($A$67=$A$64,L72)))","v":{"$error":"#REF!"}},150,null,"3Yr Data Protection - Keep Your Hard Drive",1,"10L1-SO-HDD","S10L1-T630-S-HDD","[733-10057]",150]
[null,null,null,null,null,null,null,"4Yr Data Protection - Keep Your Hard Drive",{"$f":"I70","v":1},{"$f":"J70","v":"10L1-SO-HDD"},{"$f":"K70","v":"S10L1-T630-S-HDD"},"[733-10058]",{"$f":"M70","v":150}]
[null,null,null,null,null,null,null,"5Yr Data Protection - Keep Your Hard Drive",{"$f":"I70","v":1},{"$f":"J70","v":"10L1-SO-HDD"},{"$f":"K70","v":"S10L1-T630-S-HDD"},"[733-10059]",{"$f":"M70","v":150}]
[]
["Protezione dei dati Selezionata"]
[{"$f":"#REF!","v":{"$error":"#REF!"}}]
[]
["Servizio Specialistico di System and Network Management per sistema opertivo Windows, erogato on site.",1,"10L1-SO-WIN","S10L1-T630-S-WIN",null,193]
["Servizio Specialistico di System and Network Management per sistema opertivo Linux, erogato on site.",1,"10L1-SO-LINUX","S10L1-T630-S-LINUX",null,193]
[]
["None",{"$f":"\"\"","v":""},{"$f":"\"\"","v":""},{"$f":"\"\"","v":""},{"$f":"\"\"","v":""},{"$f":"\"\"","v":""}]
[{"$f":"IF(#REF!>=5,H81,\"None\")","v":{"$error":"#REF!"}},{"$f":"IF(#REF!>=5,I81,\"\")","v":{"$error":"#REF!"}},{"$f":"IF(#REF!>=5,J81,\"\")","v":{"$error":"#REF!"}},{"$f":"IF(#REF!>=5,K81,\"\")","v":{"$error":"#REF!"}},{"$f":"IF(#REF!>=5,L81,\"\")","v":{"$error":"#REF!"}},{"$f":"IF(#REF!>=5,M81,\"\")","v":{"$error":"#REF!"}},null,"Servizi di manutenzione preventiva",1,"10L1-SO-PREV","S10L1-T630-S-PREV",null,193]