{"text_format":"1","workbook":"xlsx","n_sheets":9,"sheets":["Lotto7-1","Lotto7-2","Lotto7-3","Lotto7 (Custom)","Rack e Accessori","Riepilogo","Foglio1","Regole di configurazione","Codici&PrezzixRiepilogo"],"not_rendered":{"charts":0,"images":29,"macros":1,"external_links":1,"defined_names":30,"comments":0,"pivot_tables":0},"unopened":[],"bounds":{"document_bytes":16777216,"sheet_cells":100000,"rows_first":2000,"rows_last":500,"rows_between":2000,"halvings":0,"cell_chars":16384,"cell_head_chars":4096},"cells_cut":0,"cells_raw":0,"read":"whole","date_system":"1900"}

{"sheet":"Lotto7-1","index":0,"n_rows":185,"n_cols":9,"rows_kept":185,"cut":false,"hidden":false,"merged":[[91,1,91,2],[4,0,4,4],[0,5,1,5],[46,0,50,0]]}
[null,"TOTALE PRODOTTI CONVENZIONE",{"$f":"SUM(G13:G195)*$C$10","v":0},null,null,{"$f":"IF(I1+I2=0,(C1+C2),\"ERRORE VERIFICARE LA CONFIGURAZIONE\")","v":0},null,null,{"$f":"IF(A47=\"\",0,1)","v":0}]
[null,"TOTALE ARTICOLI 20%",{"$f":"SUM(H13:H195)*$C$10","v":0},null,null,null,null,null,{"$f":"IF(A92=\"\",0,1)","v":0}]
[null,"Quantità Server",0,null,null,{"$f":"Riepilogo!T6","v":"ver. 2.0"}]
[]
["POWEREDGE C6420"]
[]
[]
[]
[]
[null,"Quantità:",{"$f":"C3","v":0}]
[]
[null,"Modello Server"]
[null,"PowerEdge C6420",4,"[210-ALBP]",null,"TS2L7-SRV",8625]
[]
[null,"Configurazione dello chassis"]
{"$rows_left_out":171}
{"sheet":"Lotto7-2","index":1,"n_rows":186,"n_cols":9,"rows_kept":186,"cut":false,"hidden":false,"merged":[[91,1,91,2],[46,0,50,0],[0,5,1,5],[4,0,4,4]]}
[null,"TOTALE PRODOTTI CONVENZIONE",{"$f":"SUM(G13:G195)*$C$10","v":0},null,null,{"$f":"IF(I1+I2=0,(C1+C2),\"ERRORE VERIFICARE LA CONFIGURAZIONE\")","v":0},null,null,{"$f":"IF(A47=\"\",0,1)","v":0}]
[null,"TOTALE ARTICOLI 20%",{"$f":"SUM(H13:H195)*$C$10","v":0},null,null,null,null,null,{"$f":"IF(A90=\"\",0,1)","v":0}]
[null,"Quantità Server",0,null,null,{"$f":"Riepilogo!T6","v":"ver. 2.0"}]
[]
["POWEREDGE C6420"]
[]
[]
[]
[]
[null,"Quantità:",{"$f":"C3","v":0}]
[]
[null,"Modello Server"]
[null,"PowerEdge C6420",4,"[210-ALBP]",null,"TS2L7-SRV",8625]
[]
[null,"Configurazione dello chassis"]
{"$rows_left_out":172}
{"sheet":"Lotto7-3","index":2,"n_rows":185,"n_cols":9,"rows_kept":185,"cut":false,"hidden":false,"merged":[[91,1,91,2],[46,0,50,0],[0,5,1,5],[4,0,4,4]]}
[null,"TOTALE PRODOTTI CONVENZIONE",{"$f":"SUM(G13:G195)*$C$10","v":0},null,null,{"$f":"IF(I1+I2=0,(C1+C2),\"ERRORE VERIFICARE LA CONFIGURAZIONE\")","v":0},null,null,{"$f":"IF(A47=\"\",0,1)","v":0}]
[null,"TOTALE ARTICOLI 20%",{"$f":"SUM(H13:H195)*$C$10","v":0},null,null,null,null,null,{"$f":"IF(A92=\"\",0,1)","v":0}]
[null,"Quantità Server",0,null,null,{"$f":"Riepilogo!T6","v":"ver. 2.0"}]
[]
["POWEREDGE C6420"]
[]
[]
[]
[]
[null,"Quantità:",{"$f":"C3","v":0}]
[]
[null,"Modello Server"]
[null,"PowerEdge C6420",4,"[210-ALBP]",null,"TS2L7-SRV",8625]
[]
[null,"Configurazione dello chassis"]
{"$rows_left_out":171}
{"sheet":"Lotto7 (Custom)","index":3,"n_rows":175,"n_cols":9,"rows_kept":175,"cut":false,"hidden":true,"merged":[[79,1,79,2],[0,5,1,5],[3,0,3,4],[45,0,49,0],[60,0,64,0],[66,0,68,0]]}
[null,"TOTALE PRODOTTI CONVENZIONE",{"$f":"SUM(G12:G185)*$C$9","v":{"$error":"#N/A"}},null,null,{"$f":"IF(I1+I2=0,(C1+C2),\"ERRORE VERIFICARE LA CONFIGURAZIONE\")","v":{"$error":"#N/A"}},null,null,{"$f":"IF(A46=\"\",0,1)","v":0}]
[null,"TOTALE ARTICOLI 20%",{"$f":"SUM(H12:H185)*$C$9","v":{"$error":"#N/A"}},null,null,null,null,null,{"$f":"IF(A80=\"\",0,1)","v":0}]
[]
["POWEREDGE R7425 GPU Ready (3GPU max)"]
[]
[]
[]
[]
[null,"Quantità:",0]
[]
[null,"Modello Server"]
[null,"PowerEdge R7425 Server",1,"[210-APFK]",null,"TS2L3-SRV",2087]
[]
[null,"Configurazione dello chassis"]
[null,"Chassis w/ up to 24 x 2.5\" SAS/SATA Hard Drives for 2CPU Configuration with GPU capable, Risers 4,6",1,"[321-BDWP]",null,"TS2L3-KITGPU",null,{"$f":"'Codici&PrezzixRiepilogo'!E44","v":"TS2L7-KVMIP"}]
{"$rows_left_out":161}
{"sheet":"Rack e Accessori","index":4,"n_rows":45,"n_cols":11,"rows_kept":45,"cut":false,"hidden":false,"merged":[[44,2,44,7],[14,2,14,7],[5,2,5,7],[8,2,8,7],[11,2,11,7],[38,2,38,7],[41,2,41,7],[17,2,17,7],[20,2,20,7],[23,2,23,7],[26,2,26,7],[32,2,32,7],[35,2,35,7],[29,2,29,7],[0,7,0,8],[1,7,1,8],[0,9,1,10]]}
[null,null,null,null,null,null,"TOTALE PRODOTTI CONVENZIONE",{"$f":"SUM(Riepilogo!T42:U45)","v":0},null,{"$f":"H1+H2","v":0}]
[null,null,null,null,null,null,"TOTALE ARTICOLI 20%"]
[]
[]
[null,null,{"$f":"IF(Riepilogo!G6=\"\",\"\",\"Rack (OpzRack)\")","v":""}]
[null,null,{"$f":"IF(Riepilogo!G6=\"\",\"\",\"Tecnosteel: armadio Rack 19'' 42U\")","v":""},null,null,null,null,null,null,null,{"$f":"IF(J6>=1,\"TS2L7-RACK\",\"\")","v":""}]
[]
[null,null,{"$f":"IF(Riepilogo!$G$6=\"\",\"\",\"PDU (OpzPDU32A)\")","v":""}]
[null,null,{"$f":"IF(Riepilogo!$G$6=\"\",\"\",\"Coppia di PDU Vertical  1Ph-32A-18xC13-6xC19 - 0U Base + Kit di montaggio\")","v":""},null,null,null,null,null,null,null,{"$f":"IF(J9>=1,\"TS2L3-PDU32A\",\"\")","v":""}]
[]
[null,null,{"$f":"IF(Riepilogo!$G$6=\"\",\"\",\"PDU (OpzPDU16AMetered)\")","v":""}]
[null,null,{"$f":"IF(Riepilogo!$G$6=\"\",\"\",\"Coppia di PDU Vertical  1Ph-16A-36xC13+6xC19 -0U Metered + Kit di montaggio\")","v":""},null,null,null,null,null,null,null,{"$f":"IF(J12>=1,\"TS2L3-TM1613606\",\"\")","v":""}]
[]
[null,null,{"$f":"IF(Riepilogo!$G$6=\"\",\"\",\"PDU (OpzPDU32AMetered)\")","v":""}]
[null,null,{"$f":"IF(Riepilogo!$G$6=\"\",\"\",\"Coppia di PDU Vertical  1Ph-32A-36xC13+6xC19 -0U Metered + Kit di montaggio\")","v":""},null,null,null,null,null,null,null,{"$f":"IF(J15>=1,\"TS2L3-TM3213606\",\"\")","v":""}]
{"$rows_left_out":31}
{"sheet":"Riepilogo","index":5,"n_rows":174,"n_cols":37,"rows_kept":174,"cut":false,"hidden":false,"merged":[[131,16,131,19],[132,16,132,19],[133,16,133,19],[134,16,134,19],[135,16,135,19],[136,16,136,19],[137,16,137,19],[138,16,138,19],[139,16,139,19],[131,9,131,12],[132,9,132,12],[133,9,133,12],[134,9,134,12],[135,9,135,12],[136,9,136,12],[137,9,137,12],[138,9,138,12],[139,9,139,12],[131,2,131,5],[132,2,132,5],[133,2,133,5],[134,2,134,5],[135,2,135,5],[136,2,136,5],[137,2,137,5],[138,2,138,5],[139,2,139,5],[72,2,72,5],[72,6,72,8],[72,9,72,16],[72,17,72,18],[72,19,72,20],[121,2,121,5],[121,9,121,12],[121,16,121,19],[130,2,130,5],[130,9,130,12],[130,16,130,19],[127,9,127,12],[128,9,128,12],[129,9,129,12],[116,16,116,19],[117,16,117,19],[118,16,118,19],[119,16,119,19],[120,16,120,19],[122,16,122,19],[123,16,123,19],[124,16,124,19],[125,16,125,19],[126,16,126,19],[70,2,70,5],[70,6,70,8],[70,9,70,16],[70,17,70,18],[70,19,70,20],[71,2,71,5],[71,6,71,8],[71,9,71,16],[71,17,71,18],[71,19,71,20],[68,2,68,5],[68,6,68,8],[68,9,68,16],[68,17,68,18],[68,19,68,20],[69,2,69,5],[69,6,69,8],[69,9,69,16],[69,17,69,18],[69,19,69,20],[65,17,65,18],[65,19,65,20],[66,2,66,5],[66,6,66,8],[66,9,66,16],[66,17,66,18],[66,19,66,20],[67,2,67,5],[67,6,67,8],[67,9,67,16],[67,17,67,18],[67,19,67,20],[55,9,55,16],[55,17,55,18],[55,19,55,20],[104,9,104,12],[104,16,104,19],[78,1,78,16],[54,2,54,5],[54,6,54,8],[54,9,54,16],[54,17,54,18],[54,19,54,20],[63,2,63,5],[63,6,63,8],[63,9,63,16],[63,17,63,18],[63,19,63,20],[64,2,64,5],[64,6,64,8],[64,9,64,16],[64,17,64,18],[64,19,64,20],[65,2,65,5],[65,6,65,8],[65,9,65,16],[127,16,127,19],[128,16,128,19],[129,16,129,19],[62,2,62,5],[62,6,62,8],[62,9,62,16],[62,17,62,18],[62,19,62,20],[116,2,116,5],[117,2,117,5],[118,2,118,5],[119,2,119,5],[116,9,116,12],[117,9,117,12],[118,9,118,12],[119,9,119,12],[114,9,114,12],[114,16,114,19],[110,9,110,12],[110,16,110,19],[106,2,106,5],[106,9,106,12],[106,16,106,19],[107,2,107,5],[107,9,107,12],[107,16,107,19],[104,2,104,5],[60,2,60,5],[60,6,60,8],[60,9,60,16],[60,17,60,18],[60,19,60,20],[61,2,61,5],[61,6,61,8],[61,9,61,16],[61,17,61,18],[61,19,61,20],[105,2,105,5],[105,9,105,12],[105,16,105,19],[102,2,102,5],[102,9,102,12],[102,16,102,19],[103,2,103,5],[103,9,103,12],[103,16,103,19],[100,2,100,5],[100,9,100,12],[58,2,58,5],[58,6,58,8],[58,9,58,16],[58,17,58,18],[58,19,58,20],[59,2,59,5],[59,6,59,8],[59,9,59,16],[59,17,59,18],[59,19,59,20],[56,2,56,5],[56,6,56,8],[56,9,56,16],[56,17,56,18],[56,19,56,20],[57,2,57,5],[57,6,57,8],[57,9,57,16],[57,17,57,18],[57,19,57,20],[48,2,48,5],[48,6,48,8],[48,9,48,16],[48,17,48,18],[48,19,48,20],[49,2,49,5],[49,6,49,8],[49,9,49,16],[49,17,49,18],[49,19,49,20],[50,2,50,5],[50,6,50,8],[50,9,50,16],[50,17,50,18],[50,19,50,20],[52,2,52,5],[52,6,52,8],[52,9,52,16],[52,17,52,18],[52,19,52,20],[51,2,51,5],[51,6,51,8],[51,9,51,16],[51,17,51,18],[51,19,51,20],[53,2,53,5],[53,6,53,8],[112,2,112,5],[112,9,112,12],[112,16,112,19],[113,2,113,5],[113,9,113,12],[113,16,113,19],[168,2,168,7],[168,14,168,19],[140,9,140,12],[115,16,115,19],[140,16,140,19],[114,2,114,5],[108,2,108,5],[108,9,108,12],[108,16,108,19],[111,2,111,5],[111,9,111,12],[111,16,111,19],[109,2,109,5],[109,9,109,12],[109,16,109,19],[110,2,110,5],[169,2,172,7],[169,14,172,19],[162,12,162,13],[162,14,162,15],[162,16,162,17],[162,18,162,19],[165,3,166,18],[162,2,162,3],[162,4,162,5],[162,6,162,7],[162,8,162,9],[162,10,162,11],[100,16,100,19],[101,2,101,5],[101,9,101,12],[101,16,101,19],[98,2,98,5],[98,9,98,12],[98,16,98,19],[99,2,99,5],[99,9,99,12],[99,16,99,19],[96,2,96,5],[96,9,96,12],[96,16,96,19],[97,2,97,5],[97,9,97,12],[97,16,97,19],[95,2,95,5],[95,9,95,12],[95,16,95,19],[93,2,93,5],[93,9,93,12],[93,16,93,19],[94,2,94,5],[94,9,94,12],[94,16,94,19],[91,2,91,5],[91,9,91,12],[91,16,91,19],[92,2,92,5],[92,9,92,12],[92,16,92,19],[89,2,89,5],[89,9,89,12],[89,16,89,19],[90,2,90,5],[90,9,90,12],[90,16,90,19],[88,2,88,5],[88,9,88,12],[88,16,88,19],[78,17,78,20],[74,1,74,16],[74,17,74,20],[82,3,83,18],[75,1,75,16],[75,17,75,20],[76,1,76,16],[76,17,76,20],[77,1,77,16],[77,17,77,20],[46,2,46,5],[46,6,46,8],[46,9,46,16],[46,17,46,18],[46,19,46,20],[45,1,45,20],[86,1,86,3],[86,8,86,10],[86,15,86,17],[47,2,47,5],[47,6,47,8],[47,9,47,16],[47,17,47,18],[47,19,47,20],[73,2,73,5],[73,6,73,8],[73,9,73,16],[73,17,73,18],[73,19,73,20],[53,9,53,16],[53,17,53,18],[53,19,53,20],[55,2,55,5],[55,6,55,8],[44,2,44,5],[44,6,44,8],[44,9,44,16],[44,17,44,18],[44,19,44,20],[43,2,43,5],[43,6,43,8],[43,9,43,16],[43,17,43,18],[43,19,43,20],[42,2,42,5],[42,6,42,8],[42,9,42,16],[42,17,42,18],[42,19,42,20],[41,2,41,5],[41,6,41,8],[41,9,41,16],[41,17,41,18],[41,19,41,20],[40,1,40,20],[39,2,39,5],[39,6,39,8],[39,9,39,16],[39,17,39,18],[39,19,39,20],[38,2,38,5],[38,6,38,8],[38,9,38,16],[38,17,38,18],[38,19,38,20],[37,2,37,5],[37,6,37,8],[37,9,37,16],[37,17,37,18],[37,19,37,20],[34,2,34,5],[34,6,34,8],[34,9,34,16],[34,17,34,18],[34,19,34,20],[35,2,35,5],[35,6,35,8],[35,9,35,16],[35,17,35,18],[35,19,35,20],[36,2,36,5],[36,6,36,8],[36,9,36,16],[36,17,36,18],[36,19,36,20],[33,2,33,5],[33,6,33,8],[33,9,33,16],[33,17,33,18],[33,19,33,20],[32,2,32,5],[32,6,32,8],[32,9,32,16],[32,17,32,18],[32,19,32,20],[31,2,31,5],[31,6,31,8],[31,9,31,16],[31,17,31,18],[31,19,31,20],[30,2,30,5],[30,6,30,8],[30,9,30,16],[30,17,30,18],[30,19,30,20],[29,2,29,5],[29,6,29,8],[29,9,29,16],[29,17,29,18],[29,19,29,20],[28,2,28,5],[28,6,28,8],[28,9,28,16],[28,17,28,18],[28,19,28,20],[27,2,27,5],[27,6,27,8],[27,9,27,16],[27,17,27,18],[27,19,27,20],[26,2,26,5],[26,6,26,8],[26,9,26,16],[26,17,26,18],[26,19,26,20],[25,2,25,5],[25,6,25,8],[25,9,25,16],[25,17,25,18],[25,19,25,20],[24,2,24,5],[24,6,24,8],[24,9,24,16],[24,17,24,18],[24,19,24,20],[23,2,23,5],[23,6,23,8],[23,9,23,16],[23,17,23,18],[23,19,23,20],[22,2,22,5],[22,6,22,8],[22,9,22,16],[22,17,22,18],[22,19,22,20],[21,2,21,5],[21,6,21,8],[21,9,21,16],[21,17,21,18],[21,19,21,20],[20,2,20,5],[20,6,20,8],[20,9,20,16],[20,17,20,18],[20,19,20,20],[19,2,19,5],[19,6,19,8],[19,9,19,16],[19,17,19,18],[19,19,19,20],[4,1,4,7],[5,1,5,5],[5,6,5,7],[1,8,3,16],[4,8,4,16],[16,2,16,5],[16,6,16,8],[16,9,16,16],[16,17,16,18],[7,1,7,3],[7,4,7,8],[7,11,7,14],[9,1,9,3],[9,4,9,8],[9,9,9,10],[9,11,9,14],[7,9,7,10],[11,1,11,20],[12,2,12,5],[12,6,12,8],[0,1,0,5],[0,6,0,14],[0,17,1,20],[1,1,1,5],[1,6,1,7],[2,1,2,5],[2,6,2,7],[3,1,3,5],[3,6,3,7],[12,9,12,16],[12,17,12,18],[12,19,12,20],[7,16,7,20],[9,16,9,20],[13,1,13,20],[14,2,14,5],[14,6,14,8],[14,9,14,16],[14,17,14,18],[14,19,14,20],[16,19,16,20],[15,2,15,5],[15,6,15,8],[15,9,15,16],[15,17,15,18],[15,19,15,20],[18,2,18,5],[18,6,18,8],[18,9,18,16],[18,17,18,18],[18,19,18,20],[17,2,17,5],[17,6,17,8],[17,9,17,16],[17,17,17,18],[17,19,17,20],[142,1,142,3],[142,8,142,10],[142,15,142,17],[144,1,160,5],[144,8,160,12],[144,15,160,19],[115,2,115,5],[140,2,140,5],[115,9,115,12],[120,2,120,5],[122,2,122,5],[123,2,123,5],[124,2,124,5],[125,2,125,5],[126,2,126,5],[127,2,127,5],[128,2,128,5],[129,2,129,5],[120,9,120,12],[122,9,122,12],[123,9,123,12],[124,9,124,12],[125,9,125,12],[126,9,126,12]]}
[null,"Amministrazione ",null,null,null,null,null,null,null,null,null,null,null,null,null,null,null,"CONFIGURATORE ELETTRONICO TECNOLOGIE SERVER 2 LOTTO 7",null,null,null,1,null,"Server1","Server2","Server3","GPU"]
[null,"N° Identificativo Ordine ",null,null,null,null,null,null,{"$f":"IF(AA2>0,\"ERRORE DI CONFIGURAZIONE\",IF(Y13>0,\"ERRORE DI MANCATA COMPILAZIONE DATI NECESSARI PER L'ORDINATIVO\",\"Configurazione OK\"))","v":"ERRORE DI MANCATA COMPILAZIONE DATI NECESSARI PER L'ORDINATIVO"},null,null,null,null,null,null,null,null,null,null,null,null,1,"Errore",{"$f":"IF('Lotto7-1'!$F$1=\"ERRORE VERIFICARE LA CONFIGURAZIONE\",1,0)","v":0},{"$f":"IF('Lotto7-2'!$F$1=\"ERRORE VERIFICARE LA CONFIGURAZIONE\",1,0)","v":0},{"$f":"IF('Lotto7-3'!$F$1=\"ERRORE VERIFICARE LA CONFIGURAZIONE\",1,0)","v":0},{"$f":"SUM(X2:Z2)","v":0}]
[null,"Data Ordine",null,null,null,null,null,null,null,null,null,null,null,null,null,null,null,null,null,null,null,1,"Dati non compilati","Amministrazione ",{"$f":"IF(G1>0,0,1)","v":1}]
[null,"Tot Ordine Portale CONSIP IVA incl.",null,null,null,null,{"$f":"R79","v":0},null,null,null,null,null,null,null,null,null,null,null,null,null,"Nel \"Tot Ordine Portale CONSIP\" deve essere inserito l'importo totale risultante dall'ordinativo del portale CONSIP.\nQualora l'importo inserito corrisponde al valore ricalcolato dal configuratore viene attivato il pulsante \"Salva in formato PDF\" che permette di generare il file pdf da allegare all'ordinativo.",1,null,"N° Identificativo Ordine ",{"$f":"IF(G2>0,0,1)","v":1}]
[null,"LE CELLE IN GIALLO DEVO ESSERE COMPILATE OBBLIGATORIAMENTE",null,null,null,null,null,null,{"$f":"IF(AA2>0,\"\",IF(Y13>0,\"\",\"Cliccare il pulsante --------------> \nper generare il PDF da allegare\"))","v":""},null,null,null,null,null,null,null,null,null,null,null,null,1,null,"Data Ordine",{"$f":"IF(G3>0,0,1)","v":1}]
[null,"Quantità Server Ordinati",null,null,null,null,{"$f":"B15","v":""},null,null,null,null,null,null,null,null,null,null,null,null,"ver. 2.0",null,1,null,"Tot Ordine Portale CONSIP IVA incl.",{"$f":"IF(G4>0,0,1)","v":1}]
[null,null,null,null,null,null,null,null,null,null,null,null,null,null,null,null,null,null,null,null,null,1,null,"Referente per la Consegna",{"$f":"IF(E8>0,0,1)","v":1}]
[null,"Referente per la Consegna",null,null,null,null,null,null,null,"Telefono",null,null,null,null,null,"email",null,null,null,null,null,1,null,"Telefono",{"$f":"IF(L8>0,0,1)","v":1}]
[null,null,null,null,null,null,null,null,null,null,null,null,null,null,null,null,null,null,null,null,null,1,null,"email",{"$f":"IF(Q8>0,0,1)","v":1}]
[null,"Referente per l'installazione",null,null,null,null,null,null,null,"Telefono",null,null,null,null,null,"email",null,null,null,null,null,1,null,"Referente per l'installazione",{"$f":"IF(E10>0,0,1)","v":1}]
[null,null,null,null,null,null,null,null,null,null,null,null,null,null,null,null,null,null,null,null,null,1,null,"Telefono",{"$f":"IF(L10>0,0,1)","v":1}]
[null,"ATTENZIONE: I CODICI PRODOTTO DELL'ORDINE DEVONO ESSERE SPECULARI A QUELLI GENERATI DAL CONFIGURATORE.",null,null,null,null,null,null,null,null,null,null,null,null,null,null,null,null,null,null,null,1,null,"email",{"$f":"IF(Q10>0,0,1)","v":1}]
[null,"Qtà Ordinata","CODICE ARTICOLO PRODUTTORE",null,null,null,"CODICE ARTICOLO CONVENZIONE",null,null,"Descrizione Sintetica \n(si faccia riferimento alla guida alla convenzione per la descrizione estesa e \nper le regole di acquisto delle opzioni)",null,null,null,null,null,null,null,"Costo Unitario",null,"Costo Complessivo",null,1,null,null,{"$f":"SUM(Y3:Y12)","v":10},null,{"$f":"Y13+AA2","v":10},{"$f":"IF(AA13=0,\"_SavePDFon\",\"_SavePDFoff\")","v":"_SavePDFoff"}]
[null,"DELL EMC POWEREDGE C6420",null,null,null,null,null,null,null,null,null,null,null,null,null,null,null,null,null,null,null,{"$f":"IF(B15>=\"\",0,1)","v":0},null,"Server1","Server2","Server3",null,null,null,null,null,null,null,null,null,null,"Somma Server"]
[null,{"$f":"IF(AK15>=1,AK15,\"\")","v":""},{"$f":"IF(AK15>0,VLOOKUP($G15,'Codici&PrezzixRiepilogo'!A:E,2,FALSE),\"\")","v":""},null,null,null,{"$f":"IF(AK15>=1,W15,\"\")","v":""},null,null,{"$f":"IF(AK15>0,VLOOKUP($G15,'Codici&PrezzixRiepilogo'!A:E,3,FALSE),\"\")","v":""},null,null,null,null,null,null,null,{"$f":"IF(AK15>0,VLOOKUP($G15,'Codici&PrezzixRiepilogo'!A:E,4,FALSE),\"\")","v":""},null,{"$f":"IF(B15=\"\",\"\",R15*B15)","v":""},null,{"$f":"IF(B15>=\"\",0,1)","v":0},"TS2L7-SRV",{"$f":"'Lotto7-1'!$C$10","v":0},{"$f":"'Lotto7-2'!$C$10","v":0},{"$f":"'Lotto7-3'!$C$10","v":0},null,null,null,null,null,null,null,null,null,null,{"$f":"SUM(X15:AJ15)","v":0}]
{"$rows_left_out":160}
{"sheet":"Foglio1","index":6,"n_rows":87,"n_cols":4,"rows_kept":87,"cut":false,"hidden":true,"merged":[]}
[{"$f":"Riepilogo!E87","v":0}]
[{"$f":"Riepilogo!B89","v":"-"},{"$f":"Riepilogo!C89","v":"-"},null,{"$f":"IF(A2+A3=2,\"TS2L3-SRV2CPU\",B2)","v":{"$error":"#VALUE!"}}]
[{"$f":"Riepilogo!B90","v":"-"},{"$f":"Riepilogo!C90","v":"-"}]
[{"$f":"Riepilogo!B91","v":"-"},{"$f":"Riepilogo!C91","v":"-"}]
[{"$f":"Riepilogo!B92","v":"-"},{"$f":"Riepilogo!C92","v":"-"}]
[{"$f":"Riepilogo!B93","v":"-"},{"$f":"Riepilogo!C93","v":"-"}]
[{"$f":"Riepilogo!B94","v":"-"},{"$f":"Riepilogo!C94","v":"-"}]
[{"$f":"Riepilogo!B95","v":"-"},{"$f":"Riepilogo!C95","v":"-"}]
[{"$f":"Riepilogo!#REF!","v":{"$error":"#REF!"}},{"$f":"Riepilogo!#REF!","v":{"$error":"#REF!"}}]
[{"$f":"Riepilogo!B96","v":"-"},{"$f":"Riepilogo!C96","v":"-"}]
[{"$f":"Riepilogo!B97","v":"-"},{"$f":"Riepilogo!C97","v":"-"}]
[{"$f":"Riepilogo!B98","v":"-"},{"$f":"Riepilogo!C98","v":"-"}]
[{"$f":"Riepilogo!B99","v":"-"},{"$f":"Riepilogo!C99","v":"-"}]
[{"$f":"Riepilogo!B100","v":"-"},{"$f":"Riepilogo!C100","v":"-"}]
[{"$f":"Riepilogo!B101","v":"-"},{"$f":"Riepilogo!C101","v":"-"}]
{"$rows_left_out":73}
{"sheet":"Regole di configurazione","index":7,"n_rows":459,"n_cols":20,"rows_kept":459,"cut":false,"hidden":true,"merged":[]}
["Descrizione","Quantità","SKU","Customer Kit","Codice Convenzione","Convenzione",0.2,null,"SKU","Customer Kit",null,null,null,null,null,"SKU","Customer Kit"]
["Server DELL EMC PowerEdge R7425, 2U, 1 x AMD EPYC 7301; RAM 64GB, 2 x HDD 600GB 10K 2.5\"",1,"[210-APFK]",null,"TS2L7-SRV",8625]
["Server DELL EMC PowerEdge R7425, 2U, 2 x AMD EPYC 7301; RAM 64GB, 2 x HDD 600GB 10K 2.5\"",1,"[210-ANKP]",null,"TS2L3-SRV2CPU"]
["Intel® Xeon® Gold 5120 2.2G, 14C/28T, 10.4GT/s, 19M Cache, Turbo, HT (105W) DDR4-2400",1,"[374-BBTR]","338-BNCI","TS2L7-CPU",1250,{"$f":"\"\"","v":""},"Standard Heatsinks, below 180W CPU",2,"[412-AALN]","412-AALJ",{"$f":"\"\"","v":""},{"$f":"\"\"","v":""},{"$f":"\"\"","v":""},"Riser Config 5, 4 x8, 3 x16 slots",1,"[330-BBJD]","330-BBMK 330-BBLS",null,{"$f":"\"\"","v":""}]
["Windows Server 2016 Standard Ed,ROK,16CORE (for Distributor sale only)",null,null,"634-BRMW","TS2L7-WIN",548]
["Windows Server 2016 Standard Ed,Additional Lic,ROK,16CORE,NoMedia",null,null,"634-BJQV","TS2L7-WIN2",560]
["Windows Server 2016 Standard Ed,Additional Lic,ROK,2CORE,NoMedia",null,null,"634-BJQW","TS2L7-WIN2CORE",71]
["1-pack of Windows Server 2016,2012 Device CALs (Standard or Datacenter),CUS",null,null,"623-BBBX","TS2L7-CALDEV",20]
["1-pack of Windows Server 2016,2012 User CALs (Standard or Datacenter),CUS",null,null,"623-BBCC","TS2L7-CALUSER",24]
["CentOS 7.0",null,null,null,"TS2L7-LINUX",50]
["Windows Server 2016 DataCenter Ed,ROK,16CORE (for Distributor sale only)",null,null,"634-BRMY","TS2L7-WINDC",2350]
["Windows Server 2016 DataCenter Ed,Additional Lic,ROK,16CORE,NoMedia (for Distributor sale only)",null,null,"634-BKYO","TS2L7-WINDC2",2350]
["Windows Server 2016 DataCenter Ed,Additional Lic,ROK,2CORE,NoMedia (for Distributor sale only)",null,null,"634-BKYN","TS2L7-WINDC2COR",377]
["16GB RDIMM, 2666MT/s, Dual Rank",null,"[370-ADND]","AA138422","TS2L7-RAM16",100]
["32GB RDIMM, 2666MT/s, Dual Rank",null,"[370-ADNF]","A9781929","TS2L7-RAM32",351]
{"$rows_left_out":445}
{"sheet":"Codici&PrezzixRiepilogo","index":8,"n_rows":74,"n_cols":6,"rows_kept":74,"cut":false,"hidden":true,"merged":[[26,4,27,4],[39,4,40,4],[1,4,3,4],[5,4,7,4],[19,4,20,4],[21,4,22,4],[24,4,25,4],[1,1,3,1],[5,0,7,0],[5,1,7,1],[19,0,20,0],[19,1,20,1],[39,0,40,0],[39,1,40,1],[1,3,3,3],[5,3,7,3],[19,3,20,3],[21,3,22,3],[24,3,25,3],[26,3,27,3],[39,3,40,3],[21,0,22,0],[21,1,22,1],[24,0,25,0],[24,1,25,1],[26,0,27,0],[26,1,27,1],[1,0,3,0]]}
["CODICE CONVERGE","CODICE CONVENZIONE","Description","Prezzo vendita da Converge a CONSIP tot.","CODICE CONVERGE"]
["TS2L7-SRV","TS2L7-SRV","4 x Dell PowerEdge C6420 in C6400 Enclosure",8625,"TS2L7-SRV",{"$f":"LEN(B2)","v":9}]
[null,null,"Dell PowerEdge C6400 Enclosure"]
[null,null,"Dell PowerEdge C6420",null,null,{"$f":"LEN(B4)","v":0}]
[null,null,null,null,null,0]
["TS2L7-CPU","TS2L7-CPU","Processore Intel Xeon Gold 5120",1250,"TS2L7-CPU",{"$f":"LEN(B6)","v":9}]
[null,null,"C6420 Heatsink for CPU2",null,null,0]
[null,null,"PCIe Riser for C6420",null,null,0]
[null,null,null,null,null,0]
["TS2D-RAM16","TS2L7-RAM16","Upgrade KIT RAM 16GB",100,"TS2D-RAM16",11]
["TS2D-RAM32","TS2L7-RAM32","Upgrade KIT RAM 32GB",351,"TS2D-RAM32",11]
["TS2D-RAM64","TS2L7-RAM64","Upgrade KIT RAM 64GB",703,"TS2D-RAM64",11]
[null,null,null,null,null,0]
["TS2D-10K600","TS2L7-10K600","HDD 600GB 10K SAS 12Gbps  2.5in Hot-plug",68,"TS2D-10K600",12]
["TS2D-10K1200","TS2L7-10K1200","HDD 1200GB 10K SAS 12Gbps  2.5in Hot-plug",139,"TS2D-10K1200",13]
{"$rows_left_out":59}