{"text_format":"1","workbook":"xlsx","n_sheets":9,"sheets":["Lotto7-1","Lotto7-2","Lotto7-3","Lotto7 (Custom)","Rack e Accessori","Riepilogo","Foglio1","Regole di configurazione","Codici&PrezzixRiepilogo"],"not_rendered":{"charts":0,"images":29,"macros":1,"external_links":1,"defined_names":30,"comments":0,"pivot_tables":0},"unopened":[],"bounds":{"document_bytes":16777216,"sheet_cells":100000,"rows_first":2000,"rows_last":500,"rows_between":2000,"halvings":0,"cell_chars":16384,"cell_head_chars":4096},"cells_cut":0,"cells_raw":0,"read":"whole","date_system":"1900"}

{"sheet":"Lotto7-1","index":0,"n_rows":185,"n_cols":9,"rows_kept":185,"cut":false,"hidden":false,"merged":[[91,1,91,2],[4,0,4,4],[0,5,1,5],[46,0,50,0]]}
[null,"TOTALE PRODOTTI CONVENZIONE",{"$f":"SUM(G13:G195)*$C$10","v":0},null,null,{"$f":"IF(I1+I2=0,(C1+C2),\"ERRORE VERIFICARE LA CONFIGURAZIONE\")","v":0},null,null,{"$f":"IF(A47=\"\",0,1)","v":0}]
[null,"TOTALE ARTICOLI 20%",{"$f":"SUM(H13:H195)*$C$10","v":0},null,null,null,null,null,{"$f":"IF(A92=\"\",0,1)","v":0}]
[null,"Quantità Server",0,null,null,{"$f":"Riepilogo!T6","v":"ver. 2.0"}]
[]
["POWEREDGE C6420"]
[]
[]
[]
[]
[null,"Quantità:",{"$f":"C3","v":0}]
[]
[null,"Modello Server"]
[null,"PowerEdge C6420",4,"[210-ALBP]",null,"TS2L7-SRV",8625]
[]
[null,"Configurazione dello chassis"]
[null,"PowerEdge C6420, 2.5 Direct Chassis",1,"[321-BCZE]"]
[]
[null,"Trusted Platform Module"]
[null,"No Trusted Platform Module",1,"[461-AADZ]"]
[]
[null,"Processore"]
[null,"Intel® Xeon® Gold 5120 2.2G, 14C/28T, 10.4GT/s, 19M Cache, Turbo, HT (105W) DDR4-2400",1,"[338-BLUX]"]
[]
[null,"Processore aggiuntivo"]
[null,"No Additional Processor",{"$f":"VLOOKUP($B$25,TS2L7CPU,2,FALSE)","v":0},{"$f":"VLOOKUP($B$25,TS2L7CPU,3,FALSE)","v":"[374-BBBX]"},{"$f":"VLOOKUP($B$25,TS2L7CPU,4,FALSE)","v":""},{"$f":"VLOOKUP($B$25,TS2L7CPU,5,FALSE)","v":""},{"$f":"VLOOKUP($B$25,TS2L7CPU,6,FALSE)*$C$13","v":0},{"$f":"VLOOKUP($B$25,TS2L7CPU,7,FALSE)","v":""}]
[]
[null,"Configurazione Termica del Processore"]
[null,{"$f":"VLOOKUP($B$25,TS2L7CPU,8,FALSE)","v":"C6420 Heatsink"},{"$f":"VLOOKUP($B$25,TS2L7CPU,9,FALSE)","v":1},{"$f":"VLOOKUP($B$25,TS2L7CPU,10,FALSE)","v":"[412-AAIX]"},{"$f":"VLOOKUP($B$25,TS2L7CPU,11,FALSE)","v":0}]
[null,{"$f":"VLOOKUP($B$25,TS2L7CPU,12,FALSE)","v":0},{"$f":"VLOOKUP($B$25,TS2L7CPU,13,FALSE)","v":0},{"$f":"VLOOKUP($B$25,TS2L7CPU,14,FALSE)","v":0}]
[]
[]
[null,"Memoria Totale in GB","64     (DIMM 32GB)"]
[]
[null,"Tipo di configurazione memoria"]
[null,"Performance Optimized",1,"[370-AAIP]"]
[]
[null,"Tipo e velocità della memoria DIMM"]
[null,{"$f":"IF($C$25=0,VLOOKUP($C$32,TS2L7MEM1CPU,9,FALSE),VLOOKUP($C$32,TS2L7MEM2CPU,9,FALSE))","v":"2666MT/s RDIMMs"},{"$f":"IF($C$25=0,VLOOKUP($C$32,TS2L7MEM1CPU,10,FALSE),VLOOKUP($C$32,TS2L7MEM2CPU,10,FALSE))","v":1},{"$f":"IF($C$25=0,VLOOKUP($C$32,TS2L7MEM1CPU,11,FALSE),VLOOKUP($C$32,TS2L7MEM2CPU,11,FALSE))","v":"[370-ADNU]"}]
[]
[null,"Capacità di memoria"]
[null,{"$f":"IF($C$25=0,VLOOKUP($C$32,TS2L7MEM1CPU,2,FALSE),VLOOKUP($C$32,TS2L7MEM2CPU,2,FALSE))","v":"32GB RDIMM, 2666MT/s, Dual Rank"},{"$f":"IF($C$25=0,VLOOKUP($C$32,TS2L7MEM1CPU,3,FALSE),VLOOKUP($C$32,TS2L7MEM2CPU,3,FALSE))","v":2},{"$f":"IF($C$25=0,VLOOKUP($C$32,TS2L7MEM1CPU,4,FALSE),VLOOKUP($C$32,TS2L7MEM2CPU,4,FALSE))","v":"[370-ADNF]"},{"$f":"IF($C$25=0,VLOOKUP($C$32,TS2L7MEM1CPU,5,FALSE),VLOOKUP($C$32,TS2L7MEM2CPU,5,FALSE))","v":"A9781929"},{"$f":"IF($C$25=0,VLOOKUP($C$32,TS2L7MEM1CPU,6,FALSE),VLOOKUP($C$32,TS2L7MEM2CPU,6,FALSE))","v":""},{"$f":"IF($C$25=0,VLOOKUP($C$32,TS2L7MEM1CPU,7,FALSE),VLOOKUP($C$32,TS2L7MEM2CPU,7,FALSE))*$C$13","v":0}]
[]
[null,"Sistema operativo preinstallato"]
[null,"None",{"$f":"VLOOKUP($B$44,TS2L7OS,2,FALSE)","v":""},{"$f":"VLOOKUP($B$44,TS2L7OS,3,FALSE)","v":"[619-ABVR]"},{"$f":"VLOOKUP($B$44,TS2L7OS,4,FALSE)","v":0},{"$f":"VLOOKUP($B$44,TS2L7OS,5,FALSE)","v":""},{"$f":"VLOOKUP($B$44,TS2L7OS,6,FALSE)*$C$13","v":0},{"$f":"VLOOKUP($B$44,TS2L7OS,7,FALSE)","v":""},{"$f":"IF(E44=0,1,0)","v":1}]
[null,{"$f":"IF($C$25=0,\"\",VLOOKUP($B$44,TS2L7OS,8,FALSE))","v":""},{"$f":"IF($C$25=0,\"\",VLOOKUP($B$44,TS2L7OS,9,FALSE))","v":""},{"$f":"IF($C$25=0,\"\",VLOOKUP($B$44,TS2L7OS,10,FALSE))","v":""},{"$f":"IF($C$25=0,\"\",VLOOKUP($B$44,TS2L7OS,11,FALSE))","v":""},{"$f":"IF($C$25=0,\"\",VLOOKUP($B$44,TS2L7OS,12,FALSE))","v":""},{"$f":"IF($C$25=0,0,VLOOKUP($B$44,TS2L7OS,13,FALSE))*$C$13","v":0}]
[]
[{"$f":"IF((I44*I48)=0,\"\",\"ERRORE: \nLa selezione di licenze CAL senza il Sistema Operativo Microsoft Windows non è consentita.\")","v":""},"Client Access Licenses"]
[null,{"$f":"IF($E$44>0,'Regole di configurazione'!A93,\"\")","v":""},0,{"$f":"IF($E$44>0,'Regole di configurazione'!C93,\"\")","v":""},{"$f":"IF($E$44>0,'Regole di configurazione'!D93,\"\")","v":""},{"$f":"IF($E$44>0,'Regole di configurazione'!E93,\"\")","v":""},{"$f":"IF($E$44>0,'Regole di configurazione'!F93,0)*C48","v":0},{"$f":"IF($E$44>0,'Regole di configurazione'!G93,\"\")","v":""},{"$f":"C48+C50","v":0}]
[]
[null,{"$f":"IF($E$44>0,'Regole di configurazione'!A94,\"\")","v":""},0,{"$f":"IF($E$44>0,'Regole di configurazione'!C94,\"\")","v":""},{"$f":"IF($E$44>0,'Regole di configurazione'!D94,\"\")","v":""},{"$f":"IF($E$44>0,'Regole di configurazione'!E94,\"\")","v":""},{"$f":"IF($E$44>0,'Regole di configurazione'!F94,0)*C50","v":0},{"$f":"IF($E$44>0,'Regole di configurazione'!G94,\"\")","v":""}]
[]
[null,"Sistema operativo VMware"]
[null,"Vmware vSphere Essentials Plus Kit"]
[null,"None",{"$f":"VLOOKUP($B$54,TS2L7VMWARE1,2,FALSE)","v":1},{"$f":"VLOOKUP($B$54,TS2L7VMWARE1,3,FALSE)","v":""},{"$f":"VLOOKUP($B$54,TS2L7VMWARE1,4,FALSE)","v":""},{"$f":"VLOOKUP($B$54,TS2L7VMWARE1,5,FALSE)","v":""},{"$f":"VLOOKUP($B$54,TS2L7VMWARE1,6,FALSE)","v":0},{"$f":"VLOOKUP($B$54,TS2L7VMWARE1,7,FALSE)*C54","v":0}]
[null,"VMware vCenter Server Standard"]
[null,"None",{"$f":"VLOOKUP($B$56,TS2L7VMWARE2,2,FALSE)","v":1},{"$f":"VLOOKUP($B$56,TS2L7VMWARE2,3,FALSE)","v":""},{"$f":"VLOOKUP($B$56,TS2L7VMWARE2,4,FALSE)","v":""},{"$f":"VLOOKUP($B$56,TS2L7VMWARE2,5,FALSE)","v":""},{"$f":"VLOOKUP($B$56,TS2L7VMWARE2,6,FALSE)","v":0},{"$f":"VLOOKUP($B$56,TS2L7VMWARE2,7,FALSE)*C56","v":0}]
[null,"Vmware vSphere Standard/Enterprise"]
[null,"None",{"$f":"(VLOOKUP($B$58,TS2L7VMWARE3,2,FALSE))+C25","v":0},{"$f":"VLOOKUP($B$58,TS2L7VMWARE3,3,FALSE)","v":""},{"$f":"VLOOKUP($B$58,TS2L7VMWARE3,4,FALSE)","v":""},{"$f":"VLOOKUP($B$58,TS2L7VMWARE3,5,FALSE)","v":""},{"$f":"VLOOKUP($B$58,TS2L7VMWARE3,6,FALSE)","v":0},{"$f":"VLOOKUP($B$58,TS2L7VMWARE3,7,FALSE)*C58*4","v":0}]
[null,"VMware vSAN"]
[null,"None",{"$f":"(VLOOKUP($B$60,TS2L7VMWARE4,2,FALSE))+C25","v":0},{"$f":"VLOOKUP($B$60,TS2L7VMWARE4,3,FALSE)","v":""},{"$f":"VLOOKUP($B$60,TS2L7VMWARE4,4,FALSE)","v":""},{"$f":"VLOOKUP($B$60,TS2L7VMWARE4,5,FALSE)","v":""},{"$f":"VLOOKUP($B$60,TS2L7VMWARE4,6,FALSE)","v":0},{"$f":"VLOOKUP($B$60,TS2L7VMWARE4,7,FALSE)*C60*4","v":0}]
[]
[null,"RAID Configuration"]
[null,"C7, Unconfigured RAID for HDDs or SSDs (Mixed Drive Types Allowed)",1,"[780-BCDS]"]
[]
[null,"Controller Dischi"]
[null,"PERC H330 Controller Card",{"$f":"VLOOKUP($B$66,TS2L7RAID,2,FALSE)","v":1},{"$f":"VLOOKUP($B$66,TS2L7RAID,3,FALSE)","v":"[405-AANF]"},{"$f":"VLOOKUP($B$66,TS2L7RAID,4,FALSE)","v":""},{"$f":"VLOOKUP($B$66,TS2L7RAID,5,FALSE)","v":""},{"$f":"VLOOKUP($B$66,TS2L7RAID,6,FALSE)*$C$13","v":0},{"$f":"VLOOKUP($B$66,TS2L7RAID,7,FALSE)*4","v":0}]
[]
[null,"Dischi rigidi (numero massimo per nodo 6)"]
["\n\nSAS 10K","600GB 10K RPM SAS 12Gbps 512n 2.5in Hot-plug Hard Drive",2,"[400-ASGS]","400-AUNQ",{"$f":"IF(C69<=2,\"\",\"TS2L7-10K600\")","v":""},{"$f":"IF(C69<=2,0,(C69-2)*4*'Regole di configurazione'!F17)","v":0}]
[]
[null,"1.2TB 10K RPM SAS 12Gbps 512n 2.5in Hot-plug Hard Drive",0,"[400-ASHI]","400-ATJL",{"$f":"IF(C71=0,\"\",\"TS2L7-10K1200\")","v":""},{"$f":"C71*4*'Regole di configurazione'!F18","v":0}]
[]
["SAS 10K","1800GB 10K RPM SAS 12Gbps  2.5in Hot-plug Hard Drive A20",0,null,null,{"$f":"IF(C73=0,\"\",\"TS2L7-10K1800\")","v":""},null,{"$f":"C73*4*'Regole di configurazione'!G43","v":0}]
[]
[null,"2.4TB 10K RPM SAS 12Gbps 512e 2.5in Hot-plug Hard Drive NO VMWARE A20",0,null,null,{"$f":"IF(C75=0,\"\",\"TS2L7-L7-10K2400\")","v":""},null,{"$f":"C75*4*'Regole di configurazione'!G56","v":0}]
[]
["\n\nSSD SAS RI","480GB SSD SAS Mixed Use 12Gbps 2.5in Hot-Plug Drive A20",0,null,null,{"$f":"IF(C77=0,\"\",\"TS2L7-10K1800\")","v":""},null,{"$f":"C77*4*'Regole di configurazione'!G44","v":0}]
[]
[null,"400GB SSD SAS Write Intensive 12Gbps 512n 2.5in Hot-plug Drive, 10 DWPD A20",0,null,null,{"$f":"IF(C79=0,\"\",\"TS2L7-SSDW400\")","v":""},null,{"$f":"C79*4*'Regole di configurazione'!G55","v":0}]
[]
[null,"1.6TB SSD SAS Write Intensive 12Gb 512n 2.5in Hot-plug Drive, 10 DWPD A20",0,null,null,{"$f":"IF(C81=0,\"\",\"TS2L7-SSDW1600\")","v":""},null,{"$f":"C81*4*'Regole di configurazione'!G54","v":0}]
[]
["SSD","960GB SSD SAS Read Intensive 12Gbps 512e 2.5in Hot-plug Drive, PM5-R, 1 DWPD, 1752 TBW",0,"[400-BBPL]","400-ATLL",{"$f":"IF(C83=0,\"\",\"TS2L7-SSDR960\")","v":""},{"$f":"C83*4*'Regole di configurazione'!F19","v":0}]
[]
[null,"1.92TB SSD SAS Read Intensive 12Gbps 512n 2.5in Hot-plug Drive, PX05SR,1 DWPD,3504 TBW",0,null,"400-ATMZ",{"$f":"IF(C85=0,\"\",\"TS2L7-SSDR1920\")","v":""},{"$f":"C85*4*'Regole di configurazione'!F20","v":0}]
[null,"DISCHI TOTALI NODO",{"$f":"SUM(C69:C85)","v":2},null,null,{"$f":"CONCATENATE(\"DISCHI TOTALI \",C86*4)","v":"DISCHI TOTALI 8"}]
[]
[]
[null,null,null,"[384-BBBL]"]
[]
[null,"NOTE sulla configurazione (CAMPO OBBLIGATORIO)"]
[{"$f":"IF(C86<=6,\"\",\"ERRORE:   Totale n° di dischi superiore al consentito\")","v":""},"Specificare la configurazione RAID per l'installazione del Sistema Operativo, se richiesto.\ne/o\ninserire eventuali note.",null,null,"Specificare la configurazione RAID per l'installazione del Sistema Operativo, se richiesto.\ne/o\ninserire eventuali note.",{"$f":"IF(B92=E92,\"ERRORE:   Compilare il campo NOTE\",\"\")","v":"ERRORE:   Compilare il campo NOTE"}]
[]
[null,"Alimentatore"]
[null,"Dual, Hot-plug, Redundant Power Supply (1+1), 1600W, 250 Volt",1,"[450-AFMQ]"]
[]
[null,"Cavi di alimentazione"]
[null,"Rack Power Cord 2M (C13/C14 10A)",2,"[450-AADY]"]
[]
[null,"PCIe Riser"]
[null,{"$f":"VLOOKUP($B$25,TS2L7CPU,15,FALSE)","v":0},{"$f":"VLOOKUP($B$25,TS2L7CPU,16,FALSE)","v":0},{"$f":"VLOOKUP($B$25,TS2L7CPU,17,FALSE)","v":0},{"$f":"VLOOKUP($B$25,TS2L7CPU,18,FALSE)","v":""}]
[]
[]
[null,"Modulo Doppia SD - Internal Dual SD Module (IDSDM)"]
[null,"None",{"$f":"VLOOKUP(B117,TS2L7IDSDM,2,FALSE)","v":1},{"$f":"VLOOKUP(B105,TS2L7IDSDM,3,FALSE)","v":0},{"$f":"VLOOKUP(B105,TS2L7IDSDM,4,FALSE)","v":0},{"$f":"VLOOKUP(B105,TS2L7IDSDM,5,FALSE)","v":""},{"$f":"VLOOKUP(B105,TS2L7IDSDM,6,FALSE)","v":0},{"$f":"VLOOKUP(B105,TS2L7IDSDM,7,FALSE)","v":0}]
[]
[null,"Embedded Systems Management"]
[null,"iDRAC9,Enterprise",1,"[385-BBKT]"]
[]
[]
[]
[]
[null,"Network Mezzanine Card"]
[null,"Intel X710 Dual Port 10Gb, SFP+, OCP Mezzanine card",1,"[540-BBWC]"]
[]
[null,"Additional Card for PCIe Slot 1 (Full height) (CPU 1)"]
[null,"None",{"$f":"VLOOKUP(B117,TS2L7PCI1,2,FALSE)","v":""},{"$f":"VLOOKUP(B117,TS2L7PCI1,3,FALSE)","v":""},{"$f":"VLOOKUP(B117,TS2L7PCI1,4,FALSE)","v":""},{"$f":"VLOOKUP(B117,TS2L7PCI1,5,FALSE)","v":""},{"$f":"VLOOKUP(B117,TS2L7PCI1,6,FALSE)","v":0},{"$f":"VLOOKUP(B117,TS2L7PCI1,7,FALSE)","v":0}]
[]
[]
[null,"None",{"$f":"VLOOKUP(B120,TS2L7PCI2,2,FALSE)","v":""},{"$f":"VLOOKUP(B120,TS2L7PCI2,3,FALSE)","v":""},{"$f":"VLOOKUP(B120,TS2L7PCI2,4,FALSE)","v":""},{"$f":"VLOOKUP(B120,TS2L7PCI2,5,FALSE)","v":""},{"$f":"VLOOKUP(B120,TS2L7PCI2,6,FALSE)","v":0},{"$f":"VLOOKUP(B120,TS2L7PCI2,7,FALSE)","v":0}]
[]
[null,"Additional Card for PCIe Slot 3 (Full height) (CPU 1)"]
[null,"PERC H730P RAID Controller, 2Gb NV Cache, Adapter, Full Height",{"$f":"VLOOKUP(B123,TS2L7PCI3,2,FALSE)","v":1},{"$f":"VLOOKUP(B123,TS2L7PCI3,3,FALSE)","v":"[405-AAMR]"},{"$f":"VLOOKUP(B123,TS2L7PCI3,4,FALSE)","v":"405-AAMY"},{"$f":"VLOOKUP(B123,TS2L7PCI3,5,FALSE)","v":""},{"$f":"VLOOKUP(B123,TS2L7PCI3,6,FALSE)","v":0},{"$f":"VLOOKUP(B123,TS2L7PCI3,7,FALSE)","v":0}]
[]
[null,"Transceiver per Server NODE"]
[null,"None",{"$f":"IF(B126=TS2L7ASP,\"\",VLOOKUP(B126,TS2L7PCI4,2,FALSE))","v":""},{"$f":"IF(B126=TS2L7ASP,\"\",VLOOKUP(B126,TS2L7PCI4,3,FALSE))","v":""},{"$f":"IF(B126=TS2L7ASP,\"\",VLOOKUP(B126,TS2L7PCI4,4,FALSE))","v":""},{"$f":"IF(B126=TS2L7ASP,\"\",VLOOKUP(B126,TS2L7PCI4,5,FALSE))","v":""},{"$f":"IF(B126=TS2L7ASP,0,VLOOKUP(B126,TS2L7PCI4,6,FALSE))","v":0},{"$f":"IF(B126=TS2L7ASP,0,VLOOKUP(B126,TS2L7PCI4,7,FALSE))","v":0}]
[null,"Coppia Dell Networking, Transceiver, SFP+, SR, 10GbE",0,null,"407-BBZM","TS2L7-10GOT",null,{"$f":"168*C127*4","v":0}]
[]
[null,"Dell Networking, Transceiver, SFP, 1000BASE-T",2,"[407-BBEL]"]
[]
[null,"Additional Card for PCIe Slot 1 (Low height) (CPU 2)"]
[null,"None",{"$f":"IF(B132=TS2L7ASP,\"\",VLOOKUP(B132,TS2L7PCI6,2,FALSE))","v":""},{"$f":"IF(B132=TS2L7ASP,\"\",VLOOKUP(B132,TS2L7PCI6,3,FALSE))","v":""},{"$f":"IF(B132=TS2L7ASP,\"\",VLOOKUP(B132,TS2L7PCI6,4,FALSE))","v":""},{"$f":"IF(B132=TS2L7ASP,\"\",VLOOKUP(B132,TS2L7PCI6,5,FALSE))","v":""},{"$f":"IF(B132=TS2L7ASP,0,VLOOKUP(B132,TS2L7PCI6,6,FALSE))*4","v":0},{"$f":"IF(B132=TS2L7ASP,0,VLOOKUP(B132,TS2L7PCI6,7,FALSE))*4","v":0}]
[]
[null,"Additional Card for PCIe Slot 7 (Full height) (CPU 2) (BOSS controller card Slot)"]
[null,"None",{"$f":"IF(B135=TS2L7ASP,\"\",VLOOKUP(B135,TS2L7PCI7,2,FALSE))","v":""},{"$f":"IF(B135=TS2L7ASP,\"\",VLOOKUP(B135,TS2L7PCI7,3,FALSE))","v":""},{"$f":"IF(B135=TS2L7ASP,\"\",VLOOKUP(B135,TS2L7PCI7,4,FALSE))","v":""},{"$f":"IF(B135=TS2L7ASP,\"\",VLOOKUP(B135,TS2L7PCI7,5,FALSE))","v":""},{"$f":"IF(B135=TS2L7ASP,0,VLOOKUP(B135,TS2L7PCI7,6,FALSE))","v":0},{"$f":"IF(B135=TS2L7ASP,0,VLOOKUP(B135,TS2L7PCI7,7,FALSE))","v":0}]
[]
[null,"Additional Card for PCIe Slot 8 (Full height) (CPU 2)"]
[null,"None",{"$f":"IF(B138=TS2L7ASP,\"\",VLOOKUP(B138,TS2L7PCI8,2,FALSE))","v":""},{"$f":"IF(B138=TS2L7ASP,\"\",VLOOKUP(B138,TS2L7PCI8,3,FALSE))","v":""},{"$f":"IF(B138=TS2L7ASP,\"\",VLOOKUP(B138,TS2L7PCI8,4,FALSE))","v":""},{"$f":"IF(B138=TS2L7ASP,\"\",VLOOKUP(B138,TS2L7PCI8,5,FALSE))","v":""},{"$f":"IF(B138=TS2L7ASP,0,VLOOKUP(B138,TS2L7PCI8,6,FALSE))","v":0},{"$f":"IF(B138=TS2L7ASP,0,VLOOKUP(B138,TS2L7PCI8,7,FALSE))","v":0}]
[]
[null,"Bezel"]
[null,"No Bezel",1]
[null,"MOD,TRAY,LGG,R7425",1,"[350-BBMF]"]
[]
[null,"Quick Sync"]
[null,"No Quick Sync",1,"[350-BBJV]"]
[]
[null,"Rack Rails"]
[null,"PEC Static Rails",1,"[770-BCFZ]"]
[]
[]
[]
[]
[]
[]
[]
[]
[]
[]
[null,"Dell Services: Deployment Services"]
[null,"No Installation Service Selected (Contact Sales rep for more details)",1,"[683-11870]"]
[]
[null,"Channel only - Support Extension"]
[null,"Channel 39M Basic Warranty - Next Business Day",1,"[723-41450]"]
[]
[null,"System Documentation"]
[null,"No Systems Documentation, No OpenManage DVD Kit",1,"[631-AACK]"]
[]
[null,"Shipping Material"]
[null,"PowerEdge R7425 Shipping Material",1,"[343-BBHK]"]
[]
[null,"Shipping"]
[null,"PowerEdge R7425 Shipping EMEA1 (English/French/German/Spanish/Russian/Hebrew)",1,"[340-CBDD]"]
[]
[null,"Direct Attach Cable per ENCLOSURE"]
[null,"5 x Dell Networking, Cable, SFP+ to SFP+, 10GbE, Copper Twinax Direct Attach Cable, 3 Meter",0,null,null,"TS2L7-5XDAC10M3",null,{"$f":"125*C175","v":0}]
[]
[]
[null,"Cavi per ENCLOSURE"]
[null,"Cavo Rete UTP cat. 5e 3 metri",4,null,"ROS1403/G","TS2L7-3MRJ45",null,{"$f":"2*C179","v":8}]
[]
[null,"Estenzione di Garanzia"]
[null,"None",{"$f":"VLOOKUP(B182,TS2L7WARRANTY,2,FALSE)","v":""},{"$f":"VLOOKUP(B182,TS2L7WARRANTY,3,FALSE)","v":""},{"$f":"VLOOKUP(B182,TS2L7WARRANTY,4,FALSE)","v":""},{"$f":"VLOOKUP(B182,TS2L7WARRANTY,5,FALSE)","v":""},{"$f":"VLOOKUP(B182,TS2L7WARRANTY,6,FALSE)","v":0}]
[]
[null,"Warranty Upgrades - Non-Std/Local POS"]
[null,"CSTM CONSIP - 39M Onsite Labor Support for CRU for Servers with Basic Warranty",1,"[681-24467]"]

{"sheet":"Lotto7-2","index":1,"n_rows":186,"n_cols":9,"rows_kept":186,"cut":false,"hidden":false,"merged":[[91,1,91,2],[46,0,50,0],[0,5,1,5],[4,0,4,4]]}
[null,"TOTALE PRODOTTI CONVENZIONE",{"$f":"SUM(G13:G195)*$C$10","v":0},null,null,{"$f":"IF(I1+I2=0,(C1+C2),\"ERRORE VERIFICARE LA CONFIGURAZIONE\")","v":0},null,null,{"$f":"IF(A47=\"\",0,1)","v":0}]
[null,"TOTALE ARTICOLI 20%",{"$f":"SUM(H13:H195)*$C$10","v":0},null,null,null,null,null,{"$f":"IF(A90=\"\",0,1)","v":0}]
[null,"Quantità Server",0,null,null,{"$f":"Riepilogo!T6","v":"ver. 2.0"}]
[]
["POWEREDGE C6420"]
[]
[]
[]
[]
[null,"Quantità:",{"$f":"C3","v":0}]
[]
[null,"Modello Server"]
[null,"PowerEdge C6420",4,"[210-ALBP]",null,"TS2L7-SRV",8625]
[]
[null,"Configurazione dello chassis"]
[null,"PowerEdge C6420, 2.5 Direct Chassis",1,"[321-BCZE]"]
[]
[null,"Trusted Platform Module"]
[null,"No Trusted Platform Module",1,"[461-AADZ]"]
[]
[null,"Processore"]
[null,"Intel® Xeon® Gold 5120 2.2G, 14C/28T, 10.4GT/s, 19M Cache, Turbo, HT (105W) DDR4-2400",1,"[338-BLUX]"]
[]
[null,"Processore aggiuntivo"]
[null,"No Additional Processor",{"$f":"VLOOKUP($B$25,TS2L7CPU,2,FALSE)","v":0},{"$f":"VLOOKUP($B$25,TS2L7CPU,3,FALSE)","v":"[374-BBBX]"},{"$f":"VLOOKUP($B$25,TS2L7CPU,4,FALSE)","v":""},{"$f":"VLOOKUP($B$25,TS2L7CPU,5,FALSE)","v":""},{"$f":"VLOOKUP($B$25,TS2L7CPU,6,FALSE)*$C$13","v":0},{"$f":"VLOOKUP($B$25,TS2L7CPU,7,FALSE)","v":""}]
[]
[null,"Configurazione Termica del Processore"]
[null,{"$f":"VLOOKUP($B$25,TS2L7CPU,8,FALSE)","v":"C6420 Heatsink"},{"$f":"VLOOKUP($B$25,TS2L7CPU,9,FALSE)","v":1},{"$f":"VLOOKUP($B$25,TS2L7CPU,10,FALSE)","v":"[412-AAIX]"},{"$f":"VLOOKUP($B$25,TS2L7CPU,11,FALSE)","v":0}]
[null,{"$f":"VLOOKUP($B$25,TS2L7CPU,12,FALSE)","v":0},{"$f":"VLOOKUP($B$25,TS2L7CPU,13,FALSE)","v":0},{"$f":"VLOOKUP($B$25,TS2L7CPU,14,FALSE)","v":0}]
[]
[]
[null,"Memoria Totale in GB","64     (DIMM 32GB)"]
[]
[null,"Tipo di configurazione memoria"]
[null,"Performance Optimized",1,"[370-AAIP]"]
[]
[null,"Tipo e velocità della memoria DIMM"]
[null,{"$f":"IF($C$25=0,VLOOKUP($C$32,TS2L7MEM1CPU,9,FALSE),VLOOKUP($C$32,TS2L7MEM2CPU,9,FALSE))","v":"2666MT/s RDIMMs"},{"$f":"IF($C$25=0,VLOOKUP($C$32,TS2L7MEM1CPU,10,FALSE),VLOOKUP($C$32,TS2L7MEM2CPU,10,FALSE))","v":1},{"$f":"IF($C$25=0,VLOOKUP($C$32,TS2L7MEM1CPU,11,FALSE),VLOOKUP($C$32,TS2L7MEM2CPU,11,FALSE))","v":"[370-ADNU]"}]
[]
[null,"Capacità di memoria"]
[null,{"$f":"IF($C$25=0,VLOOKUP($C$32,TS2L7MEM1CPU,2,FALSE),VLOOKUP($C$32,TS2L7MEM2CPU,2,FALSE))","v":"32GB RDIMM, 2666MT/s, Dual Rank"},{"$f":"IF($C$25=0,VLOOKUP($C$32,TS2L7MEM1CPU,3,FALSE),VLOOKUP($C$32,TS2L7MEM2CPU,3,FALSE))","v":2},{"$f":"IF($C$25=0,VLOOKUP($C$32,TS2L7MEM1CPU,4,FALSE),VLOOKUP($C$32,TS2L7MEM2CPU,4,FALSE))","v":"[370-ADNF]"},{"$f":"IF($C$25=0,VLOOKUP($C$32,TS2L7MEM1CPU,5,FALSE),VLOOKUP($C$32,TS2L7MEM2CPU,5,FALSE))","v":"A9781929"},{"$f":"IF($C$25=0,VLOOKUP($C$32,TS2L7MEM1CPU,6,FALSE),VLOOKUP($C$32,TS2L7MEM2CPU,6,FALSE))","v":""},{"$f":"IF($C$25=0,VLOOKUP($C$32,TS2L7MEM1CPU,7,FALSE),VLOOKUP($C$32,TS2L7MEM2CPU,7,FALSE))*$C$13","v":0}]
[]
[null,"Sistema operativo preinstallato"]
[null,"None",{"$f":"VLOOKUP($B$44,TS2L7OS,2,FALSE)","v":""},{"$f":"VLOOKUP($B$44,TS2L7OS,3,FALSE)","v":"[619-ABVR]"},{"$f":"VLOOKUP($B$44,TS2L7OS,4,FALSE)","v":0},{"$f":"VLOOKUP($B$44,TS2L7OS,5,FALSE)","v":""},{"$f":"VLOOKUP($B$44,TS2L7OS,6,FALSE)*$C$13","v":0},{"$f":"VLOOKUP($B$44,TS2L7OS,7,FALSE)","v":""},{"$f":"IF(E44=0,1,0)","v":1}]
[null,{"$f":"IF($C$25=0,\"\",VLOOKUP($B$44,TS2L7OS,8,FALSE))","v":""},{"$f":"IF($C$25=0,\"\",VLOOKUP($B$44,TS2L7OS,9,FALSE))","v":""},{"$f":"IF($C$25=0,\"\",VLOOKUP($B$44,TS2L7OS,10,FALSE))","v":""},{"$f":"IF($C$25=0,\"\",VLOOKUP($B$44,TS2L7OS,11,FALSE))","v":""},{"$f":"IF($C$25=0,\"\",VLOOKUP($B$44,TS2L7OS,12,FALSE))","v":""},{"$f":"IF($C$25=0,0,VLOOKUP($B$44,TS2L7OS,13,FALSE))*$C$13","v":0}]
[]
[{"$f":"IF((I44*I48)=0,\"\",\"ERRORE: \nLa selezione di licenze CAL senza il Sistema Operativo Microsoft Windows non è consentita.\")","v":""},"Client Access Licenses"]
[null,{"$f":"IF($E$44>0,'Regole di configurazione'!A93,\"\")","v":""},0,{"$f":"IF($E$44>0,'Regole di configurazione'!C93,\"\")","v":""},{"$f":"IF($E$44>0,'Regole di configurazione'!D93,\"\")","v":""},{"$f":"IF($E$44>0,'Regole di configurazione'!E93,\"\")","v":""},{"$f":"IF($E$44>0,'Regole di configurazione'!F93,0)*C48","v":0},{"$f":"IF($E$44>0,'Regole di configurazione'!G93,\"\")","v":""},{"$f":"C48+C50","v":0}]
[]
[null,{"$f":"IF($E$44>0,'Regole di configurazione'!A94,\"\")","v":""},0,{"$f":"IF($E$44>0,'Regole di configurazione'!C94,\"\")","v":""},{"$f":"IF($E$44>0,'Regole di configurazione'!D94,\"\")","v":""},{"$f":"IF($E$44>0,'Regole di configurazione'!E94,\"\")","v":""},{"$f":"IF($E$44>0,'Regole di configurazione'!F94,0)*C50","v":0},{"$f":"IF($E$44>0,'Regole di configurazione'!G94,\"\")","v":""}]
[]
[null,"Sistema operativo VMware"]
[]
[null,"None"]
[]
[null,"None"]
[null,"Vmware vSphere Standard/Enterprise"]
[null,"None",{"$f":"(VLOOKUP($B$58,TS2L7VMWARE3,2,FALSE))+C25","v":0},{"$f":"VLOOKUP($B$58,TS2L7VMWARE3,3,FALSE)","v":""},{"$f":"VLOOKUP($B$58,TS2L7VMWARE3,4,FALSE)","v":""},{"$f":"VLOOKUP($B$58,TS2L7VMWARE3,5,FALSE)","v":""},{"$f":"VLOOKUP($B$58,TS2L7VMWARE3,6,FALSE)","v":0},{"$f":"VLOOKUP($B$58,TS2L7VMWARE3,7,FALSE)*C58*4","v":0}]
[null,"VMware vSAN"]
[null,"None",{"$f":"(VLOOKUP($B$60,TS2L7VMWARE4,2,FALSE))+C25","v":0},{"$f":"VLOOKUP($B$60,TS2L7VMWARE4,3,FALSE)","v":""},{"$f":"VLOOKUP($B$60,TS2L7VMWARE4,4,FALSE)","v":""},{"$f":"VLOOKUP($B$60,TS2L7VMWARE4,5,FALSE)","v":""},{"$f":"VLOOKUP($B$60,TS2L7VMWARE4,6,FALSE)","v":0},{"$f":"VLOOKUP($B$60,TS2L7VMWARE4,7,FALSE)*C60*4","v":0}]
[]
[null,"RAID Configuration"]
[null,"C7, Unconfigured RAID for HDDs or SSDs (Mixed Drive Types Allowed)",1,"[780-BCDS]"]
[]
[null,"Controller Dischi"]
[null,"PERC H330 Controller Card",{"$f":"VLOOKUP($B$66,TS2L7RAID,2,FALSE)","v":1},{"$f":"VLOOKUP($B$66,TS2L7RAID,3,FALSE)","v":"[405-AANF]"},{"$f":"VLOOKUP($B$66,TS2L7RAID,4,FALSE)","v":""},{"$f":"VLOOKUP($B$66,TS2L7RAID,5,FALSE)","v":""},{"$f":"VLOOKUP($B$66,TS2L7RAID,6,FALSE)*$C$13","v":0},{"$f":"VLOOKUP($B$66,TS2L7RAID,7,FALSE)*4","v":0}]
[]
[null,"Dischi rigidi (numero massimo per nodo 6)"]
["\n\nSAS 10K","600GB 10K RPM SAS 12Gbps 512n 2.5in Hot-plug Hard Drive",2,"[400-ASGS]","400-AUNQ",{"$f":"IF(C69<=2,\"\",\"TS2L7-10K600\")","v":""},{"$f":"IF(C69<=2,0,(C69-2)*4*'Regole di configurazione'!F17)","v":0}]
[null,"PERC H330 Controller Card"]
[null,"1.2TB 10K RPM SAS 12Gbps 512n 2.5in Hot-plug Hard Drive",0,"[400-ASHI]","400-ATJL",{"$f":"IF(C71=0,\"\",\"TS2L7-10K1200\")","v":""},{"$f":"C71*4*'Regole di configurazione'!F18","v":0}]
[]
["SAS 10K","1800GB 10K RPM SAS 12Gbps  2.5in Hot-plug Hard Drive A20",0,null,null,{"$f":"IF(C73=0,\"\",\"TS2L7-10K1800\")","v":""},null,{"$f":"C73*4*'Regole di configurazione'!G43","v":0}]
[]
[null,"2.4TB 10K RPM SAS 12Gbps 512e 2.5in Hot-plug Hard Drive NO VMWARE A20",0,null,null,{"$f":"IF(C75=0,\"\",\"TS2L7-L7-10K2400\")","v":""},null,{"$f":"C75*4*'Regole di configurazione'!G56","v":0}]
[]
["\n\nSSD SAS RI","480GB SSD SAS Mixed Use 12Gbps 2.5in Hot-Plug Drive A20",0,null,null,{"$f":"IF(C77=0,\"\",\"TS2L7-10K1800\")","v":""},null,{"$f":"C77*4*'Regole di configurazione'!G44","v":0}]
[]
[null,"400GB SSD SAS Write Intensive 12Gbps 512n 2.5in Hot-plug Drive, 10 DWPD A20",0,null,null,{"$f":"IF(C79=0,\"\",\"TS2L7-SSDW400\")","v":""},null,{"$f":"C79*4*'Regole di configurazione'!G55","v":0}]
[]
[null,"1.6TB SSD SAS Write Intensive 12Gb 512n 2.5in Hot-plug Drive, 10 DWPD A20",0,null,null,{"$f":"IF(C81=0,\"\",\"TS2L7-SSDW1600\")","v":""},null,{"$f":"C81*4*'Regole di configurazione'!G54","v":0}]
[]
["SSD","960GB SSD SAS Read Intensive 12Gbps 512e 2.5in Hot-plug Drive, PM5-R, 1 DWPD, 1752 TBW",0,"[400-BBPL]","400-ATLL",{"$f":"IF(C83=0,\"\",\"TS2L7-SSDR960\")","v":""},{"$f":"C83*4*'Regole di configurazione'!F19","v":0}]
[]
[null,"1.92TB SSD SAS Read Intensive 12Gbps 512n 2.5in Hot-plug Drive, PX05SR,1 DWPD,3504 TBW",0,null,"400-ATMZ",{"$f":"IF(C85=0,\"\",\"TS2L7-SSDR1920\")","v":""},{"$f":"C85*4*'Regole di configurazione'!F20","v":0}]
[null,"DISCHI TOTALI NODO",{"$f":"SUM(C69:C85)","v":2},null,null,{"$f":"CONCATENATE(\"DISCHI TOTALI \",C86*4)","v":"DISCHI TOTALI 8"}]
[null,null,0]
[]
[null,null,0,"[384-BBBL]"]
[]
[null,"NOTE sulla configurazione (CAMPO OBBLIGATORIO)"]
[{"$f":"IF(C86<=6,\"\",\"ERRORE:   Totale n° di dischi superiore al consentito\")","v":""},"Specificare la configurazione RAID per l'installazione del Sistema Operativo, se richiesto.\ne/o\ninserire eventuali note.",null,null,"Specificare la configurazione RAID per l'installazione del Sistema Operativo, se richiesto.\ne/o\ninserire eventuali note.",{"$f":"IF(B92=E92,\"ERRORE:   Compilare il campo NOTE\",\"\")","v":"ERRORE:   Compilare il campo NOTE"}]
[]
[null,"Alimentatore"]
[null,"Dual, Hot-plug, Redundant Power Supply (1+1), 1600W, 250 Volt",1,"[450-AFMQ]"]
[]
[null,"Cavi di alimentazione"]
[null,"Rack Power Cord 2M (C13/C14 10A)",2,"[450-AADY]"]
[]
[null,"PCIe Riser"]
[null,{"$f":"VLOOKUP($B$25,TS2L7CPU,15,FALSE)","v":0},{"$f":"VLOOKUP($B$25,TS2L7CPU,16,FALSE)","v":0},{"$f":"VLOOKUP($B$25,TS2L7CPU,17,FALSE)","v":0},{"$f":"VLOOKUP($B$25,TS2L7CPU,18,FALSE)","v":""}]
[]
[]
[null,"Modulo Doppia SD - Internal Dual SD Module (IDSDM)"]
[null,"None",{"$f":"VLOOKUP(B117,TS2L7IDSDM,2,FALSE)","v":1},{"$f":"VLOOKUP(B105,TS2L7IDSDM,3,FALSE)","v":0},{"$f":"VLOOKUP(B105,TS2L7IDSDM,4,FALSE)","v":0},{"$f":"VLOOKUP(B105,TS2L7IDSDM,5,FALSE)","v":""},{"$f":"VLOOKUP(B105,TS2L7IDSDM,6,FALSE)","v":0},{"$f":"VLOOKUP(B105,TS2L7IDSDM,7,FALSE)","v":0}]
[]
[null,"Embedded Systems Management"]
[null,"iDRAC9,Enterprise",1,"[385-BBKT]"]
[]
[]
[]
[]
[null,"Network Mezzanine Card"]
[null,"Intel X710 Dual Port 10Gb, SFP+, OCP Mezzanine card",1,"[540-BBWC]"]
[]
[null,"Additional Card for PCIe Slot 1 (Full height) (CPU 1)"]
[null,"None",{"$f":"VLOOKUP(B117,TS2L7PCI1,2,FALSE)","v":""},{"$f":"VLOOKUP(B117,TS2L7PCI1,3,FALSE)","v":""},{"$f":"VLOOKUP(B117,TS2L7PCI1,4,FALSE)","v":""},{"$f":"VLOOKUP(B117,TS2L7PCI1,5,FALSE)","v":""},{"$f":"VLOOKUP(B117,TS2L7PCI1,6,FALSE)","v":0},{"$f":"VLOOKUP(B117,TS2L7PCI1,7,FALSE)","v":0}]
[]
[null,"Additional Card for PCIe Slot 2 (Full height) (CPU 1)"]
[null,"None",{"$f":"VLOOKUP(B120,TS2L7PCI2,2,FALSE)","v":""},{"$f":"VLOOKUP(B120,TS2L7PCI2,3,FALSE)","v":""},{"$f":"VLOOKUP(B120,TS2L7PCI2,4,FALSE)","v":""},{"$f":"VLOOKUP(B120,TS2L7PCI2,5,FALSE)","v":""},{"$f":"VLOOKUP(B120,TS2L7PCI2,6,FALSE)","v":0},{"$f":"VLOOKUP(B120,TS2L7PCI2,7,FALSE)","v":0}]
[]
[null,"Additional Card for PCIe Slot 3 (Full height) (CPU 1)"]
[null,"PERC H730P RAID Controller, 2Gb NV Cache, Adapter, Full Height",{"$f":"VLOOKUP(B123,TS2L7PCI3,2,FALSE)","v":1},{"$f":"VLOOKUP(B123,TS2L7PCI3,3,FALSE)","v":"[405-AAMR]"},{"$f":"VLOOKUP(B123,TS2L7PCI3,4,FALSE)","v":"405-AAMY"},{"$f":"VLOOKUP(B123,TS2L7PCI3,5,FALSE)","v":""},{"$f":"VLOOKUP(B123,TS2L7PCI3,6,FALSE)","v":0},{"$f":"VLOOKUP(B123,TS2L7PCI3,7,FALSE)","v":0}]
[]
[null,"Transceiver per Server NODE"]
[null,"None",{"$f":"IF(B126=TS2L7ASP,\"\",VLOOKUP(B126,TS2L7PCI4,2,FALSE))","v":""},{"$f":"IF(B126=TS2L7ASP,\"\",VLOOKUP(B126,TS2L7PCI4,3,FALSE))","v":""},{"$f":"IF(B126=TS2L7ASP,\"\",VLOOKUP(B126,TS2L7PCI4,4,FALSE))","v":""},{"$f":"IF(B126=TS2L7ASP,\"\",VLOOKUP(B126,TS2L7PCI4,5,FALSE))","v":""},{"$f":"IF(B126=TS2L7ASP,0,VLOOKUP(B126,TS2L7PCI4,6,FALSE))","v":0},{"$f":"IF(B126=TS2L7ASP,0,VLOOKUP(B126,TS2L7PCI4,7,FALSE))","v":0}]
[null,"Coppia Dell Networking, Transceiver, SFP+, SR, 10GbE",0,null,"407-BBZM","TS2L7-10GOT",null,{"$f":"168*C127*4","v":0}]
[]
[null,"Dell Networking, Transceiver, SFP, 1000BASE-T",2,"[407-BBEL]"]
[]
[null,"Additional Card for PCIe Slot 1 (Low height) (CPU 2)",0]
[null,"None",{"$f":"IF(B132=TS2L7ASP,\"\",VLOOKUP(B132,TS2L7PCI6,2,FALSE))","v":""},{"$f":"IF(B132=TS2L7ASP,\"\",VLOOKUP(B132,TS2L7PCI6,3,FALSE))","v":""},{"$f":"IF(B132=TS2L7ASP,\"\",VLOOKUP(B132,TS2L7PCI6,4,FALSE))","v":""},{"$f":"IF(B132=TS2L7ASP,\"\",VLOOKUP(B132,TS2L7PCI6,5,FALSE))","v":""},{"$f":"IF(B132=TS2L7ASP,0,VLOOKUP(B132,TS2L7PCI6,6,FALSE))*4","v":0},{"$f":"IF(B132=TS2L7ASP,0,VLOOKUP(B132,TS2L7PCI6,7,FALSE))*4","v":0}]
[]
[null,"Additional Card for PCIe Slot 7 (Full height) (CPU 2) (BOSS controller card Slot)"]
[null,"None",{"$f":"IF(B135=TS2L7ASP,\"\",VLOOKUP(B135,TS2L7PCI7,2,FALSE))","v":""},{"$f":"IF(B135=TS2L7ASP,\"\",VLOOKUP(B135,TS2L7PCI7,3,FALSE))","v":""},{"$f":"IF(B135=TS2L7ASP,\"\",VLOOKUP(B135,TS2L7PCI7,4,FALSE))","v":""},{"$f":"IF(B135=TS2L7ASP,\"\",VLOOKUP(B135,TS2L7PCI7,5,FALSE))","v":""},{"$f":"IF(B135=TS2L7ASP,0,VLOOKUP(B135,TS2L7PCI7,6,FALSE))","v":0},{"$f":"IF(B135=TS2L7ASP,0,VLOOKUP(B135,TS2L7PCI7,7,FALSE))","v":0}]
[null,"None"]
[null,"Additional Card for PCIe Slot 8 (Full height) (CPU 2)"]
[null,"None",{"$f":"IF(B138=TS2L7ASP,\"\",VLOOKUP(B138,TS2L7PCI8,2,FALSE))","v":""},{"$f":"IF(B138=TS2L7ASP,\"\",VLOOKUP(B138,TS2L7PCI8,3,FALSE))","v":""},{"$f":"IF(B138=TS2L7ASP,\"\",VLOOKUP(B138,TS2L7PCI8,4,FALSE))","v":""},{"$f":"IF(B138=TS2L7ASP,\"\",VLOOKUP(B138,TS2L7PCI8,5,FALSE))","v":""},{"$f":"IF(B138=TS2L7ASP,0,VLOOKUP(B138,TS2L7PCI8,6,FALSE))","v":0},{"$f":"IF(B138=TS2L7ASP,0,VLOOKUP(B138,TS2L7PCI8,7,FALSE))","v":0}]
[]
[null,"Bezel"]
[null,"No Bezel",1]
[null,"MOD,TRAY,LGG,R7425",1,"[350-BBMF]"]
[]
[null,"Quick Sync"]
[null,"No Quick Sync",1,"[350-BBJV]"]
[]
[null,"Rack Rails"]
[null,"PEC Static Rails",1,"[770-BCFZ]"]
[]
[]
[]
[]
[]
[]
[]
[]
[]
[]
[null,"Dell Services: Deployment Services"]
[null,"No Installation Service Selected (Contact Sales rep for more details)",1,"[683-11870]"]
[]
[null,"Channel only - Support Extension"]
[null,"Channel 39M Basic Warranty - Next Business Day",1,"[723-41450]"]
[]
[null,"System Documentation"]
[null,"No Systems Documentation, No OpenManage DVD Kit",1,"[631-AACK]"]
[]
[null,"Shipping Material"]
[null,"PowerEdge R7425 Shipping Material",1,"[343-BBHK]"]
[]
[null,"Shipping"]
[null,"PowerEdge R7425 Shipping EMEA1 (English/French/German/Spanish/Russian/Hebrew)",1,"[340-CBDD]"]
[]
[null,"Direct Attach Cable per ENCLOSURE"]
[null,"5 x Dell Networking, Cable, SFP+ to SFP+, 10GbE, Copper Twinax Direct Attach Cable, 3 Meter",0,null,null,"TS2L7-5XDAC10M3",null,{"$f":"125*C175","v":0}]
[]
[]
[null,"Cavi per ENCLOSURE"]
[null,"Cavo Rete UTP cat. 5e 3 metri",4,null,"ROS1403/G","TS2L7-3MRJ45",null,{"$f":"2*C179","v":8}]
[]
[null,"Estenzione di Garanzia"]
[null,"None",{"$f":"VLOOKUP(B182,TS2L7WARRANTY,2,FALSE)","v":""},{"$f":"VLOOKUP(B182,TS2L7WARRANTY,3,FALSE)","v":""},{"$f":"VLOOKUP(B182,TS2L7WARRANTY,4,FALSE)","v":""},{"$f":"VLOOKUP(B182,TS2L7WARRANTY,5,FALSE)","v":""},{"$f":"VLOOKUP(B182,TS2L7WARRANTY,6,FALSE)","v":0}]
[null,null,4]
[null,"Warranty Upgrades - Non-Std/Local POS"]
[null,"CSTM CONSIP - 39M Onsite Labor Support for CRU for Servers with Basic Warranty",1,"[681-24467]"]
[null,"None"]

{"sheet":"Lotto7-3","index":2,"n_rows":185,"n_cols":9,"rows_kept":185,"cut":false,"hidden":false,"merged":[[91,1,91,2],[46,0,50,0],[0,5,1,5],[4,0,4,4]]}
[null,"TOTALE PRODOTTI CONVENZIONE",{"$f":"SUM(G13:G195)*$C$10","v":0},null,null,{"$f":"IF(I1+I2=0,(C1+C2),\"ERRORE VERIFICARE LA CONFIGURAZIONE\")","v":0},null,null,{"$f":"IF(A47=\"\",0,1)","v":0}]
[null,"TOTALE ARTICOLI 20%",{"$f":"SUM(H13:H195)*$C$10","v":0},null,null,null,null,null,{"$f":"IF(A92=\"\",0,1)","v":0}]
[null,"Quantità Server",0,null,null,{"$f":"Riepilogo!T6","v":"ver. 2.0"}]
[]
["POWEREDGE C6420"]
[]
[]
[]
[]
[null,"Quantità:",{"$f":"C3","v":0}]
[]
[null,"Modello Server"]
[null,"PowerEdge C6420",4,"[210-ALBP]",null,"TS2L7-SRV",8625]
[]
[null,"Configurazione dello chassis"]
[null,"PowerEdge C6420, 2.5 Direct Chassis",1,"[321-BCZE]"]
[]
[null,"Trusted Platform Module"]
[null,"No Trusted Platform Module",1,"[461-AADZ]"]
[]
[null,"Processore"]
[null,"Intel® Xeon® Gold 5120 2.2G, 14C/28T, 10.4GT/s, 19M Cache, Turbo, HT (105W) DDR4-2400",1,"[338-BLUX]"]
[]
[null,"Processore aggiuntivo"]
[null,"No Additional Processor",{"$f":"VLOOKUP($B$25,TS2L7CPU,2,FALSE)","v":0},{"$f":"VLOOKUP($B$25,TS2L7CPU,3,FALSE)","v":"[374-BBBX]"},{"$f":"VLOOKUP($B$25,TS2L7CPU,4,FALSE)","v":""},{"$f":"VLOOKUP($B$25,TS2L7CPU,5,FALSE)","v":""},{"$f":"VLOOKUP($B$25,TS2L7CPU,6,FALSE)*$C$13","v":0},{"$f":"VLOOKUP($B$25,TS2L7CPU,7,FALSE)","v":""}]
[]
[null,"Configurazione Termica del Processore"]
[null,{"$f":"VLOOKUP($B$25,TS2L7CPU,8,FALSE)","v":"C6420 Heatsink"},{"$f":"VLOOKUP($B$25,TS2L7CPU,9,FALSE)","v":1},{"$f":"VLOOKUP($B$25,TS2L7CPU,10,FALSE)","v":"[412-AAIX]"},{"$f":"VLOOKUP($B$25,TS2L7CPU,11,FALSE)","v":0}]
[null,{"$f":"VLOOKUP($B$25,TS2L7CPU,12,FALSE)","v":0},{"$f":"VLOOKUP($B$25,TS2L7CPU,13,FALSE)","v":0},{"$f":"VLOOKUP($B$25,TS2L7CPU,14,FALSE)","v":0}]
[]
[]
[null,"Memoria Totale in GB","64     (DIMM 32GB)"]
[]
[null,"Tipo di configurazione memoria"]
[null,"Performance Optimized",1,"[370-AAIP]"]
[]
[null,"Tipo e velocità della memoria DIMM"]
[null,{"$f":"IF($C$25=0,VLOOKUP($C$32,TS2L7MEM1CPU,9,FALSE),VLOOKUP($C$32,TS2L7MEM2CPU,9,FALSE))","v":"2666MT/s RDIMMs"},{"$f":"IF($C$25=0,VLOOKUP($C$32,TS2L7MEM1CPU,10,FALSE),VLOOKUP($C$32,TS2L7MEM2CPU,10,FALSE))","v":1},{"$f":"IF($C$25=0,VLOOKUP($C$32,TS2L7MEM1CPU,11,FALSE),VLOOKUP($C$32,TS2L7MEM2CPU,11,FALSE))","v":"[370-ADNU]"}]
[]
[null,"Capacità di memoria"]
[null,{"$f":"IF($C$25=0,VLOOKUP($C$32,TS2L7MEM1CPU,2,FALSE),VLOOKUP($C$32,TS2L7MEM2CPU,2,FALSE))","v":"32GB RDIMM, 2666MT/s, Dual Rank"},{"$f":"IF($C$25=0,VLOOKUP($C$32,TS2L7MEM1CPU,3,FALSE),VLOOKUP($C$32,TS2L7MEM2CPU,3,FALSE))","v":2},{"$f":"IF($C$25=0,VLOOKUP($C$32,TS2L7MEM1CPU,4,FALSE),VLOOKUP($C$32,TS2L7MEM2CPU,4,FALSE))","v":"[370-ADNF]"},{"$f":"IF($C$25=0,VLOOKUP($C$32,TS2L7MEM1CPU,5,FALSE),VLOOKUP($C$32,TS2L7MEM2CPU,5,FALSE))","v":"A9781929"},{"$f":"IF($C$25=0,VLOOKUP($C$32,TS2L7MEM1CPU,6,FALSE),VLOOKUP($C$32,TS2L7MEM2CPU,6,FALSE))","v":""},{"$f":"IF($C$25=0,VLOOKUP($C$32,TS2L7MEM1CPU,7,FALSE),VLOOKUP($C$32,TS2L7MEM2CPU,7,FALSE))*$C$13","v":0}]
[]
[null,"Sistema operativo preinstallato"]
[null,"None",{"$f":"VLOOKUP($B$44,TS2L7OS,2,FALSE)","v":""},{"$f":"VLOOKUP($B$44,TS2L7OS,3,FALSE)","v":"[619-ABVR]"},{"$f":"VLOOKUP($B$44,TS2L7OS,4,FALSE)","v":0},{"$f":"VLOOKUP($B$44,TS2L7OS,5,FALSE)","v":""},{"$f":"VLOOKUP($B$44,TS2L7OS,6,FALSE)*$C$13","v":0},{"$f":"VLOOKUP($B$44,TS2L7OS,7,FALSE)","v":""},{"$f":"IF(E44=0,1,0)","v":1}]
[null,{"$f":"IF($C$25=0,\"\",VLOOKUP($B$44,TS2L7OS,8,FALSE))","v":""},{"$f":"IF($C$25=0,\"\",VLOOKUP($B$44,TS2L7OS,9,FALSE))","v":""},{"$f":"IF($C$25=0,\"\",VLOOKUP($B$44,TS2L7OS,10,FALSE))","v":""},{"$f":"IF($C$25=0,\"\",VLOOKUP($B$44,TS2L7OS,11,FALSE))","v":""},{"$f":"IF($C$25=0,\"\",VLOOKUP($B$44,TS2L7OS,12,FALSE))","v":""},{"$f":"IF($C$25=0,0,VLOOKUP($B$44,TS2L7OS,13,FALSE))*$C$13","v":0}]
[]
[{"$f":"IF((I44*I48)=0,\"\",\"ERRORE: \nLa selezione di licenze CAL senza il Sistema Operativo Microsoft Windows non è consentita.\")","v":""},"Client Access Licenses"]
[null,{"$f":"IF($E$44>0,'Regole di configurazione'!A93,\"\")","v":""},0,{"$f":"IF($E$44>0,'Regole di configurazione'!C93,\"\")","v":""},{"$f":"IF($E$44>0,'Regole di configurazione'!D93,\"\")","v":""},{"$f":"IF($E$44>0,'Regole di configurazione'!E93,\"\")","v":""},{"$f":"IF($E$44>0,'Regole di configurazione'!F93,0)*C48","v":0},{"$f":"IF($E$44>0,'Regole di configurazione'!G93,\"\")","v":""},{"$f":"C48+C50","v":0}]
[]
[null,{"$f":"IF($E$44>0,'Regole di configurazione'!A94,\"\")","v":""},0,{"$f":"IF($E$44>0,'Regole di configurazione'!C94,\"\")","v":""},{"$f":"IF($E$44>0,'Regole di configurazione'!D94,\"\")","v":""},{"$f":"IF($E$44>0,'Regole di configurazione'!E94,\"\")","v":""},{"$f":"IF($E$44>0,'Regole di configurazione'!F94,0)*C50","v":0},{"$f":"IF($E$44>0,'Regole di configurazione'!G94,\"\")","v":""}]
[]
[null,"Sistema operativo VMware"]
[null,"Vmware vSphere Essentials Plus Kit"]
[null,"None",{"$f":"VLOOKUP($B$54,TS2L7VMWARE1,2,FALSE)","v":1},{"$f":"VLOOKUP($B$54,TS2L7VMWARE1,3,FALSE)","v":""},{"$f":"VLOOKUP($B$54,TS2L7VMWARE1,4,FALSE)","v":""},{"$f":"VLOOKUP($B$54,TS2L7VMWARE1,5,FALSE)","v":""},{"$f":"VLOOKUP($B$54,TS2L7VMWARE1,6,FALSE)","v":0},{"$f":"VLOOKUP($B$54,TS2L7VMWARE1,7,FALSE)*C54","v":0}]
[null,"VMware vCenter Server Standard"]
[null,"None",{"$f":"VLOOKUP($B$56,TS2L7VMWARE2,2,FALSE)","v":1},{"$f":"VLOOKUP($B$56,TS2L7VMWARE2,3,FALSE)","v":""},{"$f":"VLOOKUP($B$56,TS2L7VMWARE2,4,FALSE)","v":""},{"$f":"VLOOKUP($B$56,TS2L7VMWARE2,5,FALSE)","v":""},{"$f":"VLOOKUP($B$56,TS2L7VMWARE2,6,FALSE)","v":0},{"$f":"VLOOKUP($B$56,TS2L7VMWARE2,7,FALSE)*C56","v":0}]
[null,"Vmware vSphere Standard/Enterprise"]
[null,"None",{"$f":"(VLOOKUP($B$58,TS2L7VMWARE3,2,FALSE))+C25","v":0},{"$f":"VLOOKUP($B$58,TS2L7VMWARE3,3,FALSE)","v":""},{"$f":"VLOOKUP($B$58,TS2L7VMWARE3,4,FALSE)","v":""},{"$f":"VLOOKUP($B$58,TS2L7VMWARE3,5,FALSE)","v":""},{"$f":"VLOOKUP($B$58,TS2L7VMWARE3,6,FALSE)","v":0},{"$f":"VLOOKUP($B$58,TS2L7VMWARE3,7,FALSE)*C58*4","v":0}]
[null,"VMware vSAN"]
[null,"None",{"$f":"(VLOOKUP($B$60,TS2L7VMWARE4,2,FALSE))+C25","v":0},{"$f":"VLOOKUP($B$60,TS2L7VMWARE4,3,FALSE)","v":""},{"$f":"VLOOKUP($B$60,TS2L7VMWARE4,4,FALSE)","v":""},{"$f":"VLOOKUP($B$60,TS2L7VMWARE4,5,FALSE)","v":""},{"$f":"VLOOKUP($B$60,TS2L7VMWARE4,6,FALSE)","v":0},{"$f":"VLOOKUP($B$60,TS2L7VMWARE4,7,FALSE)*C60*4","v":0}]
[]
[null,"RAID Configuration"]
[null,"C7, Unconfigured RAID for HDDs or SSDs (Mixed Drive Types Allowed)",1,"[780-BCDS]"]
[]
[null,"Controller Dischi"]
[null,"PERC H330 Controller Card",{"$f":"VLOOKUP($B$66,TS2L7RAID,2,FALSE)","v":1},{"$f":"VLOOKUP($B$66,TS2L7RAID,3,FALSE)","v":"[405-AANF]"},{"$f":"VLOOKUP($B$66,TS2L7RAID,4,FALSE)","v":""},{"$f":"VLOOKUP($B$66,TS2L7RAID,5,FALSE)","v":""},{"$f":"VLOOKUP($B$66,TS2L7RAID,6,FALSE)*$C$13","v":0},{"$f":"VLOOKUP($B$66,TS2L7RAID,7,FALSE)*4","v":0}]
[]
[null,"Dischi rigidi (numero massimo per nodo 6)"]
["\n\nSAS 10K","600GB 10K RPM SAS 12Gbps 512n 2.5in Hot-plug Hard Drive",2,"[400-ASGS]","400-AUNQ",{"$f":"IF(C69<=2,\"\",\"TS2L7-10K600\")","v":""},{"$f":"IF(C69<=2,0,(C69-2)*4*'Regole di configurazione'!F17)","v":0}]
[]
[null,"1.2TB 10K RPM SAS 12Gbps 512n 2.5in Hot-plug Hard Drive",0,"[400-ASHI]","400-ATJL",{"$f":"IF(C71=0,\"\",\"TS2L7-10K1200\")","v":""},{"$f":"C71*4*'Regole di configurazione'!F18","v":0}]
[]
["SAS 10K","1800GB 10K RPM SAS 12Gbps  2.5in Hot-plug Hard Drive A20",0,null,null,{"$f":"IF(C73=0,\"\",\"TS2L7-10K1800\")","v":""},null,{"$f":"C73*4*'Regole di configurazione'!G43","v":0}]
[]
[null,"2.4TB 10K RPM SAS 12Gbps 512e 2.5in Hot-plug Hard Drive NO VMWARE A20",0,null,null,{"$f":"IF(C75=0,\"\",\"TS2L7-L7-10K2400\")","v":""},null,{"$f":"C75*4*'Regole di configurazione'!G56","v":0}]
[]
["\n\nSSD SAS RI","480GB SSD SAS Mixed Use 12Gbps 2.5in Hot-Plug Drive A20",0,null,null,{"$f":"IF(C77=0,\"\",\"TS2L7-10K1800\")","v":""},null,{"$f":"C77*4*'Regole di configurazione'!G44","v":0}]
[]
[null,"400GB SSD SAS Write Intensive 12Gbps 512n 2.5in Hot-plug Drive, 10 DWPD A20",0,null,null,{"$f":"IF(C79=0,\"\",\"TS2L7-SSDW400\")","v":""},null,{"$f":"C79*4*'Regole di configurazione'!G55","v":0}]
[]
[null,"1.6TB SSD SAS Write Intensive 12Gb 512n 2.5in Hot-plug Drive, 10 DWPD A20",0,null,null,{"$f":"IF(C81=0,\"\",\"TS2L7-SSDW1600\")","v":""},null,{"$f":"C81*4*'Regole di configurazione'!G54","v":0}]
[]
["SSD","960GB SSD SAS Read Intensive 12Gbps 512e 2.5in Hot-plug Drive, PM5-R, 1 DWPD, 1752 TBW",0,"[400-BBPL]","400-ATLL",{"$f":"IF(C83=0,\"\",\"TS2L7-SSDR960\")","v":""},{"$f":"C83*4*'Regole di configurazione'!F19","v":0}]
[]
[null,"1.92TB SSD SAS Read Intensive 12Gbps 512n 2.5in Hot-plug Drive, PX05SR,1 DWPD,3504 TBW",0,null,"400-ATMZ",{"$f":"IF(C85=0,\"\",\"TS2L7-SSDR1920\")","v":""},{"$f":"C85*4*'Regole di configurazione'!F20","v":0}]
[null,"DISCHI TOTALI NODO",{"$f":"SUM(C69:C85)","v":2},null,null,{"$f":"CONCATENATE(\"DISCHI TOTALI \",C86*4)","v":"DISCHI TOTALI 8"}]
[]
[]
[null,null,null,"[384-BBBL]"]
[]
[null,"NOTE sulla configurazione (CAMPO OBBLIGATORIO)"]
[{"$f":"IF(C86<=6,\"\",\"ERRORE:   Totale n° di dischi superiore al consentito\")","v":""},"Specificare la configurazione RAID per l'installazione del Sistema Operativo, se richiesto.\ne/o\ninserire eventuali note.",null,null,"Specificare la configurazione RAID per l'installazione del Sistema Operativo, se richiesto.\ne/o\ninserire eventuali note.",{"$f":"IF(B92=E92,\"ERRORE:   Compilare il campo NOTE\",\"\")","v":"ERRORE:   Compilare il campo NOTE"}]
[]
[null,"Alimentatore"]
[null,"Dual, Hot-plug, Redundant Power Supply (1+1), 1600W, 250 Volt",1,"[450-AFMQ]"]
[]
[null,"Cavi di alimentazione"]
[null,"Rack Power Cord 2M (C13/C14 10A)",2,"[450-AADY]"]
[]
[null,"PCIe Riser"]
[null,{"$f":"VLOOKUP($B$25,TS2L7CPU,15,FALSE)","v":0},{"$f":"VLOOKUP($B$25,TS2L7CPU,16,FALSE)","v":0},{"$f":"VLOOKUP($B$25,TS2L7CPU,17,FALSE)","v":0},{"$f":"VLOOKUP($B$25,TS2L7CPU,18,FALSE)","v":""}]
[]
[]
[null,"Modulo Doppia SD - Internal Dual SD Module (IDSDM)"]
[null,"None",{"$f":"VLOOKUP(B117,TS2L7IDSDM,2,FALSE)","v":1},{"$f":"VLOOKUP(B105,TS2L7IDSDM,3,FALSE)","v":0},{"$f":"VLOOKUP(B105,TS2L7IDSDM,4,FALSE)","v":0},{"$f":"VLOOKUP(B105,TS2L7IDSDM,5,FALSE)","v":""},{"$f":"VLOOKUP(B105,TS2L7IDSDM,6,FALSE)","v":0},{"$f":"VLOOKUP(B105,TS2L7IDSDM,7,FALSE)","v":0}]
[]
[null,"Embedded Systems Management"]
[null,"iDRAC9,Enterprise",1,"[385-BBKT]"]
[]
[]
[]
[]
[null,"Network Mezzanine Card"]
[null,"Intel X710 Dual Port 10Gb, SFP+, OCP Mezzanine card",1,"[540-BBWC]"]
[]
[null,"Additional Card for PCIe Slot 1 (Full height) (CPU 1)"]
[null,"None",{"$f":"VLOOKUP(B117,TS2L7PCI1,2,FALSE)","v":""},{"$f":"VLOOKUP(B117,TS2L7PCI1,3,FALSE)","v":""},{"$f":"VLOOKUP(B117,TS2L7PCI1,4,FALSE)","v":""},{"$f":"VLOOKUP(B117,TS2L7PCI1,5,FALSE)","v":""},{"$f":"VLOOKUP(B117,TS2L7PCI1,6,FALSE)","v":0},{"$f":"VLOOKUP(B117,TS2L7PCI1,7,FALSE)","v":0}]
[]
[null,"Additional Card for PCIe Slot 2 (Full height) (CPU 1)"]
[null,"None",{"$f":"VLOOKUP(B120,TS2L7PCI2,2,FALSE)","v":""},{"$f":"VLOOKUP(B120,TS2L7PCI2,3,FALSE)","v":""},{"$f":"VLOOKUP(B120,TS2L7PCI2,4,FALSE)","v":""},{"$f":"VLOOKUP(B120,TS2L7PCI2,5,FALSE)","v":""},{"$f":"VLOOKUP(B120,TS2L7PCI2,6,FALSE)","v":0},{"$f":"VLOOKUP(B120,TS2L7PCI2,7,FALSE)","v":0}]
[]
[null,"Additional Card for PCIe Slot 3 (Full height) (CPU 1)"]
[null,"PERC H730P RAID Controller, 2Gb NV Cache, Adapter, Full Height",{"$f":"VLOOKUP(B123,TS2L7PCI3,2,FALSE)","v":1},{"$f":"VLOOKUP(B123,TS2L7PCI3,3,FALSE)","v":"[405-AAMR]"},{"$f":"VLOOKUP(B123,TS2L7PCI3,4,FALSE)","v":"405-AAMY"},{"$f":"VLOOKUP(B123,TS2L7PCI3,5,FALSE)","v":""},{"$f":"VLOOKUP(B123,TS2L7PCI3,6,FALSE)","v":0},{"$f":"VLOOKUP(B123,TS2L7PCI3,7,FALSE)","v":0}]
[]
[null,"Transceiver per Server NODE"]
[null,"None",{"$f":"IF(B126=TS2L7ASP,\"\",VLOOKUP(B126,TS2L7PCI4,2,FALSE))","v":""},{"$f":"IF(B126=TS2L7ASP,\"\",VLOOKUP(B126,TS2L7PCI4,3,FALSE))","v":""},{"$f":"IF(B126=TS2L7ASP,\"\",VLOOKUP(B126,TS2L7PCI4,4,FALSE))","v":""},{"$f":"IF(B126=TS2L7ASP,\"\",VLOOKUP(B126,TS2L7PCI4,5,FALSE))","v":""},{"$f":"IF(B126=TS2L7ASP,0,VLOOKUP(B126,TS2L7PCI4,6,FALSE))","v":0},{"$f":"IF(B126=TS2L7ASP,0,VLOOKUP(B126,TS2L7PCI4,7,FALSE))","v":0}]
[null,"Coppia Dell Networking, Transceiver, SFP+, SR, 10GbE",0,null,"407-BBZM","TS2L7-10GOT",null,{"$f":"168*C127*4","v":0}]
[]
[null,"Dell Networking, Transceiver, SFP, 1000BASE-T",2,"[407-BBEL]"]
[]
[null,"Additional Card for PCIe Slot 1 (Low height) (CPU 2)"]
[null,"None",{"$f":"IF(B132=TS2L7ASP,\"\",VLOOKUP(B132,TS2L7PCI6,2,FALSE))","v":""},{"$f":"IF(B132=TS2L7ASP,\"\",VLOOKUP(B132,TS2L7PCI6,3,FALSE))","v":""},{"$f":"IF(B132=TS2L7ASP,\"\",VLOOKUP(B132,TS2L7PCI6,4,FALSE))","v":""},{"$f":"IF(B132=TS2L7ASP,\"\",VLOOKUP(B132,TS2L7PCI6,5,FALSE))","v":""},{"$f":"IF(B132=TS2L7ASP,0,VLOOKUP(B132,TS2L7PCI6,6,FALSE))*4","v":0},{"$f":"IF(B132=TS2L7ASP,0,VLOOKUP(B132,TS2L7PCI6,7,FALSE))*4","v":0}]
[]
[null,"Additional Card for PCIe Slot 7 (Full height) (CPU 2) (BOSS controller card Slot)"]
[null,"None",{"$f":"IF(B135=TS2L7ASP,\"\",VLOOKUP(B135,TS2L7PCI7,2,FALSE))","v":""},{"$f":"IF(B135=TS2L7ASP,\"\",VLOOKUP(B135,TS2L7PCI7,3,FALSE))","v":""},{"$f":"IF(B135=TS2L7ASP,\"\",VLOOKUP(B135,TS2L7PCI7,4,FALSE))","v":""},{"$f":"IF(B135=TS2L7ASP,\"\",VLOOKUP(B135,TS2L7PCI7,5,FALSE))","v":""},{"$f":"IF(B135=TS2L7ASP,0,VLOOKUP(B135,TS2L7PCI7,6,FALSE))","v":0},{"$f":"IF(B135=TS2L7ASP,0,VLOOKUP(B135,TS2L7PCI7,7,FALSE))","v":0}]
[]
[null,"Additional Card for PCIe Slot 8 (Full height) (CPU 2)"]
[null,"None",{"$f":"IF(B138=TS2L7ASP,\"\",VLOOKUP(B138,TS2L7PCI8,2,FALSE))","v":""},{"$f":"IF(B138=TS2L7ASP,\"\",VLOOKUP(B138,TS2L7PCI8,3,FALSE))","v":""},{"$f":"IF(B138=TS2L7ASP,\"\",VLOOKUP(B138,TS2L7PCI8,4,FALSE))","v":""},{"$f":"IF(B138=TS2L7ASP,\"\",VLOOKUP(B138,TS2L7PCI8,5,FALSE))","v":""},{"$f":"IF(B138=TS2L7ASP,0,VLOOKUP(B138,TS2L7PCI8,6,FALSE))","v":0},{"$f":"IF(B138=TS2L7ASP,0,VLOOKUP(B138,TS2L7PCI8,7,FALSE))","v":0}]
[]
[null,"Bezel"]
[null,"No Bezel",1]
[null,"MOD,TRAY,LGG,R7425",1,"[350-BBMF]"]
[]
[null,"Quick Sync"]
[null,"No Quick Sync",1,"[350-BBJV]"]
[]
[null,"Rack Rails"]
[null,"PEC Static Rails",1,"[770-BCFZ]"]
[]
[]
[]
[]
[]
[]
[]
[]
[]
[]
[null,"Dell Services: Deployment Services"]
[null,"No Installation Service Selected (Contact Sales rep for more details)",1,"[683-11870]"]
[]
[null,"Channel only - Support Extension"]
[null,"Channel 39M Basic Warranty - Next Business Day",1,"[723-41450]"]
[]
[null,"System Documentation"]
[null,"No Systems Documentation, No OpenManage DVD Kit",1,"[631-AACK]"]
[]
[null,"Shipping Material"]
[null,"PowerEdge R7425 Shipping Material",1,"[343-BBHK]"]
[]
[null,"Shipping"]
[null,"PowerEdge R7425 Shipping EMEA1 (English/French/German/Spanish/Russian/Hebrew)",1,"[340-CBDD]"]
[]
[null,"Direct Attach Cable per ENCLOSURE"]
[null,"5 x Dell Networking, Cable, SFP+ to SFP+, 10GbE, Copper Twinax Direct Attach Cable, 3 Meter",0,null,null,"TS2L7-5XDAC10M3",null,{"$f":"125*C175","v":0}]
[]
[]
[null,"Cavi per ENCLOSURE"]
[null,"Cavo Rete UTP cat. 5e 3 metri",4,null,"ROS1403/G","TS2L7-3MRJ45",null,{"$f":"2*C179","v":8}]
[]
[null,"Estenzione di Garanzia"]
[null,"None",{"$f":"VLOOKUP(B182,TS2L7WARRANTY,2,FALSE)","v":""},{"$f":"VLOOKUP(B182,TS2L7WARRANTY,3,FALSE)","v":""},{"$f":"VLOOKUP(B182,TS2L7WARRANTY,4,FALSE)","v":""},{"$f":"VLOOKUP(B182,TS2L7WARRANTY,5,FALSE)","v":""},{"$f":"VLOOKUP(B182,TS2L7WARRANTY,6,FALSE)","v":0}]
[]
[null,"Warranty Upgrades - Non-Std/Local POS"]
[null,"CSTM CONSIP - 39M Onsite Labor Support for CRU for Servers with Basic Warranty",1,"[681-24467]"]

{"sheet":"Lotto7 (Custom)","index":3,"n_rows":175,"n_cols":9,"rows_kept":175,"cut":false,"hidden":true,"merged":[[79,1,79,2],[0,5,1,5],[3,0,3,4],[45,0,49,0],[60,0,64,0],[66,0,68,0]]}
[null,"TOTALE PRODOTTI CONVENZIONE",{"$f":"SUM(G12:G185)*$C$9","v":{"$error":"#N/A"}},null,null,{"$f":"IF(I1+I2=0,(C1+C2),\"ERRORE VERIFICARE LA CONFIGURAZIONE\")","v":{"$error":"#N/A"}},null,null,{"$f":"IF(A46=\"\",0,1)","v":0}]
[null,"TOTALE ARTICOLI 20%",{"$f":"SUM(H12:H185)*$C$9","v":{"$error":"#N/A"}},null,null,null,null,null,{"$f":"IF(A80=\"\",0,1)","v":0}]
[]
["POWEREDGE R7425 GPU Ready (3GPU max)"]
[]
[]
[]
[]
[null,"Quantità:",0]
[]
[null,"Modello Server"]
[null,"PowerEdge R7425 Server",1,"[210-APFK]",null,"TS2L3-SRV",2087]
[]
[null,"Configurazione dello chassis"]
[null,"Chassis w/ up to 24 x 2.5\" SAS/SATA Hard Drives for 2CPU Configuration with GPU capable, Risers 4,6",1,"[321-BDWP]",null,"TS2L3-KITGPU",null,{"$f":"'Codici&PrezzixRiepilogo'!E44","v":"TS2L7-KVMIP"}]
[]
[null,"Trusted Platform Module"]
[null,"No Trusted Platform Module",1,"[461-AADZ]"]
[]
[null,"Processore"]
[null,"AMD EPYC™ 7301 2.2GHz/2.7GHz, 16C/32T, 64M Cache (155W/170W) DDR4-2400/2666",1,"[338-BNBZ]"]
[]
[null,"Processore aggiuntivo"]
[null,"AMD EPYC™ 7301 2.2GHz/2.7GHz, 16C/32T, 64M Cache (155W/170W) DDR4-2400/2666",{"$f":"VLOOKUP($B$24,TS2L7CPU,2,FALSE)","v":{"$error":"#N/A"}},{"$f":"VLOOKUP($B$24,TS2L7CPU,3,FALSE)","v":{"$error":"#N/A"}},{"$f":"VLOOKUP($B$24,TS2L7CPU,4,FALSE)","v":{"$error":"#N/A"}},{"$f":"VLOOKUP($B$24,TS2L7CPU,5,FALSE)","v":{"$error":"#N/A"}},{"$f":"VLOOKUP($B$24,TS2L7CPU,6,FALSE)","v":{"$error":"#N/A"}},{"$f":"VLOOKUP($B$24,TS2L7CPU,7,FALSE)","v":{"$error":"#N/A"}}]
[]
[null,"Configurazione Termica del Processore"]
[null,{"$f":"VLOOKUP($B$24,TS2L7CPU,8,FALSE)","v":{"$error":"#N/A"}},{"$f":"VLOOKUP($B$24,TS2L7CPU,9,FALSE)","v":{"$error":"#N/A"}},{"$f":"VLOOKUP($B$24,TS2L7CPU,10,FALSE)","v":{"$error":"#N/A"}},{"$f":"VLOOKUP($B$24,TS2L7CPU,11,FALSE)","v":{"$error":"#N/A"}}]
[null,{"$f":"VLOOKUP($B$24,TS2L7CPU,12,FALSE)","v":{"$error":"#N/A"}},{"$f":"VLOOKUP($B$24,TS2L7CPU,13,FALSE)","v":{"$error":"#N/A"}},{"$f":"VLOOKUP($B$24,TS2L7CPU,14,FALSE)","v":{"$error":"#N/A"}}]
[]
[]
[null,"Memoria Totale in GB","64     (DIMM 32GB)"]
[]
[null,"Tipo di configurazione memoria"]
[null,"Performance Optimized",1,"[370-AAIP]"]
[]
[null,"Tipo e velocità della memoria DIMM"]
[null,{"$f":"IF($C$24=0,VLOOKUP($C$31,TS2L7MEM1CPU,9,FALSE),VLOOKUP($C$31,TS2L7MEM2CPU,9,FALSE))","v":{"$error":"#N/A"}},{"$f":"IF($C$24=0,VLOOKUP($C$31,TS2L7MEM1CPU,10,FALSE),VLOOKUP($C$31,TS2L7MEM2CPU,10,FALSE))","v":{"$error":"#N/A"}},{"$f":"IF($C$24=0,VLOOKUP($C$31,TS2L7MEM1CPU,11,FALSE),VLOOKUP($C$31,TS2L7MEM2CPU,11,FALSE))","v":{"$error":"#N/A"}}]
[]
[null,"Capacità di memoria"]
[null,{"$f":"IF($C$24=0,VLOOKUP($C$31,TS2L7MEM1CPU,2,FALSE),VLOOKUP($C$31,TS2L7MEM2CPU,2,FALSE))","v":{"$error":"#N/A"}},{"$f":"IF($C$24=0,VLOOKUP($C$31,TS2L7MEM1CPU,3,FALSE),VLOOKUP($C$31,TS2L7MEM2CPU,3,FALSE))","v":{"$error":"#N/A"}},{"$f":"IF($C$24=0,VLOOKUP($C$31,TS2L7MEM1CPU,4,FALSE),VLOOKUP($C$31,TS2L7MEM2CPU,4,FALSE))","v":{"$error":"#N/A"}},{"$f":"IF($C$24=0,VLOOKUP($C$31,TS2L7MEM1CPU,5,FALSE),VLOOKUP($C$31,TS2L7MEM2CPU,5,FALSE))","v":{"$error":"#N/A"}},{"$f":"IF($C$24=0,VLOOKUP($C$31,TS2L7MEM1CPU,6,FALSE),VLOOKUP($C$31,TS2L7MEM2CPU,6,FALSE))","v":{"$error":"#N/A"}},{"$f":"IF($C$24=0,VLOOKUP($C$31,TS2L7MEM1CPU,7,FALSE),VLOOKUP($C$31,TS2L7MEM2CPU,7,FALSE))","v":{"$error":"#N/A"}}]
[]
[null,"Sistema operativo preinstallato"]
[null,"None",{"$f":"VLOOKUP($B$43,TS2L7OS,2,FALSE)","v":""},{"$f":"VLOOKUP($B$43,TS2L7OS,3,FALSE)","v":"[619-ABVR]"},{"$f":"VLOOKUP($B$43,TS2L7OS,4,FALSE)","v":0},{"$f":"VLOOKUP($B$43,TS2L7OS,5,FALSE)","v":""},{"$f":"VLOOKUP($B$43,TS2L7OS,6,FALSE)","v":0},{"$f":"VLOOKUP($B$43,TS2L7OS,7,FALSE)","v":""},{"$f":"IF(E43=0,1,0)","v":1}]
[null,{"$f":"IF(C24=0,\"\",IF(E43>0,'Regole di configurazione'!A95,\"\"))","v":{"$error":"#N/A"}},{"$f":"IF(B44=\"\",0,8)","v":{"$error":"#N/A"}},{"$f":"IF($B$44=\"\",\"\",'Regole di configurazione'!C95)","v":{"$error":"#N/A"}},{"$f":"IF($B$44=\"\",\"\",'Regole di configurazione'!D95)","v":{"$error":"#N/A"}},{"$f":"IF($B$44=\"\",\"\",'Regole di configurazione'!E95)","v":{"$error":"#N/A"}},{"$f":"IF($B$44=\"\",0,'Regole di configurazione'!F95)*C44","v":{"$error":"#N/A"}},{"$f":"IF($B$44=\"\",\"\",'Regole di configurazione'!G95)","v":{"$error":"#N/A"}}]
[]
[{"$f":"IF((I43*I47)=0,\"\",\"ERRORE: \nLa selezione di licenze CAL senza il Sistema Operativo Microsoft Windows non è consentita.\")","v":""},"Client Access Licenses"]
[null,{"$f":"IF($E$43>0,'Regole di configurazione'!A93,\"\")","v":""},0,{"$f":"IF($E$43>0,'Regole di configurazione'!C93,\"\")","v":""},{"$f":"IF($E$43>0,'Regole di configurazione'!D93,\"\")","v":""},{"$f":"IF($E$43>0,'Regole di configurazione'!E93,\"\")","v":""},{"$f":"IF($E$43>0,'Regole di configurazione'!F93,0)*C47","v":0},{"$f":"IF($E$43>0,'Regole di configurazione'!G93,\"\")","v":""},{"$f":"C47+C49","v":0}]
[]
[null,{"$f":"IF($E$43>0,'Regole di configurazione'!A94,\"\")","v":""},0,{"$f":"IF($E$43>0,'Regole di configurazione'!C94,\"\")","v":""},{"$f":"IF($E$43>0,'Regole di configurazione'!D94,\"\")","v":""},{"$f":"IF($E$43>0,'Regole di configurazione'!E94,\"\")","v":""},{"$f":"IF($E$43>0,'Regole di configurazione'!F94,0)*C49","v":0},{"$f":"IF($E$43>0,'Regole di configurazione'!G94,\"\")","v":""}]
[]
[null,"OS Media Kits"]
[null,"No Media Required",1,"[605-BBFN]"]
[]
[null,"RAID Configuration"]
[null,"C7, Unconfigured RAID for HDDs or SSDs (Mixed Drive Types Allowed)",1,"[780-BCDS]"]
[]
[null,"Controller Dischi"]
[null,"PERC H730P RAID Controller, 2Gb NV Cache, Adapter, Low Profile",1,"[405-AAOE]"]
[]
[null,"Dischi rigidi (numero massimo totale 24)"]
["\n\nSAS 10K","600GB 10K RPM SAS 12Gbps 512n 2.5in Hot-plug Hard Drive",2,"[400-ASGS]","400-AUNQ",{"$f":"IF(C61<=2,\"\",\"TS2L3-10K600\")","v":""},{"$f":"IF(C61<=2,0,(C61-2)*'Regole di configurazione'!F17)","v":0}]
[]
[null,"1.2TB 10K RPM SAS 12Gbps 512n 2.5in Hot-plug Hard Drive",0,"[400-ASHI]","400-ATJL",{"$f":"IF(C63=0,\"\",\"TS2L3-10K1800\")","v":""},{"$f":"C63*'Regole di configurazione'!F18","v":0}]
[]
[null,"1.8TB 10K RPM SAS 12Gbps 512e 2.5in Hot-plug Hard Drive ",0,"[400-ARXC]","400-ATJR",{"$f":"IF(C65=0,\"\",\"TS2L3-10K1200\")","v":""},{"$f":"C65*'Regole di configurazione'!#REF!","v":{"$error":"#REF!"}}]
[]
["\n\nSSD SAS RI","960GB SSD SAS Read Intensive 12Gbps 512e 2.5in Hot-plug Drive, PM5-R, 1 DWPD, 1752 TBW",0,"[400-BBPL]","400-ATLL",{"$f":"IF(C67=0,\"\",\"TS2L3-SSDR960\")","v":""},{"$f":"C67*'Regole di configurazione'!F19","v":0}]
[]
[null,"1.92TB SSD SAS Read Intensive 12Gbps 512e 2.5in Hot-plug Drive, PM1633a",0,"[400-ASFX]","400-ATND",{"$f":"IF(C69=0,\"\",\"TS2L3-SSDR1920\")","v":""},{"$f":"C69*'Regole di configurazione'!F20","v":0}]
[]
[null,"DISCHI TOTALI",{"$f":"SUM(C61:C70)","v":2}]
[]
[null,"Impostazioni del BIOS per la gestione dell'alimentazione"]
[null,"Performance BIOS Setting",1,"[384-BBBL]"]
[]
[null,"Advanced System Configurations"]
[null,"UEFI BIOS Boot Mode with GPT Partition",1,"[800-BBDM]"]
[]
[null,"NOTE sulla configurazione"]
[{"$f":"IF(C71<=24,\"\",\"ERRORE:   Totale n° di dischi superiore al consentito\")","v":""},"Inserire eventuali note sulla configurazione"]
[]
[null,"Ventole"]
[null,"6 Performance Fans",1,"[384-BBST]"]
[]
[null,"Alimentatore"]
[null,"Dual, Hot-plug, Power Supply, 2000W, C19/C20 Power Cord Required ",1,"[450-AENU]"]
[]
[null,"Cavi di alimentazione"]
[null,"C19 to C20, PDU Style, 2.5M Power Cord",2,"[450-AEJI]"]
[]
[null,"PCIe Riser"]
[null,"Riser Config 4, 2 x8, 4 x16 slots ",{"$f":"VLOOKUP($B$24,TS2L7CPU,16,FALSE)","v":{"$error":"#N/A"}},"[330-BBJC]","330-BBLX 330-BBMK 330-BBLS"]
[]
[null,"Motherboard"]
[null,"PowerEdge R7425 Motherboard",1,"[329-BDSW]"]
[]
[null,"Embedded Systems Management"]
[null,"iDRAC9,Enterprise",1,"[385-BBKT]"]
[]
[]
[]
[]
[null,"Network Daughter Card"]
[null,"Broadcom 5720 QP 1Gb Network Daughter Card",1,"[540-BBBW]"]
[]
[null,"Additional Card for PCIe Slot 1 (Full height) (CPU 1) GPU"]
[null,"None",{"$f":"VLOOKUP(B107,TS2L7PCIGPU,2,FALSE)","v":""},{"$f":"VLOOKUP(B107,TS2L7PCIGPU,3,FALSE)","v":""},{"$f":"VLOOKUP(B107,TS2L7PCIGPU,4,FALSE)","v":""},{"$f":"VLOOKUP(B107,TS2L7PCIGPU,5,FALSE)","v":""},{"$f":"VLOOKUP(B107,TS2L7PCIGPU,6,FALSE)","v":0},{"$f":"VLOOKUP(B107,TS2L7PCIGPU,7,FALSE)","v":0}]
[]
[null,"Additional Card for PCIe Slot 2 (Full height) (CPU 1)"]
[null,"None",null,null,null,null,{"$f":"VLOOKUP(B110,TS2L7PCI2,6,FALSE)","v":0},{"$f":"VLOOKUP(B110,TS2L7PCI2,7,FALSE)","v":0}]
[]
[null,"Additional Card for PCIe Slot 3 (Full height) (CPU 1)"]
[null,"None",{"$f":"VLOOKUP(B113,TS2L7PCI2,2,FALSE)","v":""},{"$f":"VLOOKUP(B113,TS2L7PCI2,3,FALSE)","v":""},{"$f":"VLOOKUP(B113,TS2L7PCI2,4,FALSE)","v":""},{"$f":"VLOOKUP(B113,TS2L7PCI2,5,FALSE)","v":""},{"$f":"VLOOKUP(B113,TS2L7PCI2,6,FALSE)","v":0},{"$f":"VLOOKUP(B113,TS2L7PCI2,7,FALSE)","v":0}]
[]
[null,"Additional Card for PCIe Slot 4 (Full height) (CPU 2) GPU"]
[null,"None",{"$f":"IF(B116=TS2L7ASP,\"\",VLOOKUP(B116,TS2L7PCIGPU,2,FALSE))","v":""},{"$f":"IF(B116=TS2L7ASP,\"\",VLOOKUP(B116,TS2L7PCIGPU,3,FALSE))","v":""},{"$f":"IF(B116=TS2L7ASP,\"\",VLOOKUP(B116,TS2L7PCIGPU,4,FALSE))","v":""},{"$f":"IF(B116=TS2L7ASP,\"\",VLOOKUP(B116,TS2L7PCIGPU,5,FALSE))","v":""},{"$f":"IF(B116=TS2L7ASP,0,VLOOKUP(B116,TS2L7PCIGPU,6,FALSE))","v":0},{"$f":"IF(B116=TS2L7ASP,0,VLOOKUP(B116,TS2L7PCIGPU,7,FALSE))","v":0}]
[]
[null,"Additional Card for PCIe Slot 5 (Full height) (CPU 2)"]
[null,"None"]
[]
[null,"Additional Card for PCIe Slot 6 (Low height) (CPU 2)"]
[null,"PERC H730P RAID Controller, 2Gb NV Cache, Adapter, Low Profile",1,"[405-AAOE]",null,null,0,0]
[]
[null,"Additional Card for PCIe Slot 7 (Full height) (CPU 2) (BOSS controller card Slot)"]
[null,"None",{"$f":"IF(B125=TS2L7ASP,\"\",VLOOKUP(B125,TS2L7PCI7,2,FALSE))","v":""},{"$f":"IF(B125=TS2L7ASP,\"\",VLOOKUP(B125,TS2L7PCI7,3,FALSE))","v":""},{"$f":"IF(B125=TS2L7ASP,\"\",VLOOKUP(B125,TS2L7PCI7,4,FALSE))","v":""},{"$f":"IF(B125=TS2L7ASP,\"\",VLOOKUP(B125,TS2L7PCI7,5,FALSE))","v":""},{"$f":"IF(B125=TS2L7ASP,0,VLOOKUP(B125,TS2L7PCI7,6,FALSE))","v":0},{"$f":"IF(B125=TS2L7ASP,0,VLOOKUP(B125,TS2L7PCI7,7,FALSE))","v":0}]
[]
[null,"Additional Card for PCIe Slot 8 (Full height) (CPU 2) GPU"]
[null,"None",{"$f":"IF(B128=TS2L7ASP,\"\",VLOOKUP(B128,TS2L7PCIGPU,2,FALSE))","v":""},{"$f":"IF(B128=TS2L7ASP,\"\",VLOOKUP(B128,TS2L7PCIGPU,3,FALSE))","v":""},{"$f":"IF(B128=TS2L7ASP,\"\",VLOOKUP(B128,TS2L7PCIGPU,4,FALSE))","v":""},{"$f":"IF(B128=TS2L7ASP,\"\",VLOOKUP(B128,TS2L7PCIGPU,5,FALSE))","v":""},{"$f":"IF(B128=TS2L7ASP,0,VLOOKUP(B128,TS2L7PCIGPU,6,FALSE))","v":0},{"$f":"IF(B128=TS2L7ASP,0,VLOOKUP(B128,TS2L7PCIGPU,7,FALSE))","v":0}]
[]
[null,"Bezel"]
[null,"No Bezel",1,"[350-BBBW]"]
[null,"MOD,TRAY,LGG,R7425",1,"[350-BBMF]"]
[]
[null,"Quick Sync"]
[null,"No Quick Sync",1,"[350-BBJV]"]
[]
[null,"Rack Rails"]
[null,"ReadyRails™ Sliding Rails Without Cable Management Arm",1,"[770-BBBQ]"]
[]
[null,"Password"]
[null,"iDRAC,Factory Generated Password",1,"[379-BCSF]"]
[]
[null,"Group Manager"]
[null,"iDRAC Group Manager, Enabled",1,"[379-BCQV]"]
[]
[null,"Internal Optical Drive"]
[null,"No Internal Optical Drive for 12/24 HD Chassis",1,"[429-AAIQ]"]
[]
[null,"Dell Services: Deployment Services"]
[null,"No Installation Service Selected (Contact Sales rep for more details)",1,"[683-11870]"]
[]
[null,"Channel only - Support Extension"]
[null,"Channel 39M Basic Warranty - Next Business Day",1,"[723-41450]"]
[]
[null,"System Documentation"]
[null,"No Systems Documentation, No OpenManage DVD Kit",1,"[631-AACK]"]
[]
[null,"Shipping Material"]
[null,"PowerEdge R7425 Shipping Material",1,"[343-BBHK]"]
[]
[null,"Shipping"]
[null,"PowerEdge R7425 Shipping EMEA1 (English/French/German/Spanish/Russian/Hebrew)",1,"[340-CBDD]"]
[]
[null,"Base warranty"]
[null,"Base Warranty",1,"[709-13131]"]
[null,"3Yr Basic Warranty - Next Business Day - Minimum Warranty",1,"[709-15813]"]
[]
[null,"Cavi"]
[null,"Cavo Rete UTP cat. 5e 3 metri",5,null,"ROS1403/G",{"$f":"IF(C169=0,\"\",\"TS2L3-ROS1403\")","v":"TS2L3-ROS1403"},null,{"$f":"2*C169","v":10}]
[]
[null,"Estenzione di Garanzia"]
[null,"None",{"$f":"VLOOKUP(B172,TS2L7WARRANTY,2,FALSE)","v":""},{"$f":"VLOOKUP(B172,TS2L7WARRANTY,3,FALSE)","v":""},{"$f":"VLOOKUP(B172,TS2L7WARRANTY,4,FALSE)","v":""},{"$f":"VLOOKUP(B172,TS2L7WARRANTY,5,FALSE)","v":""},{"$f":"VLOOKUP(B172,TS2L7WARRANTY,6,FALSE)","v":0}]
[]
[null,"Warranty Upgrades - Non-Std/Local POS"]
[null,"CSTM CONSIP - 39M Onsite Labor Support for CRU for Servers with Basic Warranty",1,"[681-24467]"]

{"sheet":"Rack e Accessori","index":4,"n_rows":45,"n_cols":11,"rows_kept":45,"cut":false,"hidden":false,"merged":[[44,2,44,7],[14,2,14,7],[5,2,5,7],[8,2,8,7],[11,2,11,7],[38,2,38,7],[41,2,41,7],[17,2,17,7],[20,2,20,7],[23,2,23,7],[26,2,26,7],[32,2,32,7],[35,2,35,7],[29,2,29,7],[0,7,0,8],[1,7,1,8],[0,9,1,10]]}
[null,null,null,null,null,null,"TOTALE PRODOTTI CONVENZIONE",{"$f":"SUM(Riepilogo!T42:U45)","v":0},null,{"$f":"H1+H2","v":0}]
[null,null,null,null,null,null,"TOTALE ARTICOLI 20%"]
[]
[]
[null,null,{"$f":"IF(Riepilogo!G6=\"\",\"\",\"Rack (OpzRack)\")","v":""}]
[null,null,{"$f":"IF(Riepilogo!G6=\"\",\"\",\"Tecnosteel: armadio Rack 19'' 42U\")","v":""},null,null,null,null,null,null,null,{"$f":"IF(J6>=1,\"TS2L7-RACK\",\"\")","v":""}]
[]
[null,null,{"$f":"IF(Riepilogo!$G$6=\"\",\"\",\"PDU (OpzPDU32A)\")","v":""}]
[null,null,{"$f":"IF(Riepilogo!$G$6=\"\",\"\",\"Coppia di PDU Vertical  1Ph-32A-18xC13-6xC19 - 0U Base + Kit di montaggio\")","v":""},null,null,null,null,null,null,null,{"$f":"IF(J9>=1,\"TS2L3-PDU32A\",\"\")","v":""}]
[]
[null,null,{"$f":"IF(Riepilogo!$G$6=\"\",\"\",\"PDU (OpzPDU16AMetered)\")","v":""}]
[null,null,{"$f":"IF(Riepilogo!$G$6=\"\",\"\",\"Coppia di PDU Vertical  1Ph-16A-36xC13+6xC19 -0U Metered + Kit di montaggio\")","v":""},null,null,null,null,null,null,null,{"$f":"IF(J12>=1,\"TS2L3-TM1613606\",\"\")","v":""}]
[]
[null,null,{"$f":"IF(Riepilogo!$G$6=\"\",\"\",\"PDU (OpzPDU32AMetered)\")","v":""}]
[null,null,{"$f":"IF(Riepilogo!$G$6=\"\",\"\",\"Coppia di PDU Vertical  1Ph-32A-36xC13+6xC19 -0U Metered + Kit di montaggio\")","v":""},null,null,null,null,null,null,null,{"$f":"IF(J15>=1,\"TS2L3-TM3213606\",\"\")","v":""}]
[]
[null,null,{"$f":"IF(Riepilogo!$G$6=\"\",\"\",\"PDU (OpzPDU32A3PHMetered)\")","v":""}]
[null,null,{"$f":"IF(Riepilogo!$G$6=\"\",\"\",\"Coppia di PDU Vertical  3Ph-32A-36xC13+6xC19 -0U Metered + Kit di montaggio\")","v":""},null,null,null,null,null,null,null,{"$f":"IF(J18>=1,\"TS2L3-TM3233606\",\"\")","v":""}]
[]
[null,null,{"$f":"IF(Riepilogo!$G$6=\"\",\"\",\"PDU (OpzPDU16AControlled)\")","v":""}]
[null,null,{"$f":"IF(Riepilogo!$G$6=\"\",\"\",\"Coppia di PDU Vertical  1Ph-16A-24xC13+6xC19 -0U Controlled + Kit di montaggio\")","v":""},null,null,null,null,null,null,null,{"$f":"IF(J21>=1,\"TS2L3-TK1612406\",\"\")","v":""}]
[]
[null,null,{"$f":"IF(Riepilogo!$G$6=\"\",\"\",\"PDU (OpzPDU32AControlled)\")","v":""}]
[null,null,{"$f":"IF(Riepilogo!$G$6=\"\",\"\",\"Coppia di PDU Vertical  1Ph-32A-24xC13+6xC19 -0U Controlled + Kit di montaggio\")","v":""},null,null,null,null,null,null,null,{"$f":"IF(J24>=1,\"TS2L3-TK3212406\",\"\")","v":""}]
[]
[null,null,{"$f":"IF(Riepilogo!$G$6=\"\",\"\",\"PDU (OpzPDU32A3PHControlled)\")","v":""}]
[null,null,{"$f":"IF(Riepilogo!$G$6=\"\",\"\",\"Coppia di PDU Vertical  3Ph-32A-24xC13+6xC19 -0U Controlled + Kit di montaggio\")","v":""},null,null,null,null,null,null,null,{"$f":"IF(J27>=1,\"TS2L3-TK3232406\",\"\")","v":""}]
[]
[null,null,{"$f":"IF(Riepilogo!$G$6=\"\",\"\",\"PDU (OpzPDU16AFull)\")","v":""}]
[null,null,{"$f":"IF(Riepilogo!$G$6=\"\",\"\",\"Coppia di PDU Vertical  1Ph-16A-24xC13+6xC19 -0U Full + Kit di montaggio\")","v":""},null,null,null,null,null,null,null,{"$f":"IF(J30>=1,\"TS2L3-TF1612406\",\"\")","v":""}]
[]
[null,null,{"$f":"IF(Riepilogo!$G$6=\"\",\"\",\"PDU (OpzPDU32AFull)\")","v":""}]
[null,null,{"$f":"IF(Riepilogo!$G$6=\"\",\"\",\"Coppia di PDU Vertical  1Ph-32A-24xC13+6xC19 -0U Full + Kit di montaggio\")","v":""},null,null,null,null,null,null,null,{"$f":"IF(J33>=1,\"TS2L3-TF3212406\",\"\")","v":""}]
[]
[null,null,{"$f":"IF(Riepilogo!$G$6=\"\",\"\",\"PDU (OpzPDU32A3PHFull)\")","v":""}]
[null,null,{"$f":"IF(Riepilogo!$G$6=\"\",\"\",\"Coppia di PDU Vertical  3Ph-32A-24xC13+6xC19 -0U Full + Kit di montaggio\")","v":""},null,null,null,null,null,null,null,{"$f":"IF(J36>=1,\"TS2L3-TF3232406\",\"\")","v":""}]
[]
[null,null,{"$f":"IF(Riepilogo!G6=\"\",\"\",\"KVM (OpzGUIRack)\")","v":""}]
[null,null,{"$f":"IF(Riepilogo!G6=\"\",\"\",\"Tecnosteel: 1U Rackmount Console 17'' with Italian Keyboard\")","v":""},null,null,null,null,null,null,null,{"$f":"IF(J39>=1,\"TS2L7-GUI\",\"\")","v":""}]
[]
[null,null,{"$f":"IF(Riepilogo!G6=\"\",\"\",\"KVM Option (OpzSWGUIRack)\")","v":""}]
[null,null,{"$f":"IF(Riepilogo!G6=\"\",\"\",\"Tecnosteel: 16-port remote KVM switch with one remote user\")","v":""},null,null,null,null,null,null,null,{"$f":"IF(J42>=1,\"TS2L7-KVMIP\",\"\")","v":""}]
[]
[null,null,{"$f":"IF(Riepilogo!G6=\"\",\"\",\"Uninterrupted Power Supply (OpzUPS 3000VA)\")","v":""}]
[null,null,{"$f":"IF(Riepilogo!G6=\"\",\"\",\"Riello - UPS MSR3000EVO 3000VA 2U Rackmount (SNMP+USB+RS232)\")","v":""},null,null,null,null,null,null,null,{"$f":"IF(J45>=1,\"TS2L7-UPS\",\"\")","v":""}]

{"sheet":"Riepilogo","index":5,"n_rows":174,"n_cols":37,"rows_kept":174,"cut":false,"hidden":false,"merged":[[131,16,131,19],[132,16,132,19],[133,16,133,19],[134,16,134,19],[135,16,135,19],[136,16,136,19],[137,16,137,19],[138,16,138,19],[139,16,139,19],[131,9,131,12],[132,9,132,12],[133,9,133,12],[134,9,134,12],[135,9,135,12],[136,9,136,12],[137,9,137,12],[138,9,138,12],[139,9,139,12],[131,2,131,5],[132,2,132,5],[133,2,133,5],[134,2,134,5],[135,2,135,5],[136,2,136,5],[137,2,137,5],[138,2,138,5],[139,2,139,5],[72,2,72,5],[72,6,72,8],[72,9,72,16],[72,17,72,18],[72,19,72,20],[121,2,121,5],[121,9,121,12],[121,16,121,19],[130,2,130,5],[130,9,130,12],[130,16,130,19],[127,9,127,12],[128,9,128,12],[129,9,129,12],[116,16,116,19],[117,16,117,19],[118,16,118,19],[119,16,119,19],[120,16,120,19],[122,16,122,19],[123,16,123,19],[124,16,124,19],[125,16,125,19],[126,16,126,19],[70,2,70,5],[70,6,70,8],[70,9,70,16],[70,17,70,18],[70,19,70,20],[71,2,71,5],[71,6,71,8],[71,9,71,16],[71,17,71,18],[71,19,71,20],[68,2,68,5],[68,6,68,8],[68,9,68,16],[68,17,68,18],[68,19,68,20],[69,2,69,5],[69,6,69,8],[69,9,69,16],[69,17,69,18],[69,19,69,20],[65,17,65,18],[65,19,65,20],[66,2,66,5],[66,6,66,8],[66,9,66,16],[66,17,66,18],[66,19,66,20],[67,2,67,5],[67,6,67,8],[67,9,67,16],[67,17,67,18],[67,19,67,20],[55,9,55,16],[55,17,55,18],[55,19,55,20],[104,9,104,12],[104,16,104,19],[78,1,78,16],[54,2,54,5],[54,6,54,8],[54,9,54,16],[54,17,54,18],[54,19,54,20],[63,2,63,5],[63,6,63,8],[63,9,63,16],[63,17,63,18],[63,19,63,20],[64,2,64,5],[64,6,64,8],[64,9,64,16],[64,17,64,18],[64,19,64,20],[65,2,65,5],[65,6,65,8],[65,9,65,16],[127,16,127,19],[128,16,128,19],[129,16,129,19],[62,2,62,5],[62,6,62,8],[62,9,62,16],[62,17,62,18],[62,19,62,20],[116,2,116,5],[117,2,117,5],[118,2,118,5],[119,2,119,5],[116,9,116,12],[117,9,117,12],[118,9,118,12],[119,9,119,12],[114,9,114,12],[114,16,114,19],[110,9,110,12],[110,16,110,19],[106,2,106,5],[106,9,106,12],[106,16,106,19],[107,2,107,5],[107,9,107,12],[107,16,107,19],[104,2,104,5],[60,2,60,5],[60,6,60,8],[60,9,60,16],[60,17,60,18],[60,19,60,20],[61,2,61,5],[61,6,61,8],[61,9,61,16],[61,17,61,18],[61,19,61,20],[105,2,105,5],[105,9,105,12],[105,16,105,19],[102,2,102,5],[102,9,102,12],[102,16,102,19],[103,2,103,5],[103,9,103,12],[103,16,103,19],[100,2,100,5],[100,9,100,12],[58,2,58,5],[58,6,58,8],[58,9,58,16],[58,17,58,18],[58,19,58,20],[59,2,59,5],[59,6,59,8],[59,9,59,16],[59,17,59,18],[59,19,59,20],[56,2,56,5],[56,6,56,8],[56,9,56,16],[56,17,56,18],[56,19,56,20],[57,2,57,5],[57,6,57,8],[57,9,57,16],[57,17,57,18],[57,19,57,20],[48,2,48,5],[48,6,48,8],[48,9,48,16],[48,17,48,18],[48,19,48,20],[49,2,49,5],[49,6,49,8],[49,9,49,16],[49,17,49,18],[49,19,49,20],[50,2,50,5],[50,6,50,8],[50,9,50,16],[50,17,50,18],[50,19,50,20],[52,2,52,5],[52,6,52,8],[52,9,52,16],[52,17,52,18],[52,19,52,20],[51,2,51,5],[51,6,51,8],[51,9,51,16],[51,17,51,18],[51,19,51,20],[53,2,53,5],[53,6,53,8],[112,2,112,5],[112,9,112,12],[112,16,112,19],[113,2,113,5],[113,9,113,12],[113,16,113,19],[168,2,168,7],[168,14,168,19],[140,9,140,12],[115,16,115,19],[140,16,140,19],[114,2,114,5],[108,2,108,5],[108,9,108,12],[108,16,108,19],[111,2,111,5],[111,9,111,12],[111,16,111,19],[109,2,109,5],[109,9,109,12],[109,16,109,19],[110,2,110,5],[169,2,172,7],[169,14,172,19],[162,12,162,13],[162,14,162,15],[162,16,162,17],[162,18,162,19],[165,3,166,18],[162,2,162,3],[162,4,162,5],[162,6,162,7],[162,8,162,9],[162,10,162,11],[100,16,100,19],[101,2,101,5],[101,9,101,12],[101,16,101,19],[98,2,98,5],[98,9,98,12],[98,16,98,19],[99,2,99,5],[99,9,99,12],[99,16,99,19],[96,2,96,5],[96,9,96,12],[96,16,96,19],[97,2,97,5],[97,9,97,12],[97,16,97,19],[95,2,95,5],[95,9,95,12],[95,16,95,19],[93,2,93,5],[93,9,93,12],[93,16,93,19],[94,2,94,5],[94,9,94,12],[94,16,94,19],[91,2,91,5],[91,9,91,12],[91,16,91,19],[92,2,92,5],[92,9,92,12],[92,16,92,19],[89,2,89,5],[89,9,89,12],[89,16,89,19],[90,2,90,5],[90,9,90,12],[90,16,90,19],[88,2,88,5],[88,9,88,12],[88,16,88,19],[78,17,78,20],[74,1,74,16],[74,17,74,20],[82,3,83,18],[75,1,75,16],[75,17,75,20],[76,1,76,16],[76,17,76,20],[77,1,77,16],[77,17,77,20],[46,2,46,5],[46,6,46,8],[46,9,46,16],[46,17,46,18],[46,19,46,20],[45,1,45,20],[86,1,86,3],[86,8,86,10],[86,15,86,17],[47,2,47,5],[47,6,47,8],[47,9,47,16],[47,17,47,18],[47,19,47,20],[73,2,73,5],[73,6,73,8],[73,9,73,16],[73,17,73,18],[73,19,73,20],[53,9,53,16],[53,17,53,18],[53,19,53,20],[55,2,55,5],[55,6,55,8],[44,2,44,5],[44,6,44,8],[44,9,44,16],[44,17,44,18],[44,19,44,20],[43,2,43,5],[43,6,43,8],[43,9,43,16],[43,17,43,18],[43,19,43,20],[42,2,42,5],[42,6,42,8],[42,9,42,16],[42,17,42,18],[42,19,42,20],[41,2,41,5],[41,6,41,8],[41,9,41,16],[41,17,41,18],[41,19,41,20],[40,1,40,20],[39,2,39,5],[39,6,39,8],[39,9,39,16],[39,17,39,18],[39,19,39,20],[38,2,38,5],[38,6,38,8],[38,9,38,16],[38,17,38,18],[38,19,38,20],[37,2,37,5],[37,6,37,8],[37,9,37,16],[37,17,37,18],[37,19,37,20],[34,2,34,5],[34,6,34,8],[34,9,34,16],[34,17,34,18],[34,19,34,20],[35,2,35,5],[35,6,35,8],[35,9,35,16],[35,17,35,18],[35,19,35,20],[36,2,36,5],[36,6,36,8],[36,9,36,16],[36,17,36,18],[36,19,36,20],[33,2,33,5],[33,6,33,8],[33,9,33,16],[33,17,33,18],[33,19,33,20],[32,2,32,5],[32,6,32,8],[32,9,32,16],[32,17,32,18],[32,19,32,20],[31,2,31,5],[31,6,31,8],[31,9,31,16],[31,17,31,18],[31,19,31,20],[30,2,30,5],[30,6,30,8],[30,9,30,16],[30,17,30,18],[30,19,30,20],[29,2,29,5],[29,6,29,8],[29,9,29,16],[29,17,29,18],[29,19,29,20],[28,2,28,5],[28,6,28,8],[28,9,28,16],[28,17,28,18],[28,19,28,20],[27,2,27,5],[27,6,27,8],[27,9,27,16],[27,17,27,18],[27,19,27,20],[26,2,26,5],[26,6,26,8],[26,9,26,16],[26,17,26,18],[26,19,26,20],[25,2,25,5],[25,6,25,8],[25,9,25,16],[25,17,25,18],[25,19,25,20],[24,2,24,5],[24,6,24,8],[24,9,24,16],[24,17,24,18],[24,19,24,20],[23,2,23,5],[23,6,23,8],[23,9,23,16],[23,17,23,18],[23,19,23,20],[22,2,22,5],[22,6,22,8],[22,9,22,16],[22,17,22,18],[22,19,22,20],[21,2,21,5],[21,6,21,8],[21,9,21,16],[21,17,21,18],[21,19,21,20],[20,2,20,5],[20,6,20,8],[20,9,20,16],[20,17,20,18],[20,19,20,20],[19,2,19,5],[19,6,19,8],[19,9,19,16],[19,17,19,18],[19,19,19,20],[4,1,4,7],[5,1,5,5],[5,6,5,7],[1,8,3,16],[4,8,4,16],[16,2,16,5],[16,6,16,8],[16,9,16,16],[16,17,16,18],[7,1,7,3],[7,4,7,8],[7,11,7,14],[9,1,9,3],[9,4,9,8],[9,9,9,10],[9,11,9,14],[7,9,7,10],[11,1,11,20],[12,2,12,5],[12,6,12,8],[0,1,0,5],[0,6,0,14],[0,17,1,20],[1,1,1,5],[1,6,1,7],[2,1,2,5],[2,6,2,7],[3,1,3,5],[3,6,3,7],[12,9,12,16],[12,17,12,18],[12,19,12,20],[7,16,7,20],[9,16,9,20],[13,1,13,20],[14,2,14,5],[14,6,14,8],[14,9,14,16],[14,17,14,18],[14,19,14,20],[16,19,16,20],[15,2,15,5],[15,6,15,8],[15,9,15,16],[15,17,15,18],[15,19,15,20],[18,2,18,5],[18,6,18,8],[18,9,18,16],[18,17,18,18],[18,19,18,20],[17,2,17,5],[17,6,17,8],[17,9,17,16],[17,17,17,18],[17,19,17,20],[142,1,142,3],[142,8,142,10],[142,15,142,17],[144,1,160,5],[144,8,160,12],[144,15,160,19],[115,2,115,5],[140,2,140,5],[115,9,115,12],[120,2,120,5],[122,2,122,5],[123,2,123,5],[124,2,124,5],[125,2,125,5],[126,2,126,5],[127,2,127,5],[128,2,128,5],[129,2,129,5],[120,9,120,12],[122,9,122,12],[123,9,123,12],[124,9,124,12],[125,9,125,12],[126,9,126,12]]}
[null,"Amministrazione ",null,null,null,null,null,null,null,null,null,null,null,null,null,null,null,"CONFIGURATORE ELETTRONICO TECNOLOGIE SERVER 2 LOTTO 7",null,null,null,1,null,"Server1","Server2","Server3","GPU"]
[null,"N° Identificativo Ordine ",null,null,null,null,null,null,{"$f":"IF(AA2>0,\"ERRORE DI CONFIGURAZIONE\",IF(Y13>0,\"ERRORE DI MANCATA COMPILAZIONE DATI NECESSARI PER L'ORDINATIVO\",\"Configurazione OK\"))","v":"ERRORE DI MANCATA COMPILAZIONE DATI NECESSARI PER L'ORDINATIVO"},null,null,null,null,null,null,null,null,null,null,null,null,1,"Errore",{"$f":"IF('Lotto7-1'!$F$1=\"ERRORE VERIFICARE LA CONFIGURAZIONE\",1,0)","v":0},{"$f":"IF('Lotto7-2'!$F$1=\"ERRORE VERIFICARE LA CONFIGURAZIONE\",1,0)","v":0},{"$f":"IF('Lotto7-3'!$F$1=\"ERRORE VERIFICARE LA CONFIGURAZIONE\",1,0)","v":0},{"$f":"SUM(X2:Z2)","v":0}]
[null,"Data Ordine",null,null,null,null,null,null,null,null,null,null,null,null,null,null,null,null,null,null,null,1,"Dati non compilati","Amministrazione ",{"$f":"IF(G1>0,0,1)","v":1}]
[null,"Tot Ordine Portale CONSIP IVA incl.",null,null,null,null,{"$f":"R79","v":0},null,null,null,null,null,null,null,null,null,null,null,null,null,"Nel \"Tot Ordine Portale CONSIP\" deve essere inserito l'importo totale risultante dall'ordinativo del portale CONSIP.\nQualora l'importo inserito corrisponde al valore ricalcolato dal configuratore viene attivato il pulsante \"Salva in formato PDF\" che permette di generare il file pdf da allegare all'ordinativo.",1,null,"N° Identificativo Ordine ",{"$f":"IF(G2>0,0,1)","v":1}]
[null,"LE CELLE IN GIALLO DEVO ESSERE COMPILATE OBBLIGATORIAMENTE",null,null,null,null,null,null,{"$f":"IF(AA2>0,\"\",IF(Y13>0,\"\",\"Cliccare il pulsante --------------> \nper generare il PDF da allegare\"))","v":""},null,null,null,null,null,null,null,null,null,null,null,null,1,null,"Data Ordine",{"$f":"IF(G3>0,0,1)","v":1}]
[null,"Quantità Server Ordinati",null,null,null,null,{"$f":"B15","v":""},null,null,null,null,null,null,null,null,null,null,null,null,"ver. 2.0",null,1,null,"Tot Ordine Portale CONSIP IVA incl.",{"$f":"IF(G4>0,0,1)","v":1}]
[null,null,null,null,null,null,null,null,null,null,null,null,null,null,null,null,null,null,null,null,null,1,null,"Referente per la Consegna",{"$f":"IF(E8>0,0,1)","v":1}]
[null,"Referente per la Consegna",null,null,null,null,null,null,null,"Telefono",null,null,null,null,null,"email",null,null,null,null,null,1,null,"Telefono",{"$f":"IF(L8>0,0,1)","v":1}]
[null,null,null,null,null,null,null,null,null,null,null,null,null,null,null,null,null,null,null,null,null,1,null,"email",{"$f":"IF(Q8>0,0,1)","v":1}]
[null,"Referente per l'installazione",null,null,null,null,null,null,null,"Telefono",null,null,null,null,null,"email",null,null,null,null,null,1,null,"Referente per l'installazione",{"$f":"IF(E10>0,0,1)","v":1}]
[null,null,null,null,null,null,null,null,null,null,null,null,null,null,null,null,null,null,null,null,null,1,null,"Telefono",{"$f":"IF(L10>0,0,1)","v":1}]
[null,"ATTENZIONE: I CODICI PRODOTTO DELL'ORDINE DEVONO ESSERE SPECULARI A QUELLI GENERATI DAL CONFIGURATORE.",null,null,null,null,null,null,null,null,null,null,null,null,null,null,null,null,null,null,null,1,null,"email",{"$f":"IF(Q10>0,0,1)","v":1}]
[null,"Qtà Ordinata","CODICE ARTICOLO PRODUTTORE",null,null,null,"CODICE ARTICOLO CONVENZIONE",null,null,"Descrizione Sintetica \n(si faccia riferimento alla guida alla convenzione per la descrizione estesa e \nper le regole di acquisto delle opzioni)",null,null,null,null,null,null,null,"Costo Unitario",null,"Costo Complessivo",null,1,null,null,{"$f":"SUM(Y3:Y12)","v":10},null,{"$f":"Y13+AA2","v":10},{"$f":"IF(AA13=0,\"_SavePDFon\",\"_SavePDFoff\")","v":"_SavePDFoff"}]
[null,"DELL EMC POWEREDGE C6420",null,null,null,null,null,null,null,null,null,null,null,null,null,null,null,null,null,null,null,{"$f":"IF(B15>=\"\",0,1)","v":0},null,"Server1","Server2","Server3",null,null,null,null,null,null,null,null,null,null,"Somma Server"]
[null,{"$f":"IF(AK15>=1,AK15,\"\")","v":""},{"$f":"IF(AK15>0,VLOOKUP($G15,'Codici&PrezzixRiepilogo'!A:E,2,FALSE),\"\")","v":""},null,null,null,{"$f":"IF(AK15>=1,W15,\"\")","v":""},null,null,{"$f":"IF(AK15>0,VLOOKUP($G15,'Codici&PrezzixRiepilogo'!A:E,3,FALSE),\"\")","v":""},null,null,null,null,null,null,null,{"$f":"IF(AK15>0,VLOOKUP($G15,'Codici&PrezzixRiepilogo'!A:E,4,FALSE),\"\")","v":""},null,{"$f":"IF(B15=\"\",\"\",R15*B15)","v":""},null,{"$f":"IF(B15>=\"\",0,1)","v":0},"TS2L7-SRV",{"$f":"'Lotto7-1'!$C$10","v":0},{"$f":"'Lotto7-2'!$C$10","v":0},{"$f":"'Lotto7-3'!$C$10","v":0},null,null,null,null,null,null,null,null,null,null,{"$f":"SUM(X15:AJ15)","v":0}]
[null,{"$f":"IF(AK16>=1,AK16,\"\")","v":""},{"$f":"IF(AK16>0,VLOOKUP($G16,'Codici&PrezzixRiepilogo'!B:E,4,FALSE),\"\")","v":""},null,null,null,{"$f":"IF(AK16>=1,W16,\"\")","v":""},null,null,{"$f":"IF(AK16>0,VLOOKUP($G16,'Codici&PrezzixRiepilogo'!B:E,2,FALSE),\"\")","v":""},null,null,null,null,null,null,null,{"$f":"IF(AK16>0,VLOOKUP($G16,'Codici&PrezzixRiepilogo'!B:E,3,FALSE),\"\")","v":""},null,{"$f":"IF(B16=\"\",\"\",R16*B16)","v":""},null,{"$f":"IF(B16>=\"\",0,1)","v":0},"TS2L7-CPU",{"$f":"'Lotto7-1'!$C$25*$X$15*4","v":0},{"$f":"'Lotto7-2'!$C$25*$Y$15*4","v":0},{"$f":"'Lotto7-3'!$C$25*$Z$15*4","v":0},null,null,null,null,null,null,null,null,null,null,{"$f":"SUM(X16:AJ16)","v":0}]
[null,{"$f":"IF(AK17>=1,AK17,\"\")","v":""},{"$f":"IF(AK17>0,VLOOKUP($G17,'Codici&PrezzixRiepilogo'!B:E,4,FALSE),\"\")","v":""},null,null,null,{"$f":"IF(AK17>=1,W17,\"\")","v":""},null,null,{"$f":"IF(AK17>0,VLOOKUP($G17,'Codici&PrezzixRiepilogo'!B:E,2,FALSE),\"\")","v":""},null,null,null,null,null,null,null,{"$f":"IF(AK17>0,VLOOKUP($G17,'Codici&PrezzixRiepilogo'!B:E,3,FALSE),\"\")","v":""},null,{"$f":"IF(B17=\"\",\"\",R17*B17)","v":""},null,0,"TS2L7-RAM16",null,null,null,null,null,null,null,null,null,null,null,null,null,{"$f":"SUM(X17:AJ17)","v":0}]
[null,"",{"$f":"IF(AK18>0,VLOOKUP($G18,'Codici&PrezzixRiepilogo'!B:E,4,FALSE),\"\")","v":""},null,null,null,"",null,null,{"$f":"IF(AK18>0,VLOOKUP($G18,'Codici&PrezzixRiepilogo'!B:E,2,FALSE),\"\")","v":""},null,null,null,null,null,null,null,{"$f":"IF(AK18>0,VLOOKUP($G18,'Codici&PrezzixRiepilogo'!B:E,3,FALSE),\"\")","v":""},null,"",null,0,"TS2L7-RAM32",{"$f":"IF('Lotto7-1'!$F$41=Riepilogo!$W18,('Lotto7-1'!$C$41-2)*Riepilogo!$X$15*4,0)","v":0},{"$f":"IF('Lotto7-2'!$F$41=Riepilogo!$W18,('Lotto7-2'!$C$41-2)*Riepilogo!$Y$15*4,0)","v":0},{"$f":"IF('Lotto7-3'!$F$41=Riepilogo!$W18,('Lotto7-3'!$C$41-2)*Riepilogo!$Z$15*4,0)","v":0},null,null,null,null,null,null,null,null,null,null,0]
[null,"",{"$f":"IF(AK19>0,VLOOKUP($G19,'Codici&PrezzixRiepilogo'!B:E,4,FALSE),\"\")","v":""},null,null,null,"",null,null,{"$f":"IF(AK19>0,VLOOKUP($G19,'Codici&PrezzixRiepilogo'!B:E,2,FALSE),\"\")","v":""},null,null,null,null,null,null,null,{"$f":"IF(AK19>0,VLOOKUP($G19,'Codici&PrezzixRiepilogo'!B:E,3,FALSE),\"\")","v":""},null,"",null,0,"TS2L7-RAM64",{"$f":"IF('Lotto7-1'!$F$41=Riepilogo!$W19,('Lotto7-1'!$C$41)*Riepilogo!$X$15*4,0)","v":0},{"$f":"IF('Lotto7-2'!$F$41=Riepilogo!$W19,('Lotto7-2'!$C$41)*Riepilogo!$Y$15*4,0)","v":0},{"$f":"IF('Lotto7-3'!$F$41=Riepilogo!$W19,('Lotto7-3'!$C$41)*Riepilogo!$Z$15*4,0)","v":0},null,null,null,null,null,null,null,null,null,null,0]
[null,"",{"$f":"IF(AK20>0,VLOOKUP($G20,'Codici&PrezzixRiepilogo'!B:E,4,FALSE),\"\")","v":""},null,null,null,"",null,null,{"$f":"IF(AK20>0,VLOOKUP($G20,'Codici&PrezzixRiepilogo'!B:E,2,FALSE),\"\")","v":""},null,null,null,null,null,null,null,{"$f":"IF(AK20>0,VLOOKUP($G20,'Codici&PrezzixRiepilogo'!B:E,3,FALSE),\"\")","v":""},null,"",null,0,"TS2L7-10K600",{"$f":"IF('Lotto7-1'!$F$69=Riepilogo!$W20,('Lotto7-1'!$C$69-2)*X15*4,0)","v":0},{"$f":"IF('Lotto7-2'!$F$69=Riepilogo!$W20,('Lotto7-2'!$C$69-2)*Y15*4,0)","v":0},{"$f":"IF('Lotto7-3'!$F$69=Riepilogo!$W20,('Lotto7-3'!$C$69-2)*Z15*4,0)","v":0},null,null,null,null,null,null,null,null,null,null,0]
[null,"",{"$f":"IF(AK21>0,VLOOKUP($G21,'Codici&PrezzixRiepilogo'!B:E,4,FALSE),\"\")","v":""},null,null,null,"",null,null,{"$f":"IF(AK21>0,VLOOKUP($G21,'Codici&PrezzixRiepilogo'!B:E,2,FALSE),\"\")","v":""},null,null,null,null,null,null,null,{"$f":"IF(AK21>0,VLOOKUP($G21,'Codici&PrezzixRiepilogo'!B:E,3,FALSE),\"\")","v":""},null,"",null,0,"TS2L7-10K1200",{"$f":"('Lotto7-1'!$C$71)*$X$15*4","v":0},{"$f":"('Lotto7-2'!$C$71)*$Y$15*4","v":0},{"$f":"('Lotto7-3'!$C$71)*$Z$15*4","v":0},null,null,null,null,null,null,null,null,null,null,0]
[null,"",{"$f":"IF(AK22>0,VLOOKUP($G22,'Codici&PrezzixRiepilogo'!B:E,4,FALSE),\"\")","v":""},null,null,null,"",null,null,{"$f":"IF(AK22>0,VLOOKUP($G22,'Codici&PrezzixRiepilogo'!B:E,2,FALSE),\"\")","v":""},null,null,null,null,null,null,null,{"$f":"IF(AK22>0,VLOOKUP($G22,'Codici&PrezzixRiepilogo'!B:E,3,FALSE),\"\")","v":""},null,"",null,0,"TS2L7-SSDR960",{"$f":"('Lotto7-1'!$C$83)*$X$15*4","v":0},{"$f":"('Lotto7-2'!$C$83)*$Y$15*4","v":0},{"$f":"('Lotto7-3'!$C$83)*$Z$15*4","v":0},null,null,null,null,null,null,null,null,null,null,{"$f":"SUM(X22:AJ22)","v":0}]
[null,"",{"$f":"IF(AK23>0,VLOOKUP($G23,'Codici&PrezzixRiepilogo'!B:E,4,FALSE),\"\")","v":""},null,null,null,"",null,null,{"$f":"IF(AK23>0,VLOOKUP($G23,'Codici&PrezzixRiepilogo'!B:E,2,FALSE),\"\")","v":""},null,null,null,null,null,null,null,{"$f":"IF(AK23>0,VLOOKUP($G23,'Codici&PrezzixRiepilogo'!B:E,3,FALSE),\"\")","v":""},null,"",null,0,"TS2L7-SSDR1920",{"$f":"('Lotto7-1'!$C$85)*$X$15*4","v":0},{"$f":"('Lotto7-2'!$C$85)*$Y$15*4","v":0},{"$f":"('Lotto7-3'!$C$85)*$Z$15*4","v":0},null,null,null,null,null,null,null,null,null,null,0]
[null,"",{"$f":"IF(AK24>0,VLOOKUP($G24,'Codici&PrezzixRiepilogo'!B:E,4,FALSE),\"\")","v":""},null,null,null,"",null,null,{"$f":"IF(AK24>0,VLOOKUP($G24,'Codici&PrezzixRiepilogo'!B:E,2,FALSE),\"\")","v":""},null,null,null,null,null,null,null,{"$f":"IF(AK24>0,VLOOKUP($G24,'Codici&PrezzixRiepilogo'!B:E,3,FALSE),\"\")","v":""},null,"",null,0,"TS2L7-LAN1",{"$f":"COUNTIF($AB$24:$AB$31,W24)*$X$15","v":0},{"$f":"COUNTIF($AC$24:$AC$31,W24)*$Y$15","v":0},{"$f":"COUNTIF($AD$24:$AD$31,W24)*$Z$15","v":0},null,{"$f":"'Lotto7-1'!$F$117","v":""},{"$f":"'Lotto7-2'!$F$117","v":""},{"$f":"'Lotto7-3'!$F$117","v":""},null,null,null,null,null,null,0]
[null,"",{"$f":"IF(AK25>0,VLOOKUP($G25,'Codici&PrezzixRiepilogo'!B:E,4,FALSE),\"\")","v":""},null,null,null,"",null,null,{"$f":"IF(AK25>0,VLOOKUP($G25,'Codici&PrezzixRiepilogo'!B:E,2,FALSE),\"\")","v":""},null,null,null,null,null,null,null,{"$f":"IF(AK25>0,VLOOKUP($G25,'Codici&PrezzixRiepilogo'!B:E,3,FALSE),\"\")","v":""},null,"",null,0,"TS2L7-LAN10",{"$f":"COUNTIF($AB$24:$AB$31,W25)*$X$15","v":0},{"$f":"COUNTIF($AC$24:$AC$31,W25)*$Y$15","v":0},{"$f":"COUNTIF($AD$24:$AD$31,W25)*$Z$15","v":0},null,{"$f":"'Lotto7-1'!$F$120","v":""},{"$f":"'Lotto7-2'!$F$120","v":""},{"$f":"'Lotto7-3'!$F$120","v":""},null,null,null,null,null,null,0]
[null,"",{"$f":"IF(AK26>0,VLOOKUP($G26,'Codici&PrezzixRiepilogo'!B:E,4,FALSE),\"\")","v":""},null,null,null,"",null,null,{"$f":"IF(AK26>0,VLOOKUP($G26,'Codici&PrezzixRiepilogo'!B:E,2,FALSE),\"\")","v":""},null,null,null,null,null,null,null,{"$f":"IF(AK26>0,VLOOKUP($G26,'Codici&PrezzixRiepilogo'!B:E,3,FALSE),\"\")","v":""},null,"",null,0,"TS2L7-CNA10",{"$f":"COUNTIF($AB$24:$AB$31,W26)*$X$15","v":0},{"$f":"COUNTIF($AC$24:$AC$31,W26)*$Y$15","v":0},{"$f":"COUNTIF($AD$24:$AD$31,W26)*$Z$15","v":0},null,{"$f":"'Lotto7-1'!$F$123","v":""},{"$f":"'Lotto7-2'!$F$123","v":""},{"$f":"'Lotto7-3'!$F$123","v":""},null,null,null,null,null,null,0]
[null,"",{"$f":"IF(AK27>0,VLOOKUP($G27,'Codici&PrezzixRiepilogo'!B:E,4,FALSE),\"\")","v":""},null,null,null,"",null,null,{"$f":"IF(AK27>0,VLOOKUP($G27,'Codici&PrezzixRiepilogo'!B:E,2,FALSE),\"\")","v":""},null,null,null,null,null,null,null,{"$f":"IF(AK27>0,VLOOKUP($G27,'Codici&PrezzixRiepilogo'!B:E,3,FALSE),\"\")","v":""},null,"",null,0,"TS2L7-FC8",{"$f":"COUNTIF($AB$24:$AB$31,W27)*$X$15","v":0},{"$f":"COUNTIF($AC$24:$AC$31,W27)*$Y$15","v":0},{"$f":"COUNTIF($AD$24:$AD$31,W27)*$Z$15","v":0},null,{"$f":"'Lotto7-1'!$F$126","v":""},{"$f":"'Lotto7-2'!$F$126","v":""},{"$f":"'Lotto7-3'!$F$126","v":""},null,null,null,null,null,null,0]
[null,"",{"$f":"IF(AK28>0,VLOOKUP($G28,'Codici&PrezzixRiepilogo'!B:E,4,FALSE),\"\")","v":""},null,null,null,"",null,null,{"$f":"IF(AK28>0,VLOOKUP($G28,'Codici&PrezzixRiepilogo'!B:E,2,FALSE),\"\")","v":""},null,null,null,null,null,null,null,{"$f":"IF(AK28>0,VLOOKUP($G28,'Codici&PrezzixRiepilogo'!B:E,3,FALSE),\"\")","v":""},null,"",null,0,"TS2L7-LAN1-L",{"$f":"COUNTIF($AB$24:$AB$31,W28)*$X$15*4","v":0},{"$f":"COUNTIF($AC$24:$AC$31,W28)*$Y$15*4","v":0},{"$f":"COUNTIF($AD$24:$AD$31,W28)*$Z$15*4","v":0},null,{"$f":"'Lotto7-1'!$F$129","v":0},{"$f":"'Lotto7-2'!$F$129","v":0},{"$f":"'Lotto7-3'!$F$129","v":0},null,null,null,null,null,null,0]
[null,"",{"$f":"IF(AK29>0,VLOOKUP($G29,'Codici&PrezzixRiepilogo'!B:E,4,FALSE),\"\")","v":""},null,null,null,"",null,null,{"$f":"IF(AK29>0,VLOOKUP($G29,'Codici&PrezzixRiepilogo'!B:E,2,FALSE),\"\")","v":""},null,null,null,null,null,null,null,{"$f":"IF(AK29>0,VLOOKUP($G29,'Codici&PrezzixRiepilogo'!B:E,3,FALSE),\"\")","v":""},null,"",null,0,"TS2L7-LAN10-L",{"$f":"COUNTIF($AB$24:$AB$31,W29)*$X$15*4","v":0},{"$f":"COUNTIF($AC$24:$AC$31,W29)*$Y$15*4","v":0},{"$f":"COUNTIF($AD$24:$AD$31,W29)*$Z$15*4","v":0},null,{"$f":"'Lotto7-1'!$F$132","v":""},{"$f":"'Lotto7-2'!$F$132","v":""},{"$f":"'Lotto7-3'!$F$132","v":""},null,null,null,null,null,null,0]
[null,"",{"$f":"IF(AK30>0,VLOOKUP($G30,'Codici&PrezzixRiepilogo'!B:E,4,FALSE),\"\")","v":""},null,null,null,"",null,null,{"$f":"IF(AK30>0,VLOOKUP($G30,'Codici&PrezzixRiepilogo'!B:E,2,FALSE),\"\")","v":""},null,null,null,null,null,null,null,{"$f":"IF(AK30>0,VLOOKUP($G30,'Codici&PrezzixRiepilogo'!B:E,3,FALSE),\"\")","v":""},null,"",null,0,"TS2L7-CNA10-L",{"$f":"COUNTIF($AB$24:$AB$31,W30)*$X$15*4","v":0},{"$f":"COUNTIF($AC$24:$AC$31,W30)*$Y$15*4","v":0},{"$f":"COUNTIF($AD$24:$AD$31,W30)*$Z$15*4","v":0},null,{"$f":"'Lotto7-1'!$F$135","v":""},{"$f":"'Lotto7-2'!$F$135","v":""},{"$f":"'Lotto7-3'!$F$135","v":""},null,null,null,null,null,null,0]
[null,"",{"$f":"IF(AK31>0,VLOOKUP($G31,'Codici&PrezzixRiepilogo'!B:E,4,FALSE),\"\")","v":""},null,null,null,"",null,null,{"$f":"IF(AK31>0,VLOOKUP($G31,'Codici&PrezzixRiepilogo'!B:E,2,FALSE),\"\")","v":""},null,null,null,null,null,null,null,{"$f":"IF(AK31>0,VLOOKUP($G31,'Codici&PrezzixRiepilogo'!B:E,3,FALSE),\"\")","v":""},null,"",null,0,"TS2L7-FC8-L",{"$f":"COUNTIF($AB$24:$AB$31,W31)*$X$15*4","v":0},{"$f":"COUNTIF($AC$24:$AC$31,W31)*$Y$15*4","v":0},{"$f":"COUNTIF($AD$24:$AD$31,W31)*$Z$15*4","v":0},null,{"$f":"'Lotto7-1'!$F$138","v":""},{"$f":"'Lotto7-2'!$F$138","v":""},{"$f":"'Lotto7-3'!$F$138","v":""},null,null,null,null,null,null,0]
[null,"",{"$f":"IF(AK32>0,VLOOKUP($G32,'Codici&PrezzixRiepilogo'!B:E,4,FALSE),\"\")","v":""},null,null,null,"",null,null,{"$f":"IF(AK32>0,VLOOKUP($G32,'Codici&PrezzixRiepilogo'!B:E,2,FALSE),\"\")","v":""},null,null,null,null,null,null,null,{"$f":"IF(AK32>0,VLOOKUP($G32,'Codici&PrezzixRiepilogo'!B:E,3,FALSE),\"\")","v":""},null,"",null,0,"TS2L7-4Y",{"$f":"IF('Lotto7-1'!$F$182=Riepilogo!$W32,('Lotto7-1'!$C$182)*$X$15,0)","v":0},{"$f":"IF('Lotto7-2'!$F$182=Riepilogo!$W32,('Lotto7-2'!$C$182)*$Y$15,0)","v":0},{"$f":"IF('Lotto7-3'!$F$182=Riepilogo!$W32,('Lotto7-3'!$C$182)*$Z$15,0)","v":0},null,null,null,null,null,null,null,null,null,null,0]
[null,"",{"$f":"IF(AK33>0,VLOOKUP($G33,'Codici&PrezzixRiepilogo'!B:E,4,FALSE),\"\")","v":""},null,null,null,"",null,null,{"$f":"IF(AK33>0,VLOOKUP($G33,'Codici&PrezzixRiepilogo'!B:E,2,FALSE),\"\")","v":""},null,null,null,null,null,null,null,{"$f":"IF(AK33>0,VLOOKUP($G33,'Codici&PrezzixRiepilogo'!B:E,3,FALSE),\"\")","v":""},null,"",null,0,"TS2L7-5Y",{"$f":"IF('Lotto7-1'!$F$182=Riepilogo!$W33,('Lotto7-1'!$C$182)*$X$15,0)","v":0},{"$f":"IF('Lotto7-2'!$F$182=Riepilogo!$W33,('Lotto7-2'!$C$182)*$Y$15,0)","v":0},{"$f":"IF('Lotto7-3'!$F$182=Riepilogo!$W33,('Lotto7-3'!$C$182)*$Z$15,0)","v":0},null,null,null,null,null,null,null,null,null,null,0]
[null,"",{"$f":"IF(AK34>0,VLOOKUP($G34,'Codici&PrezzixRiepilogo'!B:E,4,FALSE),\"\")","v":""},null,null,null,"",null,null,{"$f":"IF(AK34>0,VLOOKUP($G34,'Codici&PrezzixRiepilogo'!B:E,2,FALSE),\"\")","v":""},null,null,null,null,null,null,null,{"$f":"IF(AK34>0,VLOOKUP($G34,'Codici&PrezzixRiepilogo'!B:E,3,FALSE),\"\")","v":""},null,"",null,0,"TS2L7-WIN",{"$f":"IF('Lotto7-1'!$F$44=Riepilogo!$W34,('Lotto7-1'!$C$44)*$X$15*4,0)","v":0},{"$f":"IF('Lotto7-2'!$F$44=Riepilogo!$W34,('Lotto7-2'!$C$44)*$Y$15*4,0)","v":0},{"$f":"IF('Lotto7-3'!$F$44=Riepilogo!$W34,('Lotto7-3'!$C$44)*$Z$15*4,0)","v":0},null,null,null,null,null,null,null,null,null,null,0]
[null,"",{"$f":"IF(AK35>0,VLOOKUP($G35,'Codici&PrezzixRiepilogo'!B:E,4,FALSE),\"\")","v":""},null,null,null,"",null,null,{"$f":"IF(AK35>0,VLOOKUP($G35,'Codici&PrezzixRiepilogo'!B:E,2,FALSE),\"\")","v":""},null,null,null,null,null,null,null,{"$f":"IF(AK35>0,VLOOKUP($G35,'Codici&PrezzixRiepilogo'!B:E,3,FALSE),\"\")","v":""},null,"",null,0,"TS2L7-WIN2",{"$f":"IF('Lotto7-1'!$F$45=Riepilogo!$W35,('Lotto7-1'!$C$44)*$X$15*4,0)","v":0},{"$f":"IF('Lotto7-2'!$F$45=Riepilogo!$W35,('Lotto7-2'!$C$44)*$Y$15*4,0)","v":0},{"$f":"IF('Lotto7-3'!$F$45=Riepilogo!$W35,('Lotto7-3'!$C$44)*$Z$15*4,0)","v":0},null,null,null,null,null,null,null,null,null,null,0]
[null,"",{"$f":"IF(AK36>0,VLOOKUP($G36,'Codici&PrezzixRiepilogo'!B:E,4,FALSE),\"\")","v":""},null,null,null,{"$f":"IF(AK36>=1,W36,\"\")","v":""},null,null,{"$f":"IF(AK36>0,VLOOKUP($G36,'Codici&PrezzixRiepilogo'!B:E,2,FALSE),\"\")","v":""},null,null,null,null,null,null,null,{"$f":"IF(AK36>0,VLOOKUP($G36,'Codici&PrezzixRiepilogo'!B:E,3,FALSE),\"\")","v":""},null,{"$f":"IF(B36=\"\",\"\",R36*B36)","v":""},null,0,"TS2L7-WINDC",{"$f":"IF('Lotto7-1'!$F$44=Riepilogo!$W36,('Lotto7-1'!$C$44)*$X$15*4,0)","v":0},{"$f":"IF('Lotto7-2'!$F$44=Riepilogo!$W36,('Lotto7-2'!$C$44)*$Y$15*4,0)","v":0},{"$f":"IF('Lotto7-3'!$F$44=Riepilogo!$W36,('Lotto7-3'!$C$44)*$Z$15*4,0)","v":0},null,null,null,null,null,null,null,null,null,null,0]
[null,"",{"$f":"IF(AK37>0,VLOOKUP($G37,'Codici&PrezzixRiepilogo'!B:E,4,FALSE),\"\")","v":""},null,null,null,{"$f":"IF(AK37>=1,W37,\"\")","v":""},null,null,{"$f":"IF(AK37>0,VLOOKUP($G37,'Codici&PrezzixRiepilogo'!B:E,2,FALSE),\"\")","v":""},null,null,null,null,null,null,null,{"$f":"IF(AK37>0,VLOOKUP($G37,'Codici&PrezzixRiepilogo'!B:E,3,FALSE),\"\")","v":""},null,{"$f":"IF(B37=\"\",\"\",R37*B37)","v":""},null,{"$f":"IF(B37>=\"\",0,1)","v":0},"TS2L7-WINDC2",{"$f":"IF('Lotto7-1'!$F$45=Riepilogo!$W37,('Lotto7-1'!$C$44)*$X$15*4,0)","v":0},{"$f":"IF('Lotto7-2'!$F$45=Riepilogo!$W37,('Lotto7-2'!$C$44)*$Y$15*4,0)","v":0},{"$f":"IF('Lotto7-3'!$F$45=Riepilogo!$W37,('Lotto7-3'!$C$44)*$Z$15*4,0)","v":0},null,null,null,null,null,null,null,null,null,null,0]
[null,"",{"$f":"IF(AK38>0,VLOOKUP($G38,'Codici&PrezzixRiepilogo'!B:E,4,FALSE),\"\")","v":""},null,null,null,"",null,null,{"$f":"IF(AK38>0,VLOOKUP($G38,'Codici&PrezzixRiepilogo'!B:E,2,FALSE),\"\")","v":""},null,null,null,null,null,null,null,{"$f":"IF(AK38>0,VLOOKUP($G38,'Codici&PrezzixRiepilogo'!B:E,3,FALSE),\"\")","v":""},null,"",null,0,"TS2L7-LINUX",{"$f":"IF('Lotto7-1'!$F$44=Riepilogo!$W38,('Lotto7-1'!$C$44)*$X$15*4,0)","v":0},{"$f":"IF('Lotto7-2'!$F$44=Riepilogo!$W38,('Lotto7-2'!$C$44)*$Y$15*4,0)","v":0},{"$f":"IF('Lotto7-3'!$F$44=Riepilogo!$W38,('Lotto7-3'!$C$44)*$Z$15*4,0)","v":0},null,null,null,null,null,null,null,null,null,null,0]
[null,"",{"$f":"IF(AK39>0,VLOOKUP($G39,'Codici&PrezzixRiepilogo'!B:E,4,FALSE),\"\")","v":""},null,null,null,"",null,null,{"$f":"IF(AK39>0,VLOOKUP($G39,'Codici&PrezzixRiepilogo'!B:E,2,FALSE),\"\")","v":""},null,null,null,null,null,null,null,{"$f":"IF(AK39>0,VLOOKUP($G39,'Codici&PrezzixRiepilogo'!B:E,3,FALSE),\"\")","v":""},null,"",null,0,"TS2L7-CALDEV",{"$f":"'Lotto7-1'!$C$48*X15","v":0},{"$f":"'Lotto7-2'!$C$48*Y15","v":0},{"$f":"'Lotto7-3'!$C$48*Z15","v":0},null,null,null,null,null,null,null,null,null,null,0]
[null,"",{"$f":"IF(AK40>0,VLOOKUP($G40,'Codici&PrezzixRiepilogo'!B:E,4,FALSE),\"\")","v":""},null,null,null,"",null,null,{"$f":"IF(AK40>0,VLOOKUP($G40,'Codici&PrezzixRiepilogo'!B:E,2,FALSE),\"\")","v":""},null,null,null,null,null,null,null,{"$f":"IF(AK40>0,VLOOKUP($G40,'Codici&PrezzixRiepilogo'!B:E,3,FALSE),\"\")","v":""},null,"",null,0,"TS2L7-CALUSER",{"$f":"'Lotto7-1'!$C$50*X15","v":0},{"$f":"'Lotto7-2'!$C$50*Y15","v":0},{"$f":"'Lotto7-3'!$C$50*Z15","v":0},null,null,null,null,null,null,null,null,null,null,0]
[null,"OPZIONI COMUNI",null,null,null,null,null,null,null,null,null,null,null,null,null,null,null,null,null,null,null,{"$f":"IF(SUM(V42:V45)=0,0,1)","v":0}]
[null,"",{"$f":"IF(AK42>0,VLOOKUP($G42,'Codici&PrezzixRiepilogo'!A:E,2,FALSE),\"\")","v":""},null,null,null,{"$f":"IF(AK42>=1,W42,\"\")","v":""},null,null,{"$f":"IF(AK42>0,VLOOKUP($G42,'Codici&PrezzixRiepilogo'!A:E,3,FALSE),\"\")","v":""},null,null,null,null,null,null,null,{"$f":"IF(AK42>0,VLOOKUP($G42,'Codici&PrezzixRiepilogo'!A:E,4,FALSE),\"\")","v":""},null,{"$f":"IF(B42=\"\",\"\",R42*B42)","v":""},null,0,"TS2L7-RACK",{"$f":"'Rack e Accessori'!J6","v":0},null,null,null,null,null,null,null,null,null,null,null,null,0]
[null,"",{"$f":"IF(AK43>0,VLOOKUP($G43,'Codici&PrezzixRiepilogo'!A:E,2,FALSE),\"\")","v":""},null,null,null,{"$f":"IF(AK43>=1,W43,\"\")","v":""},null,null,{"$f":"IF(AK43>0,VLOOKUP($G43,'Codici&PrezzixRiepilogo'!A:E,3,FALSE),\"\")","v":""},null,null,null,null,null,null,null,{"$f":"IF(AK43>0,VLOOKUP($G43,'Codici&PrezzixRiepilogo'!A:E,4,FALSE),\"\")","v":""},null,{"$f":"IF(B43=\"\",\"\",R43*B43)","v":""},null,0,"TS2L7-GUI",{"$f":"'Rack e Accessori'!J39","v":0},null,null,null,null,null,null,null,null,null,null,null,null,0]
[null,"",{"$f":"IF(AK44>0,VLOOKUP($G44,'Codici&PrezzixRiepilogo'!A:E,2,FALSE),\"\")","v":""},null,null,null,"",null,null,{"$f":"IF(AK44>0,VLOOKUP($G44,'Codici&PrezzixRiepilogo'!A:E,3,FALSE),\"\")","v":""},null,null,null,null,null,null,null,{"$f":"IF(AK44>0,VLOOKUP($G44,'Codici&PrezzixRiepilogo'!A:E,4,FALSE),\"\")","v":""},null,"",null,0,"TS2L7-KVMIP",{"$f":"'Rack e Accessori'!J42","v":0},null,null,null,null,null,null,null,null,null,null,null,null,0]
[null,"",{"$f":"IF(AK45>0,VLOOKUP($G45,'Codici&PrezzixRiepilogo'!A:E,2,FALSE),\"\")","v":""},null,null,null,"",null,null,{"$f":"IF(AK45>0,VLOOKUP($G45,'Codici&PrezzixRiepilogo'!A:E,3,FALSE),\"\")","v":""},null,null,null,null,null,null,null,{"$f":"IF(AK45>0,VLOOKUP($G45,'Codici&PrezzixRiepilogo'!A:E,4,FALSE),\"\")","v":""},null,"",null,0,"TS2L7-UPS",{"$f":"'Rack e Accessori'!J45","v":0},null,null,null,null,null,null,null,null,null,null,null,null,0]
[null,"ULTERIORI OPZIONI 20%",null,null,null,null,null,null,null,null,null,null,null,null,null,null,null,null,null,null,null,{"$f":"IF(R76=0,0,1)","v":0}]
[null,{"$f":"IF(AK47>=1,AK47,\"\")","v":""},{"$f":"IF(AK47>0,VLOOKUP($G47,'Codici&PrezzixRiepilogo'!B:E,4,FALSE),\"\")","v":""},null,null,null,{"$f":"IF(AK47>=1,W47,\"\")","v":""},null,null,{"$f":"IF(AK47>0,VLOOKUP($G47,'Codici&PrezzixRiepilogo'!B:E,2,FALSE),\"\")","v":""},null,null,null,null,null,null,null,{"$f":"IF(AK47>0,VLOOKUP($G47,'Codici&PrezzixRiepilogo'!B:E,3,FALSE),\"\")","v":""},null,{"$f":"IF(B47=\"\",\"\",R47*B47)","v":""},null,0,"TS2L7-3MRJ45",{"$f":"'Lotto7-1'!C179*X15","v":0},{"$f":"'Lotto7-2'!C179*Y15","v":0},{"$f":"'Lotto7-3'!C179*Z15","v":0},{"$f":"'Lotto7 (Custom)'!C169*AA15","v":0},null,null,null,null,null,null,null,null,null,0]
[null,"",{"$f":"IF(AK48>0,VLOOKUP($G48,'Codici&PrezzixRiepilogo'!B:E,4,FALSE),\"\")","v":""},null,null,null,{"$f":"IF(AK48>=1,W48,\"\")","v":""},null,null,{"$f":"IF(AK48>0,VLOOKUP($G48,'Codici&PrezzixRiepilogo'!B:E,2,FALSE),\"\")","v":""},null,null,null,null,null,null,null,{"$f":"IF(AK48>0,VLOOKUP($G48,'Codici&PrezzixRiepilogo'!B:E,3,FALSE),\"\")","v":""},null,{"$f":"IF(B48=\"\",\"\",R48*B48)","v":""},null,0,"TS2L7-SSDM480",{"$f":"'Lotto7-1'!$C$77*4*$X$15","v":0},{"$f":"'Lotto7-2'!$C$77*4*$Y$15","v":0},{"$f":"'Lotto7-3'!$C$77*4*$Z$15","v":0},null,null,null,null,null,null,null,null,null,null,0]
[null,"",{"$f":"IF(AK49>0,VLOOKUP($G49,'Codici&PrezzixRiepilogo'!B:E,4,FALSE),\"\")","v":""},null,null,null,{"$f":"IF(AK49>=1,W49,\"\")","v":""},null,null,{"$f":"IF(AK49>0,VLOOKUP($G49,'Codici&PrezzixRiepilogo'!B:E,2,FALSE),\"\")","v":""},null,null,null,null,null,null,null,{"$f":"IF(AK49>0,VLOOKUP($G49,'Codici&PrezzixRiepilogo'!B:E,3,FALSE),\"\")","v":""},null,{"$f":"IF(B49=\"\",\"\",R49*B49)","v":""},null,0,"TS2L7-L7-BOSS240",{"$f":"COUNTIF($AB$24:$AB$31,W49)*$X$15*4","v":0},{"$f":"COUNTIF($AC$24:$AC$31,W49)*$Y$15*4","v":0},{"$f":"COUNTIF($AD$24:$AD$31,W49)*$Z$15*4","v":0},null,null,null,null,null,null,null,null,null,null,0]
[null,"",{"$f":"IF(AK50>0,VLOOKUP($G50,'Codici&PrezzixRiepilogo'!B:E,4,FALSE),\"\")","v":""},null,null,null,"",null,null,{"$f":"IF(AK50>0,VLOOKUP($G50,'Codici&PrezzixRiepilogo'!B:E,2,FALSE),\"\")","v":""},null,null,null,null,null,null,null,{"$f":"IF(AK50>0,VLOOKUP($G50,'Codici&PrezzixRiepilogo'!B:E,3,FALSE),\"\")","v":""},null,"",null,0,"TS2L7-MCX516A3-L",{"$f":"COUNTIF($AB$24:$AB$31,W50)*$X$15*4","v":0},{"$f":"COUNTIF($AC$24:$AC$31,W50)*$Y$15*4","v":0},{"$f":"COUNTIF($AD$24:$AD$31,W50)*$Z$15*4","v":0},null,null,null,null,null,null,null,null,null,null,0]
[null,"",{"$f":"IF(AK51>0,VLOOKUP($G51,'Codici&PrezzixRiepilogo'!B:E,4,FALSE),\"\")","v":""},null,null,null,"",null,null,{"$f":"IF(AK51>0,VLOOKUP($G51,'Codici&PrezzixRiepilogo'!B:E,2,FALSE),\"\")","v":""},null,null,null,null,null,null,null,{"$f":"IF(AK51>0,VLOOKUP($G51,'Codici&PrezzixRiepilogo'!B:E,3,FALSE),\"\")","v":""},null,"",null,0,"TS2L7-MCX4121A3-L",{"$f":"COUNTIF($AB$24:$AB$31,W51)*$X$15*4","v":0},{"$f":"COUNTIF($AC$24:$AC$31,W51)*$Y$15*4","v":0},{"$f":"COUNTIF($AD$24:$AD$31,W51)*$Z$15*4","v":0},null,null,null,null,null,null,null,null,null,null,0]
[null,{"$f":"IF(AK52>=1,AK52,\"\")","v":""},{"$f":"IF(AK52>0,VLOOKUP($G52,'Codici&PrezzixRiepilogo'!B:E,4,FALSE),\"\")","v":""},null,null,null,{"$f":"IF(AK52>=1,W52,\"\")","v":""},null,null,{"$f":"IF(AK52>0,VLOOKUP($G52,'Codici&PrezzixRiepilogo'!B:E,2,FALSE),\"\")","v":""},null,null,null,null,null,null,null,{"$f":"IF(AK52>0,VLOOKUP($G52,'Codici&PrezzixRiepilogo'!B:E,3,FALSE),\"\")","v":""},null,{"$f":"IF(B52=\"\",\"\",R52*B52)","v":""},null,0,"TS2L7-MCX5SP-L",{"$f":"COUNTIF($AB$24:$AB$31,W52)*$X$15*4","v":0},{"$f":"COUNTIF($AC$24:$AC$31,W52)*$Y$15*4","v":0},{"$f":"COUNTIF($AD$24:$AD$31,W52)*$Z$15*4","v":0},null,null,null,null,null,null,null,null,null,null,{"$f":"SUM(X52:AJ52)","v":0}]
[null,"",{"$f":"IF(AK53>0,VLOOKUP($G53,'Codici&PrezzixRiepilogo'!B:E,4,FALSE),\"\")","v":""},null,null,null,"",null,null,{"$f":"IF(AK53>0,VLOOKUP($G53,'Codici&PrezzixRiepilogo'!B:E,2,FALSE),\"\")","v":""},null,null,null,null,null,null,null,{"$f":"IF(AK53>0,VLOOKUP($G53,'Codici&PrezzixRiepilogo'!B:E,3,FALSE),\"\")","v":""},null,"",null,0,"TS2L7-HBASAS12-L",{"$f":"COUNTIF($AB$24:$AB$31,W53)*$X$15*4","v":0},{"$f":"COUNTIF($AC$24:$AC$31,W53)*$Y$15*4","v":0},{"$f":"COUNTIF($AD$24:$AD$31,W53)*$Z$15*4","v":0},null,null,null,null,null,null,null,null,null,null,0]
[null,"",{"$f":"IF(AK54>0,VLOOKUP($G54,'Codici&PrezzixRiepilogo'!B:E,4,FALSE),\"\")","v":""},null,null,null,"",null,null,{"$f":"IF(AK54>0,VLOOKUP($G54,'Codici&PrezzixRiepilogo'!B:E,2,FALSE),\"\")","v":""},null,null,null,null,null,null,null,{"$f":"IF(AK54>0,VLOOKUP($G54,'Codici&PrezzixRiepilogo'!B:E,3,FALSE),\"\")","v":""},null,"",null,0,"TS2L7-L7-H730P",{"$f":"IF('Lotto7-1'!$F$66=W54,('Lotto7-1'!$C$66*4*Riepilogo!$X$15),0)","v":0},{"$f":"IF('Lotto7-2'!$F$66=W54,('Lotto7-2'!$C$66*4*Riepilogo!$Y$15),0)","v":0},{"$f":"IF('Lotto7-3'!$F$66=W54,('Lotto7-3'!$C$66*4*Riepilogo!$Z$15),0)","v":0},null,null,null,null,null,null,null,null,null,null,0]
[null,"",{"$f":"IF(AK55>0,VLOOKUP($G55,'Codici&PrezzixRiepilogo'!B:E,4,FALSE),\"\")","v":""},null,null,null,{"$f":"IF(AK55>=1,W55,\"\")","v":""},null,null,{"$f":"IF(AK55>0,VLOOKUP($G55,'Codici&PrezzixRiepilogo'!B:E,2,FALSE),\"\")","v":""},null,null,null,null,null,null,null,{"$f":"IF(AK55>0,VLOOKUP($G55,'Codici&PrezzixRiepilogo'!B:E,3,FALSE),\"\")","v":""},null,{"$f":"IF(B55=\"\",\"\",R55*B55)","v":""},null,0,"TS2L7-L7-HBA330",{"$f":"IF('Lotto7-1'!$F$66=W55,('Lotto7-1'!$C$66*4*Riepilogo!$X$15),0)","v":0},{"$f":"IF('Lotto7-2'!$F$66=W55,('Lotto7-2'!$C$66*4*Riepilogo!$Y$15),0)","v":0},{"$f":"IF('Lotto7-3'!$F$66=W55,('Lotto7-3'!$C$66*4*Riepilogo!$Z$15),0)","v":0},null,null,null,null,null,null,null,null,null,null,0]
[null,"",{"$f":"IF(AK56>0,VLOOKUP($G56,'Codici&PrezzixRiepilogo'!B:E,4,FALSE),\"\")","v":""},null,null,null,"",null,null,{"$f":"IF(AK56>0,VLOOKUP($G56,'Codici&PrezzixRiepilogo'!B:E,2,FALSE),\"\")","v":""},null,null,null,null,null,null,null,{"$f":"IF(AK56>0,VLOOKUP($G56,'Codici&PrezzixRiepilogo'!B:E,3,FALSE),\"\")","v":""},null,"",null,0,"TS2L7-Q41162T-L",{"$f":"COUNTIF($AB$24:$AB$31,W56)*$X$15*4","v":0},{"$f":"COUNTIF($AC$24:$AC$31,W56)*$Y$15*4","v":0},{"$f":"COUNTIF($AD$24:$AD$31,W56)*$Z$15*4","v":0},null,null,null,null,null,null,null,null,null,null,0]
[null,"",{"$f":"IF(AK57>0,VLOOKUP($G57,'Codici&PrezzixRiepilogo'!B:E,4,FALSE),\"\")","v":""},null,null,null,"",null,null,{"$f":"IF(AK57>0,VLOOKUP($G57,'Codici&PrezzixRiepilogo'!B:E,2,FALSE),\"\")","v":""},null,null,null,null,null,null,null,{"$f":"IF(AK57>0,VLOOKUP($G57,'Codici&PrezzixRiepilogo'!B:E,3,FALSE),\"\")","v":""},null,"",null,0,"TS2L7-Q41164T-L",{"$f":"COUNTIF($AB$24:$AB$31,W57)*$X$15*4","v":0},{"$f":"COUNTIF($AC$24:$AC$31,W57)*$Y$15*4","v":0},{"$f":"COUNTIF($AD$24:$AD$31,W57)*$Z$15*4","v":0},null,null,null,null,null,null,null,null,null,null,0]
[null,"",{"$f":"IF(AK58>0,VLOOKUP($G58,'Codici&PrezzixRiepilogo'!B:E,4,FALSE),\"\")","v":""},null,null,null,"",null,null,{"$f":"IF(AK58>0,VLOOKUP($G58,'Codici&PrezzixRiepilogo'!B:E,2,FALSE),\"\")","v":""},null,null,null,null,null,null,null,{"$f":"IF(AK58>0,VLOOKUP($G58,'Codici&PrezzixRiepilogo'!B:E,3,FALSE),\"\")","v":""},null,"",null,0,"TS2L7-B57416T-L",{"$f":"COUNTIF($AB$24:$AB$31,W58)*$X$15*4","v":0},{"$f":"COUNTIF($AC$24:$AC$31,W58)*$Y$15*4","v":0},{"$f":"COUNTIF($AD$24:$AD$31,W58)*$Z$15*4","v":0},null,null,null,null,null,null,null,null,null,null,0]
[null,"",{"$f":"IF(AK59>0,VLOOKUP($G59,'Codici&PrezzixRiepilogo'!B:E,4,FALSE),\"\")","v":""},null,null,null,"",null,null,{"$f":"IF(AK59>0,VLOOKUP($G59,'Codici&PrezzixRiepilogo'!B:E,2,FALSE),\"\")","v":""},null,null,null,null,null,null,null,{"$f":"IF(AK59>0,VLOOKUP($G59,'Codici&PrezzixRiepilogo'!B:E,3,FALSE),\"\")","v":""},null,"",null,0,"TS2L7-5XDAC10M3",{"$f":"'Lotto7-1'!$C$175*Riepilogo!$X$15","v":0},{"$f":"'Lotto7-2'!$C$175*Riepilogo!$Y$15","v":0},{"$f":"'Lotto7-3'!$C$175*Riepilogo!$Z$15","v":0},null,null,null,null,null,null,null,null,null,null,0]
[null,"",{"$f":"IF(AK60>0,VLOOKUP($G60,'Codici&PrezzixRiepilogo'!B:E,4,FALSE),\"\")","v":""},null,null,null,"",null,null,{"$f":"IF(AK60>0,VLOOKUP($G60,'Codici&PrezzixRiepilogo'!B:E,2,FALSE),\"\")","v":""},null,null,null,null,null,null,null,{"$f":"IF(AK60>0,VLOOKUP($G60,'Codici&PrezzixRiepilogo'!B:E,3,FALSE),\"\")","v":""},null,"",null,0,"TS2L7-SSDW1600",{"$f":"'Lotto7-1'!$C$81*4*Riepilogo!$X$15","v":0},{"$f":"'Lotto7-2'!$C$81*4*Riepilogo!$Y$15","v":0},{"$f":"'Lotto7-3'!$C$81*4*Riepilogo!$Z$15","v":0},null,null,null,null,null,null,null,null,null,null,0]
[null,"",{"$f":"IF(AK61>0,VLOOKUP($G61,'Codici&PrezzixRiepilogo'!B:E,4,FALSE),\"\")","v":""},null,null,null,"",null,null,{"$f":"IF(AK61>0,VLOOKUP($G61,'Codici&PrezzixRiepilogo'!B:E,2,FALSE),\"\")","v":""},null,null,null,null,null,null,null,{"$f":"IF(AK61>0,VLOOKUP($G61,'Codici&PrezzixRiepilogo'!B:E,3,FALSE),\"\")","v":""},null,"",null,0,"TS2L7-SSDW400",{"$f":"'Lotto7-1'!$C$79*4*Riepilogo!$X$15","v":0},{"$f":"'Lotto7-2'!$C$79*4*Riepilogo!$Y$15","v":0},{"$f":"'Lotto7-3'!$C$79*4*Riepilogo!$Z$15","v":0},null,null,null,null,null,null,null,null,null,null,0]
[null,"",{"$f":"IF(AK62>0,VLOOKUP($G62,'Codici&PrezzixRiepilogo'!B:E,4,FALSE),\"\")","v":""},null,null,null,"",null,null,{"$f":"IF(AK62>0,VLOOKUP($G62,'Codici&PrezzixRiepilogo'!B:E,2,FALSE),\"\")","v":""},null,null,null,null,null,null,null,{"$f":"IF(AK62>0,VLOOKUP($G62,'Codici&PrezzixRiepilogo'!B:E,3,FALSE),\"\")","v":""},null,"",null,0,"TS2L7-L7-10K2400",{"$f":"'Lotto7-1'!$C$75*4*Riepilogo!$X$15","v":0},{"$f":"'Lotto7-2'!$C$75*4*Riepilogo!$Y$15","v":0},{"$f":"'Lotto7-3'!$C$75*4*Riepilogo!$Z$15","v":0},null,null,null,null,null,null,null,null,null,null,0]
[null,"",{"$f":"IF(AK63>0,VLOOKUP($G63,'Codici&PrezzixRiepilogo'!B:E,4,FALSE),\"\")","v":""},null,null,null,"",null,null,{"$f":"IF(AK63>0,VLOOKUP($G63,'Codici&PrezzixRiepilogo'!B:E,2,FALSE),\"\")","v":""},null,null,null,null,null,null,null,{"$f":"IF(AK63>0,VLOOKUP($G63,'Codici&PrezzixRiepilogo'!B:E,3,FALSE),\"\")","v":""},null,"",null,0,"TS2L7-10GOT",{"$f":"'Lotto7-1'!$C$127*4*Riepilogo!$X$15","v":0},{"$f":"'Lotto7-2'!$C$127*4*Riepilogo!$Y$15","v":0},{"$f":"'Lotto7-3'!$C$127*4*Riepilogo!$Z$15","v":0},null,null,null,null,null,null,null,null,null,null,0]
[null,"",{"$f":"IF(AK64>0,VLOOKUP($G64,'Codici&PrezzixRiepilogo'!B:E,4,FALSE),\"\")","v":""},null,null,null,{"$f":"IF(AK64>=1,W64,\"\")","v":""},null,null,{"$f":"IF(AK64>0,VLOOKUP($G64,'Codici&PrezzixRiepilogo'!B:E,2,FALSE),\"\")","v":""},null,null,null,null,null,null,null,{"$f":"IF(AK64>0,VLOOKUP($G64,'Codici&PrezzixRiepilogo'!B:E,3,FALSE),\"\")","v":""},null,{"$f":"IF(B64=\"\",\"\",R64*B64)","v":""},null,0,"TS2L7-VMWKIT6P3Y",{"$f":"IF('Lotto7-1'!F54=Riepilogo!W64,'Lotto7-1'!C54,0)*$X$15","v":0},null,null,null,null,null,null,null,null,null,null,null,null,0]
[null,"",{"$f":"IF(AK65>0,VLOOKUP($G65,'Codici&PrezzixRiepilogo'!B:E,4,FALSE),\"\")","v":""},null,null,null,"",null,null,{"$f":"IF(AK65>0,VLOOKUP($G65,'Codici&PrezzixRiepilogo'!B:E,2,FALSE),\"\")","v":""},null,null,null,null,null,null,null,{"$f":"IF(AK65>0,VLOOKUP($G65,'Codici&PrezzixRiepilogo'!B:E,3,FALSE),\"\")","v":""},null,"",null,0,"TS2L7-VMWSTD1P3Y",{"$f":"IF('Lotto7-1'!$F$58=Riepilogo!$W65,'Lotto7-1'!$C$58,0)*$X$15*4","v":0},{"$f":"IF('Lotto7-2'!$F$58=Riepilogo!$W65,'Lotto7-2'!$C$58,0)*$Y$15*4","v":0},{"$f":"IF('Lotto7-3'!$F$58=Riepilogo!$W65,'Lotto7-3'!$C$58,0)*$Z$15*4","v":0},null,null,null,null,null,null,null,null,null,null,0]
[null,"",{"$f":"IF(AK66>0,VLOOKUP($G66,'Codici&PrezzixRiepilogo'!B:E,4,FALSE),\"\")","v":""},null,null,null,"",null,null,{"$f":"IF(AK66>0,VLOOKUP($G66,'Codici&PrezzixRiepilogo'!B:E,2,FALSE),\"\")","v":""},null,null,null,null,null,null,null,{"$f":"IF(AK66>0,VLOOKUP($G66,'Codici&PrezzixRiepilogo'!B:E,3,FALSE),\"\")","v":""},null,"",null,0,"TS2L7-VMWVCSTD3Y",{"$f":"IF('Lotto7-1'!F56=Riepilogo!W66,'Lotto7-1'!C56,0)*$X$15","v":0},null,null,null,null,null,null,null,null,null,null,null,null,0]
[null,"",{"$f":"IF(AK67>0,VLOOKUP($G67,'Codici&PrezzixRiepilogo'!B:E,4,FALSE),\"\")","v":""},null,null,null,"",null,null,{"$f":"IF(AK67>0,VLOOKUP($G67,'Codici&PrezzixRiepilogo'!B:E,2,FALSE),\"\")","v":""},null,null,null,null,null,null,null,{"$f":"IF(AK67>0,VLOOKUP($G67,'Codici&PrezzixRiepilogo'!B:E,3,FALSE),\"\")","v":""},null,"",null,0,"TS2L7-VMWVCSTD5Y",{"$f":"IF('Lotto7-1'!$F$58=Riepilogo!$W67,'Lotto7-1'!$C$58,0)*$X$15*4","v":0},{"$f":"IF('Lotto7-2'!$F$58=Riepilogo!$W67,'Lotto7-2'!$C$58,0)*$Y$15*4","v":0},{"$f":"IF('Lotto7-3'!$F$58=Riepilogo!$W67,'Lotto7-3'!$C$58,0)*$Z$15*4","v":0},null,null,null,null,null,null,null,null,null,null,0]
[null,"",{"$f":"IF(AK68>0,VLOOKUP($G68,'Codici&PrezzixRiepilogo'!B:E,4,FALSE),\"\")","v":""},null,null,null,"",null,null,{"$f":"IF(AK68>0,VLOOKUP($G68,'Codici&PrezzixRiepilogo'!B:E,2,FALSE),\"\")","v":""},null,null,null,null,null,null,null,{"$f":"IF(AK68>0,VLOOKUP($G68,'Codici&PrezzixRiepilogo'!B:E,3,FALSE),\"\")","v":""},null,"",null,{"$f":"IF(B67>=\"\",0,1)","v":0},"TS2L7-VMWEP1P3Y",{"$f":"IF('Lotto7-1'!$F$58=Riepilogo!$W68,'Lotto7-1'!$C$58,0)*$X$15*4","v":0},{"$f":"IF('Lotto7-2'!$F$58=Riepilogo!$W68,'Lotto7-2'!$C$58,0)*$Y$15*4","v":0},{"$f":"IF('Lotto7-3'!$F$58=Riepilogo!$W68,'Lotto7-3'!$C$58,0)*$Z$15*4","v":0},null,null,null,null,null,null,null,null,null,null,0]
[null,"",{"$f":"IF(AK69>0,VLOOKUP($G69,'Codici&PrezzixRiepilogo'!B:E,4,FALSE),\"\")","v":""},null,null,null,"",null,null,{"$f":"IF(AK69>0,VLOOKUP($G69,'Codici&PrezzixRiepilogo'!B:E,2,FALSE),\"\")","v":""},null,null,null,null,null,null,null,{"$f":"IF(AK69>0,VLOOKUP($G69,'Codici&PrezzixRiepilogo'!B:E,3,FALSE),\"\")","v":""},null,"",null,0,"TS2L7-VMWEP1P5Y",{"$f":"IF('Lotto7-1'!$F$58=Riepilogo!$W69,'Lotto7-1'!$C$58,0)*$X$15*4","v":0},{"$f":"IF('Lotto7-2'!$F$58=Riepilogo!$W69,'Lotto7-2'!$C$58,0)*$Y$15*4","v":0},{"$f":"IF('Lotto7-3'!$F$58=Riepilogo!$W69,'Lotto7-3'!$C$58,0)*$Z$15*4","v":0},null,null,null,null,null,null,null,null,null,null,0]
[null,"",{"$f":"IF(AK70>0,VLOOKUP($G70,'Codici&PrezzixRiepilogo'!B:E,4,FALSE),\"\")","v":""},null,null,null,"",null,null,{"$f":"IF(AK70>0,VLOOKUP($G70,'Codici&PrezzixRiepilogo'!B:E,2,FALSE),\"\")","v":""},null,null,null,null,null,null,null,{"$f":"IF(AK70>0,VLOOKUP($G70,'Codici&PrezzixRiepilogo'!B:E,3,FALSE),\"\")","v":""},null,"",null,0,"TS2L7-VSANSTD3Y",{"$f":"IF('Lotto7-1'!$F$60=Riepilogo!$W70,'Lotto7-1'!$C$60,0)*$X$15*4","v":0},{"$f":"IF('Lotto7-2'!$F$60=Riepilogo!$W70,'Lotto7-2'!$C$60,0)*$Y$15*4","v":0},{"$f":"IF('Lotto7-3'!$F$60=Riepilogo!$W70,'Lotto7-3'!$C$60,0)*$Z$15*4","v":0},null,null,null,null,null,null,null,null,null,null,0]
[null,"",{"$f":"IF(AK71>0,VLOOKUP($G71,'Codici&PrezzixRiepilogo'!B:E,4,FALSE),\"\")","v":""},null,null,null,"",null,null,{"$f":"IF(AK71>0,VLOOKUP($G71,'Codici&PrezzixRiepilogo'!B:E,2,FALSE),\"\")","v":""},null,null,null,null,null,null,null,{"$f":"IF(AK71>0,VLOOKUP($G71,'Codici&PrezzixRiepilogo'!B:E,3,FALSE),\"\")","v":""},null,"",null,0,"TS2L7-VSANSTD5Y",{"$f":"IF('Lotto7-1'!$F$60=Riepilogo!$W71,'Lotto7-1'!$C$60,0)*$X$15*4","v":0},{"$f":"IF('Lotto7-2'!$F$60=Riepilogo!$W71,'Lotto7-2'!$C$60,0)*$Y$15*4","v":0},{"$f":"IF('Lotto7-3'!$F$60=Riepilogo!$W71,'Lotto7-3'!$C$60,0)*$Z$15*4","v":0},null,null,null,null,null,null,null,null,null,null,0]
[null,"",{"$f":"IF(AK72>0,VLOOKUP($G72,'Codici&PrezzixRiepilogo'!B:E,4,FALSE),\"\")","v":""},null,null,null,"",null,null,{"$f":"IF(AK72>0,VLOOKUP($G72,'Codici&PrezzixRiepilogo'!B:E,2,FALSE),\"\")","v":""},null,null,null,null,null,null,null,{"$f":"IF(AK72>0,VLOOKUP($G72,'Codici&PrezzixRiepilogo'!B:E,3,FALSE),\"\")","v":""},null,"",null,0,"TS2L7-VSANADV3Y",{"$f":"IF('Lotto7-1'!$F$60=Riepilogo!$W72,'Lotto7-1'!$C$60,0)*$X$15*4","v":0},{"$f":"IF('Lotto7-2'!$F$60=Riepilogo!$W72,'Lotto7-2'!$C$60,0)*$Y$15*4","v":0},{"$f":"IF('Lotto7-3'!$F$60=Riepilogo!$W72,'Lotto7-3'!$C$60,0)*$Z$15*4","v":0},null,null,null,null,null,null,null,null,null,null,0]
[null,"",{"$f":"IF(AK73>0,VLOOKUP($G73,'Codici&PrezzixRiepilogo'!B:E,4,FALSE),\"\")","v":""},null,null,null,"",null,null,{"$f":"IF(AK73>0,VLOOKUP($G73,'Codici&PrezzixRiepilogo'!B:E,2,FALSE),\"\")","v":""},null,null,null,null,null,null,null,{"$f":"IF(AK73>0,VLOOKUP($G73,'Codici&PrezzixRiepilogo'!B:E,3,FALSE),\"\")","v":""},null,"",null,0,"TS2L7-VSANADV5Y",{"$f":"IF('Lotto7-1'!$F$60=Riepilogo!$W73,'Lotto7-1'!$C$60,0)*$X$15*4","v":0},{"$f":"IF('Lotto7-2'!$F$60=Riepilogo!$W73,'Lotto7-2'!$C$60,0)*$Y$15*4","v":0},{"$f":"IF('Lotto7-3'!$F$60=Riepilogo!$W73,'Lotto7-3'!$C$60,0)*$Z$15*4","v":0},null,null,null,null,null,null,null,null,null,null,0]
[null,"",{"$f":"IF(AK74>0,VLOOKUP($G74,'Codici&PrezzixRiepilogo'!B:E,4,FALSE),\"\")","v":""},null,null,null,"",null,null,{"$f":"IF(AK74>0,VLOOKUP($G74,'Codici&PrezzixRiepilogo'!B:E,2,FALSE),\"\")","v":""},null,null,null,null,null,null,null,{"$f":"IF(AK74>0,VLOOKUP($G74,'Codici&PrezzixRiepilogo'!B:E,3,FALSE),\"\")","v":""},null,"",null,{"$f":"IF(B74>=\"\",0,1)","v":0},"TS2L7-10K1800",{"$f":"'Lotto7-1'!$C$73*4*Riepilogo!$X$15","v":0},{"$f":"'Lotto7-2'!$C$73*4*Riepilogo!$Y$15","v":0},{"$f":"'Lotto7-3'!$C$73*4*Riepilogo!$Z$15","v":0},null,null,null,null,null,null,null,null,null,null,0]
[null,"TOTALE PRODOTTI CONVENZIONE (I.V.A. Esclusa)",null,null,null,null,null,null,null,null,null,null,null,null,null,null,null,{"$f":"SUM(T15:U45)","v":0},null,null,null,1]
[null,"TOTALE ULTERIORI OPZIONI (I.V.A. Esclusa)",null,null,null,null,null,null,null,null,null,null,null,null,null,null,null,{"$f":"SUM(T47:U74)","v":0},null,null,null,{"$f":"IF(R76>0,1,0)","v":0}]
[null,"TOTALE (I.V.A. Esclusa)",null,null,null,null,null,null,null,null,null,null,null,null,null,null,null,{"$f":"R76+R75","v":0},null,null,null,1]
[null,"I.V.A.",null,null,null,null,null,null,null,null,null,null,null,null,null,null,null,{"$f":"R77*22%","v":0},null,null,null,1]
[null,"TOTALE ORDINE",null,null,null,null,null,null,null,null,null,null,null,null,null,null,null,{"$f":"SUM(R77:U78)","v":0},null,null,null,1]
[null,null,null,null,null,null,null,null,null,null,null,null,null,null,null,null,null,null,null,null,null,1]
[null,null,null,null,null,null,null,null,null,null,null,null,null,null,null,null,null,null,null,null,null,1]
[null,null,null,null,null,null,null,null,null,null,null,null,null,null,null,null,null,null,null,null,null,1]
[null,null,null,{"$f":"IF(G6>0,\"DETTAGLIO CONFIGURAZIONI SERVER LOTTO 7 \",\"\")","v":"DETTAGLIO CONFIGURAZIONI SERVER LOTTO 7 "},null,null,null,null,null,null,null,null,null,null,null,null,null,null,null,null,null,1]
[null,null,null,null,null,null,null,null,null,null,null,null,null,null,null,null,null,null,null,null,null,1]
[null,null,null,null,null,null,null,null,null,null,null,null,null,null,null,null,null,null,null,null,null,1]
[null,null,null,null,null,null,null,null,null,null,null,null,null,null,null,null,null,null,null,null,null,{"$f":"IF($B$15>=\"\",0,1)","v":0}]
[null," PowerEdge R6420 Conf.1",null,null,{"$f":"X15","v":0},"Server",null,null,"PowerEdge R6420 Conf.2",null,null,{"$f":"Y15","v":0},"Server",null,null,"PowerEdge R6420 Conf.3",null,null,{"$f":"Z15","v":0},"Server",null,{"$f":"IF($B$15>=\"\",0,1)","v":0}]
[null,null,null,null,null,null,null,null,null,null,null,null,null,null,null,null,null,null,null,null,null,{"$f":"IF($B$15>=\"\",0,1)","v":0}]
[null,{"$f":"IF(X15>0,\"1\",\"-\")","v":"-"},{"$f":"IF(B89=\"-\",\"-\",CONCATENATE(MID($C$15,1,21),\" - \",$G$15))","v":"-"},null,null,null,null,null,{"$f":"IF(Y15>0,\"1\",\"-\")","v":"-"},{"$f":"IF(I89=\"-\",\"-\",CONCATENATE(MID($C$15,1,21),\" - \",$G$15))","v":"-"},null,null,null,null,null,{"$f":"IF(Z15>0,\"1\",\"-\")","v":"-"},{"$f":"IF(P89=\"-\",\"-\",CONCATENATE(MID($C$15,1,21),\" - \",$G$15))","v":"-"},null,null,null,null,{"$f":"IF((Y89+X89+W89)>0,1,0)","v":0},{"$f":"IF(B89=\"-\",0,B89)","v":0},{"$f":"IF(I89=\"-\",0,I89)","v":0},{"$f":"IF(P89=\"-\",0,P89)","v":0}]
[null,{"$f":"IF(X16=0,\"-\",X16/$E$87)","v":"-"},{"$f":"IF(B90=\"-\",\"-\",CONCATENATE(MID(C16,1,21),\" - \",G16))","v":"-"},null,null,null,null,null,{"$f":"IF(Y16=0,\"-\",Y16/$L$87)","v":"-"},{"$f":"IF(I90=\"-\",\"-\",CONCATENATE(MID(C16,1,21),\" - \",G16))","v":"-"},null,null,null,null,null,{"$f":"IF(Z16=0,\"-\",Z16/$S$87)","v":"-"},{"$f":"IF(P90=\"-\",\"-\",CONCATENATE(MID(C16,1,21),\" - \",G16))","v":"-"},null,null,null,null,{"$f":"IF((Y90+X90+W90)>0,1,0)","v":0},0,0,0]
[null,{"$f":"IF(X17=0,\"-\",X17/$E$87)","v":"-"},{"$f":"IF(B91=\"-\",\"-\",CONCATENATE(MID(C17,1,21),\" - \",G17))","v":"-"},null,null,null,null,null,{"$f":"IF(Y17=0,\"-\",Y17/$L$87)","v":"-"},{"$f":"IF(I91=\"-\",\"-\",CONCATENATE(MID(C17,1,21),\" - \",G17))","v":"-"},null,null,null,null,null,{"$f":"IF(Z17=0,\"-\",Z17/$S$87)","v":"-"},{"$f":"IF(P91=\"-\",\"-\",CONCATENATE(MID(C17,1,21),\" - \",G17))","v":"-"},null,null,null,null,{"$f":"IF((Y91+X91+W91)>0,1,0)","v":0},0,0,0]
[null,{"$f":"IF(X18=0,\"-\",X18/$E$87)","v":"-"},{"$f":"IF(B92=\"-\",\"-\",CONCATENATE(MID(C18,1,21),\" - \",G18))","v":"-"},null,null,null,null,null,{"$f":"IF(Y18=0,\"-\",Y18/$L$87)","v":"-"},{"$f":"IF(I92=\"-\",\"-\",CONCATENATE(MID(C18,1,21),\" - \",G18))","v":"-"},null,null,null,null,null,{"$f":"IF(Z18=0,\"-\",Z18/$S$87)","v":"-"},{"$f":"IF(P92=\"-\",\"-\",CONCATENATE(MID(C18,1,21),\" - \",G18))","v":"-"},null,null,null,null,0,0,0,0]
[null,{"$f":"IF(X19=0,\"-\",X19/$E$87)","v":"-"},{"$f":"IF(B93=\"-\",\"-\",CONCATENATE(MID(C19,1,21),\" - \",G19))","v":"-"},null,null,null,null,null,{"$f":"IF(Y19=0,\"-\",Y19/$L$87)","v":"-"},{"$f":"IF(I93=\"-\",\"-\",CONCATENATE(MID(C19,1,21),\" - \",G19))","v":"-"},null,null,null,null,null,{"$f":"IF(Z19=0,\"-\",Z19/$S$87)","v":"-"},{"$f":"IF(P93=\"-\",\"-\",CONCATENATE(MID(C19,1,21),\" - \",G19))","v":"-"},null,null,null,null,{"$f":"IF((Y93+X93+W93)>0,1,0)","v":0},0,0,0]
[null,{"$f":"IF(X20=0,\"-\",X20/$E$87)","v":"-"},{"$f":"IF(B94=\"-\",\"-\",CONCATENATE(MID(C20,1,21),\" - \",G20))","v":"-"},null,null,null,null,null,{"$f":"IF(Y20=0,\"-\",Y20/$L$87)","v":"-"},{"$f":"IF(I94=\"-\",\"-\",CONCATENATE(MID(C20,1,21),\" - \",G20))","v":"-"},null,null,null,null,null,{"$f":"IF(Z20=0,\"-\",Z20/$S$87)","v":"-"},{"$f":"IF(P94=\"-\",\"-\",CONCATENATE(MID(C20,1,21),\" - \",G20))","v":"-"},null,null,null,null,0,0,0,0]
[null,{"$f":"IF(X21=0,\"-\",X21/$E$87)","v":"-"},{"$f":"IF(B95=\"-\",\"-\",CONCATENATE(MID(C21,1,21),\" - \",G21))","v":"-"},null,null,null,null,null,{"$f":"IF(Y21=0,\"-\",Y21/$L$87)","v":"-"},{"$f":"IF(I95=\"-\",\"-\",CONCATENATE(MID(C21,1,21),\" - \",G21))","v":"-"},null,null,null,null,null,{"$f":"IF(Z21=0,\"-\",Z21/$S$87)","v":"-"},{"$f":"IF(P95=\"-\",\"-\",CONCATENATE(MID(C21,1,21),\" - \",G21))","v":"-"},null,null,null,null,0,0,0,0]
[null,{"$f":"IF(X22=0,\"-\",X22/$E$87)","v":"-"},{"$f":"IF(B96=\"-\",\"-\",CONCATENATE(MID(C22,1,21),\" - \",G22))","v":"-"},null,null,null,null,null,{"$f":"IF(Y22=0,\"-\",Y22/$L$87)","v":"-"},{"$f":"IF(I96=\"-\",\"-\",CONCATENATE(MID(C22,1,21),\" - \",G22))","v":"-"},null,null,null,null,null,{"$f":"IF(Z22=0,\"-\",Z22/$S$87)","v":"-"},{"$f":"IF(P96=\"-\",\"-\",CONCATENATE(MID(C22,1,21),\" - \",G22))","v":"-"},null,null,null,null,0,0,0,0]
[null,{"$f":"IF(X23=0,\"-\",X23/$E$87)","v":"-"},{"$f":"IF(B97=\"-\",\"-\",CONCATENATE(MID(C23,1,21),\" - \",G23))","v":"-"},null,null,null,null,null,{"$f":"IF(Y23=0,\"-\",Y23/$L$87)","v":"-"},{"$f":"IF(I97=\"-\",\"-\",CONCATENATE(MID(C23,1,21),\" - \",G23))","v":"-"},null,null,null,null,null,{"$f":"IF(Z23=0,\"-\",Z23/$S$87)","v":"-"},{"$f":"IF(P97=\"-\",\"-\",CONCATENATE(MID(C23,1,21),\" - \",G23))","v":"-"},null,null,null,null,0,0,0,0]
[null,{"$f":"IF(X24=0,\"-\",X24/$E$87)","v":"-"},{"$f":"IF(B98=\"-\",\"-\",CONCATENATE(MID(C24,1,21),\" - \",G24))","v":"-"},null,null,null,null,null,{"$f":"IF(Y24=0,\"-\",Y24/$L$87)","v":"-"},{"$f":"IF(I98=\"-\",\"-\",CONCATENATE(MID(C24,1,21),\" - \",G24))","v":"-"},null,null,null,null,null,{"$f":"IF(Z24=0,\"-\",Z24/$S$87)","v":"-"},{"$f":"IF(P98=\"-\",\"-\",CONCATENATE(MID(C24,1,21),\" - \",G24))","v":"-"},null,null,null,null,0,0,0,0]
[null,{"$f":"IF(X25=0,\"-\",X25/$E$87)","v":"-"},{"$f":"IF(B99=\"-\",\"-\",CONCATENATE(MID(C25,1,21),\" - \",G25))","v":"-"},null,null,null,null,null,{"$f":"IF(Y25=0,\"-\",Y25/$L$87)","v":"-"},{"$f":"IF(I99=\"-\",\"-\",CONCATENATE(MID(C25,1,21),\" - \",G25))","v":"-"},null,null,null,null,null,{"$f":"IF(Z25=0,\"-\",Z25/$S$87)","v":"-"},{"$f":"IF(P99=\"-\",\"-\",CONCATENATE(MID(C25,1,21),\" - \",G25))","v":"-"},null,null,null,null,0,0,0,0]
[null,{"$f":"IF(X26=0,\"-\",X26/$E$87)","v":"-"},{"$f":"IF(B100=\"-\",\"-\",CONCATENATE(MID(C26,1,21),\" - \",G26))","v":"-"},null,null,null,null,null,{"$f":"IF(Y26=0,\"-\",Y26/$L$87)","v":"-"},{"$f":"IF(I100=\"-\",\"-\",CONCATENATE(MID(C26,1,21),\" - \",G26))","v":"-"},null,null,null,null,null,{"$f":"IF(Z26=0,\"-\",Z26/$S$87)","v":"-"},{"$f":"IF(P100=\"-\",\"-\",CONCATENATE(MID(C26,1,21),\" - \",G26))","v":"-"},null,null,null,null,0,0,0,0]
[null,{"$f":"IF(X27=0,\"-\",X27/$E$87)","v":"-"},{"$f":"IF(B101=\"-\",\"-\",CONCATENATE(MID(C27,1,21),\" - \",G27))","v":"-"},null,null,null,null,null,{"$f":"IF(Y27=0,\"-\",Y27/$L$87)","v":"-"},{"$f":"IF(I101=\"-\",\"-\",CONCATENATE(MID(C27,1,21),\" - \",G27))","v":"-"},null,null,null,null,null,{"$f":"IF(Z27=0,\"-\",Z27/$S$87)","v":"-"},{"$f":"IF(P101=\"-\",\"-\",CONCATENATE(MID(C27,1,21),\" - \",G27))","v":"-"},null,null,null,null,0,0,0,0]
[null,{"$f":"IF(X28=0,\"-\",X28/$E$87)","v":"-"},{"$f":"IF(B102=\"-\",\"-\",CONCATENATE(MID(C28,1,21),\" - \",G28))","v":"-"},null,null,null,null,null,{"$f":"IF(Y28=0,\"-\",Y28/$L$87)","v":"-"},{"$f":"IF(I102=\"-\",\"-\",CONCATENATE(MID(C28,1,21),\" - \",G28))","v":"-"},null,null,null,null,null,{"$f":"IF(Z28=0,\"-\",Z28/$S$87)","v":"-"},{"$f":"IF(P102=\"-\",\"-\",CONCATENATE(MID(C28,1,21),\" - \",G28))","v":"-"},null,null,null,null,0,0,0,0]
[null,{"$f":"IF(X29=0,\"-\",X29/$E$87)","v":"-"},{"$f":"IF(B103=\"-\",\"-\",CONCATENATE(MID(C29,1,21),\" - \",G29))","v":"-"},null,null,null,null,null,{"$f":"IF(Y29=0,\"-\",Y29/$L$87)","v":"-"},{"$f":"IF(I103=\"-\",\"-\",CONCATENATE(MID(C29,1,21),\" - \",G29))","v":"-"},null,null,null,null,null,{"$f":"IF(Z29=0,\"-\",Z29/$S$87)","v":"-"},{"$f":"IF(P103=\"-\",\"-\",CONCATENATE(MID(C29,1,21),\" - \",G29))","v":"-"},null,null,null,null,{"$f":"IF((Y103+X103+W103)>0,1,0)","v":0},{"$f":"IF(B103=\"-\",0,B103)","v":0},{"$f":"IF(I103=\"-\",0,I103)","v":0},{"$f":"IF(P103=\"-\",0,P103)","v":0}]
[null,{"$f":"IF(X30=0,\"-\",X30/$E$87)","v":"-"},{"$f":"IF(B104=\"-\",\"-\",CONCATENATE(MID(C30,1,21),\" - \",G30))","v":"-"},null,null,null,null,null,{"$f":"IF(Y30=0,\"-\",Y30/$L$87)","v":"-"},{"$f":"IF(I104=\"-\",\"-\",CONCATENATE(MID(C30,1,21),\" - \",G30))","v":"-"},null,null,null,null,null,{"$f":"IF(Z30=0,\"-\",Z30/$S$87)","v":"-"},{"$f":"IF(P104=\"-\",\"-\",CONCATENATE(MID(C30,1,21),\" - \",G30))","v":"-"},null,null,null,null,0,0,0,0]
[null,{"$f":"IF(X31=0,\"-\",X31/$E$87)","v":"-"},{"$f":"IF(B105=\"-\",\"-\",CONCATENATE(MID(C31,1,21),\" - \",G31))","v":"-"},null,null,null,null,null,{"$f":"IF(Y31=0,\"-\",Y31/$L$87)","v":"-"},{"$f":"IF(I105=\"-\",\"-\",CONCATENATE(MID(C31,1,21),\" - \",G31))","v":"-"},null,null,null,null,null,{"$f":"IF(Z31=0,\"-\",Z31/$S$87)","v":"-"},{"$f":"IF(P105=\"-\",\"-\",CONCATENATE(MID(C31,1,21),\" - \",G31))","v":"-"},null,null,null,null,0,0,0,0]
[null,{"$f":"IF(X32=0,\"-\",X32/$E$87)","v":"-"},{"$f":"IF(B106=\"-\",\"-\",CONCATENATE(MID(C32,1,21),\" - \",G32))","v":"-"},null,null,null,null,null,{"$f":"IF(Y32=0,\"-\",Y32/$L$87)","v":"-"},{"$f":"IF(I106=\"-\",\"-\",CONCATENATE(MID(C32,1,21),\" - \",G32))","v":"-"},null,null,null,null,null,{"$f":"IF(Z32=0,\"-\",Z32/$S$87)","v":"-"},{"$f":"IF(P106=\"-\",\"-\",CONCATENATE(MID(C32,1,21),\" - \",G32))","v":"-"},null,null,null,null,0,0,0,0]
[null,{"$f":"IF(X33=0,\"-\",X33/$E$87)","v":"-"},{"$f":"IF(B107=\"-\",\"-\",CONCATENATE(MID(C33,1,21),\" - \",G33))","v":"-"},null,null,null,null,null,{"$f":"IF(Y33=0,\"-\",Y33/$L$87)","v":"-"},{"$f":"IF(I107=\"-\",\"-\",CONCATENATE(MID(C33,1,21),\" - \",G33))","v":"-"},null,null,null,null,null,{"$f":"IF(Z33=0,\"-\",Z33/$S$87)","v":"-"},{"$f":"IF(P107=\"-\",\"-\",CONCATENATE(MID(C33,1,21),\" - \",G33))","v":"-"},null,null,null,null,0,0,0,0]
[null,{"$f":"IF(X34=0,\"-\",X34/$E$87)","v":"-"},{"$f":"IF(B108=\"-\",\"-\",CONCATENATE(MID(C34,1,21),\" - \",G34))","v":"-"},null,null,null,null,null,{"$f":"IF(Y34=0,\"-\",Y34/$L$87)","v":"-"},{"$f":"IF(I108=\"-\",\"-\",CONCATENATE(MID(C34,1,21),\" - \",G34))","v":"-"},null,null,null,null,null,{"$f":"IF(Z34=0,\"-\",Z34/$S$87)","v":"-"},{"$f":"IF(P108=\"-\",\"-\",CONCATENATE(MID(C34,1,21),\" - \",G34))","v":"-"},null,null,null,null,0,0,0,0]
[null,{"$f":"IF(X35=0,\"-\",X35/$E$87)","v":"-"},{"$f":"IF(B109=\"-\",\"-\",CONCATENATE(MID(C35,1,21),\" - \",G35))","v":"-"},null,null,null,null,null,{"$f":"IF(Y35=0,\"-\",Y35/$L$87)","v":"-"},{"$f":"IF(I109=\"-\",\"-\",CONCATENATE(MID(C35,1,21),\" - \",G35))","v":"-"},null,null,null,null,null,{"$f":"IF(Z35=0,\"-\",Z35/$S$87)","v":"-"},{"$f":"IF(P109=\"-\",\"-\",CONCATENATE(MID(C35,1,21),\" - \",G35))","v":"-"},null,null,null,null,0,0,0,0]
[null,{"$f":"IF(X36=0,\"-\",X36/$E$87)","v":"-"},{"$f":"IF(B110=\"-\",\"-\",CONCATENATE(MID(C36,1,21),\" - \",G36))","v":"-"},null,null,null,null,null,{"$f":"IF(Y36=0,\"-\",Y36/$L$87)","v":"-"},{"$f":"IF(I110=\"-\",\"-\",CONCATENATE(MID(C36,1,21),\" - \",G36))","v":"-"},null,null,null,null,null,{"$f":"IF(Z36=0,\"-\",Z36/$S$87)","v":"-"},{"$f":"IF(P110=\"-\",\"-\",CONCATENATE(MID(C36,1,21),\" - \",G36))","v":"-"},null,null,null,null,0,0,0,0]
[null,{"$f":"IF(X37=0,\"-\",X37/$E$87)","v":"-"},{"$f":"IF(B111=\"-\",\"-\",CONCATENATE(MID(C37,1,21),\" - \",G37))","v":"-"},null,null,null,null,null,{"$f":"IF(Y37=0,\"-\",Y37/$L$87)","v":"-"},{"$f":"IF(I111=\"-\",\"-\",CONCATENATE(MID(C37,1,21),\" - \",G37))","v":"-"},null,null,null,null,null,{"$f":"IF(Z37=0,\"-\",Z37/$S$87)","v":"-"},{"$f":"IF(P111=\"-\",\"-\",CONCATENATE(MID(C37,1,21),\" - \",G37))","v":"-"},null,null,null,null,0,0,0,0]
[null,{"$f":"IF(X38=0,\"-\",X38/$E$87)","v":"-"},{"$f":"IF(B112=\"-\",\"-\",CONCATENATE(MID(C38,1,21),\" - \",G38))","v":"-"},null,null,null,null,null,{"$f":"IF(Y38=0,\"-\",Y38/$L$87)","v":"-"},{"$f":"IF(I112=\"-\",\"-\",CONCATENATE(MID(C38,1,21),\" - \",G38))","v":"-"},null,null,null,null,null,{"$f":"IF(Z38=0,\"-\",Z38/$S$87)","v":"-"},{"$f":"IF(P112=\"-\",\"-\",CONCATENATE(MID(C38,1,21),\" - \",G38))","v":"-"},null,null,null,null,0,0,0,0]
[null,{"$f":"IF(X39=0,\"-\",X39/$E$87)","v":"-"},{"$f":"IF(B113=\"-\",\"-\",CONCATENATE(MID(C39,1,21),\" - \",G39))","v":"-"},null,null,null,null,null,{"$f":"IF(Y39=0,\"-\",Y39/$L$87)","v":"-"},{"$f":"IF(I113=\"-\",\"-\",CONCATENATE(MID(C39,1,21),\" - \",G39))","v":"-"},null,null,null,null,null,{"$f":"IF(Z39=0,\"-\",Z39/$S$87)","v":"-"},{"$f":"IF(P113=\"-\",\"-\",CONCATENATE(MID(C39,1,21),\" - \",G39))","v":"-"},null,null,null,null,0,0,0,0]
[null,{"$f":"IF(X40=0,\"-\",X40/$E$87)","v":"-"},{"$f":"IF(B114=\"-\",\"-\",CONCATENATE(MID(C40,1,21),\" - \",G40))","v":"-"},null,null,null,null,null,{"$f":"IF(Y40=0,\"-\",Y40/$L$87)","v":"-"},{"$f":"IF(I114=\"-\",\"-\",CONCATENATE(MID(C40,1,21),\" - \",G40))","v":"-"},null,null,null,null,null,{"$f":"IF(Z40=0,\"-\",Z40/$S$87)","v":"-"},{"$f":"IF(P114=\"-\",\"-\",CONCATENATE(MID(C40,1,21),\" - \",G40))","v":"-"},null,null,null,null,0,0,0,0]
[null,{"$f":"IF(X47=0,\"-\",X47/$E$87)","v":"-"},{"$f":"IF(B115=\"-\",\"-\",CONCATENATE(MID(C47,1,21),\" - \",G47))","v":"-"},null,null,null,null,null,{"$f":"IF(Y47=0,\"-\",Y47/$L$87)","v":"-"},{"$f":"IF(I115=\"-\",\"-\",CONCATENATE(MID(C47,1,21),\" - \",G47))","v":"-"},null,null,null,null,null,{"$f":"IF(Z47=0,\"-\",Z47/$S$87)","v":"-"},{"$f":"IF(P115=\"-\",\"-\",CONCATENATE(MID(C47,1,21),\" - \",G47))","v":"-"},null,null,null,null,{"$f":"IF((Y115+X115+W115)>0,1,0)","v":0},{"$f":"IF(B115=\"-\",0,B115)","v":0},{"$f":"IF(I115=\"-\",0,I115)","v":0},{"$f":"IF(P115=\"-\",0,P115)","v":0}]
[null,{"$f":"IF(X48=0,\"-\",X48/$E$87)","v":"-"},{"$f":"IF(B116=\"-\",\"-\",CONCATENATE(MID(C48,1,21),\" - \",G48))","v":"-"},null,null,null,null,null,{"$f":"IF(Y48=0,\"-\",Y48/$L$87)","v":"-"},{"$f":"IF(I116=\"-\",\"-\",CONCATENATE(MID(C48,1,21),\" - \",G48))","v":"-"},null,null,null,null,null,{"$f":"IF(Z48=0,\"-\",Z48/$S$87)","v":"-"},{"$f":"IF(P116=\"-\",\"-\",CONCATENATE(MID(C48,1,21),\" - \",G48))","v":"-"},null,null,null,null,{"$f":"IF((Y116+X116+W116)>0,1,0)","v":0},{"$f":"IF(B116=\"-\",0,B116)","v":0},{"$f":"IF(I116=\"-\",0,I116)","v":0},{"$f":"IF(P116=\"-\",0,P116)","v":0}]
[null,{"$f":"IF(X49=0,\"-\",X49/$E$87)","v":"-"},{"$f":"IF(B117=\"-\",\"-\",CONCATENATE(MID(C49,1,21),\" - \",G49))","v":"-"},null,null,null,null,null,{"$f":"IF(Y49=0,\"-\",Y49/$L$87)","v":"-"},{"$f":"IF(I117=\"-\",\"-\",CONCATENATE(MID(C49,1,21),\" - \",G49))","v":"-"},null,null,null,null,null,{"$f":"IF(Z49=0,\"-\",Z49/$S$87)","v":"-"},{"$f":"IF(P117=\"-\",\"-\",CONCATENATE(MID(C49,1,21),\" - \",G49))","v":"-"},null,null,null,null,{"$f":"IF((Y117+X117+W117)>0,1,0)","v":0},{"$f":"IF(B117=\"-\",0,B117)","v":0},{"$f":"IF(I117=\"-\",0,I117)","v":0},{"$f":"IF(P117=\"-\",0,P117)","v":0}]
[null,{"$f":"IF(X50=0,\"-\",X50/$E$87)","v":"-"},{"$f":"IF(B118=\"-\",\"-\",CONCATENATE(MID(C50,1,21),\" - \",G50))","v":"-"},null,null,null,null,null,{"$f":"IF(Y50=0,\"-\",Y50/$L$87)","v":"-"},{"$f":"IF(I118=\"-\",\"-\",CONCATENATE(MID(C50,1,21),\" - \",G50))","v":"-"},null,null,null,null,null,{"$f":"IF(Z50=0,\"-\",Z50/$S$87)","v":"-"},{"$f":"IF(P118=\"-\",\"-\",CONCATENATE(MID(C50,1,21),\" - \",G50))","v":"-"},null,null,null,null,0,0,0,0]
[null,{"$f":"IF(X51=0,\"-\",X51/$E$87)","v":"-"},{"$f":"IF(B119=\"-\",\"-\",CONCATENATE(MID(C51,1,21),\" - \",G51))","v":"-"},null,null,null,null,null,{"$f":"IF(Y51=0,\"-\",Y51/$L$87)","v":"-"},{"$f":"IF(I119=\"-\",\"-\",CONCATENATE(MID(C51,1,21),\" - \",G51))","v":"-"},null,null,null,null,null,{"$f":"IF(Z51=0,\"-\",Z51/$S$87)","v":"-"},{"$f":"IF(P119=\"-\",\"-\",CONCATENATE(MID(C51,1,21),\" - \",G51))","v":"-"},null,null,null,null,0,0,0,0]
[null,{"$f":"IF(X53=0,\"-\",X53/$E$87)","v":"-"},{"$f":"IF(B120=\"-\",\"-\",CONCATENATE(MID(C53,1,21),\" - \",G53))","v":"-"},null,null,null,null,null,{"$f":"IF(Y53=0,\"-\",Y53/$L$87)","v":"-"},{"$f":"IF(I120=\"-\",\"-\",CONCATENATE(MID(C53,1,21),\" - \",G53))","v":"-"},null,null,null,null,null,{"$f":"IF(Z53=0,\"-\",Z53/$S$87)","v":"-"},{"$f":"IF(P120=\"-\",\"-\",CONCATENATE(MID(C53,1,21),\" - \",G53))","v":"-"},null,null,null,null,0,0,0,0]
[null,{"$f":"IF(X54=0,\"-\",X54/$E$87)","v":"-"},"-",null,null,null,null,null,{"$f":"IF(Y54=0,\"-\",Y54/$L$87)","v":"-"},"-",null,null,null,null,null,{"$f":"IF(Z54=0,\"-\",Z54/$S$87)","v":"-"},"-",null,null,null,null,0,0,0,0]
[null,{"$f":"IF(X55=0,\"-\",X55/$E$87)","v":"-"},"-",null,null,null,null,null,{"$f":"IF(Y55=0,\"-\",Y55/$L$87)","v":"-"},"-",null,null,null,null,null,{"$f":"IF(Z55=0,\"-\",Z55/$S$87)","v":"-"},"-",null,null,null,null,{"$f":"IF((Y122+X122+W122)>0,1,0)","v":0},{"$f":"IF(B122=\"-\",0,B122)","v":0},{"$f":"IF(I122=\"-\",0,I122)","v":0},{"$f":"IF(P122=\"-\",0,P122)","v":0}]
[null,{"$f":"IF(X56=0,\"-\",X56/$E$87)","v":"-"},"-",null,null,null,null,null,{"$f":"IF(Y56=0,\"-\",Y56/$L$87)","v":"-"},"-",null,null,null,null,null,{"$f":"IF(Z56=0,\"-\",Z56/$S$87)","v":"-"},"-",null,null,null,null,0,0,0,0]
[null,{"$f":"IF(X57=0,\"-\",X57/$E$87)","v":"-"},"-",null,null,null,null,null,{"$f":"IF(Y57=0,\"-\",Y57/$L$87)","v":"-"},"-",null,null,null,null,null,{"$f":"IF(Z57=0,\"-\",Z57/$S$87)","v":"-"},"-",null,null,null,null,0,0,0,0]
[null,{"$f":"IF(X58=0,\"-\",X58/$E$87)","v":"-"},"-",null,null,null,null,null,{"$f":"IF(Y58=0,\"-\",Y58/$L$87)","v":"-"},"-",null,null,null,null,null,{"$f":"IF(Z58=0,\"-\",Z58/$S$87)","v":"-"},"-",null,null,null,null,0,0,0,0]
[null,{"$f":"IF(X59=0,\"-\",X59/$E$87)","v":"-"},"-",null,null,null,null,null,{"$f":"IF(Y59=0,\"-\",Y59/$L$87)","v":"-"},"-",null,null,null,null,null,{"$f":"IF(Z59=0,\"-\",Z59/$S$87)","v":"-"},"-",null,null,null,null,0,0,0,0]
[null,{"$f":"IF(X60=0,\"-\",X60/$E$87)","v":"-"},"-",null,null,null,null,null,{"$f":"IF(Y60=0,\"-\",Y60/$L$87)","v":"-"},"-",null,null,null,null,null,{"$f":"IF(Z60=0,\"-\",Z60/$S$87)","v":"-"},"-",null,null,null,null,0,0,0,0]
[null,{"$f":"IF(X61=0,\"-\",X61/$E$87)","v":"-"},"-",null,null,null,null,null,{"$f":"IF(Y61=0,\"-\",Y61/$L$87)","v":"-"},"-",null,null,null,null,null,{"$f":"IF(Z61=0,\"-\",Z61/$S$87)","v":"-"},"-",null,null,null,null,0,0,0,0]
[null,{"$f":"IF(X62=0,\"-\",X62/$E$87)","v":"-"},"-",null,null,null,null,null,{"$f":"IF(Y62=0,\"-\",Y62/$L$87)","v":"-"},"-",null,null,null,null,null,{"$f":"IF(Z62=0,\"-\",Z62/$S$87)","v":"-"},"-",null,null,null,null,0,0,0,0]
[null,{"$f":"IF(X63=0,\"-\",X63/$E$87)","v":"-"},"-",null,null,null,null,null,{"$f":"IF(Y63=0,\"-\",Y63/$L$87)","v":"-"},"-",null,null,null,null,null,{"$f":"IF(Z63=0,\"-\",Z63/$S$87)","v":"-"},"-",null,null,null,null,0,0,0,0]
[null,{"$f":"IF(X64=0,\"-\",X64/$E$87)","v":"-"},{"$f":"IF(B131=\"-\",\"-\",CONCATENATE(MID(C64,1,21),\" - \",G64))","v":"-"},null,null,null,null,null,{"$f":"IF(Y64=0,\"-\",Y64/$L$87)","v":"-"},{"$f":"IF(I131=\"-\",\"-\",CONCATENATE(MID(C64,1,21),\" - \",G64))","v":"-"},null,null,null,null,null,{"$f":"IF(Z64=0,\"-\",Z64/$S$87)","v":"-"},{"$f":"IF(P131=\"-\",\"-\",CONCATENATE(MID(C64,1,21),\" - \",G64))","v":"-"},null,null,null,null,{"$f":"IF((Y131+X131+W131)>0,1,0)","v":0},{"$f":"IF(B131=\"-\",0,B131)","v":0},{"$f":"IF(I131=\"-\",0,I131)","v":0},{"$f":"IF(P131=\"-\",0,P131)","v":0}]
[null,"-","-",null,null,null,null,null,"-","-",null,null,null,null,null,"-","-",null,null,null,null,0,0,0,0]
[null,"-","-",null,null,null,null,null,"-","-",null,null,null,null,null,"-","-",null,null,null,null,0,0,0,0]
[null,"-","-",null,null,null,null,null,"-","-",null,null,null,null,null,"-","-",null,null,null,null,0,0,0,0]
[null,"-","-",null,null,null,null,null,"-","-",null,null,null,null,null,"-","-",null,null,null,null,0,0,0,0]
[null,"-","-",null,null,null,null,null,"-","-",null,null,null,null,null,"-","-",null,null,null,null,0,0,0,0]
[null,"-","-",null,null,null,null,null,"-","-",null,null,null,null,null,"-","-",null,null,null,null,0,0,0,0]
[null,"-","-",null,null,null,null,null,"-","-",null,null,null,null,null,"-","-",null,null,null,null,0,0,0,0]
[null,"-","-",null,null,null,null,null,"-","-",null,null,null,null,null,"-","-",null,null,null,null,0,0,0,0]
[null,"-","-",null,null,null,null,null,"-","-",null,null,null,null,null,"-","-",null,null,null,null,0,0,0,0]
[null,{"$f":"IF(X74=0,\"-\",X74/$E$87)","v":"-"},{"$f":"IF(B141=\"-\",\"-\",CONCATENATE(MID(C74,1,21),\" - \",G74))","v":"-"},null,null,null,null,null,{"$f":"IF(Y74=0,\"-\",Y74/$L$87)","v":"-"},{"$f":"IF(I141=\"-\",\"-\",CONCATENATE(MID(C74,1,21),\" - \",G74))","v":"-"},null,null,null,null,null,{"$f":"IF(Z74=0,\"-\",Z74/$S$87)","v":"-"},{"$f":"IF(P141=\"-\",\"-\",CONCATENATE(MID(C74,1,21),\" - \",G74))","v":"-"},null,null,null,null,0,0,0,0]
[null,null,null,null,null,null,null,null,null,null,null,null,null,null,null,null,null,null,null,null,null,{"$f":"IF($B$15>=\"\",0,1)","v":0}]
[null,"NOTE",null,null,null,null,null,null,"NOTE",null,null,null,null,null,null,"NOTE",null,null,null,null,null,0]
[null,null,null,null,null,null,null,null,null,null,null,null,null,null,null,null,null,null,null,null,null,0]
[null,{"$f":"'Lotto7-1'!B92","v":"Specificare la configurazione RAID per l'installazione del Sistema Operativo, se richiesto.\ne/o\ninserire eventuali note."},null,null,null,null,null,null,{"$f":"'Lotto7-2'!B92","v":"Specificare la configurazione RAID per l'installazione del Sistema Operativo, se richiesto.\ne/o\ninserire eventuali note."},null,null,null,null,null,null,{"$f":"'Lotto7-3'!B92","v":"Specificare la configurazione RAID per l'installazione del Sistema Operativo, se richiesto.\ne/o\ninserire eventuali note."},null,null,null,null,null,0]
[null,null,null,null,null,null,null,null,null,null,null,null,null,null,null,null,null,null,null,null,null,0]
[null,null,null,null,null,null,null,null,null,null,null,null,null,null,null,null,null,null,null,null,null,0]
[null,null,null,null,null,null,null,null,null,null,null,null,null,null,null,null,null,null,null,null,null,0]
[null,null,null,null,null,null,null,null,null,null,null,null,null,null,null,null,null,null,null,null,null,0]
[null,null,null,null,null,null,null,null,null,null,null,null,null,null,null,null,null,null,null,null,null,0]
[null,null,null,null,null,null,null,null,null,null,null,null,null,null,null,null,null,null,null,null,null,0]
[null,null,null,null,null,null,null,null,null,null,null,null,null,null,null,null,null,null,null,null,null,0]
[null,null,null,null,null,null,null,null,null,null,null,null,null,null,null,null,null,null,null,null,null,0]
[null,null,null,null,null,null,null,null,null,null,null,null,null,null,null,null,null,null,null,null,null,0]
[null,null,null,null,null,null,null,null,null,null,null,null,null,null,null,null,null,null,null,null,null,0]
[null,null,null,null,null,null,null,null,null,null,null,null,null,null,null,null,null,null,null,null,null,0]
[null,null,null,null,null,null,null,null,null,null,null,null,null,null,null,null,null,null,null,null,null,0]
[null,null,null,null,null,null,null,null,null,null,null,null,null,null,null,null,null,null,null,null,null,0]
[null,null,null,null,null,null,null,null,null,null,null,null,null,null,null,null,null,null,null,null,null,0]
[null,null,null,null,null,null,null,null,null,null,null,null,null,null,null,null,null,null,null,null,null,0]
[null,null,null,null,null,null,null,null,null,null,null,null,null,null,null,null,null,null,null,null,null,0]
[null,null,null,null,null,null,null,null,null,null,null,null,null,null,null,null,null,null,null,null,null,0]
[null,null,null,null,null,null,null,null,null,null,null,null,null,null,null,null,null,null,null,null,null,1]
[null,null,null,null,null,null,null,null,null,null,null,null,null,null,null,null,null,null,null,null,null,1]
[null,null,null,{"$f":"MID(C163,13,5)","v":""},null,{"$f":"MID(E163,13,5)","v":""},null,"",null,"",null,"",null,"",null,"",null,"",null,"",null,1]
[null,null,null,"AREA RISERVATA AL FORNITORE",null,null,null,null,null,null,null,null,null,null,null,null,null,null,null,null,null,1]
[null,null,null,null,null,null,null,null,null,null,null,null,null,null,null,null,null,null,null,null,null,1]
[null,null,null,null,null,null,null,null,null,null,null,null,null,null,null,null,null,null,null,null,null,1]
[null,null,"VERIFICA STAGING",null,null,null,null,null,null,null,null,null,null,null,"VERIFICA INSTALLATORE",null,null,null,null,null,null,1]
[null,null,null,null,null,null,null,null,null,null,null,null,null,null,null,null,null,null,null,null,null,1]
[null,null,null,null,null,null,null,null,null,null,null,null,null,null,null,null,null,null,null,null,null,1]
[null,null,null,null,null,null,null,null,null,null,null,null,null,null,null,null,null,null,null,null,null,1]
[null,null,null,null,null,null,null,null,null,null,null,null,null,null,null,null,null,null,null,null,null,1]
[null,null,null,null,null,null,null,null,null,null,null,null,null,null,null,null,null,null,null,null,null,1]

{"sheet":"Foglio1","index":6,"n_rows":87,"n_cols":4,"rows_kept":87,"cut":false,"hidden":true,"merged":[]}
[{"$f":"Riepilogo!E87","v":0}]
[{"$f":"Riepilogo!B89","v":"-"},{"$f":"Riepilogo!C89","v":"-"},null,{"$f":"IF(A2+A3=2,\"TS2L3-SRV2CPU\",B2)","v":{"$error":"#VALUE!"}}]
[{"$f":"Riepilogo!B90","v":"-"},{"$f":"Riepilogo!C90","v":"-"}]
[{"$f":"Riepilogo!B91","v":"-"},{"$f":"Riepilogo!C91","v":"-"}]
[{"$f":"Riepilogo!B92","v":"-"},{"$f":"Riepilogo!C92","v":"-"}]
[{"$f":"Riepilogo!B93","v":"-"},{"$f":"Riepilogo!C93","v":"-"}]
[{"$f":"Riepilogo!B94","v":"-"},{"$f":"Riepilogo!C94","v":"-"}]
[{"$f":"Riepilogo!B95","v":"-"},{"$f":"Riepilogo!C95","v":"-"}]
[{"$f":"Riepilogo!#REF!","v":{"$error":"#REF!"}},{"$f":"Riepilogo!#REF!","v":{"$error":"#REF!"}}]
[{"$f":"Riepilogo!B96","v":"-"},{"$f":"Riepilogo!C96","v":"-"}]
[{"$f":"Riepilogo!B97","v":"-"},{"$f":"Riepilogo!C97","v":"-"}]
[{"$f":"Riepilogo!B98","v":"-"},{"$f":"Riepilogo!C98","v":"-"}]
[{"$f":"Riepilogo!B99","v":"-"},{"$f":"Riepilogo!C99","v":"-"}]
[{"$f":"Riepilogo!B100","v":"-"},{"$f":"Riepilogo!C100","v":"-"}]
[{"$f":"Riepilogo!B101","v":"-"},{"$f":"Riepilogo!C101","v":"-"}]
[{"$f":"Riepilogo!B102","v":"-"},{"$f":"Riepilogo!C102","v":"-"}]
[{"$f":"Riepilogo!B103","v":"-"},{"$f":"Riepilogo!C103","v":"-"}]
[{"$f":"Riepilogo!B104","v":"-"},{"$f":"Riepilogo!C104","v":"-"}]
[{"$f":"Riepilogo!B105","v":"-"},{"$f":"Riepilogo!C105","v":"-"}]
[{"$f":"Riepilogo!B106","v":"-"},{"$f":"Riepilogo!C106","v":"-"}]
[{"$f":"Riepilogo!B107","v":"-"},{"$f":"Riepilogo!C107","v":"-"}]
[{"$f":"Riepilogo!B108","v":"-"},{"$f":"Riepilogo!C108","v":"-"}]
[{"$f":"Riepilogo!B109","v":"-"},{"$f":"Riepilogo!C109","v":"-"}]
[{"$f":"Riepilogo!B112","v":"-"},{"$f":"Riepilogo!C112","v":"-"}]
[{"$f":"Riepilogo!B113","v":"-"},{"$f":"Riepilogo!C113","v":"-"}]
[{"$f":"Riepilogo!B114","v":"-"},{"$f":"Riepilogo!C114","v":"-"}]
[{"$f":"Riepilogo!#REF!","v":{"$error":"#REF!"}},{"$f":"Riepilogo!#REF!","v":{"$error":"#REF!"}}]
[{"$f":"Riepilogo!B115","v":"-"},{"$f":"Riepilogo!C115","v":"-"}]
[]
[{"$f":"Riepilogo!L87","v":0}]
[{"$f":"Riepilogo!I89","v":"-"},{"$f":"Riepilogo!J89","v":"-"}]
[{"$f":"Riepilogo!I90","v":"-"},{"$f":"Riepilogo!J90","v":"-"}]
[{"$f":"Riepilogo!I91","v":"-"},{"$f":"Riepilogo!J91","v":"-"}]
[{"$f":"Riepilogo!I92","v":"-"},{"$f":"Riepilogo!J92","v":"-"}]
[{"$f":"Riepilogo!I93","v":"-"},{"$f":"Riepilogo!J93","v":"-"}]
[{"$f":"Riepilogo!I94","v":"-"},{"$f":"Riepilogo!J94","v":"-"}]
[{"$f":"Riepilogo!I95","v":"-"},{"$f":"Riepilogo!J95","v":"-"}]
[{"$f":"Riepilogo!#REF!","v":{"$error":"#REF!"}},{"$f":"Riepilogo!#REF!","v":{"$error":"#REF!"}}]
[{"$f":"Riepilogo!I96","v":"-"},{"$f":"Riepilogo!J96","v":"-"}]
[{"$f":"Riepilogo!I97","v":"-"},{"$f":"Riepilogo!J97","v":"-"}]
[{"$f":"Riepilogo!I98","v":"-"},{"$f":"Riepilogo!J98","v":"-"}]
[{"$f":"Riepilogo!I99","v":"-"},{"$f":"Riepilogo!J99","v":"-"}]
[{"$f":"Riepilogo!I100","v":"-"},{"$f":"Riepilogo!J100","v":"-"}]
[{"$f":"Riepilogo!I101","v":"-"},{"$f":"Riepilogo!J101","v":"-"}]
[{"$f":"Riepilogo!I102","v":"-"},{"$f":"Riepilogo!J102","v":"-"}]
[{"$f":"Riepilogo!I103","v":"-"},{"$f":"Riepilogo!J103","v":"-"}]
[{"$f":"Riepilogo!I104","v":"-"},{"$f":"Riepilogo!J104","v":"-"}]
[{"$f":"Riepilogo!I105","v":"-"},{"$f":"Riepilogo!J105","v":"-"}]
[{"$f":"Riepilogo!I106","v":"-"},{"$f":"Riepilogo!J106","v":"-"}]
[{"$f":"Riepilogo!I107","v":"-"},{"$f":"Riepilogo!J107","v":"-"}]
[{"$f":"Riepilogo!I108","v":"-"},{"$f":"Riepilogo!J108","v":"-"}]
[{"$f":"Riepilogo!I109","v":"-"},{"$f":"Riepilogo!J109","v":"-"}]
[{"$f":"Riepilogo!I112","v":"-"},{"$f":"Riepilogo!J112","v":"-"}]
[{"$f":"Riepilogo!I113","v":"-"},{"$f":"Riepilogo!J113","v":"-"}]
[{"$f":"Riepilogo!I114","v":"-"},{"$f":"Riepilogo!J114","v":"-"}]
[{"$f":"Riepilogo!#REF!","v":{"$error":"#REF!"}},{"$f":"Riepilogo!#REF!","v":{"$error":"#REF!"}}]
[{"$f":"Riepilogo!I115","v":"-"},{"$f":"Riepilogo!J115","v":"-"}]
[]
[]
[{"$f":"Riepilogo!S87","v":0}]
[{"$f":"Riepilogo!P89","v":"-"},{"$f":"Riepilogo!Q89","v":"-"}]
[{"$f":"Riepilogo!P90","v":"-"},{"$f":"Riepilogo!Q90","v":"-"}]
[{"$f":"Riepilogo!P91","v":"-"},{"$f":"Riepilogo!Q91","v":"-"}]
[{"$f":"Riepilogo!P92","v":"-"},{"$f":"Riepilogo!Q92","v":"-"}]
[{"$f":"Riepilogo!P93","v":"-"},{"$f":"Riepilogo!Q93","v":"-"}]
[{"$f":"Riepilogo!P94","v":"-"},{"$f":"Riepilogo!Q94","v":"-"}]
[{"$f":"Riepilogo!P95","v":"-"},{"$f":"Riepilogo!Q95","v":"-"}]
[{"$f":"Riepilogo!#REF!","v":{"$error":"#REF!"}},{"$f":"Riepilogo!#REF!","v":{"$error":"#REF!"}}]
[{"$f":"Riepilogo!P96","v":"-"},{"$f":"Riepilogo!Q96","v":"-"}]
[{"$f":"Riepilogo!P97","v":"-"},{"$f":"Riepilogo!Q97","v":"-"}]
[{"$f":"Riepilogo!P98","v":"-"},{"$f":"Riepilogo!Q98","v":"-"}]
[{"$f":"Riepilogo!P99","v":"-"},{"$f":"Riepilogo!Q99","v":"-"}]
[{"$f":"Riepilogo!P100","v":"-"},{"$f":"Riepilogo!Q100","v":"-"}]
[{"$f":"Riepilogo!P101","v":"-"},{"$f":"Riepilogo!Q101","v":"-"}]
[{"$f":"Riepilogo!P102","v":"-"},{"$f":"Riepilogo!Q102","v":"-"}]
[{"$f":"Riepilogo!P103","v":"-"},{"$f":"Riepilogo!Q103","v":"-"}]
[{"$f":"Riepilogo!P104","v":"-"},{"$f":"Riepilogo!Q104","v":"-"}]
[{"$f":"Riepilogo!P105","v":"-"},{"$f":"Riepilogo!Q105","v":"-"}]
[{"$f":"Riepilogo!P106","v":"-"},{"$f":"Riepilogo!Q106","v":"-"}]
[{"$f":"Riepilogo!P107","v":"-"},{"$f":"Riepilogo!Q107","v":"-"}]
[{"$f":"Riepilogo!P108","v":"-"},{"$f":"Riepilogo!Q108","v":"-"}]
[{"$f":"Riepilogo!P109","v":"-"},{"$f":"Riepilogo!Q109","v":"-"}]
[{"$f":"Riepilogo!P112","v":"-"},{"$f":"Riepilogo!Q112","v":"-"}]
[{"$f":"Riepilogo!P113","v":"-"},{"$f":"Riepilogo!Q113","v":"-"}]
[{"$f":"Riepilogo!P114","v":"-"},{"$f":"Riepilogo!Q114","v":"-"}]
[{"$f":"Riepilogo!#REF!","v":{"$error":"#REF!"}},{"$f":"Riepilogo!#REF!","v":{"$error":"#REF!"}}]
[{"$f":"Riepilogo!P115","v":"-"},{"$f":"Riepilogo!Q115","v":"-"}]

{"sheet":"Regole di configurazione","index":7,"n_rows":459,"n_cols":20,"rows_kept":459,"cut":false,"hidden":true,"merged":[]}
["Descrizione","Quantità","SKU","Customer Kit","Codice Convenzione","Convenzione",0.2,null,"SKU","Customer Kit",null,null,null,null,null,"SKU","Customer Kit"]
["Server DELL EMC PowerEdge R7425, 2U, 1 x AMD EPYC 7301; RAM 64GB, 2 x HDD 600GB 10K 2.5\"",1,"[210-APFK]",null,"TS2L7-SRV",8625]
["Server DELL EMC PowerEdge R7425, 2U, 2 x AMD EPYC 7301; RAM 64GB, 2 x HDD 600GB 10K 2.5\"",1,"[210-ANKP]",null,"TS2L3-SRV2CPU"]
["Intel® Xeon® Gold 5120 2.2G, 14C/28T, 10.4GT/s, 19M Cache, Turbo, HT (105W) DDR4-2400",1,"[374-BBTR]","338-BNCI","TS2L7-CPU",1250,{"$f":"\"\"","v":""},"Standard Heatsinks, below 180W CPU",2,"[412-AALN]","412-AALJ",{"$f":"\"\"","v":""},{"$f":"\"\"","v":""},{"$f":"\"\"","v":""},"Riser Config 5, 4 x8, 3 x16 slots",1,"[330-BBJD]","330-BBMK 330-BBLS",null,{"$f":"\"\"","v":""}]
["Windows Server 2016 Standard Ed,ROK,16CORE (for Distributor sale only)",null,null,"634-BRMW","TS2L7-WIN",548]
["Windows Server 2016 Standard Ed,Additional Lic,ROK,16CORE,NoMedia",null,null,"634-BJQV","TS2L7-WIN2",560]
["Windows Server 2016 Standard Ed,Additional Lic,ROK,2CORE,NoMedia",null,null,"634-BJQW","TS2L7-WIN2CORE",71]
["1-pack of Windows Server 2016,2012 Device CALs (Standard or Datacenter),CUS",null,null,"623-BBBX","TS2L7-CALDEV",20]
["1-pack of Windows Server 2016,2012 User CALs (Standard or Datacenter),CUS",null,null,"623-BBCC","TS2L7-CALUSER",24]
["CentOS 7.0",null,null,null,"TS2L7-LINUX",50]
["Windows Server 2016 DataCenter Ed,ROK,16CORE (for Distributor sale only)",null,null,"634-BRMY","TS2L7-WINDC",2350]
["Windows Server 2016 DataCenter Ed,Additional Lic,ROK,16CORE,NoMedia (for Distributor sale only)",null,null,"634-BKYO","TS2L7-WINDC2",2350]
["Windows Server 2016 DataCenter Ed,Additional Lic,ROK,2CORE,NoMedia (for Distributor sale only)",null,null,"634-BKYN","TS2L7-WINDC2COR",377]
["16GB RDIMM, 2666MT/s, Dual Rank",null,"[370-ADND]","AA138422","TS2L7-RAM16",100]
["32GB RDIMM, 2666MT/s, Dual Rank",null,"[370-ADNF]","A9781929","TS2L7-RAM32",351]
["64GB LRDIMM, 2666MT/s, Quad Rank",null,"[370-AECZ]","A9781930","TS2L7-RAM64",703]
["600GB 10K RPM SAS 12Gbps 512n 2.5in Hot-plug Hard Drive",null,"[400-ASGS]","400-AUNQ","TS2L7-10K600",68]
["1.2TB 10K RPM SAS 12Gbps 512n 2.5in Hot-plug Hard Drive",null,"[400-ASHI]","400-ATJL","TS2L7-10K1200",139]
["960GB SSD SAS Read Intensive 12Gbps 512e 2.5in Hot-plug Drive, PM5-R, 1 DWPD, 1752 TBW",null,"[400-BBPL]","400-ATLL","TS2L7-SSDR960",735]
["1.92TB SSD SAS Read Intensive 12Gbps 512e 2.5in Hot-plug Drive, PM1633a",null,"[400-ASFX]","400-ATND","TS2L7-SSDR1920",1422]
["Broadcom 5720 DP 1Gb Network Interface Card, Low Profile",null,"[540-BBDE]","540-BBGW","TS2L7-LAN1-L",22]
["Broadcom 57412 Dual Port 10Gb, SFP+, PCIe Adapter, Low Profile",null,"[540-BBVI]","540-BBVL","TS2L7-LAN10-L",234]
["QLogic FastLinQ 41112 Dual Port 10Gb SFP+ Adapter, Low Profile",null,"[540-BBZI]","540-BBZM","TS2L7-CNA10-L",222]
[]
["Estensione della manutenzione in garanzia per ulteriori 12 mesi",null,null,"701-11494 732-79421","TS2L7-4Y-R6420",173]
["Estensione della manutenzione in garanzia per ulteriori 24 mesi",null,null,"701-11494 701-11494 732-79422","TS2L7-5Y-R6420",346]
["Tecnosteel: armadio Rack 19'' 42U",null,null,null,"TS2L7-RACK",504]
["1U Rackmount Console 17'' with Italian Keyboard",null,null,null,"TS2L7-GUI",448]
["16-port remote KVM switch with one remote user",null,null,null,"TS2L7-KVMIP",495]
["Riello - UPS MSR3000EVO 3000VA 2U Rackmount (SNMP+USB+RS232)",null,null,null,"TS2L7-UPS",396]
[0.2]
["Coppia di PDU Vertical  1Ph-32A-18xC13-6xC19 - 0U Base + Kit di montaggio A20",null,null,null,"TS2L3-PDU32A",null,436]
["Coppia di PDU Vertical  1Ph-16A-36xC13+6xC19 -0U Metered + Kit di montaggio A20",null,null,null,"TS2L3-TM1613606",null,900]
["Coppia di PDU Vertical  1Ph-32A-36xC13+6xC19 -0U Metered + Kit di montaggio A20",null,null,null,"TS2L3-TM3213606",null,939]
["Coppia di PDU Vertical  3Ph-32A-36xC13+6xC19 -0U Metered + Kit di montaggio A20",null,null,null,"TS2L3-TM3233606",null,1106]
["Coppia di PDU Vertical  1Ph-16A-24xC13+6xC19 -0U Controlled + Kit di montaggio A20",null,null,null,"TS2L3-TK1612406",null,1723]
["Coppia di PDU Vertical  1Ph-32A-24xC13+6xC19 -0U Controlled + Kit di montaggio A20",null,null,null,"TS2L3-TK3212406",null,1817]
["Coppia di PDU Vertical  3Ph-32A-24xC13+6xC19 -0U Controlled + Kit di montaggio A20",null,null,null,"TS2L3-TK3232406",null,2154]
["Coppia di PDU Vertical  1Ph-16A-24xC13+6xC19 -0U Full + Kit di montaggio A20",null,null,null,"TS2L3-TF1612406",null,2173]
["Coppia di PDU Vertical  1Ph-32A-24xC13+6xC19 -0U Full + Kit di montaggio A20",null,null,null,"TS2L3-TF3212406",null,2277]
["Coppia di PDU Vertical  3Ph-32A-24xC13+6xC19 -0U Full + Kit di montaggio A20",null,null,null,"TS2L3-TF3232406",null,2518]
["Cavo Rete UTP cat. 5e 3 metri A20",null,null,null,"TS2L7-3MRJ45",null,2]
["HDD 1800GB 10K SAS 12Gbps  2.5in Hot-plug A20",null,null,null,"TS2L7-10K1800",null,169]
["SSD 480GB SAS MU 12Gbps 2.5in Hot-Plug A20",null,null,null,"TS2L7-SSDM480",null,399]
["BOSS controller card, 2 x 240G M.2 Drive A20",null,null,null,"TS2L7-L7-BOSS240",null,447]
["Mellanox ConnectX-5 EX Dual Port 100GbE QSFP28 PCIe Adapter, Low Profile with 2 x 100GbE QSFP28 to QSFP28, Passive Copper Direct Attach Cable,3 Meter A20",null,null,null,"TS2L7-MCX516A3-L",null,1577]
["Mellanox ConnectX-4 Lx Dual Port 25GbE SFP28 Network Adapter, Low Profile with 2x SFP28 to SFP28, 25GbE, Passive Copper Twinax DAC, 3 Meter A20",null,null,null,"TS2L7-MCX4121A3-L",null,748]
["Dell 12Gbps SAS Host Bus Adapter External Controller - Low Profile A20",null,null,null,"TS2L7-HBASAS12-L",null,158]
["Dell PERC H730P RAID Controller Adapter, C6420 A20",null,null,null,"TS2L7-L7-H730P",null,528]
["QLogic FastLinQ 41162 Dual Port 10Gb Base-T Adapter, Low Profile A20",null,null,null,"TS2L7-Q41162T-L",null,349]
["QLogic FastLinQ 41164 Quad Port 10G Base-T Adapter, Low Profile A20",null,null,null,"TS2L7-Q41164T-L",null,687]
["Broadcom 57416 Dual Port 10Gb, Base-T, PCIe Adapter, Low Profile A20",null,null,null,"TS2L7-B57416T-L",null,389]
["5 x Dell Networking, Cable, SFP+ to SFP+, 10GbE, Copper Twinax Direct Attach Cable, 3 Meter A20",null,null,null,"TS2L7-5XDAC10M3",null,125]
["1.6TB SSD SAS Write Intensive 12Gb 512n 2.5in Hot-plug Drive, 10 DWPD A20",null,null,null,"TS2L7-SSDW1600",null,1475]
["400GB SSD SAS Write Intensive 12Gbps 512n 2.5in Hot-plug Drive, 10 DWPD A20",null,null,null,"TS2L7-SSDW400",null,1155]
["2.4TB 10K RPM SAS 12Gbps 512e 2.5in Hot-plug Hard Drive NO VMWARE A20",null,null,null,"TS2L7-L7-10K2400",null,391]
["2 x SFP+ SR 10GbE Optical Transceiver, Dell",null,null,null,"TS2L7-10GOT",null,168]
["Kit upgrade R7425 per GPU A20",null,null,null,"TS2L3-KITGPU",null,999]
["PERC HBA330 RAID Controller, 12Gb Adapter, Full Height A20",1,"[405-AAOO]","405-AAMV","TS2L3-HBA330",null,999]
["PERC H740P RAID Controller, 8Gb NV Cache, Adapter, Full Height A20",1,"[405-AANR]","405-AAMX","TS2L3-H740P",null,999]
["Broadcom 57416 Dual Port 10Gb, Base-T, PCIe Adapter, Full Height A20",1,"[540-BBUI]","540-BBUO","TS2L3-57416",null,999]
["QLogic FastLinQ 41162 Dual Port 10Gb Base-T Adapter, Full Height A20",1,"[540-BBYJ]","540-BBYG","TS2L3-41162",null,999]
["Mellanox ConnectX-5 Single Port EDR VPI QSFP28 PCIe Adapter, Full Height A20",1,"[540-BCDK]","540-BCIV","TS2L3-MCX416A",null,999]
["Mellanox ConnectX-4 Dual Port 100GbE QSFP28 PCIe Adapter, Full Height A20",1,"[540-BBUT]","540-BBUU","TS2L3-MCX516A",null,999]
["QLogic 2692 Dual Port 16Gb Fibre Channel HBA A20",1,"[403-BBMQ]","403-BBMU","TS2L3-2692",null,999]
["Broadcom 57416 Dual Port 10Gb, Base-T, PCIe Adapter, Low Profile A20",1,"[540-BBVJ]","540-BBVM","TS2L3-57416-L",null,999]
["Mellanox ConnectX-4 Lx Dual Port 25GbE SFP28 Network Adapter, Low Profile A20",1,"[406-BBLD]","406-BBLC","TS2L3-MCX4121AL",null,999]
["Mellanox ConnectX-4 Dual Port 40/100GbE, QSFP28, PCIe Adapter, Low Profile A20",1,null,"540-BBVR","TS2L3-MCX416A-L",null,999]
["QLogic FastLinQ 41162 Dual Port 10Gb Base-T Adapter, Low Profile A20",1,"[540-BBZK]","540-BBZN","TS2L3-41162-L",null,999]
["QLogic 2692 Dual Port 16Gb Fibre Channel HBA, Low Profile A20",1,"[403-BBMS]","403-BBMT","TS2L3-2692-L",null,999]
["NVIDIA Tesla V100 32G Passive GPU A20",1,"[490-BENY]",null,"TS2L3-GPUV10032",null,999]
["NVIDIA Tesla™ V100 16G Passive GPU A20",1,"[490-BEDZ]",null,"TS2L3-GPUV10016",null,16366.99]
["NVIDIA Tesla P40 24GB GPU, Passive A20",1,"[489-BBCN]",null,"TS2L3-GPUP4024",null,999]
["NVIDIA Tesla M10 GPU, Requires GRID 2.0 SW for VDI Function A20",1,"[489-BBCG]",null,"TS2L3-GPUM10",null,4237.99]
["ISDM and Combo Card Reader, with 2 32Gb microSDHC/SDXC Card A20",1,null,null,"TS2L3-IDSDM32",null,999]
["ISDM and Combo Card Reader, with 2 64Gb microSDHC/SDXC Card A20",1,null,null,"TS2L3-IDSDM64",null,999]
["BOSS controller card + with 2 M.2 Sticks 240G (RAID 1),FH A20",1,"[403-BBPT]","403-BBVQ 400-ASDQ 400-ASDQ","TS2L3-BOSS240",null,999]
["BOSS controller card + with 2 M.2 Sticks 480GB (RAID 1),FH A20",1,"[403-BBSV]","403-BBVQ 400-AVSS 400-AVSS","TS2L3-BOSS480",null,999]
[]
["Trusted Platform Module"]
["No Trusted Platform Module",1,"[461-AADZ]"]
["Trusted Platform Module 2.0",1,"[461-AAEM]","461-AAEN","TS2L3-TPM2",null,0]
[]
["Processore aggiuntivo"]
["TS2L3CPU"]
["No Additional Processor",0,"[374-BBBX]",{"$f":"\"\"","v":""},{"$f":"\"\"","v":""},0,{"$f":"\"\"","v":""},"C6420 Heatsink",1,"[412-AAIX]",null,null,null,null,null,null,null,{"$f":"\"\"","v":""},{"$f":"\"\"","v":""},{"$f":"\"\"","v":""}]
["Intel® Xeon® Gold 5120 2.2G, 14C/28T, 10.4GT/s, 19M Cache, Turbo, HT (105W) DDR4-2400",1,"[374-BBPU]","338-BLUB","TS2L7-CPU",1250,{"$f":"\"\"","v":""},"C6420 Heatsink",2,"[412-AAIX]","412-AAPF",{"$f":"\"\"","v":""},{"$f":"\"\"","v":""},{"$f":"\"\"","v":""},"PCIe Riser for C6420",1,"[540-BBWN]","330-BBKN",null,{"$f":"\"\"","v":""}]
["Sistema operativo preinstallato"]
["None",{"$f":"\"\"","v":""},"[619-ABVR]",0,{"$f":"\"\"","v":""},0,{"$f":"\"\"","v":""},{"$f":"\"\"","v":""},{"$f":"\"\"","v":""},{"$f":"\"\"","v":""},{"$f":"\"\"","v":""},{"$f":"\"\"","v":""},null,{"$f":"\"\"","v":""},{"$f":"\"\"","v":""},{"$f":"\"\"","v":""},{"$f":"\"\"","v":""},{"$f":"\"\"","v":""},{"$f":"\"\"","v":""},{"$f":"\"\"","v":""}]
["Windows Server 2016 Standard Edition, ROK, 16CORE",1,null,"634-BRMW","TS2L7-WIN",548,null,"Windows Server 2016 Standard Ed,Additional Lic,ROK,16CORE,NoMedia",1,null,"634-BJQV","TS2L7-WIN2",560]
["Windows Server 2016 DataCenter Edition, ROK, 16CORE",1,null,"634-BRMY","TS2L7-WINDC",2350,null,"Windows Server 2016 DataCenter Ed,Additional Lic,ROK,16CORE,NoMedia",1,null,"634-BKYO","TS2L7-WINDC2",2350]
["CentOS 7.0",1,null,0,"TS2L7-LINUX",50,{"$f":"\"\"","v":""},{"$f":"\"\"","v":""},{"$f":"\"\"","v":""},{"$f":"\"\"","v":""},{"$f":"\"\"","v":""},{"$f":"\"\"","v":""},null,{"$f":"\"\"","v":""},{"$f":"\"\"","v":""},{"$f":"\"\"","v":""},{"$f":"\"\"","v":""},{"$f":"\"\"","v":""},{"$f":"\"\"","v":""},{"$f":"\"\"","v":""}]
["1-pack of Windows Server 2016,2012 Device CALs (Standard or Datacenter),CUS",null,null,"623-BBBX","TS2L7-CALDEV",20]
["1-pack of Windows Server 2016,2012 User CALs (Standard or Datacenter),CUS",null,null,"623-BBCC","TS2L7-CALUSER",24]
["Windows Server 2016 Standard Ed,Additional Lic,ROK,2CORE,NoMedia",null,null,"634-BJQW","TS2L7-WIN2CORE",71]
["TS2L3MEM1CPU"]
["64     (DIMM 32GB)","32GB RDIMM, 2666MT/s, Dual Rank",2,"[370-ADNF]","A9781929",{"$f":"\"\"","v":""},0,null,"2666MT/s RDIMMs",1,"[370-ADNU]"]
["96     (DIMM 32GB)","32GB RDIMM, 2666MT/s, Dual Rank",3,"[370-ADNF]","A9781929","TS2L7-RAM32",{"$f":"$F$15*(C98-$C$97)","v":351},null,"2666MT/s RDIMMs",1,"[370-ADNU]"]
["128   (DIMM 32GB)","32GB RDIMM, 2666MT/s, Dual Rank",4,"[370-ADNF]","A9781929","TS2L7-RAM32",{"$f":"$F$15*(C99-$C$97)","v":702},null,"2666MT/s RDIMMs",1,"[370-ADNU]"]
["192   (DIMM 32GB)","32GB RDIMM, 2666MT/s, Dual Rank",6,"[370-ADNF]","A9781929","TS2L7-RAM32",{"$f":"$F$15*(C100-$C$97)","v":1404},null,"2666MT/s RDIMMs",1,"[370-ADNU]"]
["256   (DIMM 32GB)","32GB RDIMM, 2666MT/s, Dual Rank",8,"[370-ADNF]","A9781929","TS2L7-RAM32",{"$f":"$F$15*(C101-$C$97)","v":2106},null,"2666MT/s RDIMMs",1,"[370-ADNU]"]
["--------------------------","32GB RDIMM, 2666MT/s, Dual Rank",2,"[370-ADNF]","A9781929","",0,null,"2666MT/s RDIMMs",1,"[370-ADNU]"]
["256   (DIMM 64GB)","64GB LRDIMM, 2666MT/s, Quad Rank",4,"[370-AECZ]","A9781930","TS2L7-RAM64",{"$f":"$F$16*C103","v":2812},null,"2666MT/s LRDIMMs",1,"[370-ADNT]"]
["384   (DIMM 64GB)","64GB LRDIMM, 2666MT/s, Quad Rank",6,"[370-AECZ]","A9781930","TS2L7-RAM64",{"$f":"$F$16*C104","v":4218},null,"2666MT/s LRDIMMs",1,"[370-ADNT]"]
["512   (DIMM 64GB)","64GB LRDIMM, 2666MT/s, Quad Rank",8,"[370-AECZ]","A9781930","TS2L7-RAM64",{"$f":"$F$16*C105","v":5624},null,"2666MT/s LRDIMMs",1,"[370-ADNT]"]
[]
["TS2L3MEM2CPU"]
["64     (DIMM 32GB)","32GB RDIMM, 2666MT/s, Dual Rank",2,"[370-ADNF]","A9781929",{"$f":"\"\"","v":""},0,null,"2666MT/s RDIMMs",1,"[370-ADNU]"]
["128   (DIMM 32GB)","32GB RDIMM, 2666MT/s, Dual Rank",4,"[370-ADNF]","A9781929","TS2L7-RAM32",{"$f":"$F$15*(C109-$C$97)","v":702},null,"2666MT/s RDIMMs",1,"[370-ADNU]"]
["192   (DIMM 32GB)","32GB RDIMM, 2666MT/s, Dual Rank",6,"[370-ADNF]","A9781929","TS2L7-RAM32",{"$f":"$F$15*(C110-$C$97)","v":1404},null,"2666MT/s RDIMMs",1,"[370-ADNU]"]
["256   (DIMM 32GB)","32GB RDIMM, 2666MT/s, Dual Rank",8,"[370-ADNF]","A9781929","TS2L7-RAM32",{"$f":"$F$15*(C111-$C$97)","v":2106},null,"2666MT/s RDIMMs",1,"[370-ADNU]"]
["384  (DIMM 32GB)","32GB RDIMM, 2666MT/s, Dual Rank",12,"[370-ADNF]","A9781929","TS2L7-RAM32",{"$f":"$F$15*(C112-$C$97)","v":3510},null,"2666MT/s RDIMMs",1,"[370-ADNU]"]
["512   (DIMM 32GB)","32GB RDIMM, 2666MT/s, Dual Rank",16,"[370-ADNF]","A9781929","TS2L7-RAM32",{"$f":"$F$15*(C113-$C$97)","v":4914},null,"2666MT/s RDIMMs",1,"[370-ADNU]"]
["--------------------------","32GB RDIMM, 2666MT/s, Dual Rank",2,"[370-ADNF]","A9781929","",0,null,"2666MT/s RDIMMs",1,"[370-ADNU]"]
["256   (DIMM 64GB)","64GB LRDIMM, 2666MT/s, Quad Rank",4,"[370-AECZ]","A9781930","TS2L7-RAM64",{"$f":"$F$16*C115","v":2812},null,"2666MT/s LRDIMMs",1,"[370-ADNT]"]
["384   (DIMM 64GB)","64GB LRDIMM, 2666MT/s, Quad Rank",6,"[370-AECZ]","A9781930","TS2L7-RAM64",{"$f":"$F$16*C116","v":4218},null,"2666MT/s LRDIMMs",1,"[370-ADNT]"]
["512   (DIMM 64GB)","64GB LRDIMM, 2666MT/s, Quad Rank",8,"[370-AECZ]","A9781930","TS2L7-RAM64",5624,null,"2666MT/s LRDIMMs",1,"[370-ADNT]"]
["768   (DIMM 64GB)","64GB LRDIMM, 2666MT/s, Quad Rank",12,"[370-AECZ]","A9781930","TS2L7-RAM64",8436,null,"2666MT/s LRDIMMs",1,"[370-ADNT]"]
["1024 (DIMM 64GB)","64GB LRDIMM, 2666MT/s, Quad Rank",16,"[370-AECZ]","A9781930","TS2L7-RAM64",11248,null,"2666MT/s LRDIMMs",1,"[370-ADNT]"]
[]
["Controller Dischi"]
["PERC H330 Controller Card",1,"[405-AANF]",{"$f":"\"\"","v":""},{"$f":"\"\"","v":""},0]
["HBA330 Controller Card, C4240/XR",1,null,null,"TS2L7-L7-HBA330",null,205]
["Dell PERC H730P RAID Controller Adapter, C6420 A20",1,null,null,"TS2L7-L7-H730P",null,528]
["PERC H740P RAID Controller, 8Gb NV Cache, Adapter, Full Height A20",1,"[405-AANR]","405-AAMX","TS2L3-H740P",null,{"$f":"G60","v":999}]
[]
["Modulo Doppia SD - Internal Dual SD Module (IDSDM)"]
["None",1,null,null,{"$f":"\"\"","v":""}]
["ISDM and Combo Card Reader, with 2 32Gb microSDHC/SDXC Card",1,null,null,"TS2L3-IDSDM32",null,{"$f":"G75","v":999}]
["ISDM and Combo Card Reader, with 2 64Gb microSDHC/SDXC Card",1,null,null,"TS2L3-IDSDM64",null,{"$f":"G76","v":999}]
[]
[]
[]
[]
["7.2 SATA"]
["1TB 7.2K RPM SATA 6Gbps 512n 2.5in Hot-plug Hard Drive",null,"[400-ASHF]","400-ATJG","TS2L3-7K1000",null,null,null,null,null,null,null,null,null," [Option Id: 5103889] [SKU: 400-ASHF]"]
["2TB 7.2K RPM SATA 6Gbps 512n 2.5in Hot-plug Hard Drive",null,"[400-ASHT]","400-ATJZ","TS2L3-7K2000",null,null,null,null,null,null,null,null,null," [Option Id: 5103953] [SKU: 400-ASHT]"]
["7.2K NLSAS"]
["1TB 7.2K RPM NLSAS 12Gbps 512n 2.5in Hot-plug Hard Drive",null,"[400-ASHE]","400-ATJD","TS2L3-NL1000",null,null,null,null,null,null,null,null,null," [Option Id: 5103886] [SKU: 400-ASHE]"]
["2TB 7.2K RPM NLSAS 12Gbps 512n 2.5in Hot-plug Hard Drive",null,"[400-ASHP]","400-ATJU","TS2L3-NL2000",null,null,null,null,null,null,null,null,null," [Option Id: 5103937] [SKU: 400-ASHP]"]
["10K"]
["600GB 10K RPM SAS 12Gbps 512n 2.5in Hot-plug Hard Drive",null,"[400-ASGS]","400-AUNQ","TS2L3-10K600",null,null,null,null,null,null,null,null,null," [Option Id: 5103901] [SKU: 400-ASHI]"]
["1.2TB 10K RPM SAS 12Gbps 512n 2.5in Hot-plug Hard Drive",null,"[400-ASHI]","400-ATJL","TS2L3-10K1200",null,null,null,null,null,null,null,null,null," [Option Id: 5103918] [SKU: 400-ASHK]"]
["1.8TB 10K RPM SAS 12Gbps 512e 2.5in Hot-plug Hard Drive",null,"[400-ARXC]","400-ATJR","TS2L3-10K1800",null,null,null,null,null,null,null,null,null," [Option Id: 5103923] [SKU: 400-ARXC]"]
["2.4TB 10K RPM SAS 12Gbps 512e 2.5in Hot-plug Hard Drive",null,"[400-AVEZ]","401-ABHQ","TS2L3-10K2400",null,null,null,null,null,null,null,null,null," [Option Id: 24TBMD] [SKU: 400-AVEZ]"]
["1.2TB 10K RPM Self-Encrypting SAS 12Gbps 512n 2.5in Hot-plug Hard Drive, FIPS140",null,"[400-ASHK]","400-ATJO",null,null,null,null,null,null,null,null,null,null," [Option Id: 24TASHJ] [SKU: 400-AVHH]"]
["2.4TB 10K RPM Self-Encrypting SAS 12Gbps 512e 2.5in Hot-plug Hard Drive, FIPS140",null,"[400-AVHH]",null,null,null,null,null,null,null,null,null,null,null," [Option Id: 5103818] [SKU: 400-ASGS]"]
["15K"]
["300GB 15K RPM SAS 12Gbps 512n 2.5in Hot-plug Hard Drive",null,"[400-ASGQ]","400-ATII","TS2L3-15K300",null,null,null,null,null,null,null,null,null," [Option Id: 5103806] [SKU: 400-ASGQ]"]
["600GB 15K RPM SAS 12Gbps 512n 2.5in Hot-plug Hard Drive",null,"[400-ARWN]","400-ATIN","TS2L3-15K600",null,null,null,null,null,null,null,null,null," [Option Id: 5102974] [SKU: 400-ARWN]"]
["900GB 15K RPM SAS 12Gbps 512n 2.5in Hot-plug Hard Drive",null,"[400-ASGV]","400-ATIQ","TS2L3-15K900",null,null,null,null,null,null,null,null,null," [Option Id: 5103865] [SKU: 400-ASGV]"]
["SATA RI"]
["480GB SSD SATA Read Intensive 6Gbps 512 2.5in Hot-plug AG Drive, 1 DWPD, 876 TBW",null,"[400-AXTV]",null,"TS2L3-STRI480",null,null,null,null,null,null,null,null,null," [Option Id: G3ZJM0K] [SKU: 400-AXTV]"]
["480GB SSD SATA Read Intensive 6Gbps 512e 2.5in Hot Plug S4510 Drive, 1 DWPD,876 TBW",null,"[400-BDOD]",null,null,null,null,null,null,null,null,null,null,null," [Option Id: GCMLA2O] [SKU: 400-BDOD]"]
["480GB SSD SATA Read Intensive 6Gbps 512e 2.5in Hot-plug Drive, S4500, 1 DWPD,876 TBW",null,"[400-ASXH]",null,null,null,null,null,null,null,null,null,null,null,"[Option Id: 5106652] [SKU: 400-ASXH]"]
["960GB SSD SATA Read Intensive 6Gbps 512 2.5in Hot-plug AG Drive, 1 DWPD, 1752 TBW",null,"[400-AXSW]",null,"TS2L3-STRI960",null,null,null,null,null,null,null,null,null," [Option Id: GA16FX3] [SKU: 400-AXSW]"]
["960GB SSD SATA Read Intensive 6Gbps 512e 2.5in Hot Plug S4510 Drive, 1 DWPD,1752 TBW",null,"[400-BDNJ]",null,null,null,null,null,null,null,null,null,null,null," [Option Id: GK6T7WB] [SKU: 400-BDNJ]"]
["960GB SSD SATA Read Intensive 6Gbps 512n 2.5in Hot-plug Drive, PM863a",null,"[400-ASFM]",null,null,null,null,null,null,null,null,null,null,null," [Option Id: 5103700] [SKU: 400-ASFM]"]
["1.6TB SSD Self-Encrypting SATA Mix Use 6Gbps 512n 2.5in Hot-plug Drive, Hawk-M4E",null,"[400-ASYY]",null,null,null,null,null,null,null,null,null,null,null," [Option Id: 5106694] [SKU: 400-ASYY]"]
["1.6TB SSD Self-Encrypting SATA Mix Use 6Gbps 512n 2.5in Hot-plug Drive, Hawk-M4E",null,"[400-ASYY]",null,null,null,null,null,null,null,null,null,null,null," [Option Id: GLDJ7FE] [SKU: 400-ASYY]"]
["1.92TB SSD SATA Read Intensive 6Gbps 512 2.5in Hot-plug AG Drive, 1 DWPD, 3504 TBW",null,"[400-AXSD]",null,null,null,null,null,null,null,null,null,null,null," [Option Id: GGMU1EX] [SKU: 400-AXSD]"]
["1.92TB SSD SATA Read Intensive 6Gbps 512e 2.5in Hot-plug S4510 Drive, 1 DWPD,3504 TBW",null,"[400-BDOE]",null,"TS2L3-STRI1920",null,null,null,null,null,null,null,null,null," [Option Id: G3UTQH6] [SKU: 400-BDOE]"]
["1.92TB SSD SATA Read Intensive 6Gpbs 512e 2.5in Hot-plug Drive, S4500,1 DWPD,3504 TBW",null,"[400-ASZJ]",null,null,null,null,null,null,null,null,null,null,null," [Option Id: 5106704] [SKU: 400-ASZJ]"]
["3.84TB SSD SATA Read Intensive 6Gbps 512 2.5in Hot-plug AG Drive, 1 DWPD, 7008 TBW",null,"[400-AXSK]",null,null,null,null,null,null,null,null,null,null,null," [Option Id: GS7WBQI] [SKU: 400-AXSK]"]
["3.84TB SSD SATA Read Intensive 6Gbps 512e 2.5in Hot-plug Drive, S4500,1 DWPD,7008 TBW",null,"[400-ASZS]",null,"TS2L3-STSRI3840",null,null,null,null,null,null,null,null,null," [Option Id: 5106713] [SKU: 400-ASZS]"]
["SATA MU"]
["480GB SSD SATA Mix Use 6Gbps 512 2.5in Hot-plug AG Drive, 3 DWPD, 2628 TBW",null,"[400-AZUT]",null,"TS2L3-STMU480",null,null,null,null,null,null,null,null,null," [Option Id: GB6HAM5] [SKU: 400-AZUT]"]
["800GB SSD SATA Mix Use 6Gbps 512n 2.5in Hot-plug Drive, Hawk-M4E,3 DWPD,4380 TBW",null,"[400-ASYC]",null,"TS2L3-STMU800",null,null,null,null,null,null,null,null,null," [Option Id: 5106672] [SKU: 400-ASYC]"]
["960GB SSD SATA Mix Use 6Gbps 512 2.5in Hot-plug AG Drive, 3 DWPD, 5256 TBW",null,"[400-AZVM]",null,"TS2L3-STMU960",null,null,null,null,null,null,null,null,null," [Option Id: GKTZGJ7] [SKU: 400-AZVM]"]
["1.6TB SSD SATA Mix Use 6Gbps 512n 2.5in Hot-plug Drive, Hawk-M4E,3 DWPD,8760 TBW",null,"[400-AVMM]",null,"TS2L3-STMU1600",null,null,null,null,null,null,null,null,null," [Option Id: 1FBT6G] [SKU: 400-AVMM]"]
["1.92TB SSD SATA Mix Use 6Gbps 512 2.5in Hot-plug AG Drive, 3 DWPD, 10512 TBW",null,"[400-AZTN]",null,null,null,null,null,null,null,null,null,null,null," [Option Id: GW19KER] [SKU: 400-AZTN]"]
["1.92TB SSD SATA Mix Use 6Gbps 512e 2.5in Hot-plug Drive, S4600,3 DWPD,10512 TBW",null,"[400-ASZB]",null,"TS2L3-STMU1920",null,null,null,null,null,null,null,null,null," [Option Id: 5106696] [SKU: 400-ASZB]"]
["SAS RI"]
["960GB SSD SAS Read Intensive 12Gbps 512 2.5in Hot-plug AG Drive, 1 DWPD, 1752 TBW",null,"[400-AXQU]",null,null,null,null,null,null,null,null,null,null,null," [Option Id: GD4L6BE] [SKU: 400-AXQU]"]
["960GB SSD SAS Read Intensive 12Gbps 512e 2.5in Hot-plug Drive, PM5-R, 1 DWPD, 1752 TBW",null,"[400-BBPL]","400-ATLL","TS2L3-SSDR960",null,null,null,null,null,null,null,null,null," [Option Id: G4YAXQB] [SKU: 400-BBPL]"]
["960GB SSD SAS Read Intensive 12Gbps 512n 2.5in Hot-plug Drive, PX05SR",null,"[400-ASEZ]",null,null,null,null,null,null,null,null,null,null,null," [Option Id: 5103679] [SKU: 400-ASEZ]"]
["1.92TB SSD SAS Read Intensive 12Gbps 512 2.5in Hot-plug AG Drive, 1 DWPD, 3504 TBW",null,"[400-AXOP]",null,null,null,null,null,null,null,null,null,null,null," [Option Id: GJM2W96] [SKU: 400-AXOP]"]
["1.92TB SSD SAS Read Intensive 12Gbps 512e 2.5in Hot-plug Drive, PM1633a",null,"[400-ASFX]","400-ATND","TS2L3-SSDR1920",null,null,null,null,null,null,null,null,null," [Option Id: 5103731] [SKU: 400-ASFX]"]
["1.92TB SSD SAS Read Intensive 12Gbps 512e 2.5in PM5-R Hot-plug Drive, 1 DWPD, 3504 TBW",null,"[400-BBQQ]",null,null,null,null,null,null,null,null,null,null,null," [Option Id: GF74XBJ] [SKU: 400-BBQQ]"]
["1.92TB SSD SAS Read Intensive MLC 12Gbps 512n 2.5in Hot-plug Drive, PX05SR",null,"[400-ARWC]",null,null,null,null,null,null,null,null,null,null,null," [Option Id: 5102925] [SKU: 400-ARWC]"]
["3.84TB SSD SAS Read Intensive 12Gb 512e 2.5in Hot-plug Drive, PM1633a,1 DWPD,7008 TBW",null,"[400-ASGI]",null,"TS2L3-SSDRI3840",null,null,null,null,null,null,null,null,null," [Option Id: 5103757] [SKU: 400-ASGI]"]
["3.84TB SSD SAS Read Intensive 12Gbps 512 2.5in Hot-plug AG Drive, 1 DWPD, 7008 TBW",null,"[400-AXPE]",null,null,null,null,null,null,null,null,null,null,null," [Option Id: GUSCJI4] [SKU: 400-AXPE]"]
["3.84TB SSD SAS Read Intensive 12Gbps 512e 2.5in PM5-R Hot-plug Drive, 1 DWPD, 7008 TBW",null,"[400-BBQX]",null,null,null,null,null,null,null,null,null,null,null," [Option Id: GQNDTX4] [SKU: 400-BBQX]"]
["3.84TB SSD SAS Read Intensive 12Gbps 512n 2.5in Hot-plug Drive, PX05SR",null,"[400-ASGG]",null,null,null,null,null,null,null,null,null,null,null," [Option Id: 5103752] [SKU: 400-ASGG]"]
["7.68TB SSD SAS Read Intensive 12Gbps 512e 2.5in Hot-plug Drive, PM1643, 1 DWPD, 14,016 TBW",null,"[400-BBSM]",null,"TS2L3-SSDRI7680",null,null,null,null,null,null,null,null,null," [Option Id: G7YW03Q] [SKU: 400-BBSM]"]
["7.68TB SSD SAS Read Intensive 12Gbps 512e 2.5in PM5-R Hot-plug Drive, 1 DWPD, 14,016 TBW",null,"[400-BDCI]",null,null,null,null,null,null,null,null,null,null,null," [Option Id: GGN2SI6] [SKU: 400-BDCI]"]
["SAS MU"]
["480GB SSD SAS Mix Use 12Gbps 512n 2.5in Hot-plug Drive, PX05SV",null,"[400-ASEO]",null,"TS2L3-SSDMU480",null,null,null,null,null,null,null,null,null," [Option Id: 5103647] [SKU: 400-ASEO]"]
["480GB SSD SAS Mixed use 12Gbps 512e 2.5in Hot-Plug PM5-V Drive, 3 DWPD, 2628 TBW",null,"[400-BCQG]",null,null,null,null,null,null,null,null,null,null,null," [Option Id: GJP8HF2] [SKU: 400-BCQG]"]
["800GB SSD SAS Mix Use 12Gbps 512e 2.5in Hot-plug AG Drive, 3 DWPD, 4380 TBW",null,"[400-AZQO]",null,"TS2L3-SSDMU800",null,null,null,null,null,null,null,null,null," [Option Id: GCAUG9H] [SKU: 400-AZQO]"]
["960GB SSD SAS Mix Use 12Gbps 512n 2.5in Hot-plug Drive, PX05SV",null,"[400-ASFI]",null,"TS2L3-SSDMU960",null,null,null,null,null,null,null,null,null," [Option Id: 5103690] [SKU: 400-ASFI]"]
["960GB SSD SAS Mixed use 12Gbps 512e 2.5in Hot-Plug PM5-V Drive",null,"[400-BCQN]",null,null,null,null,null,null,null,null,null,null,null," [Option Id: G46MPBW] [SKU: 400-BCQN]"]
["1.6TB SSD SAS Mix Use 12Gbps 512e 2.5in Hot-plug AG Drive, 3 DWPD, 8760 TBW",null,"[400-AZOY]",null,null,null,null,null,null,null,null,null,null,null," [Option Id: GN5GTO1] [SKU: 400-AZOY]"]
["1.6TB SSD SAS Mix Use 12Gbps 512e 2.5in Hot-plug Drive, PM1635a",null,"[400-ASFQ]",null,"TS2L3-SSDMU1600",null,null,null,null,null,null,null,null,null," [Option Id: 5103710] [SKU: 400-ASFQ]"]
["1.92TB SSD SAS Mix Use 12Gbps 512n 2.5in Hot-plug Drive, PX05SV",null,"[400-ASFZ]",null,"TS2L3-SSDMU1920",null,null,null,null,null,null,null,null,null," [Option Id: 5103737] [SKU: 400-ASFZ]"]
["1.92TB SSD SAS Mix Use SED 12Gbps 512n 2.5in Hot-plug Drive, FIPS140, PX05SV,3 DWPD,10512 TBW",null,"[400-ATRX]",null,null,null,null,null,null,null,null,null,null,null," [Option Id: 510710] [SKU: 400-ATRX]"]
["1.92TB SSD SAS Mixed use 12Gbps 512e 2.5in Hot-Plug PM5-V Drive, 3 DWPD, 10512 TBW",null,"[400-BCOM]",null,null,null,null,null,null,null,null,null,null,null," [Option Id: G5BLI1F] [SKU: 400-BCOM]"]
["3.84TB SSD SAS Mix Use 12Gbps 512n 2.5in Hot-plug Drive, PX05SV,3 DWPD,21024 TBW",null,"[400-ASVR]",null,"TS2L3-SSDMU3840",null,null,null,null,null,null,null,null,null," [Option Id: 5106756] [SKU: 400-ASVR]"]
["3.8TB SSD SAS Mixed use 12Gbps 512e 2.5in Hot-Plug PM5-V Drive, 3 DWPD, 7008 TBW",null,"[400-BCOV]",null,null,null,null,null,null,null,null,null,null,null," [Option Id: GXNZ83B] [SKU: 400-BCOV]"]
["SAS WI"]
["400GB SSD SAS Write Intensive 12Gbps 512n 2.5in Hot-plug Drive, PX05SM",null,"[400-ASEM]",null,"TS2L3-SSDWI400",null,null,null,null,null,null,null,null,null," [Option Id: 5103644] [SKU: 400-ASEM]"]
["800GB SSD SAS Write Intensive 12Gbps 512n 2.5in Hot-plug Drive, PX05SM",null,"[400-ASEV]",null,"TS2L3-SSDWI800",null,null,null,null,null,null,null,null,null," [Option Id: 5103669] [SKU: 400-ASEV]"]
["1.6TB SSD SAS Write Intensive 12Gbps 512n 2.5in Hot-plug Drive, PX05SM",null,"[400-ASFS]",null,"TS2L3-SSDWI1600",null,null,null,null,null,null,null,null,null," [Option Id: 5103717] [SKU: 400-ASFS]"]
[]
["VMWARE"]
["None",1,{"$f":"\"\"","v":""},{"$f":"\"\"","v":""},{"$f":"\"\"","v":""},null,0]
["VMware vSphere Essentials Plus Kit OEM 6 Processor 3yr A20",1,{"$f":"\"\"","v":""},{"$f":"\"\"","v":""},"TS2L7-VMWKIT6P3Y",null,5230]
["None",1,{"$f":"\"\"","v":""},{"$f":"\"\"","v":""},{"$f":"\"\"","v":""},null,0]
["VMw vCenter Server Standard for vSphere OEM 3yr Software A20",1,{"$f":"\"\"","v":""},{"$f":"\"\"","v":""},"TS2L7-VMWVCSTD3Y",null,8909]
["VMw vCenter Server Standard for vSphere OEM 5yr Software A20",1,{"$f":"\"\"","v":""},{"$f":"\"\"","v":""},"TS2L7-VMWVCSTD5Y",null,10549]
["None",0,{"$f":"\"\"","v":""},{"$f":"\"\"","v":""},{"$f":"\"\"","v":""},null,0]
["VMware vSphere Standard OEM 1 Processor 3yr Software A20",1,{"$f":"\"\"","v":""},{"$f":"\"\"","v":""},"TS2L7-VMWSTD1P3Y",null,1743]
["VMware vSphere Enterprise Plus OEM 1 Processor 3yr Software A20",1,{"$f":"\"\"","v":""},{"$f":"\"\"","v":""},"TS2L7-VMWEP1P3Y",null,4905]
["VMware vSphere Enterprise Plus OEM 1 Processor 5yr Software A20",1,{"$f":"\"\"","v":""},{"$f":"\"\"","v":""},"TS2L7-VMWEP1P5Y",null,6367]
["None",0,{"$f":"\"\"","v":""},{"$f":"\"\"","v":""},{"$f":"\"\"","v":""},null,0]
["VMware vSAN Standard OEM  1 Processor 3yr Software A20",1,{"$f":"\"\"","v":""},{"$f":"\"\"","v":""},"TS2L7-VSANSTD3Y",null,3177]
["VMware vSAN Standard OEM  1 Processor 5yr Software A20",1,{"$f":"\"\"","v":""},{"$f":"\"\"","v":""},"TS2L7-VSANSTD5Y",null,4107]
["VMware vSAN Advanced OEM  1 Processor 3yr Software A20",1,{"$f":"\"\"","v":""},{"$f":"\"\"","v":""},"TS2L7-VSANADV3Y",null,5010]
["VMware vSAN Advanced OEM  1 Processor 5yr Software A20",1,{"$f":"\"\"","v":""},{"$f":"\"\"","v":""},"TS2L7-VSANADV5Y",null,6475]
[]
[]
[]
[]
[]
[]
[]
["TS2L3PCI1","1CPU"]
["PCIe Slot-1"]
["None",{"$f":"\"\"","v":""},{"$f":"\"\"","v":""},{"$f":"\"\"","v":""},{"$f":"\"\"","v":""},0]
["[TS2L3-LAN1] Broadcom 5720 DP 1Gb Network Interface Card, Full Height",1,"[540-BBCX]","540-BBGY","TS2L3-LAN1",22]
["[TS2L3-LAN10] Broadcom 57412 Dual Port 10Gb, SFP+, PCIe Adapter, Full Height",1,"[540-BBUH]","540-BBUN","TS2L3-LAN10",114,null,"Kit - Dell EMC PowerEdge SFP+ SR Optic, 10GbE, 850nm",null,"407-BCBN",2]
["[TS2L3-CNA10] QLogic 41112 Dual Port 10Gb SFP+ Adapter, Full Height",1,"[540-BBYK]","540-BBYH","TS2L3-CNA10",110,null,"Kit - Dell EMC PowerEdge SFP+ SR Optic, 10GbE, 850nm",null,"407-BCBN",2]
["[TS2L3-FC8] QLogic 2562, Dual Port 8Gb Optical Fibre Channel HBA, Full Height",1,"[540-BBEC]","406-BBEK","TS2L3-FC8",245]
["------------------------ 20% -------------------------"]
["[TS2L3-57416] Broadcom 57416 Dual Port 10Gb, Base-T, PCIe Adapter, Full Height, A20",1,"[540-BBUI]","540-BBUO","TS2L3-57416"]
["[TS2L3-41162] QLogic FastLinQ 41162 Dual Port 10Gb Base-T Adapter, Full Height, A20",1,"[540-BBYJ]","540-BBYG","TS2L3-41162"]
["[TS2L3-MCX416A] Mellanox ConnectX-5 Single Port EDR VPI QSFP28 PCIe Adapter, Full Height, A20",1,"[540-BCDK]","540-BCIV","TS2L3-MCX416A"]
["[TS2L3-MCX516A] Mellanox ConnectX-4 Dual Port 100GbE QSFP28 PCIe Adapter, Full Height, A20",1,"[540-BBUT]","540-BBUU","TS2L3-MCX516A"]
["[TS2L3-2692] QLogic 2692 Dual Port 16Gb Fibre Channel HBA, A20",1,"[403-BBMQ]","403-BBMU","TS2L3-2692"]
[]
[]
["TS2L3PCI2","1CPU"]
["PCIe Slot-2"]
["None",{"$f":"\"\"","v":""},{"$f":"\"\"","v":""},{"$f":"\"\"","v":""},{"$f":"\"\"","v":""},0]
["[TS2L3-LAN1] Broadcom 5720 DP 1Gb Network Interface Card, Full Height",1,"[540-BBCX]","540-BBGY","TS2L3-LAN1",22]
["[TS2L3-LAN10] Broadcom 57412 Dual Port 10Gb, SFP+, PCIe Adapter, Full Height",1,"[540-BBUH]","540-BBUN","TS2L3-LAN10",114,null,"Kit - Dell EMC PowerEdge SFP+ SR Optic, 10GbE, 850nm",null,"407-BCBN",2]
["[TS2L3-CNA10] QLogic 41112 Dual Port 10Gb SFP+ Adapter, Full Height",1,"[540-BBYK]","540-BBYH","TS2L3-CNA10",110,null,"Kit - Dell EMC PowerEdge SFP+ SR Optic, 10GbE, 850nm",null,"407-BCBN",2]
["[TS2L3-FC8] QLogic 2562, Dual Port 8Gb Optical Fibre Channel HBA, Full Height",1,"[540-BBEC]","406-BBEK","TS2L3-FC8",245]
["------------------------ 20% -------------------------"]
["[TS2L3-57416] Broadcom 57416 Dual Port 10Gb, Base-T, PCIe Adapter, Full Height, A20",1,"[540-BBUI]","540-BBUO","TS2L3-57416"]
["[TS2L3-41162] QLogic FastLinQ 41162 Dual Port 10Gb Base-T Adapter, Full Height, A20",1,"[540-BBYJ]","540-BBYG","TS2L3-41162"]
["[TS2L3-MCX416A] Mellanox ConnectX-5 Single Port EDR VPI QSFP28 PCIe Adapter, Full Height, A20",1,"[540-BCDK]","540-BCIV","TS2L3-MCX416A"]
["[TS2L3-MCX516A] Mellanox ConnectX-4 Dual Port 100GbE QSFP28 PCIe Adapter, Full Height, A20",1,"[540-BBUT]","540-BBUU","TS2L3-MCX516A"]
["[TS2L3-2692] QLogic 2692 Dual Port 16Gb Fibre Channel HBA, A20",1,"[403-BBMQ]","403-BBMU","TS2L3-2692"]
[]
[]
["TS2L3PCI3","1CPU"]
["PCIe Slot-3"]
["PERC H730P RAID Controller, 2Gb NV Cache, Adapter, Full Height",1,"[405-AAMR]","405-AAMY",{"$f":"\"\"","v":""},0]
["------------------------ 20% -------------------------"]
["[TS2L3-HBA330] PERC HBA330 RAID Controller, 12Gb Adapter, Full Height A20",1,"[405-AAOO]","405-AAMV","TS2L3-HBA330",null,{"$f":"G59","v":999}]
["[TS2L3-H740P] PERC H740P RAID Controller, 8Gb NV Cache, Adapter, Full Height A20",1,"[405-AANR]","405-AAMX","TS2L3-H740P",null,{"$f":"G60","v":999}]
[]
["TS2L3ASP"]
["Aggiungere Secondo Processore"]
[]
["2CPU"]
["TS2L3PCI4","2CPU"]
["PCIe Slot-4"]
["None",{"$f":"\"\"","v":""},{"$f":"\"\"","v":""},{"$f":"\"\"","v":""},{"$f":"\"\"","v":""},0]
["[TS2L3-LAN1] Broadcom 5720 DP 1Gb Network Interface Card, Full Height",1,"[540-BBCX]","540-BBGY","TS2L3-LAN1",22]
["[TS2L3-LAN10] Broadcom 57412 Dual Port 10Gb, SFP+, PCIe Adapter, Full Height",1,"[540-BBUH]","540-BBUN","TS2L3-LAN10",114,null,"Kit - Dell EMC PowerEdge SFP+ SR Optic, 10GbE, 850nm",null,"407-BCBN",2]
["[TS2L3-CNA10] QLogic 41112 Dual Port 10Gb SFP+ Adapter, Full Height",1,"[540-BBYK]","540-BBYH","TS2L3-CNA10",110,null,"Kit - Dell EMC PowerEdge SFP+ SR Optic, 10GbE, 850nm",null,"407-BCBN",2]
["[TS2L3-FC8] QLogic 2562, Dual Port 8Gb Optical Fibre Channel HBA, Full Height",1,"[540-BBEC]","406-BBEK","TS2L3-FC8",245]
["------------------------ 20% -------------------------"]
["[TS2L3-57416] Broadcom 57416 Dual Port 10Gb, Base-T, PCIe Adapter, Full Height, A20",1,"[540-BBUI]","540-BBUO","TS2L3-57416"]
["[TS2L3-41162] QLogic FastLinQ 41162 Dual Port 10Gb Base-T Adapter, Full Height, A20",1,"[540-BBYJ]","540-BBYG","TS2L3-41162"]
["[TS2L3-MCX416A] Mellanox ConnectX-5 Single Port EDR VPI QSFP28 PCIe Adapter, Full Height, A20",1,"[540-BCDK]","540-BCIV","TS2L3-MCX416A"]
["[TS2L3-MCX516A] Mellanox ConnectX-4 Dual Port 100GbE QSFP28 PCIe Adapter, Full Height, A20",1,"[540-BBUT]","540-BBUU","TS2L3-MCX516A"]
["[TS2L3-2692] QLogic 2692 Dual Port 16Gb Fibre Channel HBA, A20",1,"[403-BBMQ]","403-BBMU","TS2L3-2692"]
[]
[]
["TS2L3PCI5","2CPU"]
["PCIe Slot-5"]
["None",{"$f":"\"\"","v":""},{"$f":"\"\"","v":""},{"$f":"\"\"","v":""},{"$f":"\"\"","v":""},0]
["------------------------ 20% -------------------------"]
[]
[]
["TS2L3PCI6","2CPU"]
["PCIe Slot-6"]
["None",{"$f":"\"\"","v":""},{"$f":"\"\"","v":""},{"$f":"\"\"","v":""},{"$f":"\"\"","v":""},0]
["[TS2L7-LAN1-L] Broadcom 5720 DP 1Gb Network Interface Card, Low Profile",1,null,"540-BBGW","TS2L7-LAN1-L",22]
["[TS2L7-LAN10-L] Broadcom 57412 Dual Port 10Gb, SFP+, PCIe Adapter, Low Profile",1,null,"540-BBVL","TS2L7-LAN10-L",234,null,"Kit - Dell EMC PowerEdge SFP+ SR Optic, 10GbE, 850nm",null,"407-BCBN",2]
["[TS2L7-CNA10-L] QLogic FastLinQ 41112 Dual Port 10Gb SFP+ Adapter, Low Profile",1,null,"540-BBZM","TS2L7-CNA10-L",222,null,"Kit - Dell EMC PowerEdge SFP+ SR Optic, 10GbE, 850nm",null,"407-BCBN",2]
["------------------------ 20% -------------------------"]
["[TS2L7-L7-BOSS240] BOSS controller card, 2 x 240G M.2 Drive A20",1,null,null,"TS2L7-L7-BOSS240",null,447]
["[TS2L7-MCX5SP-L] Mellanox ConnectX-5 Single Port EDR VPI QSFP28 100Gb PCIe Adapter,  Low Profile with QSFP passive copper cable, LSZH, 2m A20",1,null,null,"TS2L7-MCX5SP-L",null,718]
["[TS2L7-MCX516A3-L] Mellanox ConnectX-5 EX Dual Port 100GbE QSFP28 PCIe Adapter, Low Profile with 2 x 100GbE QSFP28 to QSFP28, Passive Copper Direct Attach Cable,3 Meter A20",1,null,null,"TS2L7-MCX516A3-L",null,1577]
["[TS2L7-MCX4121A3-L] Mellanox ConnectX-4 Lx Dual Port 25GbE SFP28 Network Adapter, Low Profile with 2x SFP28 to SFP28, 25GbE, Passive Copper Twinax DAC, 3 Meter A20",1,null,null,"TS2L7-MCX4121A3-L",null,748]
["[TS2L7-HBASAS12-L] Dell 12Gbps SAS Host Bus Adapter External Controller - Low Profile A20",1,null,null,"TS2L7-HBASAS12-L",null,158]
["[TS2L7-Q41162T-L] QLogic FastLinQ 41162 Dual Port 10Gb Base-T Adapter, Low Profile A20",1,null,null,"TS2L7-Q41162T-L",null,349]
["[TS2L7-Q41164T-L] QLogic FastLinQ 41164 Quad Port 10G Base-T Adapter, Low Profile A20",1,null,null,"TS2L7-Q41164T-L",null,687]
["[TS2L7-B57416T-L] Broadcom 57416 Dual Port 10Gb, Base-T, PCIe Adapter, Low Profile A20",1,null,null,"TS2L7-B57416T-L",null,389]
[]
[]
["TS2L3PCI7","2CPU"]
["PCIe Slot-7"]
["None",{"$f":"\"\"","v":""},{"$f":"\"\"","v":""},{"$f":"\"\"","v":""},{"$f":"\"\"","v":""},0]
["[TS2L3-LAN1] Broadcom 5720 DP 1Gb Network Interface Card, Full Height",1,"[540-BBCX]","540-BBGY","TS2L3-LAN1",22]
["[TS2L3-LAN10] Broadcom 57412 Dual Port 10Gb, SFP+, PCIe Adapter, Full Height",1,"[540-BBUH]","540-BBUN","TS2L3-LAN10",114,null,"Kit - Dell EMC PowerEdge SFP+ SR Optic, 10GbE, 850nm",null,"407-BCBN",2]
["[TS2L3-CNA10] QLogic 41112 Dual Port 10Gb SFP+ Adapter, Full Height",1,"[540-BBYK]","540-BBYH","TS2L3-CNA10",110,null,"Kit - Dell EMC PowerEdge SFP+ SR Optic, 10GbE, 850nm",null,"407-BCBN",2]
["[TS2L3-FC8] QLogic 2562, Dual Port 8Gb Optical Fibre Channel HBA, Full Height",1,"[540-BBEC]","406-BBEK","TS2L3-FC8",245]
["------------------------ 20% -------------------------"]
["[TS2L3-BOSS240] BOSS controller card + with 2 M.2 Sticks 240G (RAID 1),FH, A20",1,"[403-BBPT]","403-BBVQ 400-ASDQ 400-ASDQ","TS2L3-BOSS240"]
["[TS2L3-BOSS240] BOSS controller card + with 2 M.2 Sticks 480GB (RAID 1),FH, A20",1,"[403-BBSV]","403-BBVQ 400-AVSS 400-AVSS","TS2L3-BOSS480"]
["[TS2L3-57416] Broadcom 57416 Dual Port 10Gb, Base-T, PCIe Adapter, Full Height, A20",1,"[540-BBUI]","540-BBUO","TS2L3-57416"]
["[TS2L3-41162] QLogic FastLinQ 41162 Dual Port 10Gb Base-T Adapter, Full Height, A20",1,"[540-BBYJ]","540-BBYG","TS2L3-41162"]
["[TS2L3-MCX416A] Mellanox ConnectX-5 Single Port EDR VPI QSFP28 PCIe Adapter, Full Height, A20",1,"[540-BCDK]","540-BCIV","TS2L3-MCX416A"]
["[TS2L3-MCX516A] Mellanox ConnectX-4 Dual Port 100GbE QSFP28 PCIe Adapter, Full Height, A20",1,"[540-BBUT]","540-BBUU","TS2L3-MCX516A"]
["[TS2L3-2692] QLogic 2692 Dual Port 16Gb Fibre Channel HBA, A20",1,"[403-BBMQ]","403-BBMU","TS2L3-2692"]
[]
[]
["TS2L3PCI8","2CPU"]
["PCIe Slot-8"]
["None",{"$f":"\"\"","v":""},{"$f":"\"\"","v":""},{"$f":"\"\"","v":""},{"$f":"\"\"","v":""},0]
["[TS2L3-LAN1] Broadcom 5720 DP 1Gb Network Interface Card, Full Height",1,"[540-BBCX]","540-BBGY","TS2L3-LAN1",22]
["[TS2L3-LAN10] Broadcom 57412 Dual Port 10Gb, SFP+, PCIe Adapter, Full Height",1,"[540-BBUH]","540-BBUN","TS2L3-LAN10",114,null,"Kit - Dell EMC PowerEdge SFP+ SR Optic, 10GbE, 850nm",null,"407-BCBN",2]
["[TS2L3-CNA10] QLogic 41112 Dual Port 10Gb SFP+ Adapter, Full Height",1,"[540-BBYK]","540-BBYH","TS2L3-CNA10",110,null,"Kit - Dell EMC PowerEdge SFP+ SR Optic, 10GbE, 850nm",null,"407-BCBN",2]
["[TS2L3-FC8] QLogic 2562, Dual Port 8Gb Optical Fibre Channel HBA, Full Height",1,"[540-BBEC]","406-BBEK","TS2L3-FC8",245]
["------------------------ 20% -------------------------"]
["[TS2L3-57416] Broadcom 57416 Dual Port 10Gb, Base-T, PCIe Adapter, Full Height, A20",1,"[540-BBUI]","540-BBUO","TS2L3-57416"]
["[TS2L3-41162] QLogic FastLinQ 41162 Dual Port 10Gb Base-T Adapter, Full Height, A20",1,"[540-BBYJ]","540-BBYG","TS2L3-41162"]
["[TS2L3-MCX416A] Mellanox ConnectX-5 Single Port EDR VPI QSFP28 PCIe Adapter, Full Height, A20",1,"[540-BCDK]","540-BCIV","TS2L3-MCX416A"]
["[TS2L3-MCX516A] Mellanox ConnectX-4 Dual Port 100GbE QSFP28 PCIe Adapter, Full Height, A20",1,"[540-BBUT]","540-BBUU","TS2L3-MCX516A"]
["[TS2L3-2692] QLogic 2692 Dual Port 16Gb Fibre Channel HBA, A20",1,"[403-BBMQ]","403-BBMU","TS2L3-2692"]
[]
[]
["TS2L3PCIGPU","2CPU"]
["PCIe Slot-GPU"]
["None",{"$f":"\"\"","v":""},{"$f":"\"\"","v":""},{"$f":"\"\"","v":""},{"$f":"\"\"","v":""},0]
["------------------------ 20% GPU -------------------------"]
["[TS2L3-GPUV10032] NVIDIA Tesla V100 32G Passive GPU, A20",1,"[490-BENY]",null,"TS2L3-GPUV10032",null,9999]
["[TS2L3-GPUV10016] NVIDIA Tesla™ V100 16G Passive GPU, A20",1,"[490-BEDZ]",null,"TS2L3-GPUV10016",null,16366.99]
["[TS2L3-GPUP4024] NVIDIA Tesla P40 24GB GPU, Passive, A20",1,"[489-BBCN]",null,"TS2L3-GPUP4024",null,9999]
["[TS2L3-GPUM10] NVIDIA Tesla M10 GPU, Requires GRID 2.0 SW for VDI Function, A20",1,"[489-BBCG]",null,"TS2L3-GPUM10",null,4237.99]
["--------------------------------------------------------------"]
["[TS2L3-LAN1] Broadcom 5720 DP 1Gb Network Interface Card, Full Height",1,"[540-BBCX]","540-BBGY","TS2L3-LAN1",22]
["[TS2L3-LAN10] Broadcom 57412 Dual Port 10Gb, SFP+, PCIe Adapter, Full Height",1,"[540-BBUH]","540-BBUN","TS2L3-LAN10",114,null,"Kit - Dell EMC PowerEdge SFP+ SR Optic, 10GbE, 850nm",null,"407-BCBN",2]
["[TS2L3-CNA10] QLogic 41112 Dual Port 10Gb SFP+ Adapter, Full Height",1,"[540-BBYK]","540-BBYH","TS2L3-CNA10",110,null,"Kit - Dell EMC PowerEdge SFP+ SR Optic, 10GbE, 850nm",null,"407-BCBN",2]
["[TS2L3-FC8] QLogic 2562, Dual Port 8Gb Optical Fibre Channel HBA, Full Height",1,"[540-BBEC]","406-BBEK","TS2L3-FC8",245]
["------------------------ 20% -------------------------"]
["[TS2L3-57416] Broadcom 57416 Dual Port 10Gb, Base-T, PCIe Adapter, Full Height, A20",1,"[540-BBUI]","540-BBUO","TS2L3-57416"]
["[TS2L3-41162] QLogic FastLinQ 41162 Dual Port 10Gb Base-T Adapter, Full Height, A20",1,"[540-BBYJ]","540-BBYG","TS2L3-41162"]
["[TS2L3-MCX416A] Mellanox ConnectX-5 Single Port EDR VPI QSFP28 PCIe Adapter, Full Height, A20",1,"[540-BCDK]","540-BCIV","TS2L3-MCX416A"]
["[TS2L3-MCX516A] Mellanox ConnectX-4 Dual Port 100GbE QSFP28 PCIe Adapter, Full Height, A20",1,"[540-BBUT]","540-BBUU","TS2L3-MCX516A"]
["[TS2L3-2692] QLogic 2692 Dual Port 16Gb Fibre Channel HBA, A20",1,"[403-BBMQ]","403-BBMU","TS2L3-2692"]
[]
[]
[]
["DW"]
["GPU","1A+2A+3A"]
["SW"]
["GPU","1E+2D+3B"]
["Low Profile"]
["Intel X520 Dual Port 10Gb, SFP+, Low Profile",null,"[540-BBDG]",null,null,null,null,null,null,null,null,null,null,null," [Option Id: G8P4069] [SKU: 540-BBDG]"]
["Broadcom 57414 Dual Port 25Gb, SFP28, PCIe Adapter, Low Profile",null,"[540-BBVK]",null,null,null,null,null,null,null,null,null,null,null," [Option Id: 5100637] [SKU: 540-BBVK]"]
["Broadcom 57416 Dual Port 10Gb, Base-T, PCIe Adapter, Low Profile",null,"[540-BBVJ]",null,null,null,null,null,null,null,null,null,null,null," [Option Id: 5100636] [SKU: 540-BBVJ]"]
["Broadcom 57412 Dual Port 10Gb, SFP+, PCIe Adapter, Low Profile",null,"[540-BBVI]",null,null,null,null,null,null,null,null,null,null,null," [Option Id: 5100635] [SKU: 540-BBVI]"]
["Broadcom 5719 QP 1Gb Network Interface Card, Low Profile",null,"[540-BBDF]",null,null,null,null,null,null,null,null,null,null,null," [Option Id: 5101877] [SKU: 540-BBDF]"]
["Broadcom 5720 DP 1Gb Network Interface Card, Low Profile",null,"[540-BBDE]",null,null,null,null,null,null,null,null,null,null,null," [Option Id: 5101876] [SKU: 540-BBDE]"]
["Intel X710 Quad Port 10GbE, Base-T, PCIe Adapter, Low Profile",null,"[540-BBVO]",null,null,null,null,null,null,null,null,null,null,null," [Option Id: 5100641] [SKU: 540-BBVO]"]
["Intel X710 Dual Port 10Gb Direct Attach, SFP+, Converged Network Adapter, Low Profile",null,"[555-BCKN]",null,null,null,null,null,null,null,null,null,null,null," [Option Id: X710FP] [SKU: 555-BCKN]"]
["Intel X710 Dual Port 10Gb, SFP+, Converged Network Adapter, Low Profile, With SR Optics",null,"[555-BCKN]",null,null,null,null,"SFP+ SR Optic, 10GbE, for Intel X520 only",2," [407-BBVK]",null,null,null,null," [Option Id: X710LP] [SKU: 407-BBVK, 407-BBVK, 555-BCKN]"]
["Intel X550 Dual Port 10G Base-T Adapter, Low Profile",null,"[540-BBRL]",null,null,null,null,null,null,null,null,null,null,null," [Option Id: 10CNDP] [SKU: 540-BBRL]"]
["Intel Ethernet i350v2 QP 1Gb Server Adapter, Low Profile",null,"[540-BBCZ]",null,null,null,null,null,null,null,null,null,null,null," [Option Id: PD351G] [SKU: 540-BBCZ]"]
["Intel Ethernet i350 DP 1Gb Server Adapter, Low Profile",null,"[540-BBDB]",null,null,null,null,null,null,null,null,null,null,null," [Option Id: SV35LP] [SKU: 540-BBDB]"]
["Mellanox ConnectX-4 Lx Dual Port 25GbE SFP28 Network Adapter, Low Profile",null,"[406-BBLD]",null,null,null,null,null,null,null,null,null,null,null," [Option Id: M25GBL] [SKU: 406-BBLD]"]
["Mellanox ConnectX-3 Pro Dual Port 10 GbE SFP+ PCIE Adapter Low Profile",null,"[540-BBOD]",null,null,null,null,null,null,null,null,null,null,null," [Option Id: MCX331] [SKU: 540-BBOD]"]
["QLogic FastLinQ 41262 Dual Port 25Gb SFP28 Adapter, Low Profile",null,"[540-BBZJ]",null,null,null,null,null,null,null,null,null,null,null," [Option Id: 5106842] [SKU: 540-BBZJ]"]
["QLogic FastLinQ 41162 Dual Port 10Gb Base-T Adapter, Low Profile",null,"[540-BBZK]",null,null,null,null,null,null,null,null,null,null,null," [Option Id: 5106841] [SKU: 540-BBZK]"]
["QLogic FastLinQ 41112 Dual Port 10Gb SFP+ Adapter, Low Profile",null,"[540-BBZI]",null,null,null,null,null,null,null,null,null,null,null," [Option Id: 5106840] [SKU: 540-BBZI]"]
["Intel XXV710 Dual Port 25GbE SFP28 PCIe Adapter, Low Profile",null,"[540-BCCM]",null,null,null,null,null,null,null,null,null,null,null," [Option Id: GBR16FU] [SKU: 540-BCCM]"]
["QLogic FastLinQ 41164 Quad Port 10GBASE-T PCIe Adapter, Low Profile",null,"[540-BCHC]",null,null,null,null,null,null,null,null,null,null,null," [Option Id: GWNLYB0] [SKU: 540-BCHC]"]
["QLogic 2742 Dual Port 32Gb Fibre Channel HBA, Low Profile",null,"[403-BBMM]"]
["QLogic 2692 Dual Port 16Gb Fibre Channel HBA, Low Profile",null,"[403-BBMS]"]
["QLogic 2690 Single Port 16Gb Fibre Channel HBA, Low Profile",null,"[403-BBMW]"]
["QLogic 2562, Dual Port 8Gb Optical Fibre Channel HBA, Low Profile",null,"[540-BBEC]"]
[]
["Full Height"]
["Broadcom 57414 Dual Port 25Gb, SFP28, PCIe Adapter, Full Height",null,"[540-BBUJ]",null,null,null,null,null,null,null,null,null,null,null," [Option Id: 5100004] [SKU: 540-BBUJ]"]
["Broadcom 57416 Dual Port 10Gb, Base-T, PCIe Adapter, Full Height ",null,"[540-BBUI]",null,null,null,null,null,null,null,null,null,null,null,"[Option Id: 5100003] [SKU: 540-BBUI]"]
["Broadcom 57412 Dual Port 10Gb, SFP+, PCIe Adapter, Full Height",null,"[540-BBUH]",null,null,null,null,null,null,null,null,null,null,null," [Option Id: 5100000] [SKU: 540-BBUH]"]
["Broadcom 5720 DP 1Gb Network Interface Card",null,"[540-BBCX]",null,null,null,null,null,null,null,null,null,null,null," [Option Id: 5720DP] [SKU: 540-BBCX]"]
["Intel X710 Quad Port 10GbE, Base-T, PCIe Adapter, Full Height",null,"[540-BBUX]",null,null,null,null,null,null,null,null,null,null,null," [Option Id: 5100585] [SKU: 540-BBUX]"]
["Intel X710 Quad Port 10Gb Direct Attach, SFP+, Converged Network Adapter",null,"[540-BBHQ]",null,null,null,null,null,null,null,null,null,null,null," [Option Id: X710QP] [SKU: 540-BBHQ]"]
["Intel X710 Quad Port 10Gb, SFP+, Converged Network Adapter, with SR Optics",null,"[540-BBHQ]",null,null,null,null,"SFP+ SR Optic, 10GbE, for Intel X520 only",4," [407-BBVK]",null,null,null,null," [Option Id: X710CV] [SKU: 407-BBVK, 407-BBVK, 407-BBVK, 407-BBVK, 540-BBHQ]"]
["Intel X710 Dual Port 10Gb Direct Attach, SFP+, Converged Network Adapter",null,"[540-BBHP]",null,null,null,null,null,null,null,null,null,null,null," [Option Id: X710DA] [SKU: 540-BBHP]"]
["Intel X710 Dual Port 10Gb, SFP+, Converged Network Adapter, with SR Optics",null,"[540-BBHP]",null,null,null,null,"SFP+ SR Optic, 10GbE, for Intel X520 only",2," [407-BBVK]",null,null,null,null," [Option Id: X710SF] [SKU: 407-BBVK, 407-BBVK, 540-BBHP]"]
["Intel X550 Dual Port 10G Base-T Adapter, Full Height",null,"[540-BBRO]",null,null,null,null,null,null,null,null,null,null,null," [Option Id: 10G2NN] [SKU: 540-BBRO]"]
["Intel Ethernet I350 QP 1Gb Server Adapter",null,"[540-BBDD]",null,null,null,null,null,null,null,null,null,null,null," [Option Id: I350QP] [SKU: 540-BBDD]"]
["Intel Ethernet I350 DP 1Gb Server Adapter",null,"[540-BBDH]",null,null,null,null,null,null,null,null,null,null,null," [Option Id: I350DP] [SKU: 540-BBDH]"]
["Mellanox ConnectX-4 Lx Dual Port 25GbE SFP28 Network Adapter",null,"[406-BBLE]",null,null,null,null,null,null,null,null,null,null,null," [Option Id: M25GBP] [SKU: 406-BBLE]"]
["Intel X520 DP 10Gb DA/SFP+ Server Adapter",null,"[540-BBCT]",null,null,null,null,null,null,null,null,null,null,null," [Option Id: X520D] [SKU: 540-BBCT]"]
["Mellanox ConnectX-3 Pro Dual Port 10 GbE SFP+ PCIE Adapter Full Height",null,"[540-BBOW]",null,null,null,null,null,null,null,null,null,null,null," [Option Id: MCX33P] [SKU: 540-BBOW]"]
["QLogic FastLinQ 41162 Dual Port 10Gb Base-T Adapter, Full Height",null,"[540-BBYJ]",null,null,null,null,null,null,null,null,null,null,null," [Option Id: 5103454] [SKU: 540-BBYJ]"]
["QLogic FastLinQ 41112 Dual Port 10Gb SFP+ Adapter, Full Height",null,"[540-BBYK]",null,null,null,null,null,null,null,null,null,null,null," [Option Id: 5103455] [SKU: 540-BBYK]"]
["Intel XXV710 Dual Port 25GbE SFP28 PCIe Adapter, Full Height",null,"[540-BCDH]",null,null,null,null,null,null,null,null,null,null,null," [Option Id: G2WY1IJ] [SKU: 540-BCDH]"]
["QLogic FastLinQ 41164 Quad Port 10GbE SFP+ PCIe Adapter, Full Height",null,"[540-BCHE]",null,null,null,null,null,null,null,null,null,null,null," [Option Id: GOUBFL4] [SKU: 540-BCHE]"]
["QLogic FastLinQ 41164 Quad Port 10GBASE-T PCIe Adapter, Full Height",null,"[540-BCHG]",null,null,null,null,null,null,null,null,null,null,null," [Option Id: GSCHVG2] [SKU: 540-BCHG]"]
["Mellanox ConnectX-5 Single Port EDR VPI QSFP28 PCIe Adapter, Full Height",null,"[540-BCDK]",null,null,null,null,null,null,null,null,null,null,null," [Option Id: GDSNXO7] [SKU: 540-BCDK]"]
["Mellanox ConnectX-4 Dual Port 100GbE QSFP28 PCIe Adapter, Full Height",null,"[540-BBUT]",null,null,null,null,null,null,null,null,null,null,null," [Option Id: GB8GMIC] [SKU: 540-BBUT]"]
["Mellanox ConnectX-5 EX Dual Port 100GbE QSFP28 PCIe Adapter, Full Height",null,"[540-BCIU]",null,null,null,null,null,null,null,null,null,null,null," [Option Id: G90UBJW] [SKU: 540-BCIU]"]
["QLogic 2742 Dual Port 32Gb Fibre Channel HBA",null,"[403-BBML]"]
["QLogic 2692 Dual Port 16Gb Fibre Channel HBA",null,"[403-BBMQ]"]
["QLogic 2690 Single Port 16Gb Fibre Channel HBA",null,"[403-BBMP]"]
["QLogic 2562, Dual Port 8Gb Optical Fibre Channel HBA, Low Profile",null,"[540-BBEC]"]
[]
["Alimentatore"]
["Dual, Hot-plug, Redundant Power Supply (1+1), 1100W",1,"[450-ADWM]"]
["Single, Hot-plug Power Supply (1+0), 1600W, 250 Volt Power Cord Recommended",2,"[450-AFMR]","450-AEPB","TS2L3-PSU1600"]
["Single, Hot-plug, Power Supply, 2000W, C19/C20 Power Cord Required",2,"[450-AGFT]","450-AENT","TS2L3-PSU2000"]
[]
["Network Daughter Card"]
["Intel X520 DP 10Gb DA/SFP+, + I350 DP 1Gb Ethernet, Network Daughter Card",null,"[540-BBBB]"]
["QLogic FastLinQ 41162 Dual Port 10GBASE-T, Dual Port 1GbE, rNDC ",null,"[555-BDYF]"]
["QLogic FastLinQ 41262 Dual Port 25GbE SFP28, rNDC ",null,"[555-BDYC]"]
["QLogic FastLinQ 41164 Quad Port 10GBASE-T, rNDC ",null,"[555-BDYB]"]
["QLogic FastLinQ 41164 Quad Port 10GbE SFP+, rNDC",null,"[555-BDXY]"]
["Broadcom 57414 Dual Port 25Gb, SFP28, rNDC",null,"[540-BBUM]"]
["Broadcom 57416 2 Port 10Gb Base-T + 5720 2 Port 1Gb Base-T, rNDC",null,"[540-BBUK]"]
["Broadcom 57412 2 Port 10Gb SFP+ + 5720 2 Port 1Gb Base-T, rNDC",null,"[540-BBUL]"]
["Broadcom 5720 QP 1Gb Network Daughter Card",null,"[540-BBBW]"]
["Intel X710 Quad Port 10Gb DA/SFP+ Ethernet, Network Daughter Card",null,"[555-BCKP]"]
["Intel X710 Quad Port 10Gb DA/SFP+ Ethernet, Network Daughter Card, with SR Optics",null,"[555-BCKP]",null,null,null,null,"SFP+ SR Optic, 10GbE, for Intel X520 only",4," [407-BBVK]"]
["Intel X710 DP 10Gb DA/SFP+, + I350 DP 1Gb Ethernet, Network Daughter Card",null,"[555-BCKO]"]
["Intel X710 DP 10Gb SR/SFP+, + I350 DP 1Gb Ethernet, Network Daughter Card, with SR Optics",null,"[55-BCKO]",null,null,null,null,"SFP+ SR Optic, 10GbE, for Intel X520 only",2," [407-BBVK]"]
["Intel X550 Quad Port 10GbE, Base-T, rNDC",null,"[540-BBUY]"]
["Intel X550 2 Port 10Gb Base-T + I350 2 Port 1Gb Base-T, rNDC",null,"[540-BBUZ]"]
["Intel Ethernet I350 QP 1Gb Network Daughter Card",null,"[540-BBCB]"]
["Mellanox ConnectX-4 Lx Dual Port 25GbE SFP28 rNDC",null,"[406-BBLG]"]
["QLogic FastLinQ 41264 Dual Port 10GbE SFP+, Dual Port 1GbE, rNDC",null,"[555-BDYH]"]
[]
["Bezel"]
["No Bezel",1,"[350-BBBW]"]
["PowerEdge 2U Standard Bezel",1,"[325-BCHU]"]
["PowerEdge 2U LCD Bezel",1,"[325-BCHV]"]
[]
["Rack Rails"]
["ReadyRails™ Sliding Rails Without Cable Management Arm",1,"[770-BBBQ]"]
["ReadyRails™ Sliding Rails With Cable Management Arm",1,"[770-BBBR]"]
[]
["Estenzione di Garanzia"]
["None",{"$f":"\"\"","v":""},{"$f":"\"\"","v":""},{"$f":"\"\"","v":""},{"$f":"\"\"","v":""},0]
["Estensione della manutenzione in garanzia per ulteriori 12 mesi",1,{"$f":"\"\"","v":""},"701-11494 732-79421","TS2L7-4Y",173]
["Estensione della manutenzione in garanzia per ulteriori 24 mesi",1,{"$f":"\"\"","v":""},"701-11494 701-11494 732-79422","TS2L7-5Y",346]
[]
[]
["_SavePDFon"]
["_SavePDFoff"]

{"sheet":"Codici&PrezzixRiepilogo","index":8,"n_rows":74,"n_cols":6,"rows_kept":74,"cut":false,"hidden":true,"merged":[[26,4,27,4],[39,4,40,4],[1,4,3,4],[5,4,7,4],[19,4,20,4],[21,4,22,4],[24,4,25,4],[1,1,3,1],[5,0,7,0],[5,1,7,1],[19,0,20,0],[19,1,20,1],[39,0,40,0],[39,1,40,1],[1,3,3,3],[5,3,7,3],[19,3,20,3],[21,3,22,3],[24,3,25,3],[26,3,27,3],[39,3,40,3],[21,0,22,0],[21,1,22,1],[24,0,25,0],[24,1,25,1],[26,0,27,0],[26,1,27,1],[1,0,3,0]]}
["CODICE CONVERGE","CODICE CONVENZIONE","Description","Prezzo vendita da Converge a CONSIP tot.","CODICE CONVERGE"]
["TS2L7-SRV","TS2L7-SRV","4 x Dell PowerEdge C6420 in C6400 Enclosure",8625,"TS2L7-SRV",{"$f":"LEN(B2)","v":9}]
[null,null,"Dell PowerEdge C6400 Enclosure"]
[null,null,"Dell PowerEdge C6420",null,null,{"$f":"LEN(B4)","v":0}]
[null,null,null,null,null,0]
["TS2L7-CPU","TS2L7-CPU","Processore Intel Xeon Gold 5120",1250,"TS2L7-CPU",{"$f":"LEN(B6)","v":9}]
[null,null,"C6420 Heatsink for CPU2",null,null,0]
[null,null,"PCIe Riser for C6420",null,null,0]
[null,null,null,null,null,0]
["TS2D-RAM16","TS2L7-RAM16","Upgrade KIT RAM 16GB",100,"TS2D-RAM16",11]
["TS2D-RAM32","TS2L7-RAM32","Upgrade KIT RAM 32GB",351,"TS2D-RAM32",11]
["TS2D-RAM64","TS2L7-RAM64","Upgrade KIT RAM 64GB",703,"TS2D-RAM64",11]
[null,null,null,null,null,0]
["TS2D-10K600","TS2L7-10K600","HDD 600GB 10K SAS 12Gbps  2.5in Hot-plug",68,"TS2D-10K600",12]
["TS2D-10K1200","TS2L7-10K1200","HDD 1200GB 10K SAS 12Gbps  2.5in Hot-plug",139,"TS2D-10K1200",13]
["TS2D-SSDR960","TS2L7-SSDR960","SSD 960GB SAS RI 12Gbps 2.5in Hot-plug",735,"TS2D-SSDR960",13]
["TS2L7-SSDR1920","TS2L7-SSDR1920","SSD 1920GB SAS RI 12Gbps 2.5in Hot-plug",1422,"TS2L7-SSDR1920",14]
[null,null,null,null,null,0]
["TS2D-LAN1-L","TS2L7-LAN1-L","Scheda LAN 5720 Dual Port 1Gb,Low Profile",22,"TS2D-LAN1-L",12]
["TS2D-LAN10-L","TS2L7-LAN10-L","Scheda LAN 57412 Dual Port 10Gb, SFP+, Low Profile",234,"TS2D-LAN10-L",13]
[null,null,"Transceiver SFP+ SR, 10GbE, 850nm",null,null,0]
["TS2D-CNA10-L","TS2L7-CNA10-L","Scheda CNA 41112 Dual Port 10Gb SFP+, Low Profile",222,"TS2D-CNA10-L",13]
[null,null,"Transceiver SFP+ SR, 10GbE, 850nm",null,null,0]
[null,null,null,null,null,0]
["TS2L7-4Y","TS2L7-4Y","Estensione della manutenzione in garanzia per ulteriori 12 mesi",173,"TS2L7-4Y",8]
[null,null,"Onsite Labor CRU, 1Year",null,null,0]
["TS2L7-5Y","TS2L7-5Y","Estensione della manutenzione in garanzia per ulteriori 24 mesi",346,"TS2L7-5Y",8]
[null,null,"Onsite Labor CRU, 1Year",null,null,0]
[null,null,null,null,null,0]
["TS2D-WIN1","TS2L7-WIN","Windows Server 2016 Standard Ed 16CORE",548,"TS2D-WIN1",9]
["TS2D-WIN2","TS2L7-WIN2","Windows Server 2016 Standard Ed Add License 16CORE",560,"TS2D-WIN2",10]
["TS2D-CALDEV","TS2L7-CALDEV","Device CAL 1-pack Windows Server 2016",20,"TS2D-CALDEV",12]
["TS2D-CALUSER","TS2L7-CALUSER","User CAL 1-pack Windows Server 2016",24,"TS2D-CALUSER",13]
["TS2D-WIN2CORE","TS2L7-WIN2CORE","Windows Server 2016 Standard Ed Add License 2CORE",71,"TS2D-WIN2CORE",14]
["TS2D-WINDC","TS2L7-WINDC","Windows Server 2016 Datacenter Ed 16CORE",2350,"TS2D-WINDC",11]
["TS2D-WINDC2","TS2L7-WINDC2","Windows Server 2016 Datacenter Ed Add License 16CORE",2350,"TS2D-WINDC2",12]
["TS2D-WINDC2COR","TS2L7-WINDC2COR","Windows Server 2016 Datacenter Ed Add License 2CORE",377,"TS2D-WINDC2COR",15]
["TS2-LINUX","TS2L7-LINUX","CentOS 7.x",50,"TS2-LINUX",11]
[null,null,null,null,null,0]
["TS2L7-UPS","TS2L7-UPS","UPS MSR 3000VA + staffe",396,"TS2L7-UPS",9]
[null,null,"Kit 2 Guide universali per UPS",{"$f":"C41*#REF!","v":{"$error":"#VALUE!"}},null,0]
["TS2L7-GUI","TS2L7-GUI","Console KVM GUI da rack",448,"TS2L7-GUI",9]
["TS2L7-RACK","TS2L7-RACK","Armadio Rack 42U",504,"TS2L7-RACK",10]
["TS2L7-KVMIP","TS2L7-KVMIP","KVM Switch IP per GUI 16P con cavi",495,"TS2L7-KVMIP",11]
[null,null,null,null,null,0]
["TS2-3MRJ45","TS2L7-3MRJ45","Cavo Rete UTP cat. 5e 3 metri A20",2,"TS2-3MRJ45",12]
["TS2D-SSDM480","TS2L7-SSDM480","SSD 480GB SAS MU 12Gbps 2.5in Hot-Plug A20",399,"TS2D-SSDM480",13]
["TS2D-10K1800","TS2L7-10K1800","HDD 1800GB 10K SAS 12Gbps  2.5in Hot-plug A20",169,"TS2D-10K1800",13]
["TS2D-L7-BOSS240","TS2L7-L7-BOSS240","BOSS controller card, 2 x 240G M.2 Drive A20",447,"TS2D-L7-BOSS240",16]
["TS2D-MCX516A3-L","TS2L7-MCX516A3-L","Mellanox ConnectX-5 EX Dual Port 100GbE QSFP28 PCIe Adapter, Low Profile with 2 x 100GbE QSFP28 to QSFP28, Passive Copper Direct Attach Cable,3 Meter A20",1577,"TS2D-MCX516A3-L",16]
["TS2D-MCX4121A3-L","TS2L7-MCX4121A3-L","Mellanox ConnectX-4 Lx Dual Port 25GbE SFP28 Network Adapter, Low Profile with 2 x 100GbE QSFP28 to QSFP28, Passive Copper DAC,3 Meter A20",748,"TS2D-MCX4121AM3",17]
["TS2D-MCX5SP-L","TS2L7-MCX5SP-L","Mellanox ConnectX-5 Single Port EDR VPI QSFP28 100Gb PCIe Adapter,  Low Profile with QSFP passive copper cable, LSZH, 2m A20",718,"TS2D-MCX5SP-L",14]
["TS2D-HBASAS12-L","TS2L7-HBASAS12-L","Dell 12Gbps SAS Host Bus Adapter External Controller - Low Profile A20",158,"TS2D-HBASAS12-L",16]
["TS2D-L7-H730P","TS2L7-L7-H730P","Dell PERC H730P RAID Controller Adapter, C6420 A20",528,"TS2D-L7-H730P",14]
["TS2D-Q41162T-L","TS2L7-Q41162T-L","QLogic FastLinQ 41162 Dual Port 10Gb Base-T Adapter, Low Profile A20",349,"TS2D-Q41162T-L",15]
["TS2D-Q41164T-L","TS2L7-Q41164T-L","QLogic FastLinQ 41164 Quad Port 10G Base-T Adapter, Low Profile A20",687,"TS2D-Q41164T-L",15]
["TS2D-B57416T-L","TS2L7-B57416T-L","Broadcom 57416 Dual Port 10Gb, Base-T, PCIe Adapter, Low Profile A20",389,"TS2D-B57416T-L",15]
["TS2D-5XDAC10M3","TS2L7-5XDAC10M3","5 x Dell Networking, Cable, SFP+ to SFP+, 10GbE, Copper Twinax Direct Attach Cable, 3 Meter A20",125,"TS2D-5XDAC10M3",15]
["TS2D-SSDW800","TS2L7-SSDW800","800GB SSD SAS Write Intensive 12Gb 512n 2.5in Hot-plug Drive, 10 DWPD A20",1723,"TS2D-SSDW800",13]
["TS2D-SSDW400","TS2L7-SSDW400","400GB SSD SAS Write Intensive 12Gbps 512n 2.5in Hot-plug Drive, 10 DWPD A20",1155,"TS2D-SSDW400",13]
["TS2D-L7-10K2400","TS2L7-L7-10K2400","2.4TB 10K RPM SAS 12Gbps 512e 2.5in Hot-plug Hard Drive NO VMWARE A20",391,"TS2D-L7-10K2400",16]
["TS2D-10GOT","TS2L7-10GOT","2 x SFP+ SR 10GbE Optical Transceiver, Dell",168,"TS2D-10GOT",11]
["TS2D-VMWKIT6P3Y","TS2L7-VMWKIT6P3Y","VMware vSphere Essentials Plus Kit OEM 6 Processor 3yr A20",5230,"TS2D-VMWKIT6P3Y",16]
["TS2D-VMWSTD1P3Y","TS2L7-VMWSTD1P3Y","VMware vSphere Standard OEM 1 Processor 3yr Software A20",1743,"TS2D-VMWSTD1P3Y",16]
["TS2D-VMWVCSTD3Y","TS2L7-VMWVCSTD3Y","VMw vCenter Server Standard for vSphere OEM 3yr Software A20",8909,"TS2D-VMWVCSTD3Y",16]
["TS2D-VMWVCSTD5Y","TS2L7-VMWVCSTD5Y","VMw vCenter Server Standard for vSphere OEM 5yr Software A20",10549,"TS2D-VMWVCSTD5Y",16]
["TS2D-VMWEP1P3Y","TS2L7-VMWEP1P3Y","VMware vSphere Enterprise Plus OEM 1 Processor 3yr Software A20",4905,"TS2D-VMWEP1P3Y",15]
["TS2D-VMWEP1P5Y","TS2L7-VMWEP1P5Y","VMware vSphere Enterprise Plus OEM 1 Processor 5yr Software A20",6367,"TS2D-VMWEP1P5Y",15]
["TS2D-VSANSTD3Y","TS2L7-VSANSTD3Y","VMware vSAN Standard OEM  1 Processor 3yr Software A20",3177,"TS2D-VSANSTD3Y",15]
["TS2D-VSANSTD5Y","TS2L7-VSANSTD5Y","VMware vSAN Standard OEM  1 Processor 5yr Software A20",4107,"TS2D-VSANSTD5Y",15]
["TS2D-VSANADV3Y","TS2L7-VSANADV3Y","VMware vSAN Advanced OEM  1 Processor 3yr Software A20",5010,"TS2D-VSANADV3Y",{"$f":"LEN(B71)","v":15}]
["TS2D-VSANADV5Y","TS2L7-VSANADV5Y","VMware vSAN Advanced OEM  1 Processor 5yr Software A20",6475,"TS2D-VSANADV5Y",15]
["TS2D-L7-HBA330","TS2L7-L7-HBA330","HBA330 Controller Card, C4240/XR2, Customer Kit",205,"TS2D-L7-HBA330",15]
["TS2D-SSDW1600","TS2L7-SSDW1600","1600GB SSD SAS Write Intensive 12Gb 512n 2.5in Hot-plug Drive, 10 DWPD A20",1475,"TS2D-SSDW1600",14]