{"text_format":"1","workbook":"xlsx","n_sheets":7,"sheets":["Lotto1_T340_1","Lotto1_T340_2","Lotto1_T340_3","ConfigurationTS3L1","Tabella_prezzi","Riepilogo","Configurazione"],"not_rendered":{"charts":0,"images":24,"macros":1,"external_links":0,"defined_names":22,"comments":0,"pivot_tables":0},"unopened":[],"bounds":{"document_bytes":16777216,"sheet_cells":100000,"rows_first":2000,"rows_last":500,"rows_between":2000,"halvings":0,"cell_chars":16384,"cell_head_chars":4096},"cells_cut":0,"cells_raw":0,"read":"whole","date_system":"1900"}

{"sheet":"Lotto1_T340_1","index":0,"n_rows":96,"n_cols":17,"rows_kept":96,"cut":false,"hidden":false,"merged":[[26,7,37,7],[6,3,7,3],[9,3,10,3],[15,3,16,3],[24,3,25,3],[42,3,43,3],[84,3,85,3],[87,3,88,3],[91,3,92,3],[94,3,95,3]]}
[null,null,null,null,"Convenzione",{"$f":"SUM(J8:J96)*F5","v":0}]
[null,null,null,null,0.2,{"$f":"SUM(K8:K96)*F5","v":0}]
[null,null,null,null,"Totale",{"$f":"SUM(F1:F2)","v":0}]
[]
[null,null,"POWEREDGE T340          Consulta la Guida alla Convenzione --->",{"$f":"HYPERLINK(\"https://convenzioni.converge.it/docs/L1GuidaAllaConvenzioneTecnologieServer3.pdf\",\"&\")","v":"&"},"Quantità Server",null,null,{"$f":"Riepilogo!G8","v":"Version 2.8"}]
[]
[null,null,"Base",{"$f":"HYPERLINK(\"https://convenzioni.converge.it/docs/ts3_datasheet/dell-emc-poweredge-t340-spec-sheet.pdf\",\"i\")","v":"i"}]
[null,null,"PowerEdge T340 Server",null,{"$f":"IF($F$5>0,\"TS3L1-SRV\",\"\")","v":""},{"$f":"IF($F$5>0,1,\"\")","v":""},null,null,null,1399,null,{"$f":"VLOOKUP($C8,TS3L1_ALL,12,FALSE)","v":"L1N01"}]
[]
[null,null,"Chassis Configuration",{"$f":"HYPERLINK(\"https://dellservervr.dell.com/poweredge-t340/\",\"i\")","v":"i"}]
[null,null,"3.5\" Chassis up to 4 Hot Plug Hard Drives and Embedded SATA"]
[]
[null,null,"Trusted Platform Module (TPM)"]
[null,null,"Trusted Platform Module 2.0"]
[]
[null,null,"Processor",{"$f":"HYPERLINK(\"https://ark.intel.com/content/www/it/it/ark/products/191040/intel-xeon-e-2236-processor-12m-cache-3-40-ghz.html\",\"i\")","v":"i"}]
[null,null,"Intel® Xeon® E-2236 3.4GHz, 12M cache, 6C/12T, turbo (80W)"]
[]
[null,null,"Memory Capacity"]
[null,null,"16GB",null,{"$f":"VLOOKUP($C$20,TS3L1_RAM,13,FALSE)","v":""},{"$f":"VLOOKUP($C$20,TS3L1_RAM,7,FALSE)","v":0},null,null,null,{"$f":"VLOOKUP($C$20,TS3L1_RAM,10,FALSE)","v":0},null,{"$f":"VLOOKUP($C20,TS3L1_ALL,12,FALSE)","v":""}]
[]
[null,null,"Operating System"]
[null,null,"No Operating System",null,{"$f":"VLOOKUP($C$23,TS3L1_OS,13,FALSE)","v":""},{"$f":"VLOOKUP($C$23,TS3L1_OS,7,FALSE)","v":""},null,null,null,{"$f":"VLOOKUP($C$23,TS3L1_OS,10,FALSE)","v":0},null,{"$f":"VLOOKUP($C23,TS3L1_ALL,12,FALSE)","v":""}]
[]
[null,null,"Boot Optimized Storage Cards",{"$f":"HYPERLINK(\"https://convenzioni.converge.it/docs/ts3_datasheet/DELL_BOSS.pdf\",\"i\")","v":"i"}]
[null,null,"BOSS controller card + with 2 M.2 Sticks 480GB (RAID1),FH",null,null,null,null,"Configurazione RAID e/o NOTE"]
[null,null,null,null,null,null,null,"Specificare la configurazione RAID per l'installazione del Sistema Operativo, se richiesto.\ne/o\ninserire eventuali note."]
[null,null,"Hard Drives Bay 1"]
[null,null,"",null,{"$f":"VLOOKUP($C29,TS3L1_HDD,13,FALSE)","v":""},{"$f":"VLOOKUP($C29,TS3L1_HDD,7,FALSE)","v":""},null,null,null,{"$f":"VLOOKUP($C29,TS3L1_HDD,10,FALSE)","v":0},{"$f":"VLOOKUP($C29,TS3L1_HDD,11,FALSE)","v":0},{"$f":"VLOOKUP($C29,TS3L1_ALL,12,FALSE)","v":""}]
[]
[null,null,"Hard Drives Bay 2"]
[null,null,"",null,{"$f":"VLOOKUP($C32,TS3L1_HDD,13,FALSE)","v":""},{"$f":"VLOOKUP($C32,TS3L1_HDD,7,FALSE)","v":""},null,null,null,{"$f":"VLOOKUP($C32,TS3L1_HDD,10,FALSE)","v":0},{"$f":"VLOOKUP($C32,TS3L1_HDD,11,FALSE)","v":0},{"$f":"VLOOKUP($C32,TS3L1_ALL,12,FALSE)","v":""}]
[]
[null,null,"Hard Drives Bay 3"]
[null,null,"",null,{"$f":"VLOOKUP($C35,TS3L1_HDD,13,FALSE)","v":""},{"$f":"VLOOKUP($C35,TS3L1_HDD,7,FALSE)","v":""},null,null,null,{"$f":"VLOOKUP($C35,TS3L1_HDD,10,FALSE)","v":0},{"$f":"VLOOKUP($C35,TS3L1_HDD,11,FALSE)","v":0},{"$f":"VLOOKUP($C35,TS3L1_ALL,12,FALSE)","v":""}]
[]
[null,null,"Hard Drives Bay 4"]
[null,null,"",null,{"$f":"VLOOKUP($C38,TS3L1_HDD,13,FALSE)","v":""},{"$f":"VLOOKUP($C38,TS3L1_HDD,7,FALSE)","v":""},null,null,null,{"$f":"VLOOKUP($C38,TS3L1_HDD,10,FALSE)","v":0},{"$f":"VLOOKUP($C38,TS3L1_HDD,11,FALSE)","v":0},{"$f":"VLOOKUP($C38,TS3L1_ALL,12,FALSE)","v":""}]
[]
[null,null,"Power Supply"]
[null,null,"Single, Hot-plug Power Supply 1+0, 495W",null,{"$f":"VLOOKUP($C41,TS3L1_PSU,13,FALSE)","v":""},{"$f":"VLOOKUP($C41,TS3L1_PSU,7,FALSE)","v":""},null,null,null,{"$f":"VLOOKUP($C41,TS3L1_PSU,10,FALSE)","v":0},null,{"$f":"IF((M41+M80+M83)>0,\"L1N18\",0)","v":0},{"$f":"IF(Q41=\"\",0,1)","v":0},{"$f":"(M41+M80+M83)/(M41+M80+M83)","v":{"$error":"#DIV/0!"}},{"$f":"VLOOKUP($C41,TS3L1_PSU,11,FALSE)","v":0},{"$f":"N42/N41","v":{"$error":"#DIV/0!"}},{"$f":"VLOOKUP($C41,TS3L1_ALL,12,FALSE)","v":""}]
[null,null,null,null,null,null,null,null,null,null,{"$f":"IFERROR(N42,0)","v":0},{"$f":"IF(Q41=\"L1N18\",\"TS3L12PSU\",\"TS3L11PSU\")","v":"TS3L11PSU"},null,{"$f":"(O41+O80+O83)/(M41+M80+M83)","v":{"$error":"#DIV/0!"}}]
[null,null,"Embedded Systems Management",{"$f":"HYPERLINK(\"https://convenzioni.converge.it/docs/ts3_datasheet/idrac-spec-sheet.pdf\",\"i\")","v":"i"}]
[null,null,"iDRAC9,Enterprise"]
[]
[null,null,"Network Cards"]
[null,null,"On-Board Broadcom 5720 Dual Port 1Gb LOM"]
[]
[null,null,"PCI Slot 1 x8 PCIe Gen3 for FH/HL (x8 lanes)"]
[null,null,"BOSS controller card + with 2 M.2 Sticks 480GB (RAID 1),FH",null,{"$f":"VLOOKUP($C50,TS3L1_PCI1,13,FALSE)","v":""},{"$f":"VLOOKUP($C50,TS3L1_PCI1,7,FALSE)","v":""},null,null,null,{"$f":"VLOOKUP($C50,TS3L1_PCI1,10,FALSE)","v":0},{"$f":"VLOOKUP($C50,TS3L1_PCI1,11,FALSE)","v":0},{"$f":"VLOOKUP($C50,TS3L1_ALL,12,FALSE)","v":""}]
[]
[null,null,"PCI Slot 2  x16 PCIe Gen3 for FH/HL (x8 lanes)"]
[null,null,"",null,{"$f":"VLOOKUP($C53,TS3L1_PCI2,13,FALSE)","v":""},{"$f":"VLOOKUP($C53,TS3L1_PCI2,7,FALSE)","v":""},null,null,null,{"$f":"VLOOKUP($C53,TS3L1_PCI2,10,FALSE)","v":0},{"$f":"VLOOKUP($C53,TS3L1_PCI2,11,FALSE)","v":0},{"$f":"VLOOKUP($C53,TS3L1_ALL,12,FALSE)","v":""}]
[]
[null,null,"PCI Slot 3 x1 PCIe Gen3 for FH/HL (x1 lanes)"]
[null,null,"",null,{"$f":"VLOOKUP($C56,TS3L1_PCI3,13,FALSE)","v":""},{"$f":"VLOOKUP($C56,TS3L1_PCI3,7,FALSE)","v":""},null,null,null,{"$f":"VLOOKUP($C56,TS3L1_PCI3,10,FALSE)","v":0},{"$f":"VLOOKUP($C56,TS3L1_PCI3,11,FALSE)","v":0},{"$f":"VLOOKUP($C56,TS3L1_ALL,12,FALSE)","v":""}]
[]
[null,null,"PCI Slot 4 x8 PCIe Gen3 for FH/HL (x4 lanes)"]
[null,null,"",null,{"$f":"VLOOKUP($C59,TS3L1_PCI4,13,FALSE)","v":""},{"$f":"VLOOKUP($C59,TS3L1_PCI4,7,FALSE)","v":""},null,null,null,{"$f":"VLOOKUP($C59,TS3L1_PCI4,10,FALSE)","v":0},{"$f":"VLOOKUP($C59,TS3L1_PCI4,11,FALSE)","v":0},{"$f":"VLOOKUP($C59,TS3L1_ALL,12,FALSE)","v":""}]
[]
[null,null,"SFP+ Transceivers",null,null,"Quantità"]
[null,null,"SFP+ SR Optic for all SFP+ ports",null,{"$f":"IF(K62>0,VLOOKUP($C62,TS3L1_ALL,13,FALSE),\"\")","v":""},0,null,null,null,null,{"$f":"VLOOKUP($C62,TS3L1_ALL,11,FALSE)*F62","v":0},{"$f":"VLOOKUP($C62,TS3L1_ALL,12,FALSE)","v":"L1N34"}]
[]
[null,null,"SFP+ Direct Attach Cables (Twinax)",null,null,"Quantità"]
[null,null,"Dell Networking, Cable, SFP+ to SFP+, 10GbE, Copper Twinax Direct Attach Cable, 1 Meter",null,{"$f":"IF(K65>0,VLOOKUP($C65,TS3L1_ALL,13,FALSE),\"\")","v":""},null,null,null,null,null,{"$f":"VLOOKUP($C65,TS3L1_ALL,11,FALSE)*F65","v":0},{"$f":"VLOOKUP($C65,TS3L1_ALL,12,FALSE)","v":"L1N35"}]
[null,null,"Dell Networking, Cable, SFP+ to SFP+, 10GbE, Copper Twinax Direct Attach Cable, 3 Meter",null,{"$f":"IF(K66>0,VLOOKUP($C66,TS3L1_ALL,13,FALSE),\"\")","v":""},null,null,null,null,null,{"$f":"VLOOKUP($C66,TS3L1_ALL,11,FALSE)*F66","v":0},{"$f":"VLOOKUP($C66,TS3L1_ALL,12,FALSE)","v":"L1N36"}]
[null,null,"Dell Networking, Cable, SFP+ to SFP+, 10GbE, Copper Twinax Direct Attach Cable, 5 Meter",null,{"$f":"IF(K67>0,VLOOKUP($C67,TS3L1_ALL,13,FALSE),\"\")","v":""},null,null,null,null,null,{"$f":"VLOOKUP($C67,TS3L1_ALL,11,FALSE)*F67","v":0},{"$f":"VLOOKUP($C67,TS3L1_ALL,12,FALSE)","v":"L1N37"}]
[]
[null,null,"RJ45 Cables",null,null,"Quantità"]
[null,null,"cavo “patch” di 3 mt RJ45 certificato per gigabit ethernet",null,{"$f":"IF(K70>0,VLOOKUP($C70,TS3L1_ALL,13,FALSE),\"\")","v":"TS3L1-RJ453M"},3,null,null,null,0,{"$f":"IF(F70>0,(F70)*ConfigurationTS3L1!K58,0)","v":9},{"$f":"VLOOKUP($C70,TS3L1_ALL,12,FALSE)","v":"L1N26"}]
[]
[null,null,"SAS Cables",null,null,"Quantità"]
[null,null,"12Gb HD-Mini to HD-Mini SAS Cable, 2M",null,{"$f":"IF(K73>0,VLOOKUP($C73,TS3L1_ALL,13,FALSE),\"\")","v":""},null,null,null,null,null,{"$f":"VLOOKUP($C73,TS3L1_ALL,11,FALSE)*F73","v":0},{"$f":"VLOOKUP($C73,TS3L1_ALL,12,FALSE)","v":"L1N29"}]
[null,null,"12Gb HD-Mini to HD-Mini SAS Cable, 6M",null,{"$f":"IF(K74>0,VLOOKUP($C74,TS3L1_ALL,13,FALSE),\"\")","v":""},null,null,null,null,null,{"$f":"VLOOKUP($C74,TS3L1_ALL,11,FALSE)*F74","v":0},{"$f":"VLOOKUP($C74,TS3L1_ALL,12,FALSE)","v":"L1N30"}]
[null,null,"12Gb HD-Mini SAS cable, 0.5m",null,{"$f":"IF(K75>0,VLOOKUP($C75,TS3L1_ALL,13,FALSE),\"\")","v":""},null,null,null,null,null,{"$f":"VLOOKUP($C75,TS3L1_ALL,11,FALSE)*F75","v":0},{"$f":"VLOOKUP($C75,TS3L1_ALL,12,FALSE)","v":"L1N31"}]
[null,null,"12Gb HD-Mini SAS cable, 2m",null,{"$f":"IF(K76>0,VLOOKUP($C76,TS3L1_ALL,13,FALSE),\"\")","v":""},null,null,null,null,null,{"$f":"VLOOKUP($C76,TS3L1_ALL,11,FALSE)*F76","v":0},{"$f":"VLOOKUP($C76,TS3L1_ALL,12,FALSE)","v":"L1N32"}]
[null,null,"12Gb Mini-SAS HD to Mini-SAS HD Cable, 4m",null,{"$f":"IF(K77>0,VLOOKUP($C77,TS3L1_ALL,13,FALSE),\"\")","v":""},null,null,null,null,null,{"$f":"VLOOKUP($C77,TS3L1_ALL,11,FALSE)*F77","v":0},{"$f":"VLOOKUP($C77,TS3L1_ALL,12,FALSE)","v":"L1N33"}]
[]
[null,null,"Bezel"]
[null,null,"No Bezel",null,{"$f":"VLOOKUP($C80,TS3L1_BEZEL,13,FALSE)","v":""},{"$f":"VLOOKUP($C80,TS3L1_BEZEL,7,FALSE)","v":""},null,null,null,{"$f":"VLOOKUP($C80,TS3L1_BEZEL,10,FALSE)","v":0},null,null,{"$f":"IF(Q80=\"\",0,1)","v":0},null,{"$f":"VLOOKUP($C80,TS3L1_BEZEL,11,FALSE)","v":0},null,{"$f":"VLOOKUP($C80,TS3L1_ALL,12,FALSE)","v":""}]
[]
[null,null,"Internal Optical Drive"]
[null,null,"No Internal Optical Drive",null,{"$f":"VLOOKUP($C83,TS3L1_DVD,13,FALSE)","v":""},{"$f":"VLOOKUP($C83,TS3L1_DVD,7,FALSE)","v":""},null,null,null,{"$f":"VLOOKUP($C83,TS3L1_DVD,10,FALSE)","v":0},null,null,{"$f":"IF(Q83=\"\",0,1)","v":0},null,{"$f":"VLOOKUP($C83,TS3L1_DVD,11,FALSE)","v":0},null,{"$f":"VLOOKUP($C83,TS3L1_ALL,12,FALSE)","v":""}]
[]
[null,null,"Warranty",{"$f":"HYPERLINK(\"https://convenzioni.converge.it/docs/ts3_datasheet/TS3warranty.pdf\",\"i\")","v":"i"}]
[null,null,"Manutenzione in garanzia (36 mesi)",null,{"$f":"VLOOKUP($C86,TS3L1_WARRANTY,13,FALSE)","v":""},{"$f":"VLOOKUP($C86,TS3L1_WARRANTY,7,FALSE)","v":""},null,null,null,{"$f":"VLOOKUP($C86,TS3L1_WARRANTY,10,FALSE)","v":0},{"$f":"VLOOKUP($C86,TS3L1_WARRANTY,11,FALSE)","v":0},{"$f":"VLOOKUP($C86,TS3L1_ALL,12,FALSE)","v":""}]
[]
[null,null,"Hard Disk Retention",{"$f":"HYPERLINK(\"https://convenzioni.converge.it/docs/ts3_datasheet/DELL_HDD_KYHD.pdf\",\"i\")","v":"i"}]
[null,null,"",null,{"$f":"IFERROR($N$89,VLOOKUP($C89,TS3L1_ALL,13,FALSE))","v":""},{"$f":"IF(C89=\"\",\"\",1)","v":""},null,null,null,{"$f":"IFERROR($O$89,VLOOKUP($C89,TS3L1_ALL,10,FALSE))","v":0},{"$f":"IFERROR($P$89,VLOOKUP($C89,TS3L1_ALL,11,FALSE))","v":0},{"$f":"IFERROR($Q$89,VLOOKUP($C89,TS3L1_ALL,12,FALSE))","v":""},null,{"$f":"IF($F$86+$F$89=2,VLOOKUP(\"Hard Disk Retention (60 mesi)\",TS3L1_ALL,13,FALSE),VLOOKUP($C89,TS3L1_ALL,13,FALSE))","v":{"$error":"#VALUE!"}},{"$f":"IF($F$86+$F$89=2,VLOOKUP(\"Hard Disk Retention (60 mesi)\",TS3L1_ALL,10,FALSE),VLOOKUP($C89,TS3L1_ALL,10,FALSE))","v":{"$error":"#VALUE!"}},{"$f":"IF($F$86+$F$89=2,VLOOKUP(\"Hard Disk Retention (60 mesi)\",TS3L1_ALL,11,FALSE),VLOOKUP($C89,TS3L1_ALL,11,FALSE))","v":{"$error":"#VALUE!"}},{"$f":"IF($F$86+$F$89=2,VLOOKUP(\"Hard Disk Retention (60 mesi)\",TS3L1_ALL,12,FALSE),VLOOKUP($C89,TS3L1_ALL,12,FALSE))","v":{"$error":"#VALUE!"}}]
[]
[]
[null,null,"UPS",{"$f":"HYPERLINK(\"https://convenzioni.converge.it/docs/ts3_datasheet/RPMM_UPS.pdf\",\"i\")","v":"i"}]
[null,null,"",null,{"$f":"VLOOKUP($C93,TS3L1_UPS,13,FALSE)","v":""},{"$f":"VLOOKUP($C93,TS3L1_UPS,7,FALSE)","v":""},null,null,null,{"$f":"VLOOKUP($C93,TS3L1_UPS,10,FALSE)","v":0},{"$f":"VLOOKUP($C93,TS3L1_UPS,11,FALSE)","v":0},{"$f":"VLOOKUP($C93,TS3L1_ALL,12,FALSE)","v":""}]
[]
[null,null,"Kit Graphical User Interface",{"$f":"HYPERLINK(\"https://convenzioni.converge.it/docs/ts3_datasheet/Dell_E1916H.pdf\",\"i\")","v":"i"}]
[null,null,"",null,{"$f":"VLOOKUP($C96,TS3L1_GUI,13,FALSE)","v":""},{"$f":"VLOOKUP($C96,TS3L1_GUI,7,FALSE)","v":""},null,null,null,{"$f":"VLOOKUP($C96,TS3L1_GUI,10,FALSE)","v":0},{"$f":"VLOOKUP($C96,TS3L1_GUI,11,FALSE)","v":0},{"$f":"VLOOKUP($C96,TS3L1_ALL,12,FALSE)","v":""}]

{"sheet":"Lotto1_T340_2","index":1,"n_rows":96,"n_cols":17,"rows_kept":96,"cut":false,"hidden":false,"merged":[[26,7,37,7],[6,3,7,3],[9,3,10,3],[15,3,16,3],[24,3,25,3],[42,3,43,3],[84,3,85,3],[87,3,88,3],[91,3,92,3],[94,3,95,3]]}
[null,null,null,null,"Convenzione",{"$f":"SUM(J8:J96)*F5","v":0}]
[null,null,null,null,0.2,{"$f":"SUM(K8:K96)*F5","v":0}]
[null,null,null,null,"Totale",{"$f":"SUM(F1:F2)","v":0}]
[]
[null,null,"POWEREDGE T340          Consulta la Guida alla Convenzione --->",{"$f":"HYPERLINK(\"https://convenzioni.converge.it/docs/L1GuidaAllaConvenzioneTecnologieServer3.pdf\",\"&\")","v":"&"},"Quantità Server",null,null,{"$f":"Riepilogo!G8","v":"Version 2.8"}]
[]
[null,null,"Base",{"$f":"HYPERLINK(\"https://convenzioni.converge.it/docs/ts3_datasheet/dell-emc-poweredge-t340-spec-sheet.pdf\",\"i\")","v":"i"}]
[null,null,"PowerEdge T340 Server",null,{"$f":"IF($F$5>0,\"TS3L1-SRV\",\"\")","v":""},{"$f":"IF($F$5>0,1,\"\")","v":""},null,null,null,1399,null,{"$f":"VLOOKUP($C8,TS3L1_ALL,12,FALSE)","v":"L1N01"}]
[]
[null,null,"Chassis Configuration",{"$f":"HYPERLINK(\"https://dellservervr.dell.com/poweredge-t340/\",\"i\")","v":"i"}]
[null,null,"3.5\" Chassis up to 4 Hot Plug Hard Drives and Embedded SATA"]
[]
[null,null,"Trusted Platform Module (TPM)"]
[null,null,"Trusted Platform Module 2.0"]
[]
[null,null,"Processor",{"$f":"HYPERLINK(\"https://ark.intel.com/content/www/it/it/ark/products/191040/intel-xeon-e-2236-processor-12m-cache-3-40-ghz.html\",\"i\")","v":"i"}]
[null,null,"Intel® Xeon® E-2236 3.4GHz, 12M cache, 6C/12T, turbo (80W)"]
[]
[null,null,"Memory Capacity"]
[null,null,"16GB",null,{"$f":"VLOOKUP($C$20,TS3L1_RAM,13,FALSE)","v":""},{"$f":"VLOOKUP($C$20,TS3L1_RAM,7,FALSE)","v":0},null,null,null,{"$f":"VLOOKUP($C$20,TS3L1_RAM,10,FALSE)","v":0},null,{"$f":"VLOOKUP($C20,TS3L1_ALL,12,FALSE)","v":""}]
[]
[null,null,"Operating System"]
[null,null,"No Operating System",null,{"$f":"VLOOKUP($C$23,TS3L1_OS,13,FALSE)","v":""},{"$f":"VLOOKUP($C$23,TS3L1_OS,7,FALSE)","v":""},null,null,null,{"$f":"VLOOKUP($C$23,TS3L1_OS,10,FALSE)","v":0},null,{"$f":"VLOOKUP($C23,TS3L1_ALL,12,FALSE)","v":""}]
[]
[null,null,"Boot Optimized Storage Cards",{"$f":"HYPERLINK(\"https://convenzioni.converge.it/docs/ts3_datasheet/DELL_BOSS.pdf\",\"i\")","v":"i"}]
[null,null,"BOSS controller card + with 2 M.2 Sticks 480GB (RAID1),FH",null,null,null,null,"Configurazione RAID e/o NOTE"]
[null,null,null,null,null,null,null,"Specificare la configurazione RAID per l'installazione del Sistema Operativo, se richiesto.\ne/o\ninserire eventuali note."]
[null,null,"Hard Drives Bay 1"]
[null,null,"",null,{"$f":"VLOOKUP($C29,TS3L1_HDD,13,FALSE)","v":""},{"$f":"VLOOKUP($C29,TS3L1_HDD,7,FALSE)","v":""},null,null,null,{"$f":"VLOOKUP($C29,TS3L1_HDD,10,FALSE)","v":0},{"$f":"VLOOKUP($C29,TS3L1_HDD,11,FALSE)","v":0},{"$f":"VLOOKUP($C29,TS3L1_ALL,12,FALSE)","v":""}]
[]
[null,null,"Hard Drives Bay 2"]
[null,null,"",null,{"$f":"VLOOKUP($C32,TS3L1_HDD,13,FALSE)","v":""},{"$f":"VLOOKUP($C32,TS3L1_HDD,7,FALSE)","v":""},null,null,null,{"$f":"VLOOKUP($C32,TS3L1_HDD,10,FALSE)","v":0},{"$f":"VLOOKUP($C32,TS3L1_HDD,11,FALSE)","v":0},{"$f":"VLOOKUP($C32,TS3L1_ALL,12,FALSE)","v":""}]
[]
[null,null,"Hard Drives Bay 3"]
[null,null,"",null,{"$f":"VLOOKUP($C35,TS3L1_HDD,13,FALSE)","v":""},{"$f":"VLOOKUP($C35,TS3L1_HDD,7,FALSE)","v":""},null,null,null,{"$f":"VLOOKUP($C35,TS3L1_HDD,10,FALSE)","v":0},{"$f":"VLOOKUP($C35,TS3L1_HDD,11,FALSE)","v":0},{"$f":"VLOOKUP($C35,TS3L1_ALL,12,FALSE)","v":""}]
[]
[null,null,"Hard Drives Bay 4"]
[null,null,"",null,{"$f":"VLOOKUP($C38,TS3L1_HDD,13,FALSE)","v":""},{"$f":"VLOOKUP($C38,TS3L1_HDD,7,FALSE)","v":""},null,null,null,{"$f":"VLOOKUP($C38,TS3L1_HDD,10,FALSE)","v":0},{"$f":"VLOOKUP($C38,TS3L1_HDD,11,FALSE)","v":0},{"$f":"VLOOKUP($C38,TS3L1_ALL,12,FALSE)","v":""}]
[]
[null,null,"Power Supply"]
[null,null,"Single, Hot-plug Power Supply 1+0, 495W",null,{"$f":"VLOOKUP($C41,TS3L1_PSU,13,FALSE)","v":""},{"$f":"VLOOKUP($C41,TS3L1_PSU,7,FALSE)","v":""},null,null,null,{"$f":"VLOOKUP($C41,TS3L1_PSU,10,FALSE)","v":0},null,{"$f":"IF((M41+M80+M83)>0,\"L1N18\",0)","v":0},{"$f":"IF(Q41=\"\",0,1)","v":0},{"$f":"(M41+M80+M83)/(M41+M80+M83)","v":{"$error":"#DIV/0!"}},{"$f":"VLOOKUP($C41,TS3L1_PSU,11,FALSE)","v":0},{"$f":"N42/N41","v":{"$error":"#DIV/0!"}},{"$f":"VLOOKUP($C41,TS3L1_ALL,12,FALSE)","v":""}]
[null,null,null,null,null,null,null,null,null,null,{"$f":"IFERROR(N42,0)","v":0},{"$f":"IF(Q41=\"L1N18\",\"TS3L12PSU\",\"TS3L11PSU\")","v":"TS3L11PSU"},null,{"$f":"(O41+O80+O83)/(M41+M80+M83)","v":{"$error":"#DIV/0!"}}]
[null,null,"Embedded Systems Management",{"$f":"HYPERLINK(\"https://convenzioni.converge.it/docs/ts3_datasheet/idrac-spec-sheet.pdf\",\"i\")","v":"i"}]
[null,null,"iDRAC9,Enterprise"]
[]
[null,null,"Network Cards"]
[null,null,"On-Board Broadcom 5720 Dual Port 1Gb LOM"]
[]
[null,null,"PCI Slot 1 x8 PCIe Gen3 for FH/HL (x8 lanes)"]
[null,null,"BOSS controller card + with 2 M.2 Sticks 480GB (RAID 1),FH",null,{"$f":"VLOOKUP($C50,TS3L1_PCI1,13,FALSE)","v":""},{"$f":"VLOOKUP($C50,TS3L1_PCI1,7,FALSE)","v":""},null,null,null,{"$f":"VLOOKUP($C50,TS3L1_PCI1,10,FALSE)","v":0},{"$f":"VLOOKUP($C50,TS3L1_PCI1,11,FALSE)","v":0},{"$f":"VLOOKUP($C50,TS3L1_ALL,12,FALSE)","v":""}]
[]
[null,null,"PCI Slot 2  x16 PCIe Gen3 for FH/HL (x8 lanes)"]
[null,null,"",null,{"$f":"VLOOKUP($C53,TS3L1_PCI2,13,FALSE)","v":""},{"$f":"VLOOKUP($C53,TS3L1_PCI2,7,FALSE)","v":""},null,null,null,{"$f":"VLOOKUP($C53,TS3L1_PCI2,10,FALSE)","v":0},{"$f":"VLOOKUP($C53,TS3L1_PCI2,11,FALSE)","v":0},{"$f":"VLOOKUP($C53,TS3L1_ALL,12,FALSE)","v":""}]
[]
[null,null,"PCI Slot 3 x1 PCIe Gen3 for FH/HL (x1 lanes)"]
[null,null,"",null,{"$f":"VLOOKUP($C56,TS3L1_PCI3,13,FALSE)","v":""},{"$f":"VLOOKUP($C56,TS3L1_PCI3,7,FALSE)","v":""},null,null,null,{"$f":"VLOOKUP($C56,TS3L1_PCI3,10,FALSE)","v":0},{"$f":"VLOOKUP($C56,TS3L1_PCI3,11,FALSE)","v":0},{"$f":"VLOOKUP($C56,TS3L1_ALL,12,FALSE)","v":""}]
[]
[null,null,"PCI Slot 4 x8 PCIe Gen3 for FH/HL (x4 lanes)"]
[null,null,"",null,{"$f":"VLOOKUP($C59,TS3L1_PCI4,13,FALSE)","v":""},{"$f":"VLOOKUP($C59,TS3L1_PCI4,7,FALSE)","v":""},null,null,null,{"$f":"VLOOKUP($C59,TS3L1_PCI4,10,FALSE)","v":0},{"$f":"VLOOKUP($C59,TS3L1_PCI4,11,FALSE)","v":0},{"$f":"VLOOKUP($C59,TS3L1_ALL,12,FALSE)","v":""}]
[]
[null,null,"SFP+ Transceivers",null,null,"Quantità"]
[null,null,"SFP+ SR Optic for all SFP+ ports",null,{"$f":"IF(K62>0,VLOOKUP($C62,TS3L1_ALL,13,FALSE),\"\")","v":""},null,null,null,null,null,{"$f":"VLOOKUP($C62,TS3L1_ALL,11,FALSE)*F62","v":0},{"$f":"VLOOKUP($C62,TS3L1_ALL,12,FALSE)","v":"L1N34"}]
[]
[null,null,"SFP+ Direct Attach Cables (Twinax)",null,null,"Quantità"]
[null,null,"Dell Networking, Cable, SFP+ to SFP+, 10GbE, Copper Twinax Direct Attach Cable, 1 Meter",null,{"$f":"IF(K65>0,VLOOKUP($C65,TS3L1_ALL,13,FALSE),\"\")","v":""},null,null,null,null,null,{"$f":"VLOOKUP($C65,TS3L1_ALL,11,FALSE)*F65","v":0},{"$f":"VLOOKUP($C65,TS3L1_ALL,12,FALSE)","v":"L1N35"}]
[null,null,"Dell Networking, Cable, SFP+ to SFP+, 10GbE, Copper Twinax Direct Attach Cable, 3 Meter",null,{"$f":"IF(K66>0,VLOOKUP($C66,TS3L1_ALL,13,FALSE),\"\")","v":""},null,null,null,null,null,{"$f":"VLOOKUP($C66,TS3L1_ALL,11,FALSE)*F66","v":0},{"$f":"VLOOKUP($C66,TS3L1_ALL,12,FALSE)","v":"L1N36"}]
[null,null,"Dell Networking, Cable, SFP+ to SFP+, 10GbE, Copper Twinax Direct Attach Cable, 5 Meter",null,{"$f":"IF(K67>0,VLOOKUP($C67,TS3L1_ALL,13,FALSE),\"\")","v":""},null,null,null,null,null,{"$f":"VLOOKUP($C67,TS3L1_ALL,11,FALSE)*F67","v":0},{"$f":"VLOOKUP($C67,TS3L1_ALL,12,FALSE)","v":"L1N37"}]
[]
[null,null,"RJ45 Cables"]
[null,null,"cavo “patch” di 3 mt RJ45 certificato per gigabit ethernet",null,{"$f":"IF(K70>0,VLOOKUP($C70,ConfigurationTS3L1!A58:M100,13,FALSE),\"\")","v":"TS3L1-RJ453M"},3,null,null,null,0,{"$f":"IF(F70>0,(F70)*ConfigurationTS3L1!K58,0)","v":9},{"$f":"VLOOKUP($C70,TS3L1_ALL,12,FALSE)","v":"L1N26"}]
[]
[null,null,"SAS Cables",null,null,"Quantità"]
[null,null,"12Gb HD-Mini to HD-Mini SAS Cable, 2M",null,{"$f":"IF(K73>0,VLOOKUP($C73,TS3L1_ALL,13,FALSE),\"\")","v":""},null,null,null,null,null,{"$f":"VLOOKUP($C73,TS3L1_ALL,11,FALSE)*F73","v":0},{"$f":"VLOOKUP($C73,TS3L1_ALL,12,FALSE)","v":"L1N29"}]
[null,null,"12Gb HD-Mini to HD-Mini SAS Cable, 6M",null,{"$f":"IF(K74>0,VLOOKUP($C74,TS3L1_ALL,13,FALSE),\"\")","v":""},null,null,null,null,null,{"$f":"VLOOKUP($C74,TS3L1_ALL,11,FALSE)*F74","v":0},{"$f":"VLOOKUP($C74,TS3L1_ALL,12,FALSE)","v":"L1N30"}]
[null,null,"12Gb HD-Mini SAS cable, 0.5m",null,{"$f":"IF(K75>0,VLOOKUP($C75,TS3L1_ALL,13,FALSE),\"\")","v":""},null,null,null,null,null,{"$f":"VLOOKUP($C75,TS3L1_ALL,11,FALSE)*F75","v":0},{"$f":"VLOOKUP($C75,TS3L1_ALL,12,FALSE)","v":"L1N31"}]
[null,null,"12Gb HD-Mini SAS cable, 2m",null,{"$f":"IF(K76>0,VLOOKUP($C76,TS3L1_ALL,13,FALSE),\"\")","v":""},null,null,null,null,null,{"$f":"VLOOKUP($C76,TS3L1_ALL,11,FALSE)*F76","v":0},{"$f":"VLOOKUP($C76,TS3L1_ALL,12,FALSE)","v":"L1N32"}]
[null,null,"12Gb Mini-SAS HD to Mini-SAS HD Cable, 4m",null,{"$f":"IF(K77>0,VLOOKUP($C77,TS3L1_ALL,13,FALSE),\"\")","v":""},null,null,null,null,null,{"$f":"VLOOKUP($C77,TS3L1_ALL,11,FALSE)*F77","v":0},{"$f":"VLOOKUP($C77,TS3L1_ALL,12,FALSE)","v":"L1N33"}]
[]
[null,null,"Bezel"]
[null,null,"No Bezel",null,{"$f":"VLOOKUP($C80,TS3L1_BEZEL,13,FALSE)","v":""},{"$f":"VLOOKUP($C80,TS3L1_BEZEL,7,FALSE)","v":""},null,null,null,{"$f":"VLOOKUP($C80,TS3L1_BEZEL,10,FALSE)","v":0},null,null,{"$f":"IF(Q80=\"\",0,1)","v":0},null,{"$f":"VLOOKUP($C80,TS3L1_BEZEL,11,FALSE)","v":0},null,{"$f":"VLOOKUP($C80,TS3L1_ALL,12,FALSE)","v":""}]
[]
[null,null,"Internal Optical Drive"]
[null,null,"No Internal Optical Drive",null,{"$f":"VLOOKUP($C83,TS3L1_DVD,13,FALSE)","v":""},{"$f":"VLOOKUP($C83,TS3L1_DVD,7,FALSE)","v":""},null,null,null,{"$f":"VLOOKUP($C83,TS3L1_DVD,10,FALSE)","v":0},null,null,{"$f":"IF(Q83=\"\",0,1)","v":0},null,{"$f":"VLOOKUP($C83,TS3L1_DVD,11,FALSE)","v":0},null,{"$f":"VLOOKUP($C83,TS3L1_ALL,12,FALSE)","v":""}]
[]
[null,null,"Warranty",{"$f":"HYPERLINK(\"https://convenzioni.converge.it/docs/ts3_datasheet/TS3warranty.pdf\",\"i\")","v":"i"}]
[null,null,"Manutenzione in garanzia (36 mesi)",null,{"$f":"VLOOKUP($C86,TS3L1_WARRANTY,13,FALSE)","v":""},{"$f":"VLOOKUP($C86,TS3L1_WARRANTY,7,FALSE)","v":""},null,null,null,{"$f":"VLOOKUP($C86,TS3L1_WARRANTY,10,FALSE)","v":0},{"$f":"VLOOKUP($C86,TS3L1_WARRANTY,11,FALSE)","v":0},{"$f":"VLOOKUP($C86,TS3L1_ALL,12,FALSE)","v":""}]
[]
[null,null,"Hard Disk Retention",{"$f":"HYPERLINK(\"https://convenzioni.converge.it/docs/ts3_datasheet/DELL_HDD_KYHD.pdf\",\"i\")","v":"i"}]
[null,null,"",null,{"$f":"IFERROR($N$89,VLOOKUP($C89,TS3L1_ALL,13,FALSE))","v":""},{"$f":"IF(C89=\"\",\"\",1)","v":""},null,null,null,{"$f":"IFERROR($O$89,VLOOKUP($C89,TS3L1_ALL,10,FALSE))","v":0},{"$f":"IFERROR($P$89,VLOOKUP($C89,TS3L1_ALL,11,FALSE))","v":0},{"$f":"IFERROR($Q$89,VLOOKUP($C89,TS3L1_ALL,12,FALSE))","v":""},null,{"$f":"IF($F$86+$F$89=2,VLOOKUP(\"Hard Disk Retention (60 mesi)\",TS3L1_ALL,13,FALSE),VLOOKUP($C89,TS3L1_ALL,13,FALSE))","v":{"$error":"#VALUE!"}},{"$f":"IF($F$86+$F$89=2,VLOOKUP(\"Hard Disk Retention (60 mesi)\",TS3L1_ALL,10,FALSE),VLOOKUP($C89,TS3L1_ALL,10,FALSE))","v":{"$error":"#VALUE!"}},{"$f":"IF($F$86+$F$89=2,VLOOKUP(\"Hard Disk Retention (60 mesi)\",TS3L1_ALL,11,FALSE),VLOOKUP($C89,TS3L1_ALL,11,FALSE))","v":{"$error":"#VALUE!"}},{"$f":"IF($F$86+$F$89=2,VLOOKUP(\"Hard Disk Retention (60 mesi)\",TS3L1_ALL,12,FALSE),VLOOKUP($C89,TS3L1_ALL,12,FALSE))","v":{"$error":"#VALUE!"}}]
[]
[]
[null,null,"UPS",{"$f":"HYPERLINK(\"https://convenzioni.converge.it/docs/ts3_datasheet/RPMM_UPS.pdf\",\"i\")","v":"i"}]
[null,null,"",null,{"$f":"VLOOKUP($C93,TS3L1_UPS,13,FALSE)","v":""},{"$f":"VLOOKUP($C93,TS3L1_UPS,7,FALSE)","v":""},null,null,null,{"$f":"VLOOKUP($C93,TS3L1_UPS,10,FALSE)","v":0},{"$f":"VLOOKUP($C93,TS3L1_UPS,11,FALSE)","v":0},{"$f":"VLOOKUP($C93,TS3L1_ALL,12,FALSE)","v":""}]
[]
[null,null,"Kit Graphical User Interface",{"$f":"HYPERLINK(\"https://convenzioni.converge.it/docs/ts3_datasheet/Dell_E1916H.pdf\",\"i\")","v":"i"}]
[null,null,"",null,{"$f":"VLOOKUP($C96,TS3L1_GUI,13,FALSE)","v":""},{"$f":"VLOOKUP($C96,TS3L1_GUI,7,FALSE)","v":""},null,null,null,{"$f":"VLOOKUP($C96,TS3L1_GUI,10,FALSE)","v":0},{"$f":"VLOOKUP($C96,TS3L1_GUI,11,FALSE)","v":0},{"$f":"VLOOKUP($C96,TS3L1_ALL,12,FALSE)","v":""}]

{"sheet":"Lotto1_T340_3","index":2,"n_rows":96,"n_cols":17,"rows_kept":96,"cut":false,"hidden":false,"merged":[[26,7,37,7],[6,3,7,3],[9,3,10,3],[15,3,16,3],[24,3,25,3],[42,3,43,3],[84,3,85,3],[87,3,88,3],[91,3,92,3],[94,3,95,3]]}
[null,null,null,null,"Convenzione",{"$f":"SUM(J8:J96)*F5","v":0}]
[null,null,null,null,0.2,{"$f":"SUM(K8:K96)*F5","v":0}]
[null,null,null,null,"Totale",{"$f":"SUM(F1:F2)","v":0}]
[]
[null,null,"POWEREDGE T340          Consulta la Guida alla Convenzione --->",{"$f":"HYPERLINK(\"https://convenzioni.converge.it/docs/L1GuidaAllaConvenzioneTecnologieServer3.pdf\",\"&\")","v":"&"},"Quantità Server",null,null,{"$f":"Riepilogo!G8","v":"Version 2.8"}]
[]
[null,null,"Base",{"$f":"HYPERLINK(\"https://convenzioni.converge.it/docs/ts3_datasheet/dell-emc-poweredge-t340-spec-sheet.pdf\",\"i\")","v":"i"}]
[null,null,"PowerEdge T340 Server",null,{"$f":"IF($F$5>0,\"TS3L1-SRV\",\"\")","v":""},{"$f":"IF($F$5>0,1,\"\")","v":""},null,null,null,1399,null,{"$f":"VLOOKUP($C8,TS3L1_ALL,12,FALSE)","v":"L1N01"}]
[]
[null,null,"Chassis Configuration",{"$f":"HYPERLINK(\"https://dellservervr.dell.com/poweredge-t340/\",\"i\")","v":"i"}]
[null,null,"3.5\" Chassis up to 4 Hot Plug Hard Drives and Embedded SATA"]
[]
[null,null,"Trusted Platform Module (TPM)"]
[null,null,"Trusted Platform Module 2.0"]
[]
[null,null,"Processor",{"$f":"HYPERLINK(\"https://ark.intel.com/content/www/it/it/ark/products/191040/intel-xeon-e-2236-processor-12m-cache-3-40-ghz.html\",\"i\")","v":"i"}]
[null,null,"Intel® Xeon® E-2236 3.4GHz, 12M cache, 6C/12T, turbo (80W)"]
[]
[null,null,"Memory Capacity"]
[null,null,"16GB",null,{"$f":"VLOOKUP($C$20,TS3L1_RAM,13,FALSE)","v":""},{"$f":"VLOOKUP($C$20,TS3L1_RAM,7,FALSE)","v":0},null,null,null,{"$f":"VLOOKUP($C$20,TS3L1_RAM,10,FALSE)","v":0},null,{"$f":"VLOOKUP($C20,TS3L1_ALL,12,FALSE)","v":""}]
[]
[null,null,"Operating System"]
[null,null,"No Operating System",null,{"$f":"VLOOKUP($C$23,TS3L1_OS,13,FALSE)","v":""},{"$f":"VLOOKUP($C$23,TS3L1_OS,7,FALSE)","v":""},null,null,null,{"$f":"VLOOKUP($C$23,TS3L1_OS,10,FALSE)","v":0},null,{"$f":"VLOOKUP($C23,TS3L1_ALL,12,FALSE)","v":""}]
[]
[null,null,"Boot Optimized Storage Cards",{"$f":"HYPERLINK(\"https://convenzioni.converge.it/docs/ts3_datasheet/DELL_BOSS.pdf\",\"i\")","v":"i"}]
[null,null,"BOSS controller card + with 2 M.2 Sticks 480GB (RAID1),FH",null,null,null,null,"Configurazione RAID e/o NOTE"]
[null,null,null,null,null,null,null,"Specificare la configurazione RAID per l'installazione del Sistema Operativo, se richiesto.\ne/o\ninserire eventuali note."]
[null,null,"Hard Drives Bay 1"]
[null,null,"",null,{"$f":"VLOOKUP($C29,TS3L1_HDD,13,FALSE)","v":""},{"$f":"VLOOKUP($C29,TS3L1_HDD,7,FALSE)","v":""},null,null,null,{"$f":"VLOOKUP($C29,TS3L1_HDD,10,FALSE)","v":0},{"$f":"VLOOKUP($C29,TS3L1_HDD,11,FALSE)","v":0},{"$f":"VLOOKUP($C29,TS3L1_ALL,12,FALSE)","v":""}]
[]
[null,null,"Hard Drives Bay 2"]
[null,null,"",null,{"$f":"VLOOKUP($C32,TS3L1_HDD,13,FALSE)","v":""},{"$f":"VLOOKUP($C32,TS3L1_HDD,7,FALSE)","v":""},null,null,null,{"$f":"VLOOKUP($C32,TS3L1_HDD,10,FALSE)","v":0},{"$f":"VLOOKUP($C32,TS3L1_HDD,11,FALSE)","v":0},{"$f":"VLOOKUP($C32,TS3L1_ALL,12,FALSE)","v":""}]
[]
[null,null,"Hard Drives Bay 3"]
[null,null,"",null,{"$f":"VLOOKUP($C35,TS3L1_HDD,13,FALSE)","v":""},{"$f":"VLOOKUP($C35,TS3L1_HDD,7,FALSE)","v":""},null,null,null,{"$f":"VLOOKUP($C35,TS3L1_HDD,10,FALSE)","v":0},{"$f":"VLOOKUP($C35,TS3L1_HDD,11,FALSE)","v":0},{"$f":"VLOOKUP($C35,TS3L1_ALL,12,FALSE)","v":""}]
[]
[null,null,"Hard Drives Bay 4"]
[null,null,"",null,{"$f":"VLOOKUP($C38,TS3L1_HDD,13,FALSE)","v":""},{"$f":"VLOOKUP($C38,TS3L1_HDD,7,FALSE)","v":""},null,null,null,{"$f":"VLOOKUP($C38,TS3L1_HDD,10,FALSE)","v":0},{"$f":"VLOOKUP($C38,TS3L1_HDD,11,FALSE)","v":0},{"$f":"VLOOKUP($C38,TS3L1_ALL,12,FALSE)","v":""}]
[]
[null,null,"Power Supply"]
[null,null,"Single, Hot-plug Power Supply 1+0, 495W",null,{"$f":"VLOOKUP($C41,TS3L1_PSU,13,FALSE)","v":""},{"$f":"VLOOKUP($C41,TS3L1_PSU,7,FALSE)","v":""},null,null,null,{"$f":"VLOOKUP($C41,TS3L1_PSU,10,FALSE)","v":0},null,{"$f":"IF((M41+M80+M83)>0,\"L1N18\",0)","v":0},{"$f":"IF(Q41=\"\",0,1)","v":0},{"$f":"(M41+M80+M83)/(M41+M80+M83)","v":{"$error":"#DIV/0!"}},{"$f":"VLOOKUP($C41,TS3L1_PSU,11,FALSE)","v":0},{"$f":"N42/N41","v":{"$error":"#DIV/0!"}},{"$f":"VLOOKUP($C41,TS3L1_ALL,12,FALSE)","v":""}]
[null,null,null,null,null,null,null,null,null,null,{"$f":"IFERROR(N42,0)","v":0},{"$f":"IF(Q41=\"L1N18\",\"TS3L12PSU\",\"TS3L11PSU\")","v":"TS3L11PSU"},null,{"$f":"(O41+O80+O83)/(M41+M80+M83)","v":{"$error":"#DIV/0!"}}]
[null,null,"Embedded Systems Management",{"$f":"HYPERLINK(\"https://convenzioni.converge.it/docs/ts3_datasheet/idrac-spec-sheet.pdf\",\"i\")","v":"i"}]
[null,null,"iDRAC9,Enterprise"]
[]
[null,null,"Network Cards"]
[null,null,"On-Board Broadcom 5720 Dual Port 1Gb LOM"]
[]
[null,null,"PCI Slot 1 x8 PCIe Gen3 for FH/HL (x8 lanes)"]
[null,null,"BOSS controller card + with 2 M.2 Sticks 480GB (RAID 1),FH",null,{"$f":"VLOOKUP($C50,TS3L1_PCI1,13,FALSE)","v":""},{"$f":"VLOOKUP($C50,TS3L1_PCI1,7,FALSE)","v":""},null,null,null,{"$f":"VLOOKUP($C50,TS3L1_PCI1,10,FALSE)","v":0},{"$f":"VLOOKUP($C50,TS3L1_PCI1,11,FALSE)","v":0},{"$f":"VLOOKUP($C50,TS3L1_ALL,12,FALSE)","v":""}]
[]
[null,null,"PCI Slot 2  x16 PCIe Gen3 for FH/HL (x8 lanes)"]
[null,null,"",null,{"$f":"VLOOKUP($C53,TS3L1_PCI2,13,FALSE)","v":""},{"$f":"VLOOKUP($C53,TS3L1_PCI2,7,FALSE)","v":""},null,null,null,{"$f":"VLOOKUP($C53,TS3L1_PCI2,10,FALSE)","v":0},{"$f":"VLOOKUP($C53,TS3L1_PCI2,11,FALSE)","v":0},{"$f":"VLOOKUP($C53,TS3L1_ALL,12,FALSE)","v":""}]
[]
[null,null,"PCI Slot 3 x1 PCIe Gen3 for FH/HL (x1 lanes)"]
[null,null,"",null,{"$f":"VLOOKUP($C56,TS3L1_PCI3,13,FALSE)","v":""},{"$f":"VLOOKUP($C56,TS3L1_PCI3,7,FALSE)","v":""},null,null,null,{"$f":"VLOOKUP($C56,TS3L1_PCI3,10,FALSE)","v":0},{"$f":"VLOOKUP($C56,TS3L1_PCI3,11,FALSE)","v":0},{"$f":"VLOOKUP($C56,TS3L1_ALL,12,FALSE)","v":""}]
[]
[null,null,"PCI Slot 4 x8 PCIe Gen3 for FH/HL (x4 lanes)"]
[null,null,"",null,{"$f":"VLOOKUP($C59,TS3L1_PCI4,13,FALSE)","v":""},{"$f":"VLOOKUP($C59,TS3L1_PCI4,7,FALSE)","v":""},null,null,null,{"$f":"VLOOKUP($C59,TS3L1_PCI4,10,FALSE)","v":0},{"$f":"VLOOKUP($C59,TS3L1_PCI4,11,FALSE)","v":0},{"$f":"VLOOKUP($C59,TS3L1_ALL,12,FALSE)","v":""}]
[]
[null,null,"SFP+ Transceivers",null,null,"Quantità"]
[null,null,"SFP+ SR Optic for all SFP+ ports",null,{"$f":"IF(K62>0,VLOOKUP($C62,TS3L1_ALL,13,FALSE),\"\")","v":""},null,null,null,null,null,{"$f":"VLOOKUP($C62,TS3L1_ALL,11,FALSE)*F62","v":0},{"$f":"VLOOKUP($C62,TS3L1_ALL,12,FALSE)","v":"L1N34"}]
[]
[null,null,"SFP+ Direct Attach Cables (Twinax)",null,null,"Quantità"]
[null,null,"Dell Networking, Cable, SFP+ to SFP+, 10GbE, Copper Twinax Direct Attach Cable, 1 Meter",null,{"$f":"IF(K65>0,VLOOKUP($C65,TS3L1_ALL,13,FALSE),\"\")","v":""},null,null,null,null,null,{"$f":"VLOOKUP($C65,TS3L1_ALL,11,FALSE)*F65","v":0},{"$f":"VLOOKUP($C65,TS3L1_ALL,12,FALSE)","v":"L1N35"}]
[null,null,"Dell Networking, Cable, SFP+ to SFP+, 10GbE, Copper Twinax Direct Attach Cable, 3 Meter",null,{"$f":"IF(K66>0,VLOOKUP($C66,TS3L1_ALL,13,FALSE),\"\")","v":""},null,null,null,null,null,{"$f":"VLOOKUP($C66,TS3L1_ALL,11,FALSE)*F66","v":0},{"$f":"VLOOKUP($C66,TS3L1_ALL,12,FALSE)","v":"L1N36"}]
[null,null,"Dell Networking, Cable, SFP+ to SFP+, 10GbE, Copper Twinax Direct Attach Cable, 5 Meter",null,{"$f":"IF(K67>0,VLOOKUP($C67,TS3L1_ALL,13,FALSE),\"\")","v":""},null,null,null,null,null,{"$f":"VLOOKUP($C67,TS3L1_ALL,11,FALSE)*F67","v":0},{"$f":"VLOOKUP($C67,TS3L1_ALL,12,FALSE)","v":"L1N37"}]
[]
[null,null,"RJ45 Cables"]
[null,null,"cavo “patch” di 3 mt RJ45 certificato per gigabit ethernet",null,{"$f":"IF(K70>0,VLOOKUP($C70,ConfigurationTS3L1!A58:M58,13,FALSE),\"\")","v":"TS3L1-RJ453M"},3,null,null,null,0,{"$f":"IF(F70>0,(F70)*ConfigurationTS3L1!K58,0)","v":9},{"$f":"VLOOKUP($C70,TS3L1_ALL,12,FALSE)","v":"L1N26"}]
[]
[null,null,"SAS Cables",null,null,"Quantità"]
[null,null,"12Gb HD-Mini to HD-Mini SAS Cable, 2M",null,{"$f":"IF(K73>0,VLOOKUP($C73,TS3L1_ALL,13,FALSE),\"\")","v":""},null,null,null,null,null,{"$f":"VLOOKUP($C73,TS3L1_ALL,11,FALSE)*F73","v":0},{"$f":"VLOOKUP($C73,TS3L1_ALL,12,FALSE)","v":"L1N29"}]
[null,null,"12Gb HD-Mini to HD-Mini SAS Cable, 6M",null,{"$f":"IF(K74>0,VLOOKUP($C74,TS3L1_ALL,13,FALSE),\"\")","v":""},null,null,null,null,null,{"$f":"VLOOKUP($C74,TS3L1_ALL,11,FALSE)*F74","v":0},{"$f":"VLOOKUP($C74,TS3L1_ALL,12,FALSE)","v":"L1N30"}]
[null,null,"12Gb HD-Mini SAS cable, 0.5m",null,{"$f":"IF(K75>0,VLOOKUP($C75,TS3L1_ALL,13,FALSE),\"\")","v":""},null,null,null,null,null,{"$f":"VLOOKUP($C75,TS3L1_ALL,11,FALSE)*F75","v":0},{"$f":"VLOOKUP($C75,TS3L1_ALL,12,FALSE)","v":"L1N31"}]
[null,null,"12Gb HD-Mini SAS cable, 2m",null,{"$f":"IF(K76>0,VLOOKUP($C76,TS3L1_ALL,13,FALSE),\"\")","v":""},null,null,null,null,null,{"$f":"VLOOKUP($C76,TS3L1_ALL,11,FALSE)*F76","v":0},{"$f":"VLOOKUP($C76,TS3L1_ALL,12,FALSE)","v":"L1N32"}]
[null,null,"12Gb Mini-SAS HD to Mini-SAS HD Cable, 4m",null,{"$f":"IF(K77>0,VLOOKUP($C77,TS3L1_ALL,13,FALSE),\"\")","v":""},null,null,null,null,null,{"$f":"VLOOKUP($C77,TS3L1_ALL,11,FALSE)*F77","v":0},{"$f":"VLOOKUP($C77,TS3L1_ALL,12,FALSE)","v":"L1N33"}]
[]
[null,null,"Bezel"]
[null,null,"No Bezel",null,{"$f":"VLOOKUP($C80,TS3L1_BEZEL,13,FALSE)","v":""},null,null,null,null,{"$f":"VLOOKUP($C80,TS3L1_BEZEL,10,FALSE)","v":0},null,null,{"$f":"IF(Q80=\"\",0,1)","v":0},null,{"$f":"VLOOKUP($C80,TS3L1_BEZEL,11,FALSE)","v":0},null,{"$f":"VLOOKUP($C80,TS3L1_ALL,12,FALSE)","v":""}]
[]
[null,null,"Internal Optical Drive"]
[null,null,"No Internal Optical Drive",null,{"$f":"VLOOKUP($C83,TS3L1_DVD,13,FALSE)","v":""},{"$f":"VLOOKUP($C83,TS3L1_DVD,7,FALSE)","v":""},null,null,null,{"$f":"VLOOKUP($C83,TS3L1_DVD,10,FALSE)","v":0},null,null,{"$f":"IF(Q83=\"\",0,1)","v":0},null,{"$f":"VLOOKUP($C83,TS3L1_DVD,11,FALSE)","v":0},null,{"$f":"VLOOKUP($C83,TS3L1_ALL,12,FALSE)","v":""}]
[]
[null,null,"Warranty",{"$f":"HYPERLINK(\"https://convenzioni.converge.it/docs/ts3_datasheet/TS3warranty.pdf\",\"i\")","v":"i"}]
[null,null,"Manutenzione in garanzia (36 mesi)",null,{"$f":"VLOOKUP($C86,TS3L1_WARRANTY,13,FALSE)","v":""},{"$f":"VLOOKUP($C86,TS3L1_WARRANTY,7,FALSE)","v":""},null,null,null,{"$f":"VLOOKUP($C86,TS3L1_WARRANTY,10,FALSE)","v":0},{"$f":"VLOOKUP($C86,TS3L1_WARRANTY,11,FALSE)","v":0},{"$f":"VLOOKUP($C86,TS3L1_ALL,12,FALSE)","v":""}]
[]
[null,null,"Hard Disk Retention",{"$f":"HYPERLINK(\"https://convenzioni.converge.it/docs/ts3_datasheet/DELL_HDD_KYHD.pdf\",\"i\")","v":"i"}]
[null,null,"",null,{"$f":"IFERROR($N$89,VLOOKUP($C89,TS3L1_ALL,13,FALSE))","v":""},{"$f":"IF(C89=\"\",\"\",1)","v":""},null,null,null,{"$f":"IFERROR($O$89,VLOOKUP($C89,TS3L1_ALL,10,FALSE))","v":0},{"$f":"IFERROR($P$89,VLOOKUP($C89,TS3L1_ALL,11,FALSE))","v":0},{"$f":"IFERROR($Q$89,VLOOKUP($C89,TS3L1_ALL,12,FALSE))","v":""},null,{"$f":"IF($F$86+$F$89=2,VLOOKUP(\"Hard Disk Retention (60 mesi)\",TS3L1_ALL,13,FALSE),VLOOKUP($C89,TS3L1_ALL,13,FALSE))","v":{"$error":"#VALUE!"}},{"$f":"IF($F$86+$F$89=2,VLOOKUP(\"Hard Disk Retention (60 mesi)\",TS3L1_ALL,10,FALSE),VLOOKUP($C89,TS3L1_ALL,10,FALSE))","v":{"$error":"#VALUE!"}},{"$f":"IF($F$86+$F$89=2,VLOOKUP(\"Hard Disk Retention (60 mesi)\",TS3L1_ALL,11,FALSE),VLOOKUP($C89,TS3L1_ALL,11,FALSE))","v":{"$error":"#VALUE!"}},{"$f":"IF($F$86+$F$89=2,VLOOKUP(\"Hard Disk Retention (60 mesi)\",TS3L1_ALL,12,FALSE),VLOOKUP($C89,TS3L1_ALL,12,FALSE))","v":{"$error":"#VALUE!"}}]
[]
[]
[null,null,"UPS",{"$f":"HYPERLINK(\"https://convenzioni.converge.it/docs/ts3_datasheet/RPMM_UPS.pdf\",\"i\")","v":"i"}]
[null,null,"",null,{"$f":"VLOOKUP($C93,TS3L1_UPS,13,FALSE)","v":""},{"$f":"VLOOKUP($C93,TS3L1_UPS,7,FALSE)","v":""},null,null,null,{"$f":"VLOOKUP($C93,TS3L1_UPS,10,FALSE)","v":0},{"$f":"VLOOKUP($C93,TS3L1_UPS,11,FALSE)","v":0},{"$f":"VLOOKUP($C93,TS3L1_ALL,12,FALSE)","v":""}]
[]
[null,null,"Kit Graphical User Interface",{"$f":"HYPERLINK(\"https://convenzioni.converge.it/docs/ts3_datasheet/Dell_E1916H.pdf\",\"i\")","v":"i"}]
[null,null,"",null,{"$f":"VLOOKUP($C96,TS3L1_GUI,13,FALSE)","v":""},{"$f":"VLOOKUP($C96,TS3L1_GUI,7,FALSE)","v":""},null,null,null,{"$f":"VLOOKUP($C96,TS3L1_GUI,10,FALSE)","v":0},{"$f":"VLOOKUP($C96,TS3L1_GUI,11,FALSE)","v":0},{"$f":"VLOOKUP($C96,TS3L1_ALL,12,FALSE)","v":""}]

{"sheet":"ConfigurationTS3L1","index":3,"n_rows":110,"n_cols":14,"rows_kept":110,"cut":false,"hidden":true,"merged":[]}
[]
[null,"Module Name","Option ID","Option Name","Option List Price","SKUs","Qty","SKU Customer Kit","Attributo","Valore inserito",null,"N°","Codice Convenzione"]
["PowerEdge T340 Server",null,null,{"$f":"VLOOKUP(L3,Tabella_prezzi!$A$3:$J$58,8,FALSE)","v":"DELL PowerEdge T340 Server"},null,null,null,null,{"$f":"VLOOKUP(L3,Tabella_prezzi!$A$3:$J$58,3,FALSE)","v":"Server Tower mono-processore"},{"$f":"VLOOKUP(L3,Tabella_prezzi!$A$3:$J$58,4,FALSE)","v":1399},null,"L1N01",{"$f":"VLOOKUP(L3,Tabella_prezzi!$A$3:$J$58,6,FALSE)","v":"TS3L1-SRV"}]
[]
[]
["TS3L1_RAM"]
["16GB","Memory Capacity"," GYWO126",{"$f":"D8","v":"16GB - 2Rx8 DDR4 UDIMM 2666MHz"},null,"370-AEKL",0,"AA335286",{"$f":"\"\"","v":""},null,null,{"$f":"\"\"","v":""},{"$f":"\"\"","v":""}]
["32GB","Memory Capacity"," GYWO126",{"$f":"VLOOKUP(L8,Tabella_prezzi!$A$3:$J$58,8,FALSE)","v":"16GB - 2Rx8 DDR4 UDIMM 2666MHz"},null,"370-AEKL",1,{"$f":"VLOOKUP(L8,Tabella_prezzi!$A$3:$J$58,9,FALSE)","v":"L1N02-OpzRAM16GB"},{"$f":"VLOOKUP(L8,Tabella_prezzi!$A$3:$J$58,3,FALSE)","v":"OpzRAM16GB"},{"$f":"VLOOKUP(L8,Tabella_prezzi!$A$3:$J$58,4,FALSE)*G8","v":98},null,"L1N02",{"$f":"VLOOKUP(L8,Tabella_prezzi!$A$3:$J$58,6,FALSE)","v":"TS3L1-RAM16"}]
["48GB","Memory Capacity"," GYWO126",{"$f":"VLOOKUP(L9,Tabella_prezzi!$A$3:$J$58,8,FALSE)","v":"16GB - 2Rx8 DDR4 UDIMM 2666MHz"},null,"370-AEKL",2,{"$f":"VLOOKUP(L9,Tabella_prezzi!$A$3:$J$58,9,FALSE)","v":"L1N02-OpzRAM16GB"},{"$f":"VLOOKUP(L9,Tabella_prezzi!$A$3:$J$58,3,FALSE)","v":"OpzRAM16GB"},{"$f":"VLOOKUP(L9,Tabella_prezzi!$A$3:$J$58,4,FALSE)*G9","v":196},null,"L1N02",{"$f":"VLOOKUP(L9,Tabella_prezzi!$A$3:$J$58,6,FALSE)","v":"TS3L1-RAM16"}]
["64GB","Memory Capacity"," GYWO126",{"$f":"VLOOKUP(L10,Tabella_prezzi!$A$3:$J$58,8,FALSE)","v":"16GB - 2Rx8 DDR4 UDIMM 2666MHz"},null,"370-AEKL",3,{"$f":"VLOOKUP(L10,Tabella_prezzi!$A$3:$J$58,9,FALSE)","v":"L1N02-OpzRAM16GB"},{"$f":"VLOOKUP(L10,Tabella_prezzi!$A$3:$J$58,3,FALSE)","v":"OpzRAM16GB"},{"$f":"VLOOKUP(L10,Tabella_prezzi!$A$3:$J$58,4,FALSE)*G10","v":294},null,"L1N02",{"$f":"VLOOKUP(L10,Tabella_prezzi!$A$3:$J$58,6,FALSE)","v":"TS3L1-RAM16"}]
[]
["TS3L1_OS"]
["No Operating System","Operating System",null,null,null,null,{"$f":"\"\"","v":""},null,{"$f":"\"\"","v":""},null,null,{"$f":"\"\"","v":""},{"$f":"\"\"","v":""}]
["[TS3L1-WINSRVESS] Windows Server® 2019 Essentials","Operating System","GQ5SW9I",{"$f":"VLOOKUP(L14,Tabella_prezzi!$A$3:$J$58,8,FALSE)","v":"Windows Server 2019,Essentials, ROK"},null,"634-BSFC",1,{"$f":"VLOOKUP(L14,Tabella_prezzi!$A$3:$J$58,9,FALSE)","v":"L1N12-OpzWinServESS"},{"$f":"VLOOKUP(L14,Tabella_prezzi!$A$3:$J$58,3,FALSE)","v":"OpzWinServESS"},{"$f":"VLOOKUP(L14,Tabella_prezzi!$A$3:$J$58,4,FALSE)","v":256},null,"L1N12",{"$f":"VLOOKUP(L14,Tabella_prezzi!$A$3:$J$58,6,FALSE)","v":"TS3L1-WINSRVESS"}]
["[TS3L1-LINUX] Ubuntu 18.04 LTS 64 Bit","Operating System",null,{"$f":"VLOOKUP(L15,Tabella_prezzi!$A$3:$J$58,8,FALSE)","v":"Ubuntu 18.04 LTS 64 Bit"},null,null,1,null,{"$f":"VLOOKUP(L15,Tabella_prezzi!$A$3:$J$58,3,FALSE)","v":"OpzOpenSource"},{"$f":"VLOOKUP(L15,Tabella_prezzi!$A$3:$J$58,4,FALSE)","v":49},null,"L1N15",{"$f":"VLOOKUP(L15,Tabella_prezzi!$A$3:$J$58,6,FALSE)","v":"TS3L1-LINUX"}]
[]
["TS3L1_HDD"]
[{"$f":"\"\"","v":""},null,null,null,null,null,{"$f":"\"\"","v":""},null,{"$f":"\"\"","v":""},null,null,{"$f":"\"\"","v":""},{"$f":"\"\"","v":""}]
["[TS3L1-HDD8TB] 8TB 7.2K RPM SATA 6Gbps Hot-plug Hard Drive","Hard Drives","8T35HL",{"$f":"VLOOKUP(L19,Tabella_prezzi!$A$3:$J$58,8,FALSE)","v":"HDD 8TB 7.2K SATA 6Gbps 3.5in Hot-plug"},null,"400-AOJN",1,{"$f":"VLOOKUP(L19,Tabella_prezzi!$A$3:$J$58,9,FALSE)","v":"L1N04-OpzHDD8TB"},{"$f":"VLOOKUP(L19,Tabella_prezzi!$A$3:$J$58,3,FALSE)","v":"OpzHDD8TB"},{"$f":"VLOOKUP(L19,Tabella_prezzi!$A$3:$J$58,4,FALSE)","v":285},null,"L1N04",{"$f":"VLOOKUP(L19,Tabella_prezzi!$A$3:$J$58,6,FALSE)","v":"TS3L1-HDD8TB"}]
["[TS3L1-HDD4TB] 4TB 7.2K RPM SATA 6Gbps Hot-plug Hard Drive","Hard Drives",5107763,{"$f":"VLOOKUP(L20,Tabella_prezzi!$A$3:$J$58,8,FALSE)","v":"HDD 4TB 7.2K SATA 6Gbps 3.5in Hot-plug"},null,"400-ASNY",1,{"$f":"VLOOKUP(L20,Tabella_prezzi!$A$3:$J$58,9,FALSE)","v":"L1N05-OpzHDD4TB"},{"$f":"VLOOKUP(L20,Tabella_prezzi!$A$3:$J$58,3,FALSE)","v":"OpzHDD4TB"},{"$f":"VLOOKUP(L20,Tabella_prezzi!$A$3:$J$58,4,FALSE)","v":194},null,"L1N05",{"$f":"VLOOKUP(L20,Tabella_prezzi!$A$3:$J$58,6,FALSE)","v":"TS3L1-HDD4TB"}]
["[TS3L1-HDD2TB] 2TB 7.2K RPM SATA 6Gbps Hot-plug Hard Drive","Hard Drives",5107836,{"$f":"VLOOKUP(L21,Tabella_prezzi!$A$3:$J$58,8,FALSE)","v":"HDD 2TB 7.2K SATA 6Gbps 3.5in Hot-plug"},null,"400-ASNC",1,{"$f":"VLOOKUP(L21,Tabella_prezzi!$A$3:$J$58,9,FALSE)","v":"L1N06-OpzHDD2TB"},{"$f":"VLOOKUP(L21,Tabella_prezzi!$A$3:$J$58,3,FALSE)","v":"OpzHDD2TB"},{"$f":"VLOOKUP(L21,Tabella_prezzi!$A$3:$J$58,4,FALSE)","v":148},null,"L1N06",{"$f":"VLOOKUP(L21,Tabella_prezzi!$A$3:$J$58,6,FALSE)","v":"TS3L1-HDD2TB"}]
["[TS3L1-HDD1TB] 1TB 7.2K RPM SATA 6Gbps Hot-plug Hard Drive","Hard Drives"," 5107834",{"$f":"VLOOKUP(L22,Tabella_prezzi!$A$3:$J$58,8,FALSE)","v":"HDD 1TB 7.2K SATA 6Gbps 3.5in Hot-plug"},null,"400-ASMG",1,{"$f":"VLOOKUP(L22,Tabella_prezzi!$A$3:$J$58,9,FALSE)","v":"L1N07-OpzHDD1TB"},{"$f":"VLOOKUP(L22,Tabella_prezzi!$A$3:$J$58,3,FALSE)","v":"OpzHDD1TB"},{"$f":"VLOOKUP(L22,Tabella_prezzi!$A$3:$J$58,4,FALSE)","v":80},null,"L1N07",{"$f":"VLOOKUP(L22,Tabella_prezzi!$A$3:$J$58,6,FALSE)","v":"TS3L1-HDD1TB"}]
["[TS3L1-RI800GB] 960GB SSD SATA Read Intensive 6Gbps Hot-plug Hard Drive","Hard Drives","GCOWB60",{"$f":"VLOOKUP(L23,Tabella_prezzi!$A$3:$J$58,8,FALSE)","v":"SSD 960GB SATA RI 6Gbps 2.5in in 3.5in Hybrid Carrier, 1 DWPD"},null,"400-AXRX",1,{"$f":"VLOOKUP(L23,Tabella_prezzi!$A$3:$J$58,9,FALSE)","v":"L1N08-OpzSSD-RI800GB"},{"$f":"VLOOKUP(L23,Tabella_prezzi!$A$3:$J$58,3,FALSE)","v":"OpzSSD-RI800GB"},{"$f":"VLOOKUP(L23,Tabella_prezzi!$A$3:$J$58,4,FALSE)","v":216},null,"L1N08",{"$f":"VLOOKUP(L23,Tabella_prezzi!$A$3:$J$58,6,FALSE)","v":"TS3L1-RI800GB"}]
["[TS3L1-RI400GB] 480GB SSD SATA Read Intensive 6Gbps Hot-plug Hard Drive","Hard Drives","GDAKNC1",{"$f":"VLOOKUP(L24,Tabella_prezzi!$A$3:$J$58,8,FALSE)","v":"SSD 480GB SATA RI 6Gbps 2.5in in 3.5in Hybrid Carrier, 1 DWPD"},null,"400-BDOB",1,{"$f":"VLOOKUP(L24,Tabella_prezzi!$A$3:$J$58,9,FALSE)","v":"L1N09-OpzSSD-RI400GB"},{"$f":"VLOOKUP(L24,Tabella_prezzi!$A$3:$J$58,3,FALSE)","v":"OpzSSD-RI400GB"},{"$f":"VLOOKUP(L24,Tabella_prezzi!$A$3:$J$58,4,FALSE)","v":160},null,"L1N09",{"$f":"VLOOKUP(L24,Tabella_prezzi!$A$3:$J$58,6,FALSE)","v":"TS3L1-RI400GB"}]
[]
["TS3L1_PSU"]
["Single, Hot-plug Power Supply 1+0, 495W","Power Supply"," GBF3YIX","Single, Hot-plug Power Supply 1+0, 495W",null,"450-AHVN",{"$f":"\"\"","v":""},null,{"$f":"\"\"","v":""},null,0,{"$f":"\"\"","v":""},{"$f":"\"\"","v":""}]
["-=-=-=-=-=-=-=-=-=-=-=-=-=-=-=-=-20%-=-=-=-=-=-=-=-=-=-=-=-=-=-=-=-=-",null,null,null,null,null,{"$f":"\"\"","v":""},null,{"$f":"\"\"","v":""},null,null,{"$f":"\"\"","v":""},{"$f":"\"\"","v":""}]
["[TS3L1-PSUDVDBZL] Dual, Hot-plug, Redundant Power Supply 1+1, 495W","Power Supply","GZ8351O",{"$f":"VLOOKUP(L29,Tabella_prezzi!$A$3:$J$58,8,FALSE)","v":"Kit per T340 composto da: Hot-plug Power Supply 495W, DVD+/-RW SATA interno, Security Bezel"},null,"450-AHVO",1,{"$f":"VLOOKUP(L29,Tabella_prezzi!$A$3:$J$58,9,FALSE)","v":"TS3-OpzA20T340K"},{"$f":"VLOOKUP(L29,Tabella_prezzi!$A$3:$J$58,3,FALSE)","v":0},null,{"$f":"VLOOKUP(L29,Tabella_prezzi!$A$3:$J$58,4,FALSE)","v":230},"L1N18",{"$f":"VLOOKUP(L29,Tabella_prezzi!$A$3:$J$58,6,FALSE)","v":"TS3L1-PSUDVDBZL"}]
[]
["TS3L1_PCI1"]
["BOSS controller card + with 2 M.2 Sticks 480GB (RAID 1),FH",null,null,null,null,"403-BCNL",{"$f":"\"\"","v":""},null,{"$f":"\"\"","v":""},null,null,{"$f":"\"\"","v":""},{"$f":"\"\"","v":""}]
[]
["TS3L1_PCI2"]
[{"$f":"\"\"","v":""},null,null,null,null,null,{"$f":"\"\"","v":""},null,{"$f":"\"\"","v":""},null,null,{"$f":"\"\"","v":""},{"$f":"\"\"","v":""}]
["[TS3L1-LAN1] Broadcom 5720 Dual Port 1GbE BASE-T Adapter","Additional Network Cards","GI7RBKF",{"$f":"VLOOKUP(L36,Tabella_prezzi!$A$3:$J$58,8,FALSE)","v":"Scheda LAN 5720 DP 1Gb Full"},null,"540-BBCX",1,{"$f":"VLOOKUP(L36,Tabella_prezzi!$A$3:$J$58,9,FALSE)","v":"L1N03-OpzGigabit"},{"$f":"VLOOKUP(L36,Tabella_prezzi!$A$3:$J$58,3,FALSE)","v":"OpzGigabit"},{"$f":"VLOOKUP(L36,Tabella_prezzi!$A$3:$J$58,4,FALSE)","v":25},null,"L1N03",{"$f":"VLOOKUP(L36,Tabella_prezzi!$A$3:$J$58,6,FALSE)","v":"TS3L1-LAN1"}]
["-=-=-=-=-=-=-=-=-=-=-=-=-=-=-=-=-20%-=-=-=-=-=-=-=-=-=-=-=-=-=-=-=-=-",null,null,null,null,null,{"$f":"\"\"","v":""},null,{"$f":"\"\"","v":""},null,null,{"$f":"\"\"","v":""},{"$f":"\"\"","v":""}]
["[TS3L1-LAN1QP] Broadcom 5719 Quad Port 1GbE BASE-T Adapter","Additional Network Cards","GY5BHD0",{"$f":"VLOOKUP(L38,Tabella_prezzi!$A$3:$J$58,8,FALSE)","v":"Hard Disk Retention 60 mesi"},null,"540-BBCW",1,{"$f":"VLOOKUP(L38,Tabella_prezzi!$A$3:$J$58,9,FALSE)","v":"L1N19-OpzHDDRetention60"},{"$f":"VLOOKUP(L38,Tabella_prezzi!$A$3:$J$58,3,FALSE)","v":"OpzHDDRetention60"},null,{"$f":"VLOOKUP(L38,Tabella_prezzi!$A$3:$J$58,4,FALSE)","v":63},"L1N19",{"$f":"VLOOKUP(L38,Tabella_prezzi!$A$3:$J$58,6,FALSE)","v":"TS3L1-HDRTNTN60"}]
["[TS3L1-I3502P] Intel Ethernet I350 Dual Port 1GbE BASE-T Adapter","Additional Network Cards","G3NO02S",{"$f":"VLOOKUP(L39,Tabella_prezzi!$A$3:$J$58,8,FALSE)","v":0},null,"540-BBDH",1,{"$f":"VLOOKUP(L39,Tabella_prezzi!$A$3:$J$58,9,FALSE)","v":0},{"$f":"VLOOKUP(L39,Tabella_prezzi!$A$3:$J$58,3,FALSE)","v":0},null,{"$f":"VLOOKUP(L39,Tabella_prezzi!$A$3:$J$58,4,FALSE)","v":0},"L1N20",{"$f":"VLOOKUP(L39,Tabella_prezzi!$A$3:$J$58,6,FALSE)","v":0}]
["[TS3L1-I3504P] Intel Ethernet I350 Quad Port 1GbE BASE-T Adapter","Additional Network Cards","G3PC875",{"$f":"VLOOKUP(L40,Tabella_prezzi!$A$3:$J$58,8,FALSE)","v":0},null,"540-BBDD",1,{"$f":"VLOOKUP(L40,Tabella_prezzi!$A$3:$J$58,9,FALSE)","v":0},{"$f":"VLOOKUP(L40,Tabella_prezzi!$A$3:$J$58,3,FALSE)","v":0},null,{"$f":"VLOOKUP(L40,Tabella_prezzi!$A$3:$J$58,4,FALSE)","v":0},"L1N21",{"$f":"VLOOKUP(L40,Tabella_prezzi!$A$3:$J$58,6,FALSE)","v":0}]
["[TS3L1-X550] Intel X550 Dual Port 10GbE BASE-T Adapter","Additional Network Cards","G4JBP29",{"$f":"VLOOKUP(L41,Tabella_prezzi!$A$3:$J$58,8,FALSE)","v":0},null,"540-BBRO",1,{"$f":"VLOOKUP(L41,Tabella_prezzi!$A$3:$J$58,9,FALSE)","v":0},{"$f":"VLOOKUP(L41,Tabella_prezzi!$A$3:$J$58,3,FALSE)","v":0},null,{"$f":"VLOOKUP(L41,Tabella_prezzi!$A$3:$J$58,4,FALSE)","v":0},"L1N22",{"$f":"VLOOKUP(L41,Tabella_prezzi!$A$3:$J$58,6,FALSE)","v":0}]
["[TS3L1-X710] Intel X710 Dual Port 10GbE SFP+ Adapter","Additional Network Cards","G4BZI6S",{"$f":"VLOOKUP(L42,Tabella_prezzi!$A$3:$J$58,8,FALSE)","v":0},null,"540-BBHP",1,{"$f":"VLOOKUP(L42,Tabella_prezzi!$A$3:$J$58,9,FALSE)","v":0},{"$f":"VLOOKUP(L42,Tabella_prezzi!$A$3:$J$58,3,FALSE)","v":0},null,{"$f":"VLOOKUP(L42,Tabella_prezzi!$A$3:$J$58,4,FALSE)","v":0},"L1N23",{"$f":"VLOOKUP(L42,Tabella_prezzi!$A$3:$J$58,6,FALSE)","v":0}]
["[TS3L1-E12002] Emulex LPE 12002 Dual Port 8Gb Fibre Channel HBA","Fibre Channel Adapters/Converged Network Adapter","G39XE5Y",{"$f":"VLOOKUP(L43,Tabella_prezzi!$A$3:$J$58,8,FALSE)","v":0},null,"406-BBDY",1,{"$f":"VLOOKUP(L43,Tabella_prezzi!$A$3:$J$58,9,FALSE)","v":0},{"$f":"VLOOKUP(L43,Tabella_prezzi!$A$3:$J$58,3,FALSE)","v":0},null,{"$f":"VLOOKUP(L43,Tabella_prezzi!$A$3:$J$58,4,FALSE)","v":0},"L1N24",{"$f":"VLOOKUP(L43,Tabella_prezzi!$A$3:$J$58,6,FALSE)","v":0}]
["[TS3L1-CtrlSAS] SAS 12Gbps HBA External Controller","Additional PCIe Cards","GHPM5DX",{"$f":"VLOOKUP(L44,Tabella_prezzi!$A$3:$J$58,8,FALSE)","v":0},null,"405-AAEB",1,{"$f":"VLOOKUP(L44,Tabella_prezzi!$A$3:$J$58,9,FALSE)","v":0},{"$f":"VLOOKUP(L44,Tabella_prezzi!$A$3:$J$58,3,FALSE)","v":0},null,{"$f":"VLOOKUP(L44,Tabella_prezzi!$A$3:$J$58,4,FALSE)","v":0},"L1N25",{"$f":"VLOOKUP(L44,Tabella_prezzi!$A$3:$J$58,6,FALSE)","v":0}]
[]
["TS3L1_PCI3"]
[{"$f":"\"\"","v":""},null,null,null,null,null,{"$f":"\"\"","v":""},null,{"$f":"\"\"","v":""},null,null,{"$f":"\"\"","v":""},{"$f":"\"\"","v":""}]
["[TS3L1-LAN1] Broadcom 5720 Dual Port 1GbE BASE-T Adapter","Additional Network Cards","GI7RBKF",{"$f":"VLOOKUP(L48,Tabella_prezzi!$A$3:$J$58,8,FALSE)","v":"Scheda LAN 5720 DP 1Gb Full"},null,"540-BBCX",1,{"$f":"VLOOKUP(L48,Tabella_prezzi!$A$3:$J$58,9,FALSE)","v":"L1N03-OpzGigabit"},{"$f":"VLOOKUP(L48,Tabella_prezzi!$A$3:$J$58,3,FALSE)","v":"OpzGigabit"},{"$f":"VLOOKUP(L48,Tabella_prezzi!$A$3:$J$58,4,FALSE)","v":25},null,"L1N03",{"$f":"VLOOKUP(L48,Tabella_prezzi!$A$3:$J$58,6,FALSE)","v":"TS3L1-LAN1"}]
[]
["TS3L1_PCI4"]
[{"$f":"\"\"","v":""},null,null,null,null,null,{"$f":"\"\"","v":""},null,{"$f":"\"\"","v":""},null,null,{"$f":"\"\"","v":""},{"$f":"\"\"","v":""}]
["[TS3L1-LAN1] Broadcom 5720 Dual Port 1GbE BASE-T Adapter","Additional Network Cards","GI7RBKF",{"$f":"VLOOKUP(L52,Tabella_prezzi!$A$3:$J$58,8,FALSE)","v":"Scheda LAN 5720 DP 1Gb Full"},null,"540-BBCX",1,{"$f":"VLOOKUP(L52,Tabella_prezzi!$A$3:$J$58,9,FALSE)","v":"L1N03-OpzGigabit"},{"$f":"VLOOKUP(L52,Tabella_prezzi!$A$3:$J$58,3,FALSE)","v":"OpzGigabit"},{"$f":"VLOOKUP(L52,Tabella_prezzi!$A$3:$J$58,4,FALSE)","v":25},null,"L1N03",{"$f":"VLOOKUP(L52,Tabella_prezzi!$A$3:$J$58,6,FALSE)","v":"TS3L1-LAN1"}]
["-=-=-=-=-=-=-=-=-=-=-=-=-=-=-=-=-20%-=-=-=-=-=-=-=-=-=-=-=-=-=-=-=-=-",null,null,null,null,null,{"$f":"\"\"","v":""},null,{"$f":"\"\"","v":""},null,null,{"$f":"\"\"","v":""},{"$f":"\"\"","v":""}]
["[TS3L1-LAN1QP] Broadcom 5719 Quad Port 1GbE BASE-T Adapter","Additional Network Cards","GY5BHD0",{"$f":"VLOOKUP(L54,Tabella_prezzi!$A$3:$J$58,8,FALSE)","v":"Hard Disk Retention 60 mesi"},null,"540-BBCW",1,{"$f":"VLOOKUP(L54,Tabella_prezzi!$A$3:$J$58,9,FALSE)","v":"L1N19-OpzHDDRetention60"},{"$f":"VLOOKUP(L54,Tabella_prezzi!$A$3:$J$58,3,FALSE)","v":"OpzHDDRetention60"},null,{"$f":"VLOOKUP(L54,Tabella_prezzi!$A$3:$J$58,4,FALSE)","v":63},"L1N19",{"$f":"VLOOKUP(L54,Tabella_prezzi!$A$3:$J$58,6,FALSE)","v":"TS3L1-HDRTNTN60"}]
["[TS3L1-I3502P] Intel Ethernet I350 Dual Port 1GbE BASE-T Adapter","Additional Network Cards","G3NO02S",{"$f":"VLOOKUP(L55,Tabella_prezzi!$A$3:$J$58,8,FALSE)","v":0},null,"540-BBDH",1,{"$f":"VLOOKUP(L55,Tabella_prezzi!$A$3:$J$58,9,FALSE)","v":0},{"$f":"VLOOKUP(L55,Tabella_prezzi!$A$3:$J$58,3,FALSE)","v":0},null,{"$f":"VLOOKUP(L55,Tabella_prezzi!$A$3:$J$58,4,FALSE)","v":0},"L1N20",{"$f":"VLOOKUP(L55,Tabella_prezzi!$A$3:$J$58,6,FALSE)","v":0}]
["[TS3L1-I3504P] Intel Ethernet I350 Quad Port 1GbE BASE-T Adapter","Additional Network Cards","G3PC875",{"$f":"VLOOKUP(L56,Tabella_prezzi!$A$3:$J$58,8,FALSE)","v":0},null,"540-BBDD",1,{"$f":"VLOOKUP(L56,Tabella_prezzi!$A$3:$J$58,9,FALSE)","v":0},{"$f":"VLOOKUP(L56,Tabella_prezzi!$A$3:$J$58,3,FALSE)","v":0},null,{"$f":"VLOOKUP(L56,Tabella_prezzi!$A$3:$J$58,4,FALSE)","v":0},"L1N21",{"$f":"VLOOKUP(L56,Tabella_prezzi!$A$3:$J$58,6,FALSE)","v":0}]
[]
["Cavo “patch” di 3 mt RJ45 certificato per gigabit ethernet",null,null,null,null,null,{"$f":"\"\"","v":""},null,{"$f":"VLOOKUP(L58,Tabella_prezzi!$A$3:$J$58,3,FALSE)","v":"OpzRJ45 3m"},null,{"$f":"VLOOKUP(L58,Tabella_prezzi!$A$3:$J$58,4,FALSE)","v":3},"L1N26",{"$f":"VLOOKUP(L58,Tabella_prezzi!$A$3:$J$58,6,FALSE)","v":"TS3L1-RJ453M"}]
[]
[]
["TS3L1_BEZEL"]
["No Bezel","Bezel"," GKGZ6OF","No Bezel",null,"350-BBBW",{"$f":"\"\"","v":""},null,{"$f":"\"\"","v":""},null,0,{"$f":"\"\"","v":""},{"$f":"\"\"","v":""}]
["-=-=-=-=-=-=-=-=-=-=-=-=-=-=-=-=-20%-=-=-=-=-=-=-=-=-=-=-=-=-=-=-=-=-",null,null,null,null,null,{"$f":"\"\"","v":""},null,{"$f":"\"\"","v":""},null,null,{"$f":"\"\"","v":""},{"$f":"\"\"","v":""}]
["[TS3L1-PSUDVDBZL] Tower Security Bezel","Bezel","G87WRUY","Tower Security Bezel",null,"325-BCOO",1,{"$f":"VLOOKUP(L64,Tabella_prezzi!$A$3:$J$58,9,FALSE)","v":"TS3-OpzA20T340K"},{"$f":"VLOOKUP(L64,Tabella_prezzi!$A$3:$J$58,3,FALSE)","v":0},null,{"$f":"VLOOKUP(L64,Tabella_prezzi!$A$3:$J$58,4,FALSE)","v":230},"L1N18",{"$f":"VLOOKUP(L64,Tabella_prezzi!$A$3:$J$58,6,FALSE)","v":"TS3L1-PSUDVDBZL"}]
[]
["TS3L1_DVD"]
["No Internal Optical Drive","Internal Optical Drive"," G5M9GE3","No Internal Optical Drive",null,"429-ABDL",{"$f":"\"\"","v":""},null,{"$f":"\"\"","v":""},null,0,{"$f":"\"\"","v":""},{"$f":"\"\"","v":""}]
["-=-=-=-=-=-=-=-=-=-=-=-=-=-=-=-=-20%-=-=-=-=-=-=-=-=-=-=-=-=-=-=-=-=-",null,null,null,null,null,{"$f":"\"\"","v":""},null,{"$f":"\"\"","v":""},null,null,{"$f":"\"\"","v":""},{"$f":"\"\"","v":""}]
["[TS3L1-PSUDVDBZL] DVD +/-RW, SATA, Internal","Internal Optical Drive","GR53HYI","DVD +/-RW, SATA, Internal",null,"429-ABCJ",1,{"$f":"VLOOKUP(L69,Tabella_prezzi!$A$3:$J$58,9,FALSE)","v":"TS3-OpzA20T340K"},{"$f":"VLOOKUP(L69,Tabella_prezzi!$A$3:$J$58,3,FALSE)","v":0},null,{"$f":"VLOOKUP(L69,Tabella_prezzi!$A$3:$J$58,4,FALSE)","v":230},"L1N18",{"$f":"VLOOKUP(L69,Tabella_prezzi!$A$3:$J$58,6,FALSE)","v":"TS3L1-PSUDVDBZL"}]
[]
["TS3L1_WARRANTY"]
["Manutenzione in garanzia (36 mesi)","Dell Services: Extended Service"," G5IMJFP","RESTRICTED:ProSupport One Data Center and Next Business Day Onsite Service Volume Low, 39 Month(s)",null,"865-BBKY, 865-BBKZ",{"$f":"\"\"","v":""},null,{"$f":"\"\"","v":""},null,null,{"$f":"\"\"","v":""},{"$f":"\"\"","v":""}]
["[TS3L1-5Y] Manutenzione in garanzia (60 mesi)","Dell Services: Extended Service"," G5IMJFP",{"$f":"VLOOKUP(L73,Tabella_prezzi!$A$3:$J$58,8,FALSE)","v":"Estensione della manutenzione in garanzia per ulteriori 24 mesi"},null,"865-BBKY, 865-BBKZ",1,{"$f":"VLOOKUP(L73,Tabella_prezzi!$A$3:$J$58,9,FALSE)","v":"L1N17-OpzEstensione24"},{"$f":"VLOOKUP(L73,Tabella_prezzi!$A$3:$J$58,3,FALSE)","v":"OpzEstensione24"},{"$f":"VLOOKUP(L73,Tabella_prezzi!$A$3:$J$58,4,FALSE)","v":79},null,"L1N17",{"$f":"VLOOKUP(L73,Tabella_prezzi!$A$3:$J$58,6,FALSE)","v":"TS3L1-5Y"}]
[]
["TS3L1_KYHDD"]
[{"$f":"\"\"","v":""},"Keep Your Hard Drive",null,null,null,null,{"$f":"\"\"","v":""},null,{"$f":"\"\"","v":""},null,null,{"$f":"\"\"","v":""},{"$f":"\"\"","v":""}]
["Hard Disk Retention","Keep Your Hard Drive"," GPZX1KQ",{"$f":"VLOOKUP(L77,Tabella_prezzi!$A$3:$J$58,8,FALSE)","v":"Hard Disk Retention 36 mesi"},null,"711-BBBR",1,{"$f":"VLOOKUP(L77,Tabella_prezzi!$A$3:$J$58,9,FALSE)","v":"L1N16-OpzHDDRetention"},{"$f":"VLOOKUP(L77,Tabella_prezzi!$A$3:$J$58,3,FALSE)","v":"OpzHDDRetention"},{"$f":"VLOOKUP(L77,Tabella_prezzi!$A$3:$J$58,4,FALSE)","v":38},null,"L1N16",{"$f":"VLOOKUP(L77,Tabella_prezzi!$A$3:$J$58,6,FALSE)","v":"TS3L1-HDRTNTN"},{"$f":"LEN(M77)","v":13}]
["Hard Disk Retention (60 mesi)","Keep Your Hard Drive",null,{"$f":"VLOOKUP(L78,Tabella_prezzi!$A$3:$J$58,8,FALSE)","v":"Hard Disk Retention 60 mesi"},null,null,1,{"$f":"VLOOKUP(L78,Tabella_prezzi!$A$3:$J$58,9,FALSE)","v":"L1N19-OpzHDDRetention60"},{"$f":"VLOOKUP(L78,Tabella_prezzi!$A$3:$J$58,3,FALSE)","v":"OpzHDDRetention60"},{"$f":"VLOOKUP(L78,Tabella_prezzi!$A$3:$J$58,4,FALSE)","v":63},null,"L1N19",{"$f":"VLOOKUP(L78,Tabella_prezzi!$A$3:$J$58,6,FALSE)","v":"TS3L1-HDRTNTN60"}]
[]
["TS3L1_UPS"]
[{"$f":"\"\"","v":""},null,null,null,null,null,{"$f":"\"\"","v":""},null,{"$f":"\"\"","v":""},null,null,{"$f":"\"\"","v":""},{"$f":"\"\"","v":""}]
["[TS3L1-UPS] UPS PowerMe RPMM/9K - 3000VA Tower",null,null,{"$f":"VLOOKUP(L82,Tabella_prezzi!$A$3:$J$58,8,FALSE)","v":"Powerme Online UPS RPMM/9 3K, Tower, SNMP card"},null,null,1,{"$f":"VLOOKUP(L82,Tabella_prezzi!$A$3:$J$58,9,FALSE)","v":"L1N10-OpzUps"},{"$f":"VLOOKUP(L82,Tabella_prezzi!$A$3:$J$58,3,FALSE)","v":"OpzUps (3000VA)"},{"$f":"VLOOKUP(L82,Tabella_prezzi!$A$3:$J$58,4,FALSE)","v":302},null,"L1N10",{"$f":"VLOOKUP(L82,Tabella_prezzi!$A$3:$J$58,6,FALSE)","v":"TS3L1-UPS"}]
[]
["TS3L1_GUI"]
[{"$f":"\"\"","v":""},null,null,null,null,null,{"$f":"\"\"","v":""},null,{"$f":"\"\"","v":""},null,null,{"$f":"\"\"","v":""},{"$f":"\"\"","v":""}]
["[TS3L1-GUI] Monitor DELL E1920H + Keyboard + Mouse",null,null,{"$f":"VLOOKUP(L86,Tabella_prezzi!$A$3:$J$58,8,FALSE)","v":"KIT Monitor 19\" E1920H + Mouse MS116 + Tastiera KB216"},null,null,1,{"$f":"VLOOKUP(L86,Tabella_prezzi!$A$3:$J$58,9,FALSE)","v":"L1N11-OpzGUI"},{"$f":"VLOOKUP(L86,Tabella_prezzi!$A$3:$J$58,3,FALSE)","v":"OpzGUI per tower"},{"$f":"VLOOKUP(L86,Tabella_prezzi!$A$3:$J$58,4,FALSE)","v":69},null,"L1N11",{"$f":"VLOOKUP(L86,Tabella_prezzi!$A$3:$J$58,6,FALSE)","v":"TS3L1-GUI"}]
[]
["TS3L1-SFPALL"]
[{"$f":"D89","v":"SFP+ SR Optic for all SFP+ ports"},"SFP+ Transceivers",null,"SFP+ SR Optic for all SFP+ ports",null,null,1,{"$f":"VLOOKUP(L89,Tabella_prezzi!$A$3:$J$58,9,FALSE)","v":0},{"$f":"VLOOKUP(L89,Tabella_prezzi!$A$3:$J$58,3,FALSE)","v":0},null,{"$f":"VLOOKUP(L89,Tabella_prezzi!$A$3:$J$58,4,FALSE)","v":0},"L1N34",{"$f":"VLOOKUP(L89,Tabella_prezzi!$A$3:$J$58,6,FALSE)","v":0}]
[]
["TS3L1_DAC"]
[{"$f":"D92","v":"Dell Networking, Cable, SFP+ to SFP+, 10GbE, Copper Twinax Direct Attach Cable, 1 Meter"},"SFP+ Direct Attach Cables (Twinax)",null,{"$f":"VLOOKUP(L92,Tabella_prezzi!$A$3:$J$58,8,FALSE)","v":"Dell Networking, Cable, SFP+ to SFP+, 10GbE, Copper Twinax Direct Attach Cable, 1 Meter"},null,null,1,{"$f":"VLOOKUP(L92,Tabella_prezzi!$A$3:$J$58,9,FALSE)","v":0},{"$f":"VLOOKUP(L92,Tabella_prezzi!$A$3:$J$58,3,FALSE)","v":0},null,{"$f":"VLOOKUP(L92,Tabella_prezzi!$A$3:$J$58,4,FALSE)","v":0},"L1N35",{"$f":"VLOOKUP(L92,Tabella_prezzi!$A$3:$J$58,6,FALSE)","v":0}]
["Dell Networking, Cable, SFP+ to SFP+, 10GbE, Copper Twinax Direct Attach Cable, 3 Meter","SFP+ Direct Attach Cables (Twinax)",null,{"$f":"VLOOKUP(L93,Tabella_prezzi!$A$3:$J$58,8,FALSE)","v":"Dell Networking, Cable, SFP+ to SFP+, 10GbE, Copper Twinax Direct Attach Cable, 3 Meter"},null,null,1,{"$f":"VLOOKUP(L93,Tabella_prezzi!$A$3:$J$58,9,FALSE)","v":0},{"$f":"VLOOKUP(L93,Tabella_prezzi!$A$3:$J$58,3,FALSE)","v":0},null,{"$f":"VLOOKUP(L93,Tabella_prezzi!$A$3:$J$58,4,FALSE)","v":0},"L1N36",{"$f":"VLOOKUP(L93,Tabella_prezzi!$A$3:$J$58,6,FALSE)","v":0}]
["Dell Networking, Cable, SFP+ to SFP+, 10GbE, Copper Twinax Direct Attach Cable, 5 Meter","SFP+ Direct Attach Cables (Twinax)",null,{"$f":"VLOOKUP(L94,Tabella_prezzi!$A$3:$J$58,8,FALSE)","v":"Dell Networking, Cable, SFP+ to SFP+, 10GbE, Copper Twinax Direct Attach Cable, 5 Meter"},null,null,1,{"$f":"VLOOKUP(L94,Tabella_prezzi!$A$3:$J$58,9,FALSE)","v":0},{"$f":"VLOOKUP(L94,Tabella_prezzi!$A$3:$J$58,3,FALSE)","v":0},null,{"$f":"VLOOKUP(L94,Tabella_prezzi!$A$3:$J$58,4,FALSE)","v":0},"L1N37",{"$f":"VLOOKUP(L94,Tabella_prezzi!$A$3:$J$58,6,FALSE)","v":0}]
[]
["TS3L1_SAS"]
[{"$f":"D97","v":"12Gb HD-Mini to HD-Mini SAS Cable, 2M"},"SAS Cables",null,"12Gb HD-Mini to HD-Mini SAS Cable, 2M",null,null,1,{"$f":"VLOOKUP(L97,Tabella_prezzi!$A$3:$J$58,9,FALSE)","v":0},{"$f":"VLOOKUP(L97,Tabella_prezzi!$A$3:$J$58,3,FALSE)","v":0},null,{"$f":"VLOOKUP(L97,Tabella_prezzi!$A$3:$J$58,4,FALSE)","v":0},"L1N29",{"$f":"VLOOKUP(L97,Tabella_prezzi!$A$3:$J$58,6,FALSE)","v":0}]
["12Gb HD-Mini to HD-Mini SAS Cable, 6M","SAS Cables",null,"12Gb HD-Mini to HD-Mini SAS Cable, 6M",null,null,1,{"$f":"VLOOKUP(L98,Tabella_prezzi!$A$3:$J$58,9,FALSE)","v":0},{"$f":"VLOOKUP(L98,Tabella_prezzi!$A$3:$J$58,3,FALSE)","v":0},null,{"$f":"VLOOKUP(L98,Tabella_prezzi!$A$3:$J$58,4,FALSE)","v":0},"L1N30",{"$f":"VLOOKUP(L98,Tabella_prezzi!$A$3:$J$58,6,FALSE)","v":0}]
["12Gb HD-Mini SAS cable, 0.5m","SAS Cables",null,"12Gb HD-Mini SAS cable, 0.5m",null,null,1,{"$f":"VLOOKUP(L99,Tabella_prezzi!$A$3:$J$58,9,FALSE)","v":0},{"$f":"VLOOKUP(L99,Tabella_prezzi!$A$3:$J$58,3,FALSE)","v":0},null,{"$f":"VLOOKUP(L99,Tabella_prezzi!$A$3:$J$58,4,FALSE)","v":0},"L1N31",{"$f":"VLOOKUP(L99,Tabella_prezzi!$A$3:$J$58,6,FALSE)","v":0}]
["12Gb HD-Mini SAS cable, 2m","SAS Cables",null,"12Gb HD-Mini SAS cable, 2m",null,null,1,{"$f":"VLOOKUP(L100,Tabella_prezzi!$A$3:$J$58,9,FALSE)","v":0},{"$f":"VLOOKUP(L100,Tabella_prezzi!$A$3:$J$58,3,FALSE)","v":0},null,{"$f":"VLOOKUP(L100,Tabella_prezzi!$A$3:$J$58,4,FALSE)","v":0},"L1N32",{"$f":"VLOOKUP(L100,Tabella_prezzi!$A$3:$J$58,6,FALSE)","v":0}]
["12Gb Mini-SAS HD to Mini-SAS HD Cable, 4m","SAS Cables",null,"12Gb Mini-SAS HD to Mini-SAS HD Cable, 4m",null,null,1,{"$f":"VLOOKUP(L101,Tabella_prezzi!$A$3:$J$58,9,FALSE)","v":0},{"$f":"VLOOKUP(L101,Tabella_prezzi!$A$3:$J$58,3,FALSE)","v":0},null,{"$f":"VLOOKUP(L101,Tabella_prezzi!$A$3:$J$58,4,FALSE)","v":0},"L1N33",{"$f":"VLOOKUP(L101,Tabella_prezzi!$A$3:$J$58,6,FALSE)","v":0}]
[]
[]
[]
[]
[]
[]
[]
["TS3L11PSU"]
["TS3L12PSU"]

{"sheet":"Tabella_prezzi","index":4,"n_rows":58,"n_cols":13,"rows_kept":58,"cut":false,"hidden":true,"merged":[[12,7,18,7],[12,9,18,9],[12,0,18,0],[12,1,18,1],[12,2,18,2],[12,3,18,3],[12,4,18,4],[12,5,18,5],[12,6,18,6],[12,8,18,8]]}
[]
["N°",null,"Attributo","Valore inserito","N°","Codice Convenzione","Qty:","Description:","Sku Number:","Brand"]
["L1N01",1,"Server Tower mono-processore",1399,"L1N01","TS3L1-SRV",1,"DELL PowerEdge T340 Server","L1N01-ServerT340","DELL",{"$f":"D3/100*20","v":279.8}]
["L1N02",2,"OpzRAM16GB",98,"L1N02","TS3L1-RAM16",1,"16GB - 2Rx8 DDR4 UDIMM 2666MHz","L1N02-OpzRAM16GB","DELL",null,null,"AA335286"]
["L1N03",3,"OpzGigabit",25,"L1N03","TS3L1-LAN1",1,"Scheda LAN 5720 DP 1Gb Full","L1N03-OpzGigabit","DELL",null,null,"540-BBGY"]
["L1N04",4,"OpzHDD8TB",285,"L1N04","TS3L1-HDD8TB",1,"HDD 8TB 7.2K SATA 6Gbps 3.5in Hot-plug","L1N04-OpzHDD8TB","DELL",null,null,"400-AHID"]
["L1N05",5,"OpzHDD4TB",194,"L1N05","TS3L1-HDD4TB",1,"HDD 4TB 7.2K SATA 6Gbps 3.5in Hot-plug","L1N05-OpzHDD4TB","DELL",null,null,"400-AUWY"]
["L1N06",6,"OpzHDD2TB",148,"L1N06","TS3L1-HDD2TB",1,"HDD 2TB 7.2K SATA 6Gbps 3.5in Hot-plug","L1N06-OpzHDD2TB","DELL",null,null,"400-AUWX"]
["L1N07",7,"OpzHDD1TB",80,"L1N07","TS3L1-HDD1TB",1,"HDD 1TB 7.2K SATA 6Gbps 3.5in Hot-plug","L1N07-OpzHDD1TB","DELL",null,null,"400-AURS"]
["L1N08",8,"OpzSSD-RI800GB",216,"L1N08","TS3L1-RI800GB",1,"SSD 960GB SATA RI 6Gbps 2.5in in 3.5in Hybrid Carrier, 1 DWPD","L1N08-OpzSSD-RI800GB","DELL",null,null,"400-BDPC"]
["L1N09",9,"OpzSSD-RI400GB",160,"L1N09","TS3L1-RI400GB",1,"SSD 480GB SATA RI 6Gbps 2.5in in 3.5in Hybrid Carrier, 1 DWPD","L1N09-OpzSSD-RI400GB","DELL",null,null,"400-BDQT"]
["L1N10",10,"OpzUps (3000VA)",302,"L1N10","TS3L1-UPS",1,"Powerme Online UPS RPMM/9 3K, Tower, SNMP card","L1N10-OpzUps","PowerME",null,null,"TPMM/ 3K"]
["L1N11",11,"OpzGUI per tower",69,"L1N11","TS3L1-GUI",1,"KIT Monitor 19\" E1920H + Mouse MS116 + Tastiera KB216","L1N11-OpzGUI","DELL",null,null,"580-ADHM"]
[null,null,null,null,null,null,1,"Mouse ottico Dell MS116 - nero","570-AAIS",null,null,null,"570-AAIS"]
[null,null,null,null,null,null,1,"BASE,DIS,MON,E1920H,EMEA","210-AURI",null,null,null,"210-AURI"]
[null,null,null,null,null,null,1,"Italian 220V Power Cord","450-ABCK",null,null,null,"450-ABCK"]
[null,null,null,null,null,null,1,"SnP order - EMEA.","800-10243",null,null,null,"800-10243"]
[null,null,null,null,null,null,1,"39M Basic with Advanced Exchange Channel","709-17931",null,null,null,"709-17931"]
[null,null,null,null,null,null,1,"No Warranty Upgrade","710-10844",null,null,null,"710-10844"]
["L1N12",12,"OpzWinServESS",256,"L1N12","TS3L1-WINSRVESS",1,"Windows Server 2019,Essentials, ROK","L1N12-OpzWinServESS","DELL",null,null,"634-BSFZ"]
["L1N13",13,null,null,"L1N13"]
["L1N14",14,null,null,"L1N14"]
["L1N15",15,"OpzOpenSource",49,"L1N15","TS3L1-LINUX",1,"Ubuntu 18.04 LTS 64 Bit","L1N15-OpzOpenSource"]
["L1N16",16,"OpzHDDRetention",38,"L1N16","TS3L1-HDRTNTN",1,"Hard Disk Retention 36 mesi","L1N16-OpzHDDRetention","DELL",null,null,"785-10921"]
["L1N17",17,"OpzEstensione24",79,"L1N17","TS3L1-5Y",1,"Estensione della manutenzione in garanzia per ulteriori 24 mesi","L1N17-OpzEstensione24","DELL",null,null,"742-10105"]
["L1N18",18,null,230,"L1N18","TS3L1-PSUDVDBZL",1,"Kit per T340 composto da: Hot-plug Power Supply 495W, DVD+/-RW SATA interno, Security Bezel","TS3-OpzA20T340K","DELL",null,null,"450-AEBM"]
["L1N19",19,"OpzHDDRetention60",63,"L1N19","TS3L1-HDRTNTN60",1,"Hard Disk Retention 60 mesi","L1N19-OpzHDDRetention60","DELL"]
["L1N20",20,null,null,"L1N20"]
["L1N21",21,null,null,"L1N21"]
["L1N22",22,null,null,"L1N22"]
["L1N23",23,null,null,"L1N23"]
["L1N24",24,null,null,"L1N24"]
["L1N25",25,null,null,"L1N25"]
["L1N26",26,"OpzRJ45 3m",3,"L1N26","TS3L1-RJ453M",1,"cavo “patch” di 3 mt RJ45 certificato per gigabit ethernet","TS3-OpzA20RJ45"]
["L1N27",27,"OpzBezel",45,"L1N27","TS3L1-BEZEL",1,"Tower Bezel, PowerEdge, T340","TS3-OpzA20BT340","DELL",null,null,"470-ACNV"]
["L1N28",28,"OpzDVD",55,"L1N28","TS3L1-DVD",1,"DVD+/-RW, SATA, Internal","TS3-OpzA20DVD","DELL",null,null,"429-ABIE"]
["L1N29",29,null,null,"L1N29"]
["L1N30",30,null,null,"L1N30"]
["L1N31",31,null,null,"L1N31"]
["L1N32",32,null,null,"L1N32"]
["L1N33",33,null,null,"L1N33"]
["L1N34",34,null,null,"L1N34"]
["L1N35",35,null,null,"L1N35",null,null,"Dell Networking, Cable, SFP+ to SFP+, 10GbE, Copper Twinax Direct Attach Cable, 1 Meter"]
["L1N36",36,null,null,"L1N36",null,null,"Dell Networking, Cable, SFP+ to SFP+, 10GbE, Copper Twinax Direct Attach Cable, 3 Meter"]
["L1N37",37,null,null,"L1N37",null,null,"Dell Networking, Cable, SFP+ to SFP+, 10GbE, Copper Twinax Direct Attach Cable, 5 Meter"]
["L1N38",38,null,null,"L1N38"]
["L1N39",39,null,null,"L1N39"]
["L1N40",40,null,null,"L1N40"]
["L1N41",41,null,null,"L1N41"]
["L1N42",42,null,null,"L1N42"]
["L1N43",43,null,null,"L1N43"]
["L1N44",44,null,null,"L1N44"]
["L1N45",45,null,null,"L1N45"]
["L1N46",46,null,null,"L1N46"]
["L1N47",47,null,null,"L1N47"]
["L1N48",48,null,null,"L1N48"]
["L1N49",49,null,null,"L1N49"]
["L1N50",50,"L1N50-OpzCodiceNATO",200,"L1N50","TS3L1-NATO",1,"Codifica NATO",null,"DELL"]

{"sheet":"Riepilogo","index":5,"n_rows":68,"n_cols":24,"rows_kept":68,"cut":false,"hidden":false,"merged":[[66,1,66,5],[63,4,63,5],[63,1,63,2],[62,1,62,5],[64,1,64,5],[65,1,65,5],[40,1,40,6],[20,1,20,6],[17,4,17,6],[1,3,1,6],[15,1,15,2],[10,3,10,6],[15,3,15,6],[12,4,12,6],[1,1,1,2],[3,1,3,2],[5,1,5,2],[7,1,7,2],[10,1,10,2]]}
[null,null,null,null,null,null,null,null,null,1]
[null,"Ente:",null,null,null,null,null,null,null,1,null,"ente",{"$f":"IF(D2>0,0,1)","v":1}]
[null,null,null,null,null,null,null,null,null,1]
[null,"Ordine N.",null,null,{"$f":"M7","v":"ERRORE DI MANCATA COMPILAZIONE DATI NECESSARI PER L'ORDINATIVO"},null,null,null,null,1,null,"N°ordine",{"$f":"IF(D4>0,0,1)","v":1}]
[null,null,null,null,{"$f":"M8","v":""},null,null,null,null,1]
[null,"Data",null,null,{"$f":"M9","v":""},null,null,null,null,1,null,"data",{"$f":"IF(D6>0,0,1)","v":1}]
[null,null,null,null,{"$f":"M10","v":""},null,null,null,null,1,null,"ERRORE1",{"$f":"IF(M2+M4+M6+M11+M13+M16+M18+O18+O13,\"ERRORE DI MANCATA COMPILAZIONE DATI NECESSARI PER L'ORDINATIVO\",\"\")","v":"ERRORE DI MANCATA COMPILAZIONE DATI NECESSARI PER L'ORDINATIVO"},{"$f":"IF(M7=\"\",0,1)","v":1}]
[null,"Totale IVA incl.",null,{"$f":"G67","v":0},{"$f":"IF(Q11=0,\"CONFIGURATORE OK\", \"\")","v":""},null,"Version 2.8",null,null,1,null,"Warning2",{"$f":"IF(G64>D64,\"!!! ATTENZIONE !!! L'IMPORTO 20% SUPERA IL VALORE MASSIMO CONSENTITO\",\"\")","v":""},{"$f":"IF(M8=\"\",0,1)","v":0}]
[null,null,null,null,null,null,null,null,null,1,null,"ERRORE3",{"$f":"\"\"","v":""},0]
[null,null,null,null,null,null,null,null,null,1,null,"Waning4",{"$f":"IF(N10>0,\"!!! ATTENZIONE !!! COMPLETARE IL CAMPO NOTE NELLE CONFIGURAZIONI\",\"\")","v":""},{"$f":"IF(M22>0,O10,0)+IF(N22>0,P10,0)+IF(O22>0,Q10,0)","v":0},{"$f":"IF(Lotto1_T340_1!$H$27=\"Specificare la configurazione RAID per l'installazione del Sistema Operativo, se richiesto.\ne/o\ninserire eventuali note.\",1,0)","v":1},{"$f":"IF(Lotto1_T340_2!$H$27=\"Specificare la configurazione RAID per l'installazione del Sistema Operativo, se richiesto.\ne/o\ninserire eventuali note.\",1,0)","v":1},{"$f":"IF(Lotto1_T340_3!$H$27=\"Specificare la configurazione RAID per l'installazione del Sistema Operativo, se richiesto.\ne/o\ninserire eventuali note.\",1,0)","v":1}]
[null,"Referente Consegna",null,null,null,null,null,null,null,1,null,"ref1",{"$f":"IF(D11>0,0,1)","v":1},null,"Verifica Errori",null,{"$f":"N7+N9","v":1}]
[null,null,null,null,null,null,null,null,null,1]
[null,"Telefono",null,"email",null,null,null,null,null,1,null,"tel1",{"$f":"IF(C13>0,0,1)","v":1},"mail1",{"$f":"IF(E13>0,0,1)","v":1}]
[null,null,null,null,null,null,null,null,null,1]
[null,null,null,null,null,null,null,null,null,1]
[null,"Referente Installazione",null,null,null,null,null,null,null,1,null,"ref2",{"$f":"IF(D16>0,0,1)","v":1}]
[null,null,null,null,null,null,null,null,null,1]
[null,"Telefono",null,"email",null,null,null,null,null,1,null,"tel2",{"$f":"IF(C18>0,0,1)","v":1},"mail2",{"$f":"IF(E18>0,0,1)","v":1}]
[null,null,null,null,null,null,null,null,null,1]
[null,null,null,null,null,null,null,null,null,1,null,null,"Server1","Server2","Server3","Totale"]
[null,"TECNOLOGIE SERVER 3 LOTTO 1 - LISTA ARTICOLI IN CONVENZIONE -",null,null,null,null,null,null,null,{"$f":"IF($G$63>0,1,0)","v":0}]
[null,"Quantità","Codice Articolo Produttore","Codice Articolo Convenzione","Descrizione","Costo unitario","Costo complessivo",null,null,{"$f":"IF($G$63>0,1,0)","v":0},"Codice Convenzione","N°",{"$f":"Lotto1_T340_1!F5","v":0},{"$f":"Lotto1_T340_2!F5","v":0},{"$f":"Lotto1_T340_3!F5","v":0}]
[null,{"$f":"IF(P23>0,P23,\"\")","v":""},{"$f":"IF(B23=\"\",\"\",VLOOKUP(L23,Tabella_prezzi!$A$3:$J$58,9,FALSE))","v":""},{"$f":"IF(B23=\"\",\"\",VLOOKUP(L23,Tabella_prezzi!$A$3:$J$58,6,FALSE))","v":""},{"$f":"IF(B23=\"\",\"\",VLOOKUP(L23,Tabella_prezzi!$A$3:$J$58,8,FALSE))","v":""},{"$f":"IF(B23=\"\",\"\",VLOOKUP(L23,Tabella_prezzi!$A$3:$J$58,4,FALSE))","v":""},{"$f":"IF(C23=\"\",\"\",F23*B23)","v":""},null,null,{"$f":"IF(B23=\"\",0,1)","v":0},"TS3L1-SRV","L1N01",{"$f":"COUNTIF($Q$23:$Q$53,L23)*$M$22","v":0},{"$f":"COUNTIF($S$23:$S$53,L23)*$N$22","v":0},{"$f":"COUNTIF($U$23:$U$53,L23)*$O$22","v":0},{"$f":"SUM(M23:O23)","v":0},{"$f":"Lotto1_T340_1!L8","v":"L1N01"},{"$f":"Lotto1_T340_1!F8","v":""},{"$f":"Lotto1_T340_2!L8","v":"L1N01"},{"$f":"Lotto1_T340_2!F8","v":""},{"$f":"Lotto1_T340_3!L8","v":"L1N01"},{"$f":"Lotto1_T340_3!F8","v":""},null,{"$f":"ISODD(J23)","v":false}]
[null,{"$f":"IF(P24>0,P24,\"\")","v":""},{"$f":"IF(B24=\"\",\"\",VLOOKUP(L24,Tabella_prezzi!$A$3:$J$58,9,FALSE))","v":""},{"$f":"IF(B24=\"\",\"\",VLOOKUP(L24,Tabella_prezzi!$A$3:$J$58,6,FALSE))","v":""},{"$f":"IF(B24=\"\",\"\",VLOOKUP(L24,Tabella_prezzi!$A$3:$J$58,8,FALSE))","v":""},{"$f":"IF(B24=\"\",\"\",VLOOKUP(L24,Tabella_prezzi!$A$3:$J$58,4,FALSE))","v":""},{"$f":"IF(C24=\"\",\"\",F24*B24)","v":""},null,null,{"$f":"IF(B24=\"\",0,1)","v":0},"TS3L1-RAM16","L1N02",{"$f":"COUNTIF($Q$23:$Q$53,L24)*$M$22*R24","v":0},{"$f":"COUNTIF($S$23:$S$53,L24)*$N$22*T24","v":0},{"$f":"COUNTIF($U$23:$U$53,L24)*$O$22*V24","v":0},0,{"$f":"Lotto1_T340_1!L20","v":""},{"$f":"Lotto1_T340_1!F20","v":0},{"$f":"Lotto1_T340_2!L20","v":""},{"$f":"Lotto1_T340_2!F20","v":0},{"$f":"Lotto1_T340_3!L20","v":""},{"$f":"Lotto1_T340_3!F20","v":0},null,{"$f":"ISODD(SUM($J$23:J24))","v":false}]
[null,"",{"$f":"IF(B25=\"\",\"\",VLOOKUP(L25,Tabella_prezzi!$A$3:$J$58,9,FALSE))","v":""},{"$f":"IF(B25=\"\",\"\",VLOOKUP(L25,Tabella_prezzi!$A$3:$J$58,6,FALSE))","v":""},{"$f":"IF(B25=\"\",\"\",VLOOKUP(L25,Tabella_prezzi!$A$3:$J$58,8,FALSE))","v":""},{"$f":"IF(B25=\"\",\"\",VLOOKUP(L25,Tabella_prezzi!$A$3:$J$58,4,FALSE))","v":""},"",null,null,0,"TS3L1-LAN1","L1N03",{"$f":"COUNTIF($Q$23:$Q$53,L25)*$M$22","v":0},{"$f":"COUNTIF($S$23:$S$53,L25)*$N$22","v":0},{"$f":"COUNTIF($U$23:$U$53,L25)*$O$22","v":0},0,{"$f":"Lotto1_T340_1!L23","v":""},{"$f":"Lotto1_T340_1!F23","v":""},{"$f":"Lotto1_T340_2!L23","v":""},{"$f":"Lotto1_T340_2!F23","v":""},{"$f":"Lotto1_T340_3!L23","v":""},{"$f":"Lotto1_T340_3!F23","v":""},null,{"$f":"ISODD(SUM($J$23:J25))","v":false}]
[null,"",{"$f":"IF(B26=\"\",\"\",VLOOKUP(L26,Tabella_prezzi!$A$3:$J$58,9,FALSE))","v":""},{"$f":"IF(B26=\"\",\"\",VLOOKUP(L26,Tabella_prezzi!$A$3:$J$58,6,FALSE))","v":""},{"$f":"IF(B26=\"\",\"\",VLOOKUP(L26,Tabella_prezzi!$A$3:$J$58,8,FALSE))","v":""},{"$f":"IF(B26=\"\",\"\",VLOOKUP(L26,Tabella_prezzi!$A$3:$J$58,4,FALSE))","v":""},"",null,null,0,"TS3L1-HDD8TB","L1N04",0,0,0,0,{"$f":"Lotto1_T340_1!L29","v":""},{"$f":"Lotto1_T340_1!F29","v":""},{"$f":"Lotto1_T340_2!L29","v":""},{"$f":"Lotto1_T340_2!F29","v":""},{"$f":"Lotto1_T340_3!L29","v":""},{"$f":"Lotto1_T340_3!F29","v":""},null,{"$f":"ISODD(SUM($J$23:J26))","v":false}]
[null,"",{"$f":"IF(B27=\"\",\"\",VLOOKUP(L27,Tabella_prezzi!$A$3:$J$58,9,FALSE))","v":""},{"$f":"IF(B27=\"\",\"\",VLOOKUP(L27,Tabella_prezzi!$A$3:$J$58,6,FALSE))","v":""},{"$f":"IF(B27=\"\",\"\",VLOOKUP(L27,Tabella_prezzi!$A$3:$J$58,8,FALSE))","v":""},{"$f":"IF(B27=\"\",\"\",VLOOKUP(L27,Tabella_prezzi!$A$3:$J$58,4,FALSE))","v":""},"",null,null,0,"TS3L1-HDD4TB","L1N05",0,0,0,0,{"$f":"Lotto1_T340_1!L32","v":""},{"$f":"Lotto1_T340_1!F32","v":""},{"$f":"Lotto1_T340_2!L32","v":""},{"$f":"Lotto1_T340_2!F32","v":""},{"$f":"Lotto1_T340_3!L32","v":""},{"$f":"Lotto1_T340_3!F32","v":""},null,{"$f":"ISODD(SUM($J$23:J27))","v":false}]
[null,"",{"$f":"IF(B28=\"\",\"\",VLOOKUP(L28,Tabella_prezzi!$A$3:$J$58,9,FALSE))","v":""},{"$f":"IF(B28=\"\",\"\",VLOOKUP(L28,Tabella_prezzi!$A$3:$J$58,6,FALSE))","v":""},{"$f":"IF(B28=\"\",\"\",VLOOKUP(L28,Tabella_prezzi!$A$3:$J$58,8,FALSE))","v":""},{"$f":"IF(B28=\"\",\"\",VLOOKUP(L28,Tabella_prezzi!$A$3:$J$58,4,FALSE))","v":""},"",null,null,0,"TS3L1-HDD2TB","L1N06",0,0,0,0,{"$f":"Lotto1_T340_1!L35","v":""},{"$f":"Lotto1_T340_1!F35","v":""},{"$f":"Lotto1_T340_2!L35","v":""},{"$f":"Lotto1_T340_2!F35","v":""},{"$f":"Lotto1_T340_3!L35","v":""},{"$f":"Lotto1_T340_3!F35","v":""},null,{"$f":"ISODD(SUM($J$23:J28))","v":false}]
[null,"",{"$f":"IF(B29=\"\",\"\",VLOOKUP(L29,Tabella_prezzi!$A$3:$J$58,9,FALSE))","v":""},{"$f":"IF(B29=\"\",\"\",VLOOKUP(L29,Tabella_prezzi!$A$3:$J$58,6,FALSE))","v":""},{"$f":"IF(B29=\"\",\"\",VLOOKUP(L29,Tabella_prezzi!$A$3:$J$58,8,FALSE))","v":""},{"$f":"IF(B29=\"\",\"\",VLOOKUP(L29,Tabella_prezzi!$A$3:$J$58,4,FALSE))","v":""},"",null,null,0,"TS3L1-HDD1TB","L1N07",0,0,0,0,{"$f":"Lotto1_T340_1!L38","v":""},{"$f":"Lotto1_T340_1!F38","v":""},{"$f":"Lotto1_T340_2!L38","v":""},{"$f":"Lotto1_T340_2!F38","v":""},{"$f":"Lotto1_T340_3!L38","v":""},{"$f":"Lotto1_T340_3!F38","v":""},null,{"$f":"ISODD(SUM($J$23:J29))","v":false}]
[null,"",{"$f":"IF(B30=\"\",\"\",VLOOKUP(L30,Tabella_prezzi!$A$3:$J$58,9,FALSE))","v":""},{"$f":"IF(B30=\"\",\"\",VLOOKUP(L30,Tabella_prezzi!$A$3:$J$58,6,FALSE))","v":""},{"$f":"IF(B30=\"\",\"\",VLOOKUP(L30,Tabella_prezzi!$A$3:$J$58,8,FALSE))","v":""},{"$f":"IF(B30=\"\",\"\",VLOOKUP(L30,Tabella_prezzi!$A$3:$J$58,4,FALSE))","v":""},"",null,null,0,"TS3L1-RI800GB","L1N08",0,0,0,0,{"$f":"Lotto1_T340_1!L41","v":0},{"$f":"Lotto1_T340_1!F41","v":""},{"$f":"Lotto1_T340_2!L41","v":0},{"$f":"Lotto1_T340_2!F41","v":""},{"$f":"Lotto1_T340_3!L41","v":0},{"$f":"Lotto1_T340_3!F41","v":""},null,{"$f":"ISODD(SUM($J$23:J30))","v":false}]
[null,"",{"$f":"IF(B31=\"\",\"\",VLOOKUP(L31,Tabella_prezzi!$A$3:$J$58,9,FALSE))","v":""},{"$f":"IF(B31=\"\",\"\",VLOOKUP(L31,Tabella_prezzi!$A$3:$J$58,6,FALSE))","v":""},{"$f":"IF(B31=\"\",\"\",VLOOKUP(L31,Tabella_prezzi!$A$3:$J$58,8,FALSE))","v":""},{"$f":"IF(B31=\"\",\"\",VLOOKUP(L31,Tabella_prezzi!$A$3:$J$58,4,FALSE))","v":""},"",null,null,0,"TS3L1-RI480GB","L1N09",0,0,0,0,{"$f":"Lotto1_T340_1!L50","v":""},{"$f":"Lotto1_T340_1!F50","v":""},{"$f":"Lotto1_T340_2!L50","v":""},{"$f":"Lotto1_T340_2!F50","v":""},{"$f":"Lotto1_T340_3!L50","v":""},{"$f":"Lotto1_T340_3!F50","v":""},null,{"$f":"ISODD(SUM($J$23:J31))","v":false}]
[null,"",{"$f":"IF(B32=\"\",\"\",VLOOKUP(L32,Tabella_prezzi!$A$3:$J$58,9,FALSE))","v":""},{"$f":"IF(B32=\"\",\"\",VLOOKUP(L32,Tabella_prezzi!$A$3:$J$58,6,FALSE))","v":""},{"$f":"IF(B32=\"\",\"\",VLOOKUP(L32,Tabella_prezzi!$A$3:$J$58,8,FALSE))","v":""},{"$f":"IF(B32=\"\",\"\",VLOOKUP(L32,Tabella_prezzi!$A$3:$J$58,4,FALSE))","v":""},"",null,null,0,"TS3L1-UPS","L1N10",0,0,0,0,{"$f":"Lotto1_T340_1!L53","v":""},{"$f":"Lotto1_T340_1!F53","v":""},{"$f":"Lotto1_T340_2!L53","v":""},{"$f":"Lotto1_T340_2!F53","v":""},{"$f":"Lotto1_T340_3!L53","v":""},{"$f":"Lotto1_T340_3!F53","v":""},null,{"$f":"ISODD(SUM($J$23:J32))","v":false}]
[null,"",{"$f":"IF(B33=\"\",\"\",VLOOKUP(L33,Tabella_prezzi!$A$3:$J$58,9,FALSE))","v":""},{"$f":"IF(B33=\"\",\"\",VLOOKUP(L33,Tabella_prezzi!$A$3:$J$58,6,FALSE))","v":""},{"$f":"IF(B33=\"\",\"\",VLOOKUP(L33,Tabella_prezzi!$A$3:$J$58,8,FALSE))","v":""},{"$f":"IF(B33=\"\",\"\",VLOOKUP(L33,Tabella_prezzi!$A$3:$J$58,4,FALSE))","v":""},"",null,null,0,"TS3L1-GUI","L1N11",0,0,0,0,{"$f":"Lotto1_T340_1!L56","v":""},{"$f":"Lotto1_T340_1!F56","v":""},{"$f":"Lotto1_T340_2!L56","v":""},{"$f":"Lotto1_T340_2!F56","v":""},{"$f":"Lotto1_T340_3!L56","v":""},{"$f":"Lotto1_T340_3!F56","v":""},null,{"$f":"ISODD(SUM($J$23:J33))","v":false}]
[null,"",{"$f":"IF(B34=\"\",\"\",VLOOKUP(L34,Tabella_prezzi!$A$3:$J$58,9,FALSE))","v":""},{"$f":"IF(B34=\"\",\"\",VLOOKUP(L34,Tabella_prezzi!$A$3:$J$58,6,FALSE))","v":""},{"$f":"IF(B34=\"\",\"\",VLOOKUP(L34,Tabella_prezzi!$A$3:$J$58,8,FALSE))","v":""},{"$f":"IF(B34=\"\",\"\",VLOOKUP(L34,Tabella_prezzi!$A$3:$J$58,4,FALSE))","v":""},"",null,null,0,"TS3L1-WINSRVESS","L1N12",0,0,0,0,{"$f":"Lotto1_T340_1!L59","v":""},{"$f":"Lotto1_T340_1!F59","v":""},{"$f":"Lotto1_T340_2!L59","v":""},{"$f":"Lotto1_T340_2!F59","v":""},{"$f":"Lotto1_T340_3!L59","v":""},{"$f":"Lotto1_T340_3!F59","v":""},null,{"$f":"ISODD(SUM($J$23:J34))","v":false}]
[null,"",{"$f":"IF(B35=\"\",\"\",VLOOKUP(L35,Tabella_prezzi!$A$3:$J$58,9,FALSE))","v":""},{"$f":"IF(B35=\"\",\"\",VLOOKUP(L35,Tabella_prezzi!$A$3:$J$58,6,FALSE))","v":""},{"$f":"IF(B35=\"\",\"\",VLOOKUP(L35,Tabella_prezzi!$A$3:$J$58,8,FALSE))","v":""},{"$f":"IF(B35=\"\",\"\",VLOOKUP(L35,Tabella_prezzi!$A$3:$J$58,4,FALSE))","v":""},"",null,null,0,null,"L1N13",0,0,0,0,{"$f":"Lotto1_T340_1!L62","v":"L1N34"},{"$f":"Lotto1_T340_1!F62","v":0},{"$f":"Lotto1_T340_2!L62","v":"L1N34"},{"$f":"Lotto1_T340_2!F62","v":0},{"$f":"Lotto1_T340_3!L62","v":"L1N34"},{"$f":"Lotto1_T340_3!F62","v":0},null,{"$f":"ISODD(SUM($J$23:J35))","v":false}]
[null,"",{"$f":"IF(B36=\"\",\"\",VLOOKUP(L36,Tabella_prezzi!$A$3:$J$58,9,FALSE))","v":""},{"$f":"IF(B36=\"\",\"\",VLOOKUP(L36,Tabella_prezzi!$A$3:$J$58,6,FALSE))","v":""},{"$f":"IF(B36=\"\",\"\",VLOOKUP(L36,Tabella_prezzi!$A$3:$J$58,8,FALSE))","v":""},{"$f":"IF(B36=\"\",\"\",VLOOKUP(L36,Tabella_prezzi!$A$3:$J$58,4,FALSE))","v":""},"",null,null,0,null,"L1N14",0,0,0,0,{"$f":"Lotto1_T340_1!L65","v":"L1N35"},{"$f":"Lotto1_T340_1!F65","v":0},{"$f":"Lotto1_T340_2!L65","v":"L1N35"},{"$f":"Lotto1_T340_2!F65","v":0},{"$f":"Lotto1_T340_3!L65","v":"L1N35"},{"$f":"Lotto1_T340_3!F65","v":0},null,{"$f":"ISODD(SUM($J$23:J36))","v":false}]
[null,"",{"$f":"IF(B37=\"\",\"\",VLOOKUP(L37,Tabella_prezzi!$A$3:$J$58,9,FALSE))","v":""},{"$f":"IF(B37=\"\",\"\",VLOOKUP(L37,Tabella_prezzi!$A$3:$J$58,6,FALSE))","v":""},{"$f":"IF(B37=\"\",\"\",VLOOKUP(L37,Tabella_prezzi!$A$3:$J$58,8,FALSE))","v":""},{"$f":"IF(B37=\"\",\"\",VLOOKUP(L37,Tabella_prezzi!$A$3:$J$58,4,FALSE))","v":""},"",null,null,0,"TS3L1-LINUX","L1N15",0,0,0,0,{"$f":"Lotto1_T340_1!L66","v":"L1N36"},{"$f":"Lotto1_T340_1!F66","v":0},{"$f":"Lotto1_T340_2!L66","v":"L1N36"},{"$f":"Lotto1_T340_2!F66","v":0},{"$f":"Lotto1_T340_3!L66","v":"L1N36"},{"$f":"Lotto1_T340_3!F66","v":0},null,{"$f":"ISODD(SUM($J$23:J37))","v":false}]
[null,"",{"$f":"IF(B38=\"\",\"\",VLOOKUP(L38,Tabella_prezzi!$A$3:$J$58,9,FALSE))","v":""},{"$f":"IF(B38=\"\",\"\",VLOOKUP(L38,Tabella_prezzi!$A$3:$J$58,6,FALSE))","v":""},{"$f":"IF(B38=\"\",\"\",VLOOKUP(L38,Tabella_prezzi!$A$3:$J$58,8,FALSE))","v":""},{"$f":"IF(B38=\"\",\"\",VLOOKUP(L38,Tabella_prezzi!$A$3:$J$58,4,FALSE))","v":""},"",null,null,0,"TS3L1-HDRTNTN","L1N16",0,0,0,0,{"$f":"Lotto1_T340_1!L67","v":"L1N37"},{"$f":"Lotto1_T340_1!F67","v":0},{"$f":"Lotto1_T340_2!L67","v":"L1N37"},{"$f":"Lotto1_T340_2!F67","v":0},{"$f":"Lotto1_T340_3!L67","v":"L1N37"},{"$f":"Lotto1_T340_3!F67","v":0},null,{"$f":"ISODD(SUM($J$23:J38))","v":false}]
[null,"",{"$f":"IF(B39=\"\",\"\",VLOOKUP(L39,Tabella_prezzi!$A$3:$J$58,9,FALSE))","v":""},{"$f":"IF(B39=\"\",\"\",VLOOKUP(L39,Tabella_prezzi!$A$3:$J$58,6,FALSE))","v":""},{"$f":"IF(B39=\"\",\"\",VLOOKUP(L39,Tabella_prezzi!$A$3:$J$58,8,FALSE))","v":""},{"$f":"IF(B39=\"\",\"\",VLOOKUP(L39,Tabella_prezzi!$A$3:$J$58,4,FALSE))","v":""},"",null,null,0,"TS3L1-5Y","L1N17",0,0,0,0,{"$f":"Lotto1_T340_1!L70","v":"L1N26"},{"$f":"Lotto1_T340_1!F70","v":3},{"$f":"Lotto1_T340_2!L70","v":"L1N26"},{"$f":"Lotto1_T340_2!F70","v":3},{"$f":"Lotto1_T340_3!L70","v":"L1N26"},{"$f":"Lotto1_T340_3!F70","v":3},null,{"$f":"ISODD(SUM($J$23:J39))","v":false}]
[null,{"$f":"IF(P40>0,P40,\"\")","v":""},{"$f":"IF(B40=\"\",\"\",VLOOKUP(L40,Tabella_prezzi!$A$3:$J$58,9,FALSE))","v":""},{"$f":"IF(B40=\"\",\"\",VLOOKUP(L40,Tabella_prezzi!$A$3:$J$58,6,FALSE))","v":""},{"$f":"IF(B40=\"\",\"\",VLOOKUP(L40,Tabella_prezzi!$A$3:$J$58,8,FALSE))","v":""},{"$f":"IF(B40=\"\",\"\",VLOOKUP(L40,Tabella_prezzi!$A$3:$J$58,4,FALSE))","v":""},{"$f":"IF(C40=\"\",\"\",F40*B40)","v":""},null,null,0,"TS3L1-HDRTNTN60","L1N19",0,0,0,{"$f":"SUM(M40:O40)","v":0},null,null,null,null,null,null,null,{"$f":"ISODD(SUM($J$23:J40))","v":false}]
[null,"TECNOLOGIE SERVER 3 LOTTO 1 - LISTA ULTERIORI ARTICOLI IN CONVENZIONE (20%) -",null,null,null,null,null,null,null,{"$f":"IF($G$64>0,1,0)","v":0},null,null,null,null,null,null,{"$f":"Lotto1_T340_1!L73","v":"L1N29"},{"$f":"Lotto1_T340_1!F73","v":0},{"$f":"Lotto1_T340_2!L73","v":"L1N29"},{"$f":"Lotto1_T340_2!F73","v":0},{"$f":"Lotto1_T340_3!L73","v":"L1N29"},{"$f":"Lotto1_T340_3!F73","v":0}]
[null,"Quantità","Codice Articolo Produttore","Codice Articolo Convenzione","Descrizione","Costo unitario","Costo complessivo",null,null,{"$f":"IF($G$64>0,1,0)","v":0},null,null,null,null,null,null,{"$f":"Lotto1_T340_1!L74","v":"L1N30"},{"$f":"Lotto1_T340_1!F74","v":0},{"$f":"Lotto1_T340_2!L74","v":"L1N30"},{"$f":"Lotto1_T340_2!F74","v":0},{"$f":"Lotto1_T340_3!L74","v":"L1N30"},{"$f":"Lotto1_T340_3!F74","v":0}]
[null,"",{"$f":"IF(B43=\"\",\"\",VLOOKUP(L43,Tabella_prezzi!$A$3:$J$58,9,FALSE))","v":""},{"$f":"IF(B43=\"\",\"\",VLOOKUP(L43,Tabella_prezzi!$A$3:$J$58,6,FALSE))","v":""},{"$f":"IF(B43=\"\",\"\",VLOOKUP(L43,Tabella_prezzi!$A$3:$J$58,8,FALSE))","v":""},{"$f":"IF(B43=\"\",\"\",VLOOKUP(L43,Tabella_prezzi!$A$3:$J$58,4,FALSE))","v":""},"",null,null,{"$f":"IF(B43=\"\",0,1)","v":0},"TS3L1-PSUDVDBZL","L1N18",{"$f":"COUNTIF($Q$23:$Q$53,L43)*$M$22","v":0},{"$f":"COUNTIF($S$23:$S$53,L43)*$N$22","v":0},{"$f":"COUNTIF($U$23:$U$53,L43)*$O$22","v":0},0,{"$f":"Lotto1_T340_1!L75","v":"L1N31"},{"$f":"Lotto1_T340_1!F75","v":0},{"$f":"Lotto1_T340_2!L75","v":"L1N31"},{"$f":"Lotto1_T340_2!F75","v":0},{"$f":"Lotto1_T340_3!L75","v":"L1N31"},{"$f":"Lotto1_T340_3!F75","v":0},null,{"$f":"ISODD(SUM($J$23:J43))","v":false}]
[null,null,null,null,null,null,null,null,null,0,"TS3L1-LAN1QP",null,null,null,null,null,{"$f":"Lotto1_T340_1!L76","v":"L1N32"},{"$f":"Lotto1_T340_1!F76","v":0},{"$f":"Lotto1_T340_2!L76","v":"L1N32"},{"$f":"Lotto1_T340_2!F76","v":0},{"$f":"Lotto1_T340_3!L76","v":"L1N32"},{"$f":"Lotto1_T340_3!F76","v":0},null,{"$f":"ISODD(SUM($J$23:J44))","v":false}]
[null,"",{"$f":"IF(B45=\"\",\"\",VLOOKUP(L45,Tabella_prezzi!$A$3:$J$58,9,FALSE))","v":""},{"$f":"IF(B45=\"\",\"\",VLOOKUP(L45,Tabella_prezzi!$A$3:$J$58,6,FALSE))","v":""},{"$f":"IF(B45=\"\",\"\",VLOOKUP(L45,Tabella_prezzi!$A$3:$J$58,8,FALSE))","v":""},{"$f":"IF(B45=\"\",\"\",VLOOKUP(L45,Tabella_prezzi!$A$3:$J$58,4,FALSE))","v":""},"",null,null,0,"TS3L1-I3502P","L1N20",{"$f":"COUNTIF($Q$23:$Q$53,L45)*$M$22","v":0},{"$f":"COUNTIF($S$23:$S$53,L45)*$N$22","v":0},{"$f":"COUNTIF($U$23:$U$53,L45)*$O$22","v":0},0,{"$f":"Lotto1_T340_1!L77","v":"L1N33"},{"$f":"Lotto1_T340_1!F77","v":0},{"$f":"Lotto1_T340_2!L77","v":"L1N33"},{"$f":"Lotto1_T340_2!F77","v":0},{"$f":"Lotto1_T340_3!L77","v":"L1N33"},{"$f":"Lotto1_T340_3!F77","v":0},null,{"$f":"ISODD(SUM($J$23:J45))","v":false}]
[null,"",{"$f":"IF(B46=\"\",\"\",VLOOKUP(L46,Tabella_prezzi!$A$3:$J$58,9,FALSE))","v":""},{"$f":"IF(B46=\"\",\"\",VLOOKUP(L46,Tabella_prezzi!$A$3:$J$58,6,FALSE))","v":""},{"$f":"IF(B46=\"\",\"\",VLOOKUP(L46,Tabella_prezzi!$A$3:$J$58,8,FALSE))","v":""},{"$f":"IF(B46=\"\",\"\",VLOOKUP(L46,Tabella_prezzi!$A$3:$J$58,4,FALSE))","v":""},"",null,null,0,"TS3L1-I3504P","L1N21",0,0,0,0,null,{"$f":"Lotto1_T340_1!F80","v":""},null,{"$f":"Lotto1_T340_2!F80","v":""},null,{"$f":"Lotto1_T340_3!F80","v":0},null,{"$f":"ISODD(SUM($J$23:J46))","v":false}]
[null,"",{"$f":"IF(B47=\"\",\"\",VLOOKUP(L47,Tabella_prezzi!$A$3:$J$58,9,FALSE))","v":""},{"$f":"IF(B47=\"\",\"\",VLOOKUP(L47,Tabella_prezzi!$A$3:$J$58,6,FALSE))","v":""},{"$f":"IF(B47=\"\",\"\",VLOOKUP(L47,Tabella_prezzi!$A$3:$J$58,8,FALSE))","v":""},{"$f":"IF(B47=\"\",\"\",VLOOKUP(L47,Tabella_prezzi!$A$3:$J$58,4,FALSE))","v":""},"",null,null,0,"TS3L1-X550","L1N22",0,0,0,0,null,{"$f":"Lotto1_T340_1!F83","v":""},null,{"$f":"Lotto1_T340_2!F83","v":""},null,{"$f":"Lotto1_T340_3!F83","v":""},null,{"$f":"ISODD(SUM($J$23:J47))","v":false}]
[null,"",{"$f":"IF(B48=\"\",\"\",VLOOKUP(L48,Tabella_prezzi!$A$3:$J$58,9,FALSE))","v":""},{"$f":"IF(B48=\"\",\"\",VLOOKUP(L48,Tabella_prezzi!$A$3:$J$58,6,FALSE))","v":""},{"$f":"IF(B48=\"\",\"\",VLOOKUP(L48,Tabella_prezzi!$A$3:$J$58,8,FALSE))","v":""},{"$f":"IF(B48=\"\",\"\",VLOOKUP(L48,Tabella_prezzi!$A$3:$J$58,4,FALSE))","v":""},"",null,null,0,"TS3L1-X710","L1N23",0,0,0,0,{"$f":"Lotto1_T340_1!L86","v":""},{"$f":"Lotto1_T340_1!F86","v":""},{"$f":"Lotto1_T340_2!L86","v":""},{"$f":"Lotto1_T340_2!F86","v":""},{"$f":"Lotto1_T340_3!L86","v":""},{"$f":"Lotto1_T340_3!F86","v":""},null,{"$f":"ISODD(SUM($J$23:J48))","v":false}]
[null,"",{"$f":"IF(B49=\"\",\"\",VLOOKUP(L49,Tabella_prezzi!$A$3:$J$58,9,FALSE))","v":""},{"$f":"IF(B49=\"\",\"\",VLOOKUP(L49,Tabella_prezzi!$A$3:$J$58,6,FALSE))","v":""},{"$f":"IF(B49=\"\",\"\",VLOOKUP(L49,Tabella_prezzi!$A$3:$J$58,8,FALSE))","v":""},{"$f":"IF(B49=\"\",\"\",VLOOKUP(L49,Tabella_prezzi!$A$3:$J$58,4,FALSE))","v":""},"",null,null,0,"TS3L1-E12002","L1N24",0,0,0,0,{"$f":"Lotto1_T340_1!L89","v":""},{"$f":"Lotto1_T340_1!F89","v":""},{"$f":"Lotto1_T340_2!L89","v":""},{"$f":"Lotto1_T340_2!F89","v":""},{"$f":"Lotto1_T340_3!L89","v":""},{"$f":"Lotto1_T340_3!F89","v":""},null,{"$f":"ISODD(SUM($J$23:J49))","v":false}]
[null,"",{"$f":"IF(B50=\"\",\"\",VLOOKUP(L50,Tabella_prezzi!$A$3:$J$58,9,FALSE))","v":""},{"$f":"IF(B50=\"\",\"\",VLOOKUP(L50,Tabella_prezzi!$A$3:$J$58,6,FALSE))","v":""},{"$f":"IF(B50=\"\",\"\",VLOOKUP(L50,Tabella_prezzi!$A$3:$J$58,8,FALSE))","v":""},{"$f":"IF(B50=\"\",\"\",VLOOKUP(L50,Tabella_prezzi!$A$3:$J$58,4,FALSE))","v":""},"",null,null,0,"TS3L1-CtrlSAS","L1N25",0,0,0,0,{"$f":"Lotto1_T340_1!L93","v":""},{"$f":"Lotto1_T340_1!F93","v":""},{"$f":"Lotto1_T340_2!L93","v":""},{"$f":"Lotto1_T340_2!F93","v":""},{"$f":"Lotto1_T340_3!L93","v":""},{"$f":"Lotto1_T340_3!F93","v":""},null,{"$f":"ISODD(SUM($J$23:J50))","v":false}]
[null,"",{"$f":"IF(B51=\"\",\"\",VLOOKUP(L51,Tabella_prezzi!$A$3:$J$58,9,FALSE))","v":""},{"$f":"IF(B51=\"\",\"\",VLOOKUP(L51,Tabella_prezzi!$A$3:$J$58,6,FALSE))","v":""},{"$f":"IF(B51=\"\",\"\",VLOOKUP(L51,Tabella_prezzi!$A$3:$J$58,8,FALSE))","v":""},{"$f":"IF(B51=\"\",\"\",VLOOKUP(L51,Tabella_prezzi!$A$3:$J$58,4,FALSE))","v":""},"",null,null,0,"TS3L1-RJ453M","L1N26",{"$f":"R39*$M$22","v":0},{"$f":"T39*$N$22","v":0},{"$f":"V39*$O$22","v":0},0,null,null,null,null,null,null,null,{"$f":"ISODD(SUM($J$23:J51))","v":false}]
[null,{"$f":"IF(P52>0,P52,\"\")","v":""},{"$f":"IF(B52=\"\",\"\",VLOOKUP(L52,Tabella_prezzi!$A$3:$J$58,9,FALSE))","v":""},{"$f":"IF(B52=\"\",\"\",VLOOKUP(L52,Tabella_prezzi!$A$3:$J$58,6,FALSE))","v":""},{"$f":"IF(B52=\"\",\"\",VLOOKUP(L52,Tabella_prezzi!$A$3:$J$58,8,FALSE))","v":""},{"$f":"IF(B52=\"\",\"\",VLOOKUP(L52,Tabella_prezzi!$A$3:$J$58,4,FALSE))","v":""},{"$f":"IF(C52=\"\",\"\",F52*B52)","v":""},null,null,0,"TS3L1-BEZEL","L1N27",{"$f":"COUNTIF($Q$23:$Q$53,L52)*$M$22","v":0},{"$f":"COUNTIF($S$23:$S$53,L52)*$N$22","v":0},{"$f":"COUNTIF($U$23:$U$53,L52)*$O$22","v":0},0,null,null,null,null,null,null,null,{"$f":"ISODD(SUM($J$23:J52))","v":false}]
[null,"",{"$f":"IF(B53=\"\",\"\",VLOOKUP(L53,Tabella_prezzi!$A$3:$J$58,9,FALSE))","v":""},{"$f":"IF(B53=\"\",\"\",VLOOKUP(L53,Tabella_prezzi!$A$3:$J$58,6,FALSE))","v":""},{"$f":"IF(B53=\"\",\"\",VLOOKUP(L53,Tabella_prezzi!$A$3:$J$58,8,FALSE))","v":""},{"$f":"IF(B53=\"\",\"\",VLOOKUP(L53,Tabella_prezzi!$A$3:$J$58,4,FALSE))","v":""},"",null,null,0,"TS3L1-DVD","L1N28",{"$f":"COUNTIF($Q$23:$Q$53,L53)*$M$22","v":0},{"$f":"COUNTIF($S$23:$S$53,L53)*$N$22","v":0},{"$f":"COUNTIF($U$23:$U$53,L53)*$O$22","v":0},0,{"$f":"Lotto1_T340_1!L96","v":""},{"$f":"Lotto1_T340_1!F96","v":""},{"$f":"Lotto1_T340_2!L96","v":""},{"$f":"Lotto1_T340_2!F96","v":""},{"$f":"Lotto1_T340_3!L96","v":""},{"$f":"Lotto1_T340_3!F96","v":""},null,{"$f":"ISODD(SUM($J$23:J53))","v":false}]
[null,"",{"$f":"IF(B54=\"\",\"\",VLOOKUP(L54,Tabella_prezzi!$A$3:$J$58,9,FALSE))","v":""},{"$f":"IF(B54=\"\",\"\",VLOOKUP(L54,Tabella_prezzi!$A$3:$J$58,6,FALSE))","v":""},{"$f":"IF(B54=\"\",\"\",VLOOKUP(L54,Tabella_prezzi!$A$3:$J$58,8,FALSE))","v":""},{"$f":"IF(B54=\"\",\"\",VLOOKUP(L54,Tabella_prezzi!$A$3:$J$58,4,FALSE))","v":""},"",null,null,0,"TS3L1-SAS2M","L1N29",{"$f":"R41*$M$22","v":0},{"$f":"T41*$N$22","v":0},{"$f":"V41*$O$22","v":0},{"$f":"SUM(M54:O54)","v":0},null,null,null,null,null,null,null,{"$f":"ISODD(SUM($J$23:J54))","v":false}]
[null,"",{"$f":"IF(B55=\"\",\"\",VLOOKUP(L55,Tabella_prezzi!$A$3:$J$58,9,FALSE))","v":""},{"$f":"IF(B55=\"\",\"\",VLOOKUP(L55,Tabella_prezzi!$A$3:$J$58,6,FALSE))","v":""},{"$f":"IF(B55=\"\",\"\",VLOOKUP(L55,Tabella_prezzi!$A$3:$J$58,8,FALSE))","v":""},{"$f":"IF(B55=\"\",\"\",VLOOKUP(L55,Tabella_prezzi!$A$3:$J$58,4,FALSE))","v":""},"",null,null,0,"TS3L1-SAS6M","L1N30",{"$f":"R42*$M$22","v":0},{"$f":"T42*$N$22","v":0},{"$f":"V42*$O$22","v":0},{"$f":"SUM(M55:O55)","v":0},null,null,null,null,null,null,null,{"$f":"ISODD(SUM($J$23:J55))","v":false}]
[null,"",{"$f":"IF(B56=\"\",\"\",VLOOKUP(L56,Tabella_prezzi!$A$3:$J$58,9,FALSE))","v":""},{"$f":"IF(B56=\"\",\"\",VLOOKUP(L56,Tabella_prezzi!$A$3:$J$58,6,FALSE))","v":""},{"$f":"IF(B56=\"\",\"\",VLOOKUP(L56,Tabella_prezzi!$A$3:$J$58,8,FALSE))","v":""},{"$f":"IF(B56=\"\",\"\",VLOOKUP(L56,Tabella_prezzi!$A$3:$J$58,4,FALSE))","v":""},"",null,null,0,"TS3L1-SAS05M","L1N31",0,0,0,0,null,null,null,null,null,null,null,{"$f":"ISODD(SUM($J$23:J56))","v":false}]
[null,"",{"$f":"IF(B57=\"\",\"\",VLOOKUP(L57,Tabella_prezzi!$A$3:$J$58,9,FALSE))","v":""},{"$f":"IF(B57=\"\",\"\",VLOOKUP(L57,Tabella_prezzi!$A$3:$J$58,6,FALSE))","v":""},{"$f":"IF(B57=\"\",\"\",VLOOKUP(L57,Tabella_prezzi!$A$3:$J$58,8,FALSE))","v":""},{"$f":"IF(B57=\"\",\"\",VLOOKUP(L57,Tabella_prezzi!$A$3:$J$58,4,FALSE))","v":""},"",null,null,0,"TS3L1-SAS2MB","L1N32",0,0,0,0,null,null,null,null,null,null,null,{"$f":"ISODD(SUM($J$23:J57))","v":false}]
[null,"",{"$f":"IF(B58=\"\",\"\",VLOOKUP(L58,Tabella_prezzi!$A$3:$J$58,9,FALSE))","v":""},{"$f":"IF(B58=\"\",\"\",VLOOKUP(L58,Tabella_prezzi!$A$3:$J$58,6,FALSE))","v":""},{"$f":"IF(B58=\"\",\"\",VLOOKUP(L58,Tabella_prezzi!$A$3:$J$58,8,FALSE))","v":""},{"$f":"IF(B58=\"\",\"\",VLOOKUP(L58,Tabella_prezzi!$A$3:$J$58,4,FALSE))","v":""},"",null,null,0,"TS3L1-SAS4M","L1N33",0,0,0,0,null,null,null,null,null,null,null,{"$f":"ISODD(SUM($J$23:J58))","v":false}]
[null,"",{"$f":"IF(B59=\"\",\"\",VLOOKUP(L59,Tabella_prezzi!$A$3:$J$58,9,FALSE))","v":""},{"$f":"IF(B59=\"\",\"\",VLOOKUP(L59,Tabella_prezzi!$A$3:$J$58,6,FALSE))","v":""},{"$f":"IF(B59=\"\",\"\",VLOOKUP(L59,Tabella_prezzi!$A$3:$J$58,8,FALSE))","v":""},{"$f":"IF(B59=\"\",\"\",VLOOKUP(L59,Tabella_prezzi!$A$3:$J$58,4,FALSE))","v":""},"",null,null,0,"TS3L1-SFPALL","L1N34",{"$f":"R35*$M$22","v":0},{"$f":"T35*$N$22","v":0},{"$f":"V35*$O$22","v":0},{"$f":"SUM(M59:O59)","v":0},null,null,null,null,null,null,null,{"$f":"ISODD(SUM($J$23:J59))","v":false}]
[null,"",{"$f":"IF(B60=\"\",\"\",VLOOKUP(L60,Tabella_prezzi!$A$3:$J$58,9,FALSE))","v":""},{"$f":"IF(B60=\"\",\"\",VLOOKUP(L60,Tabella_prezzi!$A$3:$J$58,6,FALSE))","v":""},{"$f":"IF(B60=\"\",\"\",VLOOKUP(L60,Tabella_prezzi!$A$3:$J$58,8,FALSE))","v":""},{"$f":"IF(B60=\"\",\"\",VLOOKUP(L60,Tabella_prezzi!$A$3:$J$58,4,FALSE))","v":""},"",null,null,0,"TS3L1-DAC1M","L1N35",{"$f":"R36*$M$22","v":0},{"$f":"T36*$N$22","v":0},{"$f":"V36*$O$22","v":0},{"$f":"SUM(M60:O60)","v":0},null,null,null,null,null,null,null,{"$f":"ISODD(SUM($J$23:J60))","v":false}]
[null,"",{"$f":"IF(B61=\"\",\"\",VLOOKUP(L61,Tabella_prezzi!$A$3:$J$58,9,FALSE))","v":""},{"$f":"IF(B61=\"\",\"\",VLOOKUP(L61,Tabella_prezzi!$A$3:$J$58,6,FALSE))","v":""},{"$f":"IF(B61=\"\",\"\",VLOOKUP(L61,Tabella_prezzi!$A$3:$J$58,8,FALSE))","v":""},{"$f":"IF(B61=\"\",\"\",VLOOKUP(L61,Tabella_prezzi!$A$3:$J$58,4,FALSE))","v":""},"",null,null,0,"TS3L1-DAC3M","L1N36",{"$f":"R37*$M$22","v":0},{"$f":"T37*$N$22","v":0},{"$f":"V37*$O$22","v":0},0,null,null,null,null,null,null,null,{"$f":"ISODD(SUM($J$23:J61))","v":false}]
[null,"",{"$f":"IF(B62=\"\",\"\",VLOOKUP(L62,Tabella_prezzi!$A$3:$J$58,9,FALSE))","v":""},{"$f":"IF(B62=\"\",\"\",VLOOKUP(L62,Tabella_prezzi!$A$3:$J$58,6,FALSE))","v":""},{"$f":"IF(B62=\"\",\"\",VLOOKUP(L62,Tabella_prezzi!$A$3:$J$58,8,FALSE))","v":""},{"$f":"IF(B62=\"\",\"\",VLOOKUP(L62,Tabella_prezzi!$A$3:$J$58,4,FALSE))","v":""},"",null,null,0,"TS3L1-DAC5M","L1N37",{"$f":"R38*$M$22","v":0},{"$f":"T38*$N$22","v":0},{"$f":"V38*$O$22","v":0},0,null,null,null,null,null,null,null,{"$f":"ISODD(SUM($J$23:J62))","v":false}]
[null,"Convenzione",null,null,null,null,{"$f":"SUM(G23:G40)","v":0},null,null,{"$f":"IF(G63=0,0,1)","v":0}]
[null,"Valore economico 20% consentito",null,{"$f":"G63/100*20","v":0},"Ulteriori componenti opzionali (20%)",null,{"$f":"SUM(G43:G62)","v":0},null,null,{"$f":"IF(G64=0,0,1)","v":0}]
[null,"Totale iva esclusa",null,null,null,null,{"$f":"G64+G63","v":0},null,null,0]
[null,"I.V.A.",null,null,null,null,{"$f":"G65/100*22","v":0},null,null,0]
[null,"TOTALE ORDINE",null,null,null,null,{"$f":"G65+G66","v":0},null,null,0]
[null,null,null,null,null,null,null,null,null,1]

{"sheet":"Configurazione","index":6,"n_rows":64,"n_cols":24,"rows_kept":64,"cut":false,"hidden":false,"merged":[[57,1,57,8],[59,1,59,3],[59,6,59,8],[42,1,42,2],[43,1,54,2],[42,4,42,5],[43,4,54,5],[42,7,42,8],[43,7,54,8]]}
[null,null,null,null,null,null,null,null,null,null,null,null,null,null,null,null,null,null,null,null,null,1]
[null,{"$f":"Riepilogo!M22","v":0},"PowerEdge T340 Configurazione 1",null,{"$f":"Riepilogo!N22","v":0},"PowerEdge T340 Configurazione 2",null,{"$f":"Riepilogo!O22","v":0},"PowerEdge T340 Configurazione 3",null,null,null,null,null,null,null,null,null,null,null,null,1]
[null,null,null,null,null,null,null,null,null,null,null,null,null,null,null,null,null,null,null,null,null,{"$f":"IF($U$4>0,1,0)","v":0}]
[null,{"$f":"IF(Riepilogo!M23>0,Riepilogo!M23/$B$2,\"\")","v":""},{"$f":"IF(B4=\"\",\"\",Riepilogo!K23)","v":""},null,{"$f":"IF(Riepilogo!N23>0,Riepilogo!N23/$E$2,\"\")","v":""},{"$f":"IF(E4=\"\",\"\",Riepilogo!K23)","v":""},null,{"$f":"IF(Riepilogo!O23>0,Riepilogo!O23/$H$2,\"\")","v":""},{"$f":"IF(H4=\"\",\"\",Riepilogo!K23)","v":""},null,null,{"$f":"IF(B4=\"\",0,B4)","v":0},null,null,{"$f":"IF(E4=\"\",0,E4)","v":0},null,null,{"$f":"IF(H4=\"\",0,H4)","v":0},null,null,{"$f":"SUM(L4:T4)","v":0},{"$f":"IF(U4>0,1,0)","v":0},{"$f":"ISODD(V4)","v":false}]
[null,{"$f":"IF(Riepilogo!M24>0,Riepilogo!M24/$B$2,\"\")","v":""},{"$f":"IF(B5=\"\",\"\",Riepilogo!K24)","v":""},null,{"$f":"IF(Riepilogo!N24>0,Riepilogo!N24/$E$2,\"\")","v":""},{"$f":"IF(E5=\"\",\"\",Riepilogo!K24)","v":""},null,{"$f":"IF(Riepilogo!O24>0,Riepilogo!O24/$H$2,\"\")","v":""},{"$f":"IF(H5=\"\",\"\",Riepilogo!K24)","v":""},null,null,{"$f":"IF(B5=\"\",0,B5)","v":0},null,null,{"$f":"IF(E5=\"\",0,E5)","v":0},null,null,{"$f":"IF(H5=\"\",0,H5)","v":0},null,null,{"$f":"SUM(L5:T5)","v":0},{"$f":"IF(U5>0,1,0)","v":0},{"$f":"ISODD(SUM($V$4:V5))","v":false}]
[null,{"$f":"IF(Riepilogo!M25>0,Riepilogo!M25/$B$2,\"\")","v":""},{"$f":"IF(B6=\"\",\"\",Riepilogo!K25)","v":""},null,{"$f":"IF(Riepilogo!N25>0,Riepilogo!N25/$E$2,\"\")","v":""},{"$f":"IF(E6=\"\",\"\",Riepilogo!K25)","v":""},null,{"$f":"IF(Riepilogo!O25>0,Riepilogo!O25/$H$2,\"\")","v":""},{"$f":"IF(H6=\"\",\"\",Riepilogo!K25)","v":""},null,null,0,null,null,0,null,null,0,null,null,0,0,{"$f":"ISODD(SUM($V$4:V6))","v":false}]
[null,{"$f":"IF(Riepilogo!M26>0,Riepilogo!M26/$B$2,\"\")","v":""},{"$f":"IF(B7=\"\",\"\",Riepilogo!K26)","v":""},null,{"$f":"IF(Riepilogo!N26>0,Riepilogo!N26/$E$2,\"\")","v":""},{"$f":"IF(E7=\"\",\"\",Riepilogo!K26)","v":""},null,{"$f":"IF(Riepilogo!O26>0,Riepilogo!O26/$H$2,\"\")","v":""},{"$f":"IF(H7=\"\",\"\",Riepilogo!K26)","v":""},null,null,0,null,null,0,null,null,0,null,null,0,0,{"$f":"ISODD(SUM($V$4:V7))","v":false}]
[null,{"$f":"IF(Riepilogo!M27>0,Riepilogo!M27/$B$2,\"\")","v":""},{"$f":"IF(B8=\"\",\"\",Riepilogo!K27)","v":""},null,{"$f":"IF(Riepilogo!N27>0,Riepilogo!N27/$E$2,\"\")","v":""},{"$f":"IF(E8=\"\",\"\",Riepilogo!K27)","v":""},null,{"$f":"IF(Riepilogo!O27>0,Riepilogo!O27/$H$2,\"\")","v":""},{"$f":"IF(H8=\"\",\"\",Riepilogo!K27)","v":""},null,null,0,null,null,0,null,null,0,null,null,0,0,{"$f":"ISODD(SUM($V$4:V8))","v":false}]
[null,{"$f":"IF(Riepilogo!M28>0,Riepilogo!M28/$B$2,\"\")","v":""},{"$f":"IF(B9=\"\",\"\",Riepilogo!K28)","v":""},null,{"$f":"IF(Riepilogo!N28>0,Riepilogo!N28/$E$2,\"\")","v":""},{"$f":"IF(E9=\"\",\"\",Riepilogo!K28)","v":""},null,{"$f":"IF(Riepilogo!O28>0,Riepilogo!O28/$H$2,\"\")","v":""},{"$f":"IF(H9=\"\",\"\",Riepilogo!K28)","v":""},null,null,0,null,null,0,null,null,0,null,null,0,0,{"$f":"ISODD(SUM($V$4:V9))","v":false}]
[null,{"$f":"IF(Riepilogo!M29>0,Riepilogo!M29/$B$2,\"\")","v":""},{"$f":"IF(B10=\"\",\"\",Riepilogo!K29)","v":""},null,{"$f":"IF(Riepilogo!N29>0,Riepilogo!N29/$E$2,\"\")","v":""},{"$f":"IF(E10=\"\",\"\",Riepilogo!K29)","v":""},null,{"$f":"IF(Riepilogo!O29>0,Riepilogo!O29/$H$2,\"\")","v":""},{"$f":"IF(H10=\"\",\"\",Riepilogo!K29)","v":""},null,null,0,null,null,0,null,null,0,null,null,0,0,{"$f":"ISODD(SUM($V$4:V10))","v":false}]
[null,{"$f":"IF(Riepilogo!M30>0,Riepilogo!M30/$B$2,\"\")","v":""},{"$f":"IF(B11=\"\",\"\",Riepilogo!K30)","v":""},null,{"$f":"IF(Riepilogo!N30>0,Riepilogo!N30/$E$2,\"\")","v":""},{"$f":"IF(E11=\"\",\"\",Riepilogo!K30)","v":""},null,{"$f":"IF(Riepilogo!O30>0,Riepilogo!O30/$H$2,\"\")","v":""},{"$f":"IF(H11=\"\",\"\",Riepilogo!K30)","v":""},null,null,0,null,null,0,null,null,0,null,null,0,0,{"$f":"ISODD(SUM($V$4:V11))","v":false}]
[null,{"$f":"IF(Riepilogo!M31>0,Riepilogo!M31/$B$2,\"\")","v":""},{"$f":"IF(B12=\"\",\"\",Riepilogo!K31)","v":""},null,{"$f":"IF(Riepilogo!N31>0,Riepilogo!N31/$E$2,\"\")","v":""},{"$f":"IF(E12=\"\",\"\",Riepilogo!K31)","v":""},null,{"$f":"IF(Riepilogo!O31>0,Riepilogo!O31/$H$2,\"\")","v":""},{"$f":"IF(H12=\"\",\"\",Riepilogo!K31)","v":""},null,null,0,null,null,0,null,null,0,null,null,0,0,{"$f":"ISODD(SUM($V$4:V12))","v":false}]
[null,{"$f":"IF(Riepilogo!M32>0,Riepilogo!M32/$B$2,\"\")","v":""},{"$f":"IF(B13=\"\",\"\",Riepilogo!K32)","v":""},null,{"$f":"IF(Riepilogo!N32>0,Riepilogo!N32/$E$2,\"\")","v":""},{"$f":"IF(E13=\"\",\"\",Riepilogo!K32)","v":""},null,{"$f":"IF(Riepilogo!O32>0,Riepilogo!O32/$H$2,\"\")","v":""},{"$f":"IF(H13=\"\",\"\",Riepilogo!K32)","v":""},null,null,0,null,null,0,null,null,0,null,null,0,0,{"$f":"ISODD(SUM($V$4:V13))","v":false}]
[null,{"$f":"IF(Riepilogo!M33>0,Riepilogo!M33/$B$2,\"\")","v":""},{"$f":"IF(B14=\"\",\"\",Riepilogo!K33)","v":""},null,{"$f":"IF(Riepilogo!N33>0,Riepilogo!N33/$E$2,\"\")","v":""},{"$f":"IF(E14=\"\",\"\",Riepilogo!K33)","v":""},null,{"$f":"IF(Riepilogo!O33>0,Riepilogo!O33/$H$2,\"\")","v":""},{"$f":"IF(H14=\"\",\"\",Riepilogo!K33)","v":""},null,null,0,null,null,0,null,null,0,null,null,0,0,{"$f":"ISODD(SUM($V$4:V14))","v":false}]
[null,{"$f":"IF(Riepilogo!M34>0,Riepilogo!M34/$B$2,\"\")","v":""},{"$f":"IF(B15=\"\",\"\",Riepilogo!K34)","v":""},null,{"$f":"IF(Riepilogo!N34>0,Riepilogo!N34/$E$2,\"\")","v":""},{"$f":"IF(E15=\"\",\"\",Riepilogo!K34)","v":""},null,{"$f":"IF(Riepilogo!O34>0,Riepilogo!O34/$H$2,\"\")","v":""},{"$f":"IF(H15=\"\",\"\",Riepilogo!K34)","v":""},null,null,0,null,null,0,null,null,0,null,null,0,0,{"$f":"ISODD(SUM($V$4:V15))","v":false}]
[null,{"$f":"IF(Riepilogo!M35>0,Riepilogo!M35/$B$2,\"\")","v":""},{"$f":"IF(B16=\"\",\"\",Riepilogo!K35)","v":""},null,{"$f":"IF(Riepilogo!N35>0,Riepilogo!N35/$E$2,\"\")","v":""},{"$f":"IF(E16=\"\",\"\",Riepilogo!K35)","v":""},null,{"$f":"IF(Riepilogo!O35>0,Riepilogo!O35/$H$2,\"\")","v":""},{"$f":"IF(H16=\"\",\"\",Riepilogo!K35)","v":""},null,null,0,null,null,0,null,null,0,null,null,0,0,{"$f":"ISODD(SUM($V$4:V16))","v":false}]
[null,{"$f":"IF(Riepilogo!M36>0,Riepilogo!M36/$B$2,\"\")","v":""},{"$f":"IF(B17=\"\",\"\",Riepilogo!K36)","v":""},null,{"$f":"IF(Riepilogo!N36>0,Riepilogo!N36/$E$2,\"\")","v":""},{"$f":"IF(E17=\"\",\"\",Riepilogo!K36)","v":""},null,{"$f":"IF(Riepilogo!O36>0,Riepilogo!O36/$H$2,\"\")","v":""},{"$f":"IF(H17=\"\",\"\",Riepilogo!K36)","v":""},null,null,0,null,null,0,null,null,0,null,null,0,0,{"$f":"ISODD(SUM($V$4:V17))","v":false}]
[null,{"$f":"IF(Riepilogo!M37>0,Riepilogo!M37/$B$2,\"\")","v":""},{"$f":"IF(B18=\"\",\"\",Riepilogo!K37)","v":""},null,{"$f":"IF(Riepilogo!N37>0,Riepilogo!N37/$E$2,\"\")","v":""},{"$f":"IF(E18=\"\",\"\",Riepilogo!K37)","v":""},null,{"$f":"IF(Riepilogo!O37>0,Riepilogo!O37/$H$2,\"\")","v":""},{"$f":"IF(H18=\"\",\"\",Riepilogo!K37)","v":""},null,null,0,null,null,0,null,null,0,null,null,0,0,{"$f":"ISODD(SUM($V$4:V18))","v":false}]
[null,{"$f":"IF(Riepilogo!M38>0,Riepilogo!M38/$B$2,\"\")","v":""},{"$f":"IF(B19=\"\",\"\",Riepilogo!K38)","v":""},null,{"$f":"IF(Riepilogo!N38>0,Riepilogo!N38/$E$2,\"\")","v":""},{"$f":"IF(E19=\"\",\"\",Riepilogo!K38)","v":""},null,{"$f":"IF(Riepilogo!O38>0,Riepilogo!O38/$H$2,\"\")","v":""},{"$f":"IF(H19=\"\",\"\",Riepilogo!K38)","v":""},null,null,0,null,null,0,null,null,0,null,null,0,0,{"$f":"ISODD(SUM($V$4:V19))","v":false}]
[null,{"$f":"IF(Riepilogo!M39>0,Riepilogo!M39/$B$2,\"\")","v":""},{"$f":"IF(B20=\"\",\"\",Riepilogo!K39)","v":""},null,{"$f":"IF(Riepilogo!N39>0,Riepilogo!N39/$E$2,\"\")","v":""},{"$f":"IF(E20=\"\",\"\",Riepilogo!K39)","v":""},null,{"$f":"IF(Riepilogo!O39>0,Riepilogo!O39/$H$2,\"\")","v":""},{"$f":"IF(H20=\"\",\"\",Riepilogo!K39)","v":""},null,null,0,null,null,0,null,null,0,null,null,0,0,{"$f":"ISODD(SUM($V$4:V20))","v":false}]
[null,{"$f":"IF(Riepilogo!M40>0,Riepilogo!M40/$B$2,\"\")","v":""},{"$f":"IF(B21=\"\",\"\",Riepilogo!K40)","v":""},null,{"$f":"IF(Riepilogo!N40>0,Riepilogo!N40/$E$2,\"\")","v":""},{"$f":"IF(E21=\"\",\"\",Riepilogo!K40)","v":""},null,{"$f":"IF(Riepilogo!O40>0,Riepilogo!O40/$H$2,\"\")","v":""},{"$f":"IF(H21=\"\",\"\",Riepilogo!K40)","v":""},null,null,{"$f":"IF(B21=\"\",0,B21)","v":0},null,null,{"$f":"IF(E21=\"\",0,E21)","v":0},null,null,{"$f":"IF(H21=\"\",0,H21)","v":0},null,null,{"$f":"SUM(L21:T21)","v":0},{"$f":"IF(U21>0,1,0)","v":0},{"$f":"ISODD(SUM($V$4:V21))","v":false}]
[null,{"$f":"IF(Riepilogo!M43>0,Riepilogo!M43/$B$2,\"\")","v":""},{"$f":"IF(B22=\"\",\"\",CONCATENATE(Riepilogo!C43,\" - \",Riepilogo!K43))","v":""},null,{"$f":"IF(Riepilogo!N43>0,Riepilogo!N43/$E$2,\"\")","v":""},{"$f":"IF(E22=\"\",\"\",CONCATENATE(Riepilogo!C43,\" - \",Riepilogo!K43))","v":""},null,{"$f":"IF(Riepilogo!O43>0,Riepilogo!O43/$H$2,\"\")","v":""},{"$f":"IF(H22=\"\",\"\",CONCATENATE(Riepilogo!C43,\" - \",Riepilogo!K43))","v":""},null,null,0,null,null,0,null,null,0,null,null,0,0,{"$f":"ISODD(SUM($V$4:V22))","v":false},"inizio 20%"]
[null,{"$f":"IF(Riepilogo!M44>0,Riepilogo!M44/$B$2,\"\")","v":""},{"$f":"IF(B23=\"\",\"\",CONCATENATE(Riepilogo!C44,\" - \",Riepilogo!K44))","v":""},null,{"$f":"IF(Riepilogo!N44>0,Riepilogo!N44/$E$2,\"\")","v":""},{"$f":"IF(E23=\"\",\"\",CONCATENATE(Riepilogo!C44,\" - \",Riepilogo!K44))","v":""},null,{"$f":"IF(Riepilogo!O44>0,Riepilogo!O44/$H$2,\"\")","v":""},{"$f":"IF(H23=\"\",\"\",CONCATENATE(Riepilogo!C44,\" - \",Riepilogo!K44))","v":""},null,null,0,null,null,0,null,null,0,null,null,0,0,{"$f":"ISODD(SUM($V$4:V23))","v":false}]
[null,{"$f":"IF(Riepilogo!M45>0,Riepilogo!M45/$B$2,\"\")","v":""},{"$f":"IF(B24=\"\",\"\",CONCATENATE(Riepilogo!C45,\" - \",Riepilogo!K45))","v":""},null,{"$f":"IF(Riepilogo!N45>0,Riepilogo!N45/$E$2,\"\")","v":""},{"$f":"IF(E24=\"\",\"\",CONCATENATE(Riepilogo!C45,\" - \",Riepilogo!K45))","v":""},null,{"$f":"IF(Riepilogo!O45>0,Riepilogo!O45/$H$2,\"\")","v":""},{"$f":"IF(H24=\"\",\"\",CONCATENATE(Riepilogo!C45,\" - \",Riepilogo!K45))","v":""},null,null,0,null,null,0,null,null,0,null,null,0,0,{"$f":"ISODD(SUM($V$4:V24))","v":false}]
[null,{"$f":"IF(Riepilogo!M46>0,Riepilogo!M46/$B$2,\"\")","v":""},{"$f":"IF(B25=\"\",\"\",CONCATENATE(Riepilogo!C46,\" - \",Riepilogo!K46))","v":""},null,{"$f":"IF(Riepilogo!N46>0,Riepilogo!N46/$E$2,\"\")","v":""},{"$f":"IF(E25=\"\",\"\",CONCATENATE(Riepilogo!C46,\" - \",Riepilogo!K46))","v":""},null,{"$f":"IF(Riepilogo!O46>0,Riepilogo!O46/$H$2,\"\")","v":""},{"$f":"IF(H25=\"\",\"\",CONCATENATE(Riepilogo!C46,\" - \",Riepilogo!K46))","v":""},null,null,0,null,null,0,null,null,0,null,null,0,0,{"$f":"ISODD(SUM($V$4:V25))","v":false}]
[null,{"$f":"IF(Riepilogo!M47>0,Riepilogo!M47/$B$2,\"\")","v":""},{"$f":"IF(B26=\"\",\"\",CONCATENATE(Riepilogo!C47,\" - \",Riepilogo!K47))","v":""},null,{"$f":"IF(Riepilogo!N47>0,Riepilogo!N47/$E$2,\"\")","v":""},{"$f":"IF(E26=\"\",\"\",CONCATENATE(Riepilogo!C47,\" - \",Riepilogo!K47))","v":""},null,{"$f":"IF(Riepilogo!O47>0,Riepilogo!O47/$H$2,\"\")","v":""},{"$f":"IF(H26=\"\",\"\",CONCATENATE(Riepilogo!C47,\" - \",Riepilogo!K47))","v":""},null,null,0,null,null,0,null,null,0,null,null,0,0,{"$f":"ISODD(SUM($V$4:V26))","v":false}]
[null,{"$f":"IF(Riepilogo!M48>0,Riepilogo!M48/$B$2,\"\")","v":""},{"$f":"IF(B27=\"\",\"\",CONCATENATE(Riepilogo!C48,\" - \",Riepilogo!K48))","v":""},null,{"$f":"IF(Riepilogo!N48>0,Riepilogo!N48/$E$2,\"\")","v":""},{"$f":"IF(E27=\"\",\"\",CONCATENATE(Riepilogo!C48,\" - \",Riepilogo!K48))","v":""},null,{"$f":"IF(Riepilogo!O48>0,Riepilogo!O48/$H$2,\"\")","v":""},{"$f":"IF(H27=\"\",\"\",CONCATENATE(Riepilogo!C48,\" - \",Riepilogo!K48))","v":""},null,null,0,null,null,0,null,null,0,null,null,0,0,{"$f":"ISODD(SUM($V$4:V27))","v":false}]
[null,{"$f":"IF(Riepilogo!M49>0,Riepilogo!M49/$B$2,\"\")","v":""},{"$f":"IF(B28=\"\",\"\",CONCATENATE(Riepilogo!C49,\" - \",Riepilogo!K49))","v":""},null,{"$f":"IF(Riepilogo!N49>0,Riepilogo!N49/$E$2,\"\")","v":""},{"$f":"IF(E28=\"\",\"\",CONCATENATE(Riepilogo!C49,\" - \",Riepilogo!K49))","v":""},null,{"$f":"IF(Riepilogo!O49>0,Riepilogo!O49/$H$2,\"\")","v":""},{"$f":"IF(H28=\"\",\"\",CONCATENATE(Riepilogo!C49,\" - \",Riepilogo!K49))","v":""},null,null,0,null,null,0,null,null,0,null,null,0,0,{"$f":"ISODD(SUM($V$4:V28))","v":false}]
[null,{"$f":"IF(Riepilogo!M50>0,Riepilogo!M50/$B$2,\"\")","v":""},{"$f":"IF(B29=\"\",\"\",CONCATENATE(Riepilogo!C50,\" - \",Riepilogo!K50))","v":""},null,{"$f":"IF(Riepilogo!N50>0,Riepilogo!N50/$E$2,\"\")","v":""},{"$f":"IF(E29=\"\",\"\",CONCATENATE(Riepilogo!C50,\" - \",Riepilogo!K50))","v":""},null,{"$f":"IF(Riepilogo!O50>0,Riepilogo!O50/$H$2,\"\")","v":""},{"$f":"IF(H29=\"\",\"\",CONCATENATE(Riepilogo!C50,\" - \",Riepilogo!K50))","v":""},null,null,0,null,null,0,null,null,0,null,null,0,0,{"$f":"ISODD(SUM($V$4:V29))","v":false}]
[null,{"$f":"IF(Riepilogo!M51>0,Riepilogo!M51/$B$2,\"\")","v":""},{"$f":"IF(B30=\"\",\"\",CONCATENATE(Riepilogo!C51,\" - \",Riepilogo!K51))","v":""},null,{"$f":"IF(Riepilogo!N51>0,Riepilogo!N51/$E$2,\"\")","v":""},{"$f":"IF(E30=\"\",\"\",CONCATENATE(Riepilogo!C51,\" - \",Riepilogo!K51))","v":""},null,{"$f":"IF(Riepilogo!O51>0,Riepilogo!O51/$H$2,\"\")","v":""},{"$f":"IF(H30=\"\",\"\",CONCATENATE(Riepilogo!C51,\" - \",Riepilogo!K51))","v":""},null,null,0,null,null,0,null,null,0,null,null,0,0,{"$f":"ISODD(SUM($V$4:V30))","v":false}]
[null,{"$f":"IF(Riepilogo!M52>0,Riepilogo!M52/$B$2,\"\")","v":""},{"$f":"IF(B31=\"\",\"\",CONCATENATE(Riepilogo!C52,\" - \",Riepilogo!K52))","v":""},null,{"$f":"IF(Riepilogo!N52>0,Riepilogo!N52/$E$2,\"\")","v":""},{"$f":"IF(E31=\"\",\"\",CONCATENATE(Riepilogo!C52,\" - \",Riepilogo!K52))","v":""},null,{"$f":"IF(Riepilogo!O52>0,Riepilogo!O52/$H$2,\"\")","v":""},{"$f":"IF(H31=\"\",\"\",CONCATENATE(Riepilogo!C52,\" - \",Riepilogo!K52))","v":""},null,null,0,null,null,0,null,null,0,null,null,0,0,{"$f":"ISODD(SUM($V$4:V31))","v":false}]
[null,{"$f":"IF(Riepilogo!M53>0,Riepilogo!M53/$B$2,\"\")","v":""},{"$f":"IF(B32=\"\",\"\",CONCATENATE(Riepilogo!C53,\" - \",Riepilogo!K53))","v":""},null,{"$f":"IF(Riepilogo!N53>0,Riepilogo!N53/$E$2,\"\")","v":""},{"$f":"IF(E32=\"\",\"\",CONCATENATE(Riepilogo!C53,\" - \",Riepilogo!K53))","v":""},null,{"$f":"IF(Riepilogo!O53>0,Riepilogo!O53/$H$2,\"\")","v":""},{"$f":"IF(H32=\"\",\"\",CONCATENATE(Riepilogo!C53,\" - \",Riepilogo!K53))","v":""},null,null,0,null,null,0,null,null,0,null,null,0,0,{"$f":"ISODD(SUM($V$4:V32))","v":false}]
[null,{"$f":"IF(Riepilogo!M54>0,Riepilogo!M54/$B$2,\"\")","v":""},{"$f":"IF(B33=\"\",\"\",CONCATENATE(Riepilogo!C54,\" - \",Riepilogo!K54))","v":""},null,{"$f":"IF(Riepilogo!N54>0,Riepilogo!N54/$E$2,\"\")","v":""},{"$f":"IF(E33=\"\",\"\",CONCATENATE(Riepilogo!C54,\" - \",Riepilogo!K54))","v":""},null,{"$f":"IF(Riepilogo!O54>0,Riepilogo!O54/$H$2,\"\")","v":""},{"$f":"IF(H33=\"\",\"\",CONCATENATE(Riepilogo!C54,\" - \",Riepilogo!K54))","v":""},null,null,{"$f":"IF(B33=\"\",0,B33)","v":0},null,null,{"$f":"IF(E33=\"\",0,E33)","v":0},null,null,{"$f":"IF(H33=\"\",0,H33)","v":0},null,null,{"$f":"SUM(L33:T33)","v":0},{"$f":"IF(U33>0,1,0)","v":0},{"$f":"ISODD(SUM($V$4:V33))","v":false}]
[null,{"$f":"IF(Riepilogo!M55>0,Riepilogo!M55/$B$2,\"\")","v":""},{"$f":"IF(B34=\"\",\"\",CONCATENATE(Riepilogo!C55,\" - \",Riepilogo!K55))","v":""},null,{"$f":"IF(Riepilogo!N55>0,Riepilogo!N55/$E$2,\"\")","v":""},{"$f":"IF(E34=\"\",\"\",CONCATENATE(Riepilogo!C55,\" - \",Riepilogo!K55))","v":""},null,{"$f":"IF(Riepilogo!O55>0,Riepilogo!O55/$H$2,\"\")","v":""},{"$f":"IF(H34=\"\",\"\",CONCATENATE(Riepilogo!C55,\" - \",Riepilogo!K55))","v":""},null,null,0,null,null,0,null,null,0,null,null,0,0,{"$f":"ISODD(SUM($V$4:V34))","v":false}]
[null,{"$f":"IF(Riepilogo!M56>0,Riepilogo!M56/$B$2,\"\")","v":""},{"$f":"IF(B35=\"\",\"\",CONCATENATE(Riepilogo!C56,\" - \",Riepilogo!K56))","v":""},null,{"$f":"IF(Riepilogo!N56>0,Riepilogo!N56/$E$2,\"\")","v":""},{"$f":"IF(E35=\"\",\"\",CONCATENATE(Riepilogo!C56,\" - \",Riepilogo!K56))","v":""},null,{"$f":"IF(Riepilogo!O56>0,Riepilogo!O56/$H$2,\"\")","v":""},{"$f":"IF(H35=\"\",\"\",CONCATENATE(Riepilogo!C56,\" - \",Riepilogo!K56))","v":""},null,null,0,null,null,0,null,null,0,null,null,0,0,{"$f":"ISODD(SUM($V$4:V35))","v":false}]
[null,{"$f":"IF(Riepilogo!M57>0,Riepilogo!M57/$B$2,\"\")","v":""},{"$f":"IF(B36=\"\",\"\",CONCATENATE(Riepilogo!C57,\" - \",Riepilogo!K57))","v":""},null,{"$f":"IF(Riepilogo!N57>0,Riepilogo!N57/$E$2,\"\")","v":""},{"$f":"IF(E36=\"\",\"\",CONCATENATE(Riepilogo!C57,\" - \",Riepilogo!K57))","v":""},null,{"$f":"IF(Riepilogo!O57>0,Riepilogo!O57/$H$2,\"\")","v":""},{"$f":"IF(H36=\"\",\"\",CONCATENATE(Riepilogo!C57,\" - \",Riepilogo!K57))","v":""},null,null,0,null,null,0,null,null,0,null,null,0,0,{"$f":"ISODD(SUM($V$4:V36))","v":false}]
[null,{"$f":"IF(Riepilogo!M58>0,Riepilogo!M58/$B$2,\"\")","v":""},{"$f":"IF(B37=\"\",\"\",CONCATENATE(Riepilogo!C58,\" - \",Riepilogo!K58))","v":""},null,{"$f":"IF(Riepilogo!N58>0,Riepilogo!N58/$E$2,\"\")","v":""},{"$f":"IF(E37=\"\",\"\",CONCATENATE(Riepilogo!C58,\" - \",Riepilogo!K58))","v":""},null,{"$f":"IF(Riepilogo!O58>0,Riepilogo!O58/$H$2,\"\")","v":""},{"$f":"IF(H37=\"\",\"\",CONCATENATE(Riepilogo!C58,\" - \",Riepilogo!K58))","v":""},null,null,0,null,null,0,null,null,0,null,null,0,0,{"$f":"ISODD(SUM($V$4:V37))","v":false}]
[null,{"$f":"IF(Riepilogo!M59>0,Riepilogo!M59/$B$2,\"\")","v":""},{"$f":"IF(B38=\"\",\"\",CONCATENATE(Riepilogo!C59,\" - \",Riepilogo!K59))","v":""},null,{"$f":"IF(Riepilogo!N59>0,Riepilogo!N59/$E$2,\"\")","v":""},{"$f":"IF(E38=\"\",\"\",CONCATENATE(Riepilogo!C59,\" - \",Riepilogo!K59))","v":""},null,{"$f":"IF(Riepilogo!O59>0,Riepilogo!O59/$H$2,\"\")","v":""},{"$f":"IF(H38=\"\",\"\",CONCATENATE(Riepilogo!C59,\" - \",Riepilogo!K59))","v":""},null,null,0,null,null,0,null,null,0,null,null,0,0,{"$f":"ISODD(SUM($V$4:V38))","v":false}]
[null,{"$f":"IF(Riepilogo!M60>0,Riepilogo!M60/$B$2,\"\")","v":""},{"$f":"IF(B39=\"\",\"\",CONCATENATE(Riepilogo!C60,\" - \",Riepilogo!K60))","v":""},null,{"$f":"IF(Riepilogo!N60>0,Riepilogo!N60/$E$2,\"\")","v":""},{"$f":"IF(E39=\"\",\"\",CONCATENATE(Riepilogo!C60,\" - \",Riepilogo!K60))","v":""},null,{"$f":"IF(Riepilogo!O60>0,Riepilogo!O60/$H$2,\"\")","v":""},{"$f":"IF(H39=\"\",\"\",CONCATENATE(Riepilogo!C60,\" - \",Riepilogo!K60))","v":""},null,null,0,null,null,0,null,null,0,null,null,0,0,{"$f":"ISODD(SUM($V$4:V39))","v":false}]
[null,{"$f":"IF(Riepilogo!M61>0,Riepilogo!M61/$B$2,\"\")","v":""},{"$f":"IF(B40=\"\",\"\",CONCATENATE(Riepilogo!C61,\" - \",Riepilogo!K61))","v":""},null,{"$f":"IF(Riepilogo!N61>0,Riepilogo!N61/$E$2,\"\")","v":""},{"$f":"IF(E40=\"\",\"\",CONCATENATE(Riepilogo!C61,\" - \",Riepilogo!K61))","v":""},null,{"$f":"IF(Riepilogo!O61>0,Riepilogo!O61/$H$2,\"\")","v":""},{"$f":"IF(H40=\"\",\"\",CONCATENATE(Riepilogo!C61,\" - \",Riepilogo!K61))","v":""},null,null,0,null,null,0,null,null,0,null,null,0,0,{"$f":"ISODD(SUM($V$4:V40))","v":false}]
[null,{"$f":"IF(Riepilogo!M62>0,Riepilogo!M62/$B$2,\"\")","v":""},{"$f":"IF(B41=\"\",\"\",CONCATENATE(Riepilogo!C62,\" - \",Riepilogo!K62))","v":""},null,{"$f":"IF(Riepilogo!N62>0,Riepilogo!N62/$E$2,\"\")","v":""},{"$f":"IF(E41=\"\",\"\",CONCATENATE(Riepilogo!C62,\" - \",Riepilogo!K62))","v":""},null,{"$f":"IF(Riepilogo!O62>0,Riepilogo!O62/$H$2,\"\")","v":""},{"$f":"IF(H41=\"\",\"\",CONCATENATE(Riepilogo!C62,\" - \",Riepilogo!K62))","v":""},null,null,0,null,null,0,null,null,0,null,null,0,0,{"$f":"ISODD(SUM($V$4:V41))","v":false}]
[null,null,null,null,null,null,null,null,null,null,null,null,null,null,null,null,null,null,null,null,null,{"$f":"IF($U$4>0,1,0)","v":0}]
[null,"Configurazione RAID e/o NOTE",null,null,"Configurazione RAID e/o NOTE",null,null,"Configurazione RAID e/o NOTE",null,null,null,null,null,null,null,null,null,null,null,null,null,{"$f":"IF($U$4>0,1,0)","v":0}]
[null,{"$f":"Lotto1_T340_1!H27","v":"Specificare la configurazione RAID per l'installazione del Sistema Operativo, se richiesto.\ne/o\ninserire eventuali note."},null,null,{"$f":"Lotto1_T340_2!H27","v":"Specificare la configurazione RAID per l'installazione del Sistema Operativo, se richiesto.\ne/o\ninserire eventuali note."},null,null,{"$f":"Lotto1_T340_3!H27","v":"Specificare la configurazione RAID per l'installazione del Sistema Operativo, se richiesto.\ne/o\ninserire eventuali note."},null,null,null,null,null,null,null,null,null,null,null,null,null,0]
[null,null,null,null,null,null,null,null,null,null,null,null,null,null,null,null,null,null,null,null,null,0]
[null,null,null,null,null,null,null,null,null,null,null,null,null,null,null,null,null,null,null,null,null,0]
[null,null,null,null,null,null,null,null,null,null,null,null,null,null,null,null,null,null,null,null,null,0]
[null,null,null,null,null,null,null,null,null,null,null,null,null,null,null,null,null,null,null,null,null,0]
[null,null,null,null,null,null,null,null,null,null,null,null,null,null,null,null,null,null,null,null,null,0]
[null,null,null,null,null,null,null,null,null,null,null,null,null,null,null,null,null,null,null,null,null,0]
[null,null,null,null,null,null,null,null,null,null,null,null,null,null,null,null,null,null,null,null,null,0]
[null,null,null,null,null,null,null,null,null,null,null,null,null,null,null,null,null,null,null,null,null,0]
[null,null,null,null,null,null,null,null,null,null,null,null,null,null,null,null,null,null,null,null,null,0]
[null,null,null,null,null,null,null,null,null,null,null,null,null,null,null,null,null,null,null,null,null,0]
[null,null,null,null,null,null,null,null,null,null,null,null,null,null,null,null,null,null,null,null,null,0]
[null,null,null,null,null,null,null,null,null,null,null,null,null,null,null,null,null,null,null,null,null,1]
[null,null,null,null,null,null,null,null,null,null,null,null,null,null,null,null,null,null,null,null,null,1]
[null,"AREA RISERVATA AL FORNITORE",null,null,null,null,null,null,null,null,null,null,null,null,null,null,null,null,null,null,null,1]
[null,null,null,null,null,null,null,null,null,null,null,null,null,null,null,null,null,null,null,null,null,1]
[null,"VERIFICA STAGING",null,null,null,null,"VERIFICA INSTALLATORE",null,null,null,null,null,null,null,null,null,null,null,null,null,null,1]
[null,null,null,null,null,null,null,null,null,null,null,null,null,null,null,null,null,null,null,null,null,1]
[null,null,null,null,null,null,null,null,null,null,null,null,null,null,null,null,null,null,null,null,null,1]
[null,null,null,null,null,null,null,null,null,null,null,null,null,null,null,null,null,null,null,null,null,1]
[null,null,null,null,null,null,null,null,null,null,null,null,null,null,null,null,null,null,null,null,null,1]