{"text_format":"1","workbook":"xlsx","n_sheets":7,"sheets":["Lotto1_T340_1","Lotto1_T340_2","Lotto1_T340_3","ConfigurationTS3L1","Tabella_prezzi","Riepilogo","Configurazione"],"not_rendered":{"charts":0,"images":24,"macros":1,"external_links":0,"defined_names":22,"comments":0,"pivot_tables":0},"unopened":[],"bounds":{"document_bytes":16777216,"sheet_cells":100000,"rows_first":2000,"rows_last":500,"rows_between":2000,"halvings":0,"cell_chars":16384,"cell_head_chars":4096},"cells_cut":0,"cells_raw":0,"read":"whole","date_system":"1900"}

{"sheet":"Lotto1_T340_1","index":0,"n_rows":96,"n_cols":17,"rows_kept":96,"cut":false,"hidden":false,"merged":[[26,7,37,7],[6,3,7,3],[9,3,10,3],[15,3,16,3],[24,3,25,3],[42,3,43,3],[84,3,85,3],[87,3,88,3],[91,3,92,3],[94,3,95,3]]}
[null,null,null,null,"Convenzione",{"$f":"SUM(J8:J96)*F5","v":0}]
[null,null,null,null,0.2,{"$f":"SUM(K8:K96)*F5","v":0}]
[null,null,null,null,"Totale",{"$f":"SUM(F1:F2)","v":0}]
[]
[null,null,"POWEREDGE T340          Consulta la Guida alla Convenzione --->",{"$f":"HYPERLINK(\"https://convenzioni.converge.it/docs/L1GuidaAllaConvenzioneTecnologieServer3.pdf\",\"&\")","v":"&"},"Quantità Server",null,null,{"$f":"Riepilogo!G8","v":"Version 2.8"}]
[]
[null,null,"Base",{"$f":"HYPERLINK(\"https://convenzioni.converge.it/docs/ts3_datasheet/dell-emc-poweredge-t340-spec-sheet.pdf\",\"i\")","v":"i"}]
[null,null,"PowerEdge T340 Server",null,{"$f":"IF($F$5>0,\"TS3L1-SRV\",\"\")","v":""},{"$f":"IF($F$5>0,1,\"\")","v":""},null,null,null,1399,null,{"$f":"VLOOKUP($C8,TS3L1_ALL,12,FALSE)","v":"L1N01"}]
[]
[null,null,"Chassis Configuration",{"$f":"HYPERLINK(\"https://dellservervr.dell.com/poweredge-t340/\",\"i\")","v":"i"}]
[null,null,"3.5\" Chassis up to 4 Hot Plug Hard Drives and Embedded SATA"]
[]
[null,null,"Trusted Platform Module (TPM)"]
[null,null,"Trusted Platform Module 2.0"]
[]
[null,null,"Processor",{"$f":"HYPERLINK(\"https://ark.intel.com/content/www/it/it/ark/products/191040/intel-xeon-e-2236-processor-12m-cache-3-40-ghz.html\",\"i\")","v":"i"}]
[null,null,"Intel® Xeon® E-2236 3.4GHz, 12M cache, 6C/12T, turbo (80W)"]
[]
[null,null,"Memory Capacity"]
[null,null,"16GB",null,{"$f":"VLOOKUP($C$20,TS3L1_RAM,13,FALSE)","v":""},{"$f":"VLOOKUP($C$20,TS3L1_RAM,7,FALSE)","v":0},null,null,null,{"$f":"VLOOKUP($C$20,TS3L1_RAM,10,FALSE)","v":0},null,{"$f":"VLOOKUP($C20,TS3L1_ALL,12,FALSE)","v":""}]
{"$rows_left_out":77}
{"sheet":"Lotto1_T340_2","index":1,"n_rows":96,"n_cols":17,"rows_kept":96,"cut":false,"hidden":false,"merged":[[26,7,37,7],[6,3,7,3],[9,3,10,3],[15,3,16,3],[24,3,25,3],[42,3,43,3],[84,3,85,3],[87,3,88,3],[91,3,92,3],[94,3,95,3]]}
[null,null,null,null,"Convenzione",{"$f":"SUM(J8:J96)*F5","v":0}]
[null,null,null,null,0.2,{"$f":"SUM(K8:K96)*F5","v":0}]
[null,null,null,null,"Totale",{"$f":"SUM(F1:F2)","v":0}]
[]
[null,null,"POWEREDGE T340          Consulta la Guida alla Convenzione --->",{"$f":"HYPERLINK(\"https://convenzioni.converge.it/docs/L1GuidaAllaConvenzioneTecnologieServer3.pdf\",\"&\")","v":"&"},"Quantità Server",null,null,{"$f":"Riepilogo!G8","v":"Version 2.8"}]
[]
[null,null,"Base",{"$f":"HYPERLINK(\"https://convenzioni.converge.it/docs/ts3_datasheet/dell-emc-poweredge-t340-spec-sheet.pdf\",\"i\")","v":"i"}]
[null,null,"PowerEdge T340 Server",null,{"$f":"IF($F$5>0,\"TS3L1-SRV\",\"\")","v":""},{"$f":"IF($F$5>0,1,\"\")","v":""},null,null,null,1399,null,{"$f":"VLOOKUP($C8,TS3L1_ALL,12,FALSE)","v":"L1N01"}]
[]
[null,null,"Chassis Configuration",{"$f":"HYPERLINK(\"https://dellservervr.dell.com/poweredge-t340/\",\"i\")","v":"i"}]
[null,null,"3.5\" Chassis up to 4 Hot Plug Hard Drives and Embedded SATA"]
[]
[null,null,"Trusted Platform Module (TPM)"]
[null,null,"Trusted Platform Module 2.0"]
[]
[null,null,"Processor",{"$f":"HYPERLINK(\"https://ark.intel.com/content/www/it/it/ark/products/191040/intel-xeon-e-2236-processor-12m-cache-3-40-ghz.html\",\"i\")","v":"i"}]
[null,null,"Intel® Xeon® E-2236 3.4GHz, 12M cache, 6C/12T, turbo (80W)"]
[]
[null,null,"Memory Capacity"]
[null,null,"16GB",null,{"$f":"VLOOKUP($C$20,TS3L1_RAM,13,FALSE)","v":""},{"$f":"VLOOKUP($C$20,TS3L1_RAM,7,FALSE)","v":0},null,null,null,{"$f":"VLOOKUP($C$20,TS3L1_RAM,10,FALSE)","v":0},null,{"$f":"VLOOKUP($C20,TS3L1_ALL,12,FALSE)","v":""}]
{"$rows_left_out":77}
{"sheet":"Lotto1_T340_3","index":2,"n_rows":96,"n_cols":17,"rows_kept":96,"cut":false,"hidden":false,"merged":[[26,7,37,7],[6,3,7,3],[9,3,10,3],[15,3,16,3],[24,3,25,3],[42,3,43,3],[84,3,85,3],[87,3,88,3],[91,3,92,3],[94,3,95,3]]}
[null,null,null,null,"Convenzione",{"$f":"SUM(J8:J96)*F5","v":0}]
[null,null,null,null,0.2,{"$f":"SUM(K8:K96)*F5","v":0}]
[null,null,null,null,"Totale",{"$f":"SUM(F1:F2)","v":0}]
[]
[null,null,"POWEREDGE T340          Consulta la Guida alla Convenzione --->",{"$f":"HYPERLINK(\"https://convenzioni.converge.it/docs/L1GuidaAllaConvenzioneTecnologieServer3.pdf\",\"&\")","v":"&"},"Quantità Server",null,null,{"$f":"Riepilogo!G8","v":"Version 2.8"}]
[]
[null,null,"Base",{"$f":"HYPERLINK(\"https://convenzioni.converge.it/docs/ts3_datasheet/dell-emc-poweredge-t340-spec-sheet.pdf\",\"i\")","v":"i"}]
[null,null,"PowerEdge T340 Server",null,{"$f":"IF($F$5>0,\"TS3L1-SRV\",\"\")","v":""},{"$f":"IF($F$5>0,1,\"\")","v":""},null,null,null,1399,null,{"$f":"VLOOKUP($C8,TS3L1_ALL,12,FALSE)","v":"L1N01"}]
[]
[null,null,"Chassis Configuration",{"$f":"HYPERLINK(\"https://dellservervr.dell.com/poweredge-t340/\",\"i\")","v":"i"}]
[null,null,"3.5\" Chassis up to 4 Hot Plug Hard Drives and Embedded SATA"]
[]
[null,null,"Trusted Platform Module (TPM)"]
[null,null,"Trusted Platform Module 2.0"]
[]
[null,null,"Processor",{"$f":"HYPERLINK(\"https://ark.intel.com/content/www/it/it/ark/products/191040/intel-xeon-e-2236-processor-12m-cache-3-40-ghz.html\",\"i\")","v":"i"}]
[null,null,"Intel® Xeon® E-2236 3.4GHz, 12M cache, 6C/12T, turbo (80W)"]
[]
[null,null,"Memory Capacity"]
[null,null,"16GB",null,{"$f":"VLOOKUP($C$20,TS3L1_RAM,13,FALSE)","v":""},{"$f":"VLOOKUP($C$20,TS3L1_RAM,7,FALSE)","v":0},null,null,null,{"$f":"VLOOKUP($C$20,TS3L1_RAM,10,FALSE)","v":0},null,{"$f":"VLOOKUP($C20,TS3L1_ALL,12,FALSE)","v":""}]
{"$rows_left_out":77}
{"sheet":"ConfigurationTS3L1","index":3,"n_rows":110,"n_cols":14,"rows_kept":110,"cut":false,"hidden":true,"merged":[]}
[]
[null,"Module Name","Option ID","Option Name","Option List Price","SKUs","Qty","SKU Customer Kit","Attributo","Valore inserito",null,"N°","Codice Convenzione"]
["PowerEdge T340 Server",null,null,{"$f":"VLOOKUP(L3,Tabella_prezzi!$A$3:$J$58,8,FALSE)","v":"DELL PowerEdge T340 Server"},null,null,null,null,{"$f":"VLOOKUP(L3,Tabella_prezzi!$A$3:$J$58,3,FALSE)","v":"Server Tower mono-processore"},{"$f":"VLOOKUP(L3,Tabella_prezzi!$A$3:$J$58,4,FALSE)","v":1399},null,"L1N01",{"$f":"VLOOKUP(L3,Tabella_prezzi!$A$3:$J$58,6,FALSE)","v":"TS3L1-SRV"}]
[]
[]
["TS3L1_RAM"]
["16GB","Memory Capacity"," GYWO126",{"$f":"D8","v":"16GB - 2Rx8 DDR4 UDIMM 2666MHz"},null,"370-AEKL",0,"AA335286",{"$f":"\"\"","v":""},null,null,{"$f":"\"\"","v":""},{"$f":"\"\"","v":""}]
["32GB","Memory Capacity"," GYWO126",{"$f":"VLOOKUP(L8,Tabella_prezzi!$A$3:$J$58,8,FALSE)","v":"16GB - 2Rx8 DDR4 UDIMM 2666MHz"},null,"370-AEKL",1,{"$f":"VLOOKUP(L8,Tabella_prezzi!$A$3:$J$58,9,FALSE)","v":"L1N02-OpzRAM16GB"},{"$f":"VLOOKUP(L8,Tabella_prezzi!$A$3:$J$58,3,FALSE)","v":"OpzRAM16GB"},{"$f":"VLOOKUP(L8,Tabella_prezzi!$A$3:$J$58,4,FALSE)*G8","v":98},null,"L1N02",{"$f":"VLOOKUP(L8,Tabella_prezzi!$A$3:$J$58,6,FALSE)","v":"TS3L1-RAM16"}]
["48GB","Memory Capacity"," GYWO126",{"$f":"VLOOKUP(L9,Tabella_prezzi!$A$3:$J$58,8,FALSE)","v":"16GB - 2Rx8 DDR4 UDIMM 2666MHz"},null,"370-AEKL",2,{"$f":"VLOOKUP(L9,Tabella_prezzi!$A$3:$J$58,9,FALSE)","v":"L1N02-OpzRAM16GB"},{"$f":"VLOOKUP(L9,Tabella_prezzi!$A$3:$J$58,3,FALSE)","v":"OpzRAM16GB"},{"$f":"VLOOKUP(L9,Tabella_prezzi!$A$3:$J$58,4,FALSE)*G9","v":196},null,"L1N02",{"$f":"VLOOKUP(L9,Tabella_prezzi!$A$3:$J$58,6,FALSE)","v":"TS3L1-RAM16"}]
["64GB","Memory Capacity"," GYWO126",{"$f":"VLOOKUP(L10,Tabella_prezzi!$A$3:$J$58,8,FALSE)","v":"16GB - 2Rx8 DDR4 UDIMM 2666MHz"},null,"370-AEKL",3,{"$f":"VLOOKUP(L10,Tabella_prezzi!$A$3:$J$58,9,FALSE)","v":"L1N02-OpzRAM16GB"},{"$f":"VLOOKUP(L10,Tabella_prezzi!$A$3:$J$58,3,FALSE)","v":"OpzRAM16GB"},{"$f":"VLOOKUP(L10,Tabella_prezzi!$A$3:$J$58,4,FALSE)*G10","v":294},null,"L1N02",{"$f":"VLOOKUP(L10,Tabella_prezzi!$A$3:$J$58,6,FALSE)","v":"TS3L1-RAM16"}]
[]
["TS3L1_OS"]
["No Operating System","Operating System",null,null,null,null,{"$f":"\"\"","v":""},null,{"$f":"\"\"","v":""},null,null,{"$f":"\"\"","v":""},{"$f":"\"\"","v":""}]
["[TS3L1-WINSRVESS] Windows Server® 2019 Essentials","Operating System","GQ5SW9I",{"$f":"VLOOKUP(L14,Tabella_prezzi!$A$3:$J$58,8,FALSE)","v":"Windows Server 2019,Essentials, ROK"},null,"634-BSFC",1,{"$f":"VLOOKUP(L14,Tabella_prezzi!$A$3:$J$58,9,FALSE)","v":"L1N12-OpzWinServESS"},{"$f":"VLOOKUP(L14,Tabella_prezzi!$A$3:$J$58,3,FALSE)","v":"OpzWinServESS"},{"$f":"VLOOKUP(L14,Tabella_prezzi!$A$3:$J$58,4,FALSE)","v":256},null,"L1N12",{"$f":"VLOOKUP(L14,Tabella_prezzi!$A$3:$J$58,6,FALSE)","v":"TS3L1-WINSRVESS"}]
["[TS3L1-LINUX] Ubuntu 18.04 LTS 64 Bit","Operating System",null,{"$f":"VLOOKUP(L15,Tabella_prezzi!$A$3:$J$58,8,FALSE)","v":"Ubuntu 18.04 LTS 64 Bit"},null,null,1,null,{"$f":"VLOOKUP(L15,Tabella_prezzi!$A$3:$J$58,3,FALSE)","v":"OpzOpenSource"},{"$f":"VLOOKUP(L15,Tabella_prezzi!$A$3:$J$58,4,FALSE)","v":49},null,"L1N15",{"$f":"VLOOKUP(L15,Tabella_prezzi!$A$3:$J$58,6,FALSE)","v":"TS3L1-LINUX"}]
[]
["TS3L1_HDD"]
[{"$f":"\"\"","v":""},null,null,null,null,null,{"$f":"\"\"","v":""},null,{"$f":"\"\"","v":""},null,null,{"$f":"\"\"","v":""},{"$f":"\"\"","v":""}]
["[TS3L1-HDD8TB] 8TB 7.2K RPM SATA 6Gbps Hot-plug Hard Drive","Hard Drives","8T35HL",{"$f":"VLOOKUP(L19,Tabella_prezzi!$A$3:$J$58,8,FALSE)","v":"HDD 8TB 7.2K SATA 6Gbps 3.5in Hot-plug"},null,"400-AOJN",1,{"$f":"VLOOKUP(L19,Tabella_prezzi!$A$3:$J$58,9,FALSE)","v":"L1N04-OpzHDD8TB"},{"$f":"VLOOKUP(L19,Tabella_prezzi!$A$3:$J$58,3,FALSE)","v":"OpzHDD8TB"},{"$f":"VLOOKUP(L19,Tabella_prezzi!$A$3:$J$58,4,FALSE)","v":285},null,"L1N04",{"$f":"VLOOKUP(L19,Tabella_prezzi!$A$3:$J$58,6,FALSE)","v":"TS3L1-HDD8TB"}]
["[TS3L1-HDD4TB] 4TB 7.2K RPM SATA 6Gbps Hot-plug Hard Drive","Hard Drives",5107763,{"$f":"VLOOKUP(L20,Tabella_prezzi!$A$3:$J$58,8,FALSE)","v":"HDD 4TB 7.2K SATA 6Gbps 3.5in Hot-plug"},null,"400-ASNY",1,{"$f":"VLOOKUP(L20,Tabella_prezzi!$A$3:$J$58,9,FALSE)","v":"L1N05-OpzHDD4TB"},{"$f":"VLOOKUP(L20,Tabella_prezzi!$A$3:$J$58,3,FALSE)","v":"OpzHDD4TB"},{"$f":"VLOOKUP(L20,Tabella_prezzi!$A$3:$J$58,4,FALSE)","v":194},null,"L1N05",{"$f":"VLOOKUP(L20,Tabella_prezzi!$A$3:$J$58,6,FALSE)","v":"TS3L1-HDD4TB"}]
{"$rows_left_out":91}
{"sheet":"Tabella_prezzi","index":4,"n_rows":58,"n_cols":13,"rows_kept":58,"cut":false,"hidden":true,"merged":[[12,7,18,7],[12,9,18,9],[12,0,18,0],[12,1,18,1],[12,2,18,2],[12,3,18,3],[12,4,18,4],[12,5,18,5],[12,6,18,6],[12,8,18,8]]}
[]
["N°",null,"Attributo","Valore inserito","N°","Codice Convenzione","Qty:","Description:","Sku Number:","Brand"]
["L1N01",1,"Server Tower mono-processore",1399,"L1N01","TS3L1-SRV",1,"DELL PowerEdge T340 Server","L1N01-ServerT340","DELL",{"$f":"D3/100*20","v":279.8}]
["L1N02",2,"OpzRAM16GB",98,"L1N02","TS3L1-RAM16",1,"16GB - 2Rx8 DDR4 UDIMM 2666MHz","L1N02-OpzRAM16GB","DELL",null,null,"AA335286"]
["L1N03",3,"OpzGigabit",25,"L1N03","TS3L1-LAN1",1,"Scheda LAN 5720 DP 1Gb Full","L1N03-OpzGigabit","DELL",null,null,"540-BBGY"]
["L1N04",4,"OpzHDD8TB",285,"L1N04","TS3L1-HDD8TB",1,"HDD 8TB 7.2K SATA 6Gbps 3.5in Hot-plug","L1N04-OpzHDD8TB","DELL",null,null,"400-AHID"]
["L1N05",5,"OpzHDD4TB",194,"L1N05","TS3L1-HDD4TB",1,"HDD 4TB 7.2K SATA 6Gbps 3.5in Hot-plug","L1N05-OpzHDD4TB","DELL",null,null,"400-AUWY"]
["L1N06",6,"OpzHDD2TB",148,"L1N06","TS3L1-HDD2TB",1,"HDD 2TB 7.2K SATA 6Gbps 3.5in Hot-plug","L1N06-OpzHDD2TB","DELL",null,null,"400-AUWX"]
["L1N07",7,"OpzHDD1TB",80,"L1N07","TS3L1-HDD1TB",1,"HDD 1TB 7.2K SATA 6Gbps 3.5in Hot-plug","L1N07-OpzHDD1TB","DELL",null,null,"400-AURS"]
["L1N08",8,"OpzSSD-RI800GB",216,"L1N08","TS3L1-RI800GB",1,"SSD 960GB SATA RI 6Gbps 2.5in in 3.5in Hybrid Carrier, 1 DWPD","L1N08-OpzSSD-RI800GB","DELL",null,null,"400-BDPC"]
["L1N09",9,"OpzSSD-RI400GB",160,"L1N09","TS3L1-RI400GB",1,"SSD 480GB SATA RI 6Gbps 2.5in in 3.5in Hybrid Carrier, 1 DWPD","L1N09-OpzSSD-RI400GB","DELL",null,null,"400-BDQT"]
["L1N10",10,"OpzUps (3000VA)",302,"L1N10","TS3L1-UPS",1,"Powerme Online UPS RPMM/9 3K, Tower, SNMP card","L1N10-OpzUps","PowerME",null,null,"TPMM/ 3K"]
["L1N11",11,"OpzGUI per tower",69,"L1N11","TS3L1-GUI",1,"KIT Monitor 19\" E1920H + Mouse MS116 + Tastiera KB216","L1N11-OpzGUI","DELL",null,null,"580-ADHM"]
[null,null,null,null,null,null,1,"Mouse ottico Dell MS116 - nero","570-AAIS",null,null,null,"570-AAIS"]
[null,null,null,null,null,null,1,"BASE,DIS,MON,E1920H,EMEA","210-AURI",null,null,null,"210-AURI"]
[null,null,null,null,null,null,1,"Italian 220V Power Cord","450-ABCK",null,null,null,"450-ABCK"]
[null,null,null,null,null,null,1,"SnP order - EMEA.","800-10243",null,null,null,"800-10243"]
[null,null,null,null,null,null,1,"39M Basic with Advanced Exchange Channel","709-17931",null,null,null,"709-17931"]
[null,null,null,null,null,null,1,"No Warranty Upgrade","710-10844",null,null,null,"710-10844"]
["L1N12",12,"OpzWinServESS",256,"L1N12","TS3L1-WINSRVESS",1,"Windows Server 2019,Essentials, ROK","L1N12-OpzWinServESS","DELL",null,null,"634-BSFZ"]
{"$rows_left_out":39}
{"sheet":"Riepilogo","index":5,"n_rows":68,"n_cols":24,"rows_kept":68,"cut":false,"hidden":false,"merged":[[66,1,66,5],[63,4,63,5],[63,1,63,2],[62,1,62,5],[64,1,64,5],[65,1,65,5],[40,1,40,6],[20,1,20,6],[17,4,17,6],[1,3,1,6],[15,1,15,2],[10,3,10,6],[15,3,15,6],[12,4,12,6],[1,1,1,2],[3,1,3,2],[5,1,5,2],[7,1,7,2],[10,1,10,2]]}
[null,null,null,null,null,null,null,null,null,1]
[null,"Ente:",null,null,null,null,null,null,null,1,null,"ente",{"$f":"IF(D2>0,0,1)","v":1}]
[null,null,null,null,null,null,null,null,null,1]
[null,"Ordine N.",null,null,{"$f":"M7","v":"ERRORE DI MANCATA COMPILAZIONE DATI NECESSARI PER L'ORDINATIVO"},null,null,null,null,1,null,"N°ordine",{"$f":"IF(D4>0,0,1)","v":1}]
[null,null,null,null,{"$f":"M8","v":""},null,null,null,null,1]
[null,"Data",null,null,{"$f":"M9","v":""},null,null,null,null,1,null,"data",{"$f":"IF(D6>0,0,1)","v":1}]
[null,null,null,null,{"$f":"M10","v":""},null,null,null,null,1,null,"ERRORE1",{"$f":"IF(M2+M4+M6+M11+M13+M16+M18+O18+O13,\"ERRORE DI MANCATA COMPILAZIONE DATI NECESSARI PER L'ORDINATIVO\",\"\")","v":"ERRORE DI MANCATA COMPILAZIONE DATI NECESSARI PER L'ORDINATIVO"},{"$f":"IF(M7=\"\",0,1)","v":1}]
[null,"Totale IVA incl.",null,{"$f":"G67","v":0},{"$f":"IF(Q11=0,\"CONFIGURATORE OK\", \"\")","v":""},null,"Version 2.8",null,null,1,null,"Warning2",{"$f":"IF(G64>D64,\"!!! ATTENZIONE !!! L'IMPORTO 20% SUPERA IL VALORE MASSIMO CONSENTITO\",\"\")","v":""},{"$f":"IF(M8=\"\",0,1)","v":0}]
[null,null,null,null,null,null,null,null,null,1,null,"ERRORE3",{"$f":"\"\"","v":""},0]
[null,null,null,null,null,null,null,null,null,1,null,"Waning4",{"$f":"IF(N10>0,\"!!! ATTENZIONE !!! COMPLETARE IL CAMPO NOTE NELLE CONFIGURAZIONI\",\"\")","v":""},{"$f":"IF(M22>0,O10,0)+IF(N22>0,P10,0)+IF(O22>0,Q10,0)","v":0},{"$f":"IF(Lotto1_T340_1!$H$27=\"Specificare la configurazione RAID per l'installazione del Sistema Operativo, se richiesto.\ne/o\ninserire eventuali note.\",1,0)","v":1},{"$f":"IF(Lotto1_T340_2!$H$27=\"Specificare la configurazione RAID per l'installazione del Sistema Operativo, se richiesto.\ne/o\ninserire eventuali note.\",1,0)","v":1},{"$f":"IF(Lotto1_T340_3!$H$27=\"Specificare la configurazione RAID per l'installazione del Sistema Operativo, se richiesto.\ne/o\ninserire eventuali note.\",1,0)","v":1}]
[null,"Referente Consegna",null,null,null,null,null,null,null,1,null,"ref1",{"$f":"IF(D11>0,0,1)","v":1},null,"Verifica Errori",null,{"$f":"N7+N9","v":1}]
[null,null,null,null,null,null,null,null,null,1]
[null,"Telefono",null,"email",null,null,null,null,null,1,null,"tel1",{"$f":"IF(C13>0,0,1)","v":1},"mail1",{"$f":"IF(E13>0,0,1)","v":1}]
[null,null,null,null,null,null,null,null,null,1]
[null,null,null,null,null,null,null,null,null,1]
[null,"Referente Installazione",null,null,null,null,null,null,null,1,null,"ref2",{"$f":"IF(D16>0,0,1)","v":1}]
[null,null,null,null,null,null,null,null,null,1]
[null,"Telefono",null,"email",null,null,null,null,null,1,null,"tel2",{"$f":"IF(C18>0,0,1)","v":1},"mail2",{"$f":"IF(E18>0,0,1)","v":1}]
[null,null,null,null,null,null,null,null,null,1]
[null,null,null,null,null,null,null,null,null,1,null,null,"Server1","Server2","Server3","Totale"]
{"$rows_left_out":49}
{"sheet":"Configurazione","index":6,"n_rows":64,"n_cols":24,"rows_kept":64,"cut":false,"hidden":false,"merged":[[57,1,57,8],[59,1,59,3],[59,6,59,8],[42,1,42,2],[43,1,54,2],[42,4,42,5],[43,4,54,5],[42,7,42,8],[43,7,54,8]]}
[null,null,null,null,null,null,null,null,null,null,null,null,null,null,null,null,null,null,null,null,null,1]
[null,{"$f":"Riepilogo!M22","v":0},"PowerEdge T340 Configurazione 1",null,{"$f":"Riepilogo!N22","v":0},"PowerEdge T340 Configurazione 2",null,{"$f":"Riepilogo!O22","v":0},"PowerEdge T340 Configurazione 3",null,null,null,null,null,null,null,null,null,null,null,null,1]
[null,null,null,null,null,null,null,null,null,null,null,null,null,null,null,null,null,null,null,null,null,{"$f":"IF($U$4>0,1,0)","v":0}]
[null,{"$f":"IF(Riepilogo!M23>0,Riepilogo!M23/$B$2,\"\")","v":""},{"$f":"IF(B4=\"\",\"\",Riepilogo!K23)","v":""},null,{"$f":"IF(Riepilogo!N23>0,Riepilogo!N23/$E$2,\"\")","v":""},{"$f":"IF(E4=\"\",\"\",Riepilogo!K23)","v":""},null,{"$f":"IF(Riepilogo!O23>0,Riepilogo!O23/$H$2,\"\")","v":""},{"$f":"IF(H4=\"\",\"\",Riepilogo!K23)","v":""},null,null,{"$f":"IF(B4=\"\",0,B4)","v":0},null,null,{"$f":"IF(E4=\"\",0,E4)","v":0},null,null,{"$f":"IF(H4=\"\",0,H4)","v":0},null,null,{"$f":"SUM(L4:T4)","v":0},{"$f":"IF(U4>0,1,0)","v":0},{"$f":"ISODD(V4)","v":false}]
[null,{"$f":"IF(Riepilogo!M24>0,Riepilogo!M24/$B$2,\"\")","v":""},{"$f":"IF(B5=\"\",\"\",Riepilogo!K24)","v":""},null,{"$f":"IF(Riepilogo!N24>0,Riepilogo!N24/$E$2,\"\")","v":""},{"$f":"IF(E5=\"\",\"\",Riepilogo!K24)","v":""},null,{"$f":"IF(Riepilogo!O24>0,Riepilogo!O24/$H$2,\"\")","v":""},{"$f":"IF(H5=\"\",\"\",Riepilogo!K24)","v":""},null,null,{"$f":"IF(B5=\"\",0,B5)","v":0},null,null,{"$f":"IF(E5=\"\",0,E5)","v":0},null,null,{"$f":"IF(H5=\"\",0,H5)","v":0},null,null,{"$f":"SUM(L5:T5)","v":0},{"$f":"IF(U5>0,1,0)","v":0},{"$f":"ISODD(SUM($V$4:V5))","v":false}]
[null,{"$f":"IF(Riepilogo!M25>0,Riepilogo!M25/$B$2,\"\")","v":""},{"$f":"IF(B6=\"\",\"\",Riepilogo!K25)","v":""},null,{"$f":"IF(Riepilogo!N25>0,Riepilogo!N25/$E$2,\"\")","v":""},{"$f":"IF(E6=\"\",\"\",Riepilogo!K25)","v":""},null,{"$f":"IF(Riepilogo!O25>0,Riepilogo!O25/$H$2,\"\")","v":""},{"$f":"IF(H6=\"\",\"\",Riepilogo!K25)","v":""},null,null,0,null,null,0,null,null,0,null,null,0,0,{"$f":"ISODD(SUM($V$4:V6))","v":false}]
[null,{"$f":"IF(Riepilogo!M26>0,Riepilogo!M26/$B$2,\"\")","v":""},{"$f":"IF(B7=\"\",\"\",Riepilogo!K26)","v":""},null,{"$f":"IF(Riepilogo!N26>0,Riepilogo!N26/$E$2,\"\")","v":""},{"$f":"IF(E7=\"\",\"\",Riepilogo!K26)","v":""},null,{"$f":"IF(Riepilogo!O26>0,Riepilogo!O26/$H$2,\"\")","v":""},{"$f":"IF(H7=\"\",\"\",Riepilogo!K26)","v":""},null,null,0,null,null,0,null,null,0,null,null,0,0,{"$f":"ISODD(SUM($V$4:V7))","v":false}]
[null,{"$f":"IF(Riepilogo!M27>0,Riepilogo!M27/$B$2,\"\")","v":""},{"$f":"IF(B8=\"\",\"\",Riepilogo!K27)","v":""},null,{"$f":"IF(Riepilogo!N27>0,Riepilogo!N27/$E$2,\"\")","v":""},{"$f":"IF(E8=\"\",\"\",Riepilogo!K27)","v":""},null,{"$f":"IF(Riepilogo!O27>0,Riepilogo!O27/$H$2,\"\")","v":""},{"$f":"IF(H8=\"\",\"\",Riepilogo!K27)","v":""},null,null,0,null,null,0,null,null,0,null,null,0,0,{"$f":"ISODD(SUM($V$4:V8))","v":false}]
[null,{"$f":"IF(Riepilogo!M28>0,Riepilogo!M28/$B$2,\"\")","v":""},{"$f":"IF(B9=\"\",\"\",Riepilogo!K28)","v":""},null,{"$f":"IF(Riepilogo!N28>0,Riepilogo!N28/$E$2,\"\")","v":""},{"$f":"IF(E9=\"\",\"\",Riepilogo!K28)","v":""},null,{"$f":"IF(Riepilogo!O28>0,Riepilogo!O28/$H$2,\"\")","v":""},{"$f":"IF(H9=\"\",\"\",Riepilogo!K28)","v":""},null,null,0,null,null,0,null,null,0,null,null,0,0,{"$f":"ISODD(SUM($V$4:V9))","v":false}]
[null,{"$f":"IF(Riepilogo!M29>0,Riepilogo!M29/$B$2,\"\")","v":""},{"$f":"IF(B10=\"\",\"\",Riepilogo!K29)","v":""},null,{"$f":"IF(Riepilogo!N29>0,Riepilogo!N29/$E$2,\"\")","v":""},{"$f":"IF(E10=\"\",\"\",Riepilogo!K29)","v":""},null,{"$f":"IF(Riepilogo!O29>0,Riepilogo!O29/$H$2,\"\")","v":""},{"$f":"IF(H10=\"\",\"\",Riepilogo!K29)","v":""},null,null,0,null,null,0,null,null,0,null,null,0,0,{"$f":"ISODD(SUM($V$4:V10))","v":false}]
[null,{"$f":"IF(Riepilogo!M30>0,Riepilogo!M30/$B$2,\"\")","v":""},{"$f":"IF(B11=\"\",\"\",Riepilogo!K30)","v":""},null,{"$f":"IF(Riepilogo!N30>0,Riepilogo!N30/$E$2,\"\")","v":""},{"$f":"IF(E11=\"\",\"\",Riepilogo!K30)","v":""},null,{"$f":"IF(Riepilogo!O30>0,Riepilogo!O30/$H$2,\"\")","v":""},{"$f":"IF(H11=\"\",\"\",Riepilogo!K30)","v":""},null,null,0,null,null,0,null,null,0,null,null,0,0,{"$f":"ISODD(SUM($V$4:V11))","v":false}]
[null,{"$f":"IF(Riepilogo!M31>0,Riepilogo!M31/$B$2,\"\")","v":""},{"$f":"IF(B12=\"\",\"\",Riepilogo!K31)","v":""},null,{"$f":"IF(Riepilogo!N31>0,Riepilogo!N31/$E$2,\"\")","v":""},{"$f":"IF(E12=\"\",\"\",Riepilogo!K31)","v":""},null,{"$f":"IF(Riepilogo!O31>0,Riepilogo!O31/$H$2,\"\")","v":""},{"$f":"IF(H12=\"\",\"\",Riepilogo!K31)","v":""},null,null,0,null,null,0,null,null,0,null,null,0,0,{"$f":"ISODD(SUM($V$4:V12))","v":false}]
[null,{"$f":"IF(Riepilogo!M32>0,Riepilogo!M32/$B$2,\"\")","v":""},{"$f":"IF(B13=\"\",\"\",Riepilogo!K32)","v":""},null,{"$f":"IF(Riepilogo!N32>0,Riepilogo!N32/$E$2,\"\")","v":""},{"$f":"IF(E13=\"\",\"\",Riepilogo!K32)","v":""},null,{"$f":"IF(Riepilogo!O32>0,Riepilogo!O32/$H$2,\"\")","v":""},{"$f":"IF(H13=\"\",\"\",Riepilogo!K32)","v":""},null,null,0,null,null,0,null,null,0,null,null,0,0,{"$f":"ISODD(SUM($V$4:V13))","v":false}]
[null,{"$f":"IF(Riepilogo!M33>0,Riepilogo!M33/$B$2,\"\")","v":""},{"$f":"IF(B14=\"\",\"\",Riepilogo!K33)","v":""},null,{"$f":"IF(Riepilogo!N33>0,Riepilogo!N33/$E$2,\"\")","v":""},{"$f":"IF(E14=\"\",\"\",Riepilogo!K33)","v":""},null,{"$f":"IF(Riepilogo!O33>0,Riepilogo!O33/$H$2,\"\")","v":""},{"$f":"IF(H14=\"\",\"\",Riepilogo!K33)","v":""},null,null,0,null,null,0,null,null,0,null,null,0,0,{"$f":"ISODD(SUM($V$4:V14))","v":false}]
[null,{"$f":"IF(Riepilogo!M34>0,Riepilogo!M34/$B$2,\"\")","v":""},{"$f":"IF(B15=\"\",\"\",Riepilogo!K34)","v":""},null,{"$f":"IF(Riepilogo!N34>0,Riepilogo!N34/$E$2,\"\")","v":""},{"$f":"IF(E15=\"\",\"\",Riepilogo!K34)","v":""},null,{"$f":"IF(Riepilogo!O34>0,Riepilogo!O34/$H$2,\"\")","v":""},{"$f":"IF(H15=\"\",\"\",Riepilogo!K34)","v":""},null,null,0,null,null,0,null,null,0,null,null,0,0,{"$f":"ISODD(SUM($V$4:V15))","v":false}]
[null,{"$f":"IF(Riepilogo!M35>0,Riepilogo!M35/$B$2,\"\")","v":""},{"$f":"IF(B16=\"\",\"\",Riepilogo!K35)","v":""},null,{"$f":"IF(Riepilogo!N35>0,Riepilogo!N35/$E$2,\"\")","v":""},{"$f":"IF(E16=\"\",\"\",Riepilogo!K35)","v":""},null,{"$f":"IF(Riepilogo!O35>0,Riepilogo!O35/$H$2,\"\")","v":""},{"$f":"IF(H16=\"\",\"\",Riepilogo!K35)","v":""},null,null,0,null,null,0,null,null,0,null,null,0,0,{"$f":"ISODD(SUM($V$4:V16))","v":false}]
[null,{"$f":"IF(Riepilogo!M36>0,Riepilogo!M36/$B$2,\"\")","v":""},{"$f":"IF(B17=\"\",\"\",Riepilogo!K36)","v":""},null,{"$f":"IF(Riepilogo!N36>0,Riepilogo!N36/$E$2,\"\")","v":""},{"$f":"IF(E17=\"\",\"\",Riepilogo!K36)","v":""},null,{"$f":"IF(Riepilogo!O36>0,Riepilogo!O36/$H$2,\"\")","v":""},{"$f":"IF(H17=\"\",\"\",Riepilogo!K36)","v":""},null,null,0,null,null,0,null,null,0,null,null,0,0,{"$f":"ISODD(SUM($V$4:V17))","v":false}]
[null,{"$f":"IF(Riepilogo!M37>0,Riepilogo!M37/$B$2,\"\")","v":""},{"$f":"IF(B18=\"\",\"\",Riepilogo!K37)","v":""},null,{"$f":"IF(Riepilogo!N37>0,Riepilogo!N37/$E$2,\"\")","v":""},{"$f":"IF(E18=\"\",\"\",Riepilogo!K37)","v":""},null,{"$f":"IF(Riepilogo!O37>0,Riepilogo!O37/$H$2,\"\")","v":""},{"$f":"IF(H18=\"\",\"\",Riepilogo!K37)","v":""},null,null,0,null,null,0,null,null,0,null,null,0,0,{"$f":"ISODD(SUM($V$4:V18))","v":false}]
[null,{"$f":"IF(Riepilogo!M38>0,Riepilogo!M38/$B$2,\"\")","v":""},{"$f":"IF(B19=\"\",\"\",Riepilogo!K38)","v":""},null,{"$f":"IF(Riepilogo!N38>0,Riepilogo!N38/$E$2,\"\")","v":""},{"$f":"IF(E19=\"\",\"\",Riepilogo!K38)","v":""},null,{"$f":"IF(Riepilogo!O38>0,Riepilogo!O38/$H$2,\"\")","v":""},{"$f":"IF(H19=\"\",\"\",Riepilogo!K38)","v":""},null,null,0,null,null,0,null,null,0,null,null,0,0,{"$f":"ISODD(SUM($V$4:V19))","v":false}]
[null,{"$f":"IF(Riepilogo!M39>0,Riepilogo!M39/$B$2,\"\")","v":""},{"$f":"IF(B20=\"\",\"\",Riepilogo!K39)","v":""},null,{"$f":"IF(Riepilogo!N39>0,Riepilogo!N39/$E$2,\"\")","v":""},{"$f":"IF(E20=\"\",\"\",Riepilogo!K39)","v":""},null,{"$f":"IF(Riepilogo!O39>0,Riepilogo!O39/$H$2,\"\")","v":""},{"$f":"IF(H20=\"\",\"\",Riepilogo!K39)","v":""},null,null,0,null,null,0,null,null,0,null,null,0,0,{"$f":"ISODD(SUM($V$4:V20))","v":false}]
{"$rows_left_out":44}