{"text_format":"1","workbook":"xlsx","n_sheets":8,"sheets":["Lotto2_T640_1","Lotto2_T640_2","Lotto2_T640_3","ConfigurationTS3L2","Tabella_prezzi","Altre_Opzioni","Riepilogo","Configurazione"],"not_rendered":{"charts":0,"images":16,"macros":1,"external_links":0,"defined_names":26,"comments":0,"pivot_tables":0},"unopened":[],"bounds":{"document_bytes":16777216,"sheet_cells":100000,"rows_first":2000,"rows_last":500,"rows_between":2000,"halvings":0,"cell_chars":16384,"cell_head_chars":4096},"cells_cut":0,"cells_raw":0,"read":"whole","date_system":"1900"}

{"sheet":"Lotto2_T640_1","index":0,"n_rows":100,"n_cols":17,"rows_kept":100,"cut":false,"hidden":false,"merged":[[29,7,39,7],[30,2,31,2],[6,3,7,3],[9,3,10,3],[15,3,16,3],[27,3,28,3],[46,3,47,3],[88,3,89,3],[91,3,92,3],[95,3,96,3],[98,3,99,3]]}
[null,null,null,null,"Convenzione",{"$f":"SUM(I8:I100)*F5","v":0}]
[null,null,null,null,0.2,{"$f":"SUM(J8:J100)*F5","v":0}]
[null,null,null,null,"Totale",{"$f":"SUM(F1:F2)","v":0}]
[]
[null,null,"POWEREDGE T640          Consulta la Guida alla Convenzione --->",{"$f":"HYPERLINK(\"https://convenzioni.converge.it/docs/L2GuidaAllaConvenzioneTecnologieServer3.pdf\",\"&\")","v":"&"},"Quantità Server",null,null,{"$f":"Riepilogo!G8","v":"Version 3.3"}]
[]
[null,null,"Base",{"$f":"HYPERLINK(\"https://convenzioni.converge.it/docs/ts3_datasheet/dell-emc-poweredge-t640-spec-sheet.pdf\",\"i\")","v":"i"}]
[null,null,"PowerEdge T640 Server",null,{"$f":"IF($F$5>0,\"TS3L2-SRV\",\"\")","v":""},{"$f":"IF($F$5>0,1,\"\")","v":""},null,null,{"$f":"VLOOKUP($C8,TS3L2_ALL,10,FALSE)","v":2088},null,{"$f":"VLOOKUP($C8,TS3L2_ALL,12,FALSE)","v":"L2N01"}]
[]
[null,null,"Chassis Configuration",{"$f":"HYPERLINK(\"https://dellservervr.dell.com/poweredge-t640/\",\"i\")","v":"i"}]
[null,null,"Chassis with up to 16 x 2.5\" SAS/ SATA Hard Drives, Tower Configuration",null,{"$f":"VLOOKUP($C$11,TS3L2_Chassis,13,FALSE)","v":""},{"$f":"VLOOKUP($C$11,TS3L2_Chassis,7,FALSE)","v":""},null,null,{"$f":"VLOOKUP($C$11,TS3L2_Chassis,10,FALSE)","v":0},{"$f":"VLOOKUP($C11,TS3L2_Chassis,11,FALSE)","v":0},{"$f":"VLOOKUP($C11,TS3L2_Chassis,12,FALSE)","v":""}]
[]
[null,null,"Trusted Platform Module (TPM)"]
[null,null,"Trusted Platform Module 2.0"]
[]
[null,null,"Processor",{"$f":"HYPERLINK(\"https://ark.intel.com/content/www/it/it/ark/products/193385/intel-xeon-silver-4214-processor-16-5m-cache-2-20-ghz.html\",\"i\")","v":"i"}]
[null,null,"Intel Xeon Silver 4214 2.2G, 12C/24T, 9.6GT/s, 16.5M Cache, Turbo, HT (85W)"]
[]
[null,null,"Additional Processor"]
[null,null,"No Additional Processor",null,{"$f":"VLOOKUP($C$20,TS3L2_CPU,13,FALSE)","v":""},{"$f":"VLOOKUP($C$20,TS3L2_CPU,7,FALSE)","v":0},null,null,{"$f":"VLOOKUP($C$20,TS3L2_CPU,10,FALSE)","v":0},null,{"$f":"VLOOKUP($C20,TS3L2_ALL,12,FALSE)","v":""}]
[]
[null,null,"Memory Capacity"]
[null,null,"32GB",null,{"$f":"VLOOKUP($C$23,TS3L2_RAM,13,FALSE)","v":""},{"$f":"VLOOKUP($C$23,TS3L2_RAM,7,FALSE)","v":0},null,null,{"$f":"VLOOKUP($C$23,TS3L2_RAM,10,FALSE)","v":0},null,{"$f":"VLOOKUP($C23,TS3L2_ALL,12,FALSE)","v":""}]
[]
[null,null,"Operating System"]
[null,null,"No Operating System",null,{"$f":"VLOOKUP($C$26,TS3L2_OS,13,FALSE)","v":""},{"$f":"VLOOKUP($C$26,TS3L2_OS,7,FALSE)","v":""},null,null,{"$f":"VLOOKUP($C$26,TS3L2_OS,10,FALSE)","v":0},null,{"$f":"VLOOKUP($C26,TS3L2_ALL,12,FALSE)","v":""}]
[null,null,null,null,{"$f":"IF(F20=1,VLOOKUP($C$26,TS3L2_OS,20,FALSE),\"\")","v":""},{"$f":"IF(F20=1,VLOOKUP($C$26,TS3L2_OS,14,FALSE),0)","v":0},null,null,{"$f":"IF(F20=1,VLOOKUP($C$26,TS3L2_OS,17,FALSE),0)","v":0},null,{"$f":"IF(F20=1,VLOOKUP($C26,TS3L2_OS,19,FALSE),\"\")","v":""}]
[null,null,"Raid Controller",{"$f":"IF(J29>0,HYPERLINK(\"https://convenzioni.converge.it/docs/ts3_datasheet/dellemc-poweredge-raid-controller-h740p.pdf\",\"i\"),HYPERLINK(\"https://convenzioni.converge.it/docs/ts3_datasheet/DELL_H730.pdf\",\"i\"))","v":"i"}]
[null,null,"PERC H730P+ Adapter RAID Controller, 2GB",null,{"$f":"VLOOKUP($C$29,TS3L2_ALL,13,FALSE)","v":""},{"$f":"VLOOKUP($C$29,TS3L2_ALL,7,FALSE)","v":""},null,"Configurazione RAID e/o NOTE",{"$f":"VLOOKUP($C$29,TS3L2_ALL,10,FALSE)","v":0},{"$f":"VLOOKUP($C$29,TS3L2_ALL,11,FALSE)","v":0},{"$f":"VLOOKUP($C29,TS3L2_ALL,12,FALSE)","v":""}]
[null,null,null,null,null,null,null,"Specificare la configurazione RAID per l'installazione del Sistema Operativo, se richiesto.\ne/o\ninserire eventuali note."]
[null,null,"Hard Drivers Bays disponibili n° 16",null,"Usati","Disponibili"]
[null,null,null,null,{"$f":"F34+F36+F38+F40+F42","v":2},{"$f":"16-E32","v":14}]
[]
[null,null,"2.4TB 10K RPM SAS 12Gbps 512e 2.5in Hot-plug",null,{"$f":"VLOOKUP($C34,TS3L2_HDD,13,FALSE)","v":"TS3L2-HDD2TB"},null,null,null,{"$f":"VLOOKUP($C34,TS3L2_HDD,10,FALSE)*F34","v":0},{"$f":"VLOOKUP($C34,TS3L2_HDD,11,FALSE)","v":0},{"$f":"VLOOKUP($C34,TS3L2_ALL,12,FALSE)","v":"L2N05"}]
[]
[null,null,{"$f":"ConfigurationTS3L2!A44","v":"1.2TB 10K RPM SAS 12Gbps 2.5in Hot-plug"},null,{"$f":"VLOOKUP($C36,TS3L2_HDD,13,FALSE)","v":"TS3L2-HDD1TB"},null,null,null,{"$f":"VLOOKUP($C36,TS3L2_HDD,10,FALSE)*F36","v":0},{"$f":"VLOOKUP($C36,TS3L2_HDD,11,FALSE)","v":0},{"$f":"VLOOKUP($C36,TS3L2_ALL,12,FALSE)","v":"L2N06"}]
[]
[null,null,{"$f":"ConfigurationTS3L2!A45","v":"300GB 15K RPM SAS 12Gbps 2.5in Hot-plug"},null,{"$f":"VLOOKUP($C38,TS3L2_HDD,13,FALSE)","v":"TS3L2-HDD300GB"},null,null,null,{"$f":"VLOOKUP($C38,TS3L2_HDD,10,FALSE)*F38","v":0},{"$f":"VLOOKUP($C38,TS3L2_HDD,11,FALSE)","v":0},{"$f":"VLOOKUP($C38,TS3L2_ALL,12,FALSE)","v":"L2N07"}]
[]
[null,null,{"$f":"ConfigurationTS3L2!A46","v":"960GB SSD SAS Read Intensive 12Gbps 2.5in Hot-plug"},null,{"$f":"VLOOKUP($C40,TS3L2_HDD,13,FALSE)","v":"TS3L2-RI800GB"},2,null,null,{"$f":"IF(F40>2,(VLOOKUP($C40,TS3L2_HDD,10,FALSE)*(F40-2)),0)","v":0},{"$f":"VLOOKUP($C40,TS3L2_HDD,11,FALSE)","v":0},{"$f":"VLOOKUP($C40,TS3L2_ALL,12,FALSE)","v":"L2N08"}]
[]
[null,null,{"$f":"ConfigurationTS3L2!A47","v":"480GB SSD SAS Read Intensive 12Gbps 2.5in Hot-plug"},null,{"$f":"VLOOKUP($C42,TS3L2_HDD,13,FALSE)","v":"TS3L2-RI400GB"},null,null,null,{"$f":"IF(F42>2,VLOOKUP($C42,TS3L2_HDD,10,FALSE)*(F42-2),0)","v":0},{"$f":"VLOOKUP($C42,TS3L2_HDD,11,FALSE)","v":0},{"$f":"VLOOKUP($C42,TS3L2_ALL,12,FALSE)","v":"L2N09"}]
[]
[null,null,"Power Supply"]
[null,null,"Dual, Hot-plug, Redundant Power Supply (1+1), 750W"]
[]
[null,null,"Embedded Systems Management",{"$f":"HYPERLINK(\"https://convenzioni.converge.it/docs/ts3_datasheet/idrac-spec-sheet.pdf\",\"i\")","v":"i"}]
[null,null,"iDRAC9,Enterprise"]
[]
[null,null,"Network Cards"]
[null,null,"On-Board Dual-Port 10GbE LOM"]
[]
[null,null,"PCI Slot 1 Processor 1 x16 PCIe Gen3 for FH/FL"]
[null,null,"",null,{"$f":"VLOOKUP($C54,TS3L2_PCI1,13,FALSE)","v":""},{"$f":"VLOOKUP($C54,TS3L2_PCI1,7,FALSE)","v":""},null,null,{"$f":"VLOOKUP($C54,TS3L2_PCI1,10,FALSE)","v":0},{"$f":"VLOOKUP($C54,TS3L2_PCI1,11,FALSE)","v":0},{"$f":"VLOOKUP($C54,TS3L2_ALL,12,FALSE)","v":""}]
[]
[null,null,"PCI Slot 2 Processor 1 x4 PCIe Gen3 for FH/FL "]
[null,null,"",null,{"$f":"VLOOKUP($C57,TS3L2_PCI2,13,FALSE)","v":""},{"$f":"VLOOKUP($C57,TS3L2_PCI2,7,FALSE)","v":""},null,null,{"$f":"VLOOKUP($C57,TS3L2_PCI2,10,FALSE)","v":0},{"$f":"VLOOKUP($C57,TS3L2_PCI2,11,FALSE)","v":0},{"$f":"VLOOKUP($C57,TS3L2_ALL,12,FALSE)","v":""}]
[]
[null,null,"PCI Slot 3 Processor 1 x16 PCIe Gen3 for FH/FL "]
[null,null,"",null,{"$f":"VLOOKUP($C60,TS3L2_PCI3,13,FALSE)","v":""},{"$f":"VLOOKUP($C60,TS3L2_PCI3,7,FALSE)","v":""},null,null,{"$f":"VLOOKUP($C60,TS3L2_PCI3,10,FALSE)","v":0},{"$f":"VLOOKUP($C60,TS3L2_PCI3,11,FALSE)","v":0},{"$f":"VLOOKUP($C60,TS3L2_ALL,12,FALSE)","v":""}]
[]
[null,null,"PCI Slot 4 Processor 2 x8 PCIe Gen3 for FH/FL "]
[null,null,"",null,{"$f":"IF($I$20>0,VLOOKUP($C63,TS3L2_PCI4,13,FALSE),\"\")","v":""},{"$f":"IF($I$20>0,VLOOKUP($C63,TS3L2_PCI4,7,FALSE),\"\")","v":""},null,null,{"$f":"IF($I$20>0,VLOOKUP($C63,TS3L2_PCI4,10,FALSE),0)","v":0},{"$f":"IF($I$20>0,VLOOKUP($C63,TS3L2_PCI4,11,FALSE),0)","v":0},{"$f":"IF($I$20>0,VLOOKUP($C63,TS3L2_ALL,12,FALSE),0)","v":0}]
[]
[null,null,"PCI Slot 5 Processor 2 x4 PCIe Gen3 for FH/FL"]
[null,null,"",null,{"$f":"IF($I$20>0,VLOOKUP($C66,TS3L2_PCI5,13,FALSE),\"\")","v":""},{"$f":"IF($I$20>0,VLOOKUP($C66,TS3L2_PCI5,7,FALSE),\"\")","v":""},null,null,{"$f":"IF($I$20>0,VLOOKUP($C66,TS3L2_PCI5,10,FALSE),0)","v":0},{"$f":"IF($I$20>0,VLOOKUP($C66,TS3L2_PCI5,11,FALSE),0)","v":0},{"$f":"IF($I$20>0,VLOOKUP($C66,TS3L2_ALL,12,FALSE),0)","v":0}]
[]
[null,null,"PCI Slot 6 Processor 2 x16 PCIe Gen3 for FH/FL"]
[null,null,"",null,{"$f":"IF($I$20>0,VLOOKUP($C69,TS3L2_PCI6,13,FALSE),\"\")","v":""},{"$f":"IF($I$20>0,VLOOKUP($C69,TS3L2_PCI6,7,FALSE),\"\")","v":""},null,null,{"$f":"IF($I$20>0,VLOOKUP($C69,TS3L2_PCI6,10,FALSE),0)","v":0},{"$f":"IF($I$20>0,VLOOKUP($C69,TS3L2_PCI6,11,FALSE),0)","v":0},{"$f":"IF($I$20>0,VLOOKUP($C69,TS3L2_ALL,12,FALSE),0)","v":0}]
[]
[null,null,"PCI Slot 7 Processor 2 x8 PCIe Gen3 for FH/FL"]
[null,null,"",null,{"$f":"IF($I$20>0,VLOOKUP($C72,TS3L2_PCI7,13,FALSE),\"\")","v":""},{"$f":"IF($I$20>0,VLOOKUP($C72,TS3L2_PCI7,7,FALSE),\"\")","v":""},null,null,{"$f":"IF($I$20>0,VLOOKUP($C72,TS3L2_PCI7,10,FALSE),0)","v":0},{"$f":"IF($I$20>0,VLOOKUP($C72,TS3L2_PCI7,11,FALSE),0)","v":0},{"$f":"IF($I$20>0,VLOOKUP($C72,TS3L2_ALL,12,FALSE),0)","v":0}]
[]
[null,null,"PCI Slot 8 Processor 2 x16 PCIe Gen3 for FH/FL"]
[null,null,"",null,{"$f":"IF($I$20>0,VLOOKUP($C75,TS3L2_PCI8,13,FALSE),\"\")","v":""},{"$f":"IF($I$20>0,VLOOKUP($C75,TS3L2_PCI8,7,FALSE),\"\")","v":""},null,null,{"$f":"IF($I$20>0,VLOOKUP($C75,TS3L2_PCI8,10,FALSE),0)","v":0},{"$f":"IF($I$20>0,VLOOKUP($C75,TS3L2_PCI8,11,FALSE),0)","v":0},{"$f":"IF(I$20>0,VLOOKUP($C75,TS3L2_ALL,12,FALSE),0)","v":0}]
[]
[null,null,"SFP+ Transceivers"]
[null,null,"Transceiver, SFP+, 10GbE, SR, 850nm Wavelength, 300m ",null,{"$f":"IF(J78>0,VLOOKUP($C78,ConfigurationTS3L2!$A$1:$M$4993,13,FALSE),\"\")","v":""},null,null,null,0,{"$f":"F78*ConfigurationTS3L2!K121","v":0},{"$f":"IF(F78>0,VLOOKUP($C78,TS3L2_ALL,12,FALSE),0)","v":0}]
[]
[null,null,"SFP+ Direct Attach Cables (Twinax)"]
[null,null,"Cable, SFP+ to SFP+, 10GbE, Copper Twinax Direct Attach Cable, 3 Meter",null,{"$f":"IF(J81>0,VLOOKUP($C81,ConfigurationTS3L2!$A$1:$M$4993,13,FALSE),\"\")","v":""},null,null,null,0,{"$f":"F81*ConfigurationTS3L2!K120","v":0},{"$f":"IF(F81>0,VLOOKUP($C81,TS3L2_ALL,12,FALSE),0)","v":0}]
[]
[null,null,"Cavi RJ45"]
[null,null,"Cavo “patch” di 3 mt RJ45 certificato per gigabit ethernet",null,{"$f":"IF(J84>0,VLOOKUP($C84,ConfigurationTS3L2!$A$1:$M$4993,13,FALSE),\"\")","v":"TS3L2-RJ453M"},3,null,null,0,{"$f":"IF(F84>1,(F84-1)*ConfigurationTS3L2!K119,0)","v":6},{"$f":"IF(F84>0,VLOOKUP($C84,TS3L2_ALL,12,FALSE),0)","v":"L2N26"}]
[]
[null,null,"Bezel"]
[null,null,"No Bezel",null,{"$f":"IF(J87>0,VLOOKUP($C87,ConfigurationTS3L2!$A$1:$M$4993,13,FALSE),\"\")","v":""},{"$f":"IF(C87=ConfigurationTS3L2!A151,\"\",VLOOKUP($C87,TS3L2_BEZEL,7,FALSE))","v":""},null,null,{"$f":"IF(C87=ConfigurationTS3L2!A151,0,VLOOKUP($C87,TS3L2_BEZEL,10,FALSE))","v":0},{"$f":"IF(C87=ConfigurationTS3L2!A151,0,VLOOKUP($C87,TS3L2_BEZEL,11,FALSE))","v":0},{"$f":"IF(C87=ConfigurationTS3L2!A151,0,VLOOKUP($C87,TS3L2_ALL,12,FALSE))","v":""}]
[]
[null,null,"Warranty",{"$f":"HYPERLINK(\"https://convenzioni.converge.it/docs/ts3_datasheet/TS3warranty.pdf\",\"i\")","v":"i"}]
[null,null,"Manutenzione in garanzia (36 mesi)",null,{"$f":"VLOOKUP($C90,TS3L2_WARRANTY,13,FALSE)","v":""},{"$f":"VLOOKUP($C90,TS3L2_WARRANTY,7,FALSE)","v":""},null,null,{"$f":"VLOOKUP($C90,TS3L2_WARRANTY,10,FALSE)","v":0},{"$f":"VLOOKUP($C90,TS3L2_WARRANTY,11,FALSE)","v":0},{"$f":"VLOOKUP($C90,TS3L2_ALL,12,FALSE)","v":""}]
[]
[null,null,"Hard Disk Retention",{"$f":"HYPERLINK(\"https://convenzioni.converge.it/docs/ts3_datasheet/DELL_HDD_KYHD.pdf\",\"i\")","v":"i"}]
[null,null,"",null,{"$f":"IFERROR(N93,VLOOKUP(C93,TS3L2_ALL,13,FALSE))","v":""},{"$f":"IF(C93=\"\",\"\",1)","v":""},null,null,{"$f":"IFERROR(O93,VLOOKUP(C93,TS3L2_ALL,10,FALSE))","v":0},{"$f":"IFERROR(P93,VLOOKUP(C93,TS3L2_ALL,11,FALSE))","v":0},{"$f":"IFERROR(Q93,VLOOKUP(C93,TS3L2_ALL,12,FALSE))","v":""},null,null,{"$f":"IF(F90+F93=2,VLOOKUP(\"Hard Disk Retention (60 mesi)\",TS3L2_ALL,13,FALSE),VLOOKUP(C93,TS3L2_ALL,13,FALSE))","v":{"$error":"#VALUE!"}},{"$f":"IF(F90+F93=2,VLOOKUP(\"Hard Disk Retention (60 mesi)\",TS3L2_ALL,10,FALSE),VLOOKUP(C93,TS3L2_ALL,10,FALSE))","v":{"$error":"#VALUE!"}},{"$f":"IF(F90+F93=2,VLOOKUP(\"Hard Disk Retention (60 mesi)\",TS3L2_ALL,11,FALSE),VLOOKUP(C93,TS3L2_ALL,11,FALSE))","v":{"$error":"#VALUE!"}},{"$f":"IF(F90+F93=2,VLOOKUP(\"Hard Disk Retention (60 mesi)\",TS3L2_ALL,12,FALSE),VLOOKUP(C93,TS3L2_ALL,12,FALSE))","v":{"$error":"#VALUE!"}}]
[]
[]
[null,null,"UPS",{"$f":"HYPERLINK(\"https://convenzioni.converge.it/docs/ts3_datasheet/RPMM_UPS.pdf\",\"i\")","v":"i"}]
[null,null,"",null,{"$f":"VLOOKUP($C97,TS3L2_UPS,13,FALSE)","v":""},{"$f":"VLOOKUP($C97,TS3L2_UPS,7,FALSE)","v":""},null,null,{"$f":"VLOOKUP($C97,TS3L2_UPS,10,FALSE)","v":0},{"$f":"VLOOKUP($C97,TS3L2_UPS,11,FALSE)","v":0},{"$f":"VLOOKUP($C97,TS3L2_ALL,12,FALSE)","v":""}]
[]
[null,null,"Kit Graphical User Interface",{"$f":"HYPERLINK(\"https://convenzioni.converge.it/docs/ts3_datasheet/Dell_E1916H.pdf\",\"i\")","v":"i"}]
[null,null,"",null,{"$f":"VLOOKUP($C100,TS3L2_GUI,13,FALSE)","v":""},{"$f":"VLOOKUP($C100,TS3L2_GUI,7,FALSE)","v":""},null,null,{"$f":"VLOOKUP($C100,TS3L2_GUI,10,FALSE)","v":0},{"$f":"VLOOKUP($C100,TS3L2_GUI,11,FALSE)","v":0},{"$f":"VLOOKUP($C100,TS3L2_ALL,12,FALSE)","v":""}]

{"sheet":"Lotto2_T640_2","index":1,"n_rows":100,"n_cols":17,"rows_kept":100,"cut":false,"hidden":false,"merged":[[29,7,39,7],[30,2,31,2],[6,3,7,3],[9,3,10,3],[15,3,16,3],[27,3,28,3],[46,3,47,3],[88,3,89,3],[91,3,92,3],[95,3,96,3],[98,3,99,3]]}
[null,null,null,null,"Convenzione",{"$f":"SUM(I8:I100)*F5","v":0}]
[null,null,null,null,0.2,{"$f":"SUM(J8:J100)*F5","v":0}]
[null,null,null,null,"Totale",{"$f":"SUM(F1:F2)","v":0}]
[]
[null,null,"POWEREDGE T640          Consulta la Guida alla Convenzione --->",{"$f":"HYPERLINK(\"https://convenzioni.converge.it/docs/L2GuidaAllaConvenzioneTecnologieServer3.pdf\",\"&\")","v":"&"},"Quantità Server",null,null,{"$f":"Riepilogo!G8","v":"Version 3.3"}]
[]
[null,null,"Base",{"$f":"HYPERLINK(\"https://convenzioni.converge.it/docs/ts3_datasheet/dell-emc-poweredge-t640-spec-sheet.pdf\",\"i\")","v":"i"}]
[null,null,"PowerEdge T640 Server",null,{"$f":"IF($F$5>0,\"TS3L2-SRV\",\"\")","v":""},{"$f":"IF($F$5>0,1,\"\")","v":""},null,null,{"$f":"VLOOKUP($C8,TS3L2_ALL,10,FALSE)","v":2088},null,{"$f":"VLOOKUP($C8,TS3L2_ALL,12,FALSE)","v":"L2N01"}]
[]
[null,null,"Chassis Configuration",{"$f":"HYPERLINK(\"https://dellservervr.dell.com/poweredge-t640/\",\"i\")","v":"i"}]
[null,null,"Chassis with up to 16 x 2.5\" SAS/ SATA Hard Drives, Tower Configuration",null,{"$f":"VLOOKUP($C$11,TS3L2_Chassis,13,FALSE)","v":""},{"$f":"VLOOKUP($C$11,TS3L2_Chassis,7,FALSE)","v":""},null,null,{"$f":"VLOOKUP($C$11,TS3L2_Chassis,10,FALSE)","v":0},{"$f":"VLOOKUP($C11,TS3L2_Chassis,11,FALSE)","v":0},{"$f":"VLOOKUP($C11,TS3L2_Chassis,12,FALSE)","v":""}]
[]
[null,null,"Trusted Platform Module (TPM)"]
[null,null,"Trusted Platform Module 2.0"]
[]
[null,null,"Processor",{"$f":"HYPERLINK(\"https://ark.intel.com/content/www/it/it/ark/products/193385/intel-xeon-silver-4214-processor-16-5m-cache-2-20-ghz.html\",\"i\")","v":"i"}]
[null,null,"Intel Xeon Silver 4214 2.2G, 12C/24T, 9.6GT/s, 16.5M Cache, Turbo, HT (85W)"]
[]
[null,null,"Additional Processor"]
[null,null,"No Additional Processor",null,{"$f":"VLOOKUP($C$20,TS3L2_CPU,13,FALSE)","v":""},{"$f":"VLOOKUP($C$20,TS3L2_CPU,7,FALSE)","v":0},null,null,{"$f":"VLOOKUP($C$20,TS3L2_CPU,10,FALSE)","v":0},null,{"$f":"VLOOKUP($C20,TS3L2_ALL,12,FALSE)","v":""}]
[]
[null,null,"Memory Capacity"]
[null,null,"32GB",null,{"$f":"VLOOKUP($C$23,TS3L2_RAM,13,FALSE)","v":""},{"$f":"VLOOKUP($C$23,TS3L2_RAM,7,FALSE)","v":0},null,null,{"$f":"VLOOKUP($C$23,TS3L2_RAM,10,FALSE)","v":0},null,{"$f":"VLOOKUP($C23,TS3L2_ALL,12,FALSE)","v":""}]
[]
[null,null,"Operating System"]
[null,null,"No Operating System",null,{"$f":"VLOOKUP($C$26,TS3L2_OS,13,FALSE)","v":""},{"$f":"VLOOKUP($C$26,TS3L2_OS,7,FALSE)","v":""},null,null,{"$f":"VLOOKUP($C$26,TS3L2_OS,10,FALSE)","v":0},null,{"$f":"VLOOKUP($C26,TS3L2_ALL,12,FALSE)","v":""}]
[null,null,null,null,{"$f":"IF(F20=1,VLOOKUP($C$26,TS3L2_OS,20,FALSE),\"\")","v":""},{"$f":"IF(F20=1,VLOOKUP($C$26,TS3L2_OS,14,FALSE),0)","v":0},null,null,{"$f":"IF(F20=1,VLOOKUP($C$26,TS3L2_OS,17,FALSE),0)","v":0},null,{"$f":"IF(F20=1,VLOOKUP($C26,TS3L2_OS,19,FALSE),\"\")","v":""}]
[null,null,"Raid Controller",{"$f":"IF(J29>0,HYPERLINK(\"https://convenzioni.converge.it/docs/ts3_datasheet/dellemc-poweredge-raid-controller-h740p.pdf\",\"i\"),HYPERLINK(\"https://convenzioni.converge.it/docs/ts3_datasheet/DELL_H730.pdf\",\"i\"))","v":"i"}]
[null,null,"PERC H730P+ Adapter RAID Controller, 2GB",null,{"$f":"VLOOKUP($C$29,TS3L2_ALL,13,FALSE)","v":""},{"$f":"VLOOKUP($C$29,TS3L2_ALL,7,FALSE)","v":""},null,"Configurazione RAID e/o NOTE",{"$f":"VLOOKUP($C$29,TS3L2_ALL,10,FALSE)","v":0},{"$f":"VLOOKUP($C$29,TS3L2_ALL,11,FALSE)","v":0},{"$f":"VLOOKUP($C29,TS3L2_ALL,12,FALSE)","v":""}]
[null,null,null,null,null,null,null,"Specificare la configurazione RAID per l'installazione del Sistema Operativo, se richiesto.\ne/o\ninserire eventuali note."]
[null,null,"Hard Drivers Bays disponibili n° 16",null,"Usati","Disponibili"]
[null,null,null,null,{"$f":"F34+F36+F38+F40+F42","v":2},{"$f":"16-E32","v":14}]
[]
[null,null,"2.4TB 10K RPM SAS 12Gbps 512e 2.5in Hot-plug",null,{"$f":"VLOOKUP($C34,TS3L2_HDD,13,FALSE)","v":"TS3L2-HDD2TB"},null,null,null,{"$f":"VLOOKUP($C34,TS3L2_HDD,10,FALSE)*F34","v":0},{"$f":"VLOOKUP($C34,TS3L2_HDD,11,FALSE)","v":0},{"$f":"VLOOKUP($C34,TS3L2_ALL,12,FALSE)","v":"L2N05"}]
[]
[null,null,{"$f":"ConfigurationTS3L2!A44","v":"1.2TB 10K RPM SAS 12Gbps 2.5in Hot-plug"},null,{"$f":"VLOOKUP($C36,TS3L2_HDD,13,FALSE)","v":"TS3L2-HDD1TB"},null,null,null,{"$f":"VLOOKUP($C36,TS3L2_HDD,10,FALSE)*F36","v":0},{"$f":"VLOOKUP($C36,TS3L2_HDD,11,FALSE)","v":0},{"$f":"VLOOKUP($C36,TS3L2_ALL,12,FALSE)","v":"L2N06"}]
[]
[null,null,{"$f":"ConfigurationTS3L2!A45","v":"300GB 15K RPM SAS 12Gbps 2.5in Hot-plug"},null,{"$f":"VLOOKUP($C38,TS3L2_HDD,13,FALSE)","v":"TS3L2-HDD300GB"},null,null,null,{"$f":"VLOOKUP($C38,TS3L2_HDD,10,FALSE)*F38","v":0},{"$f":"VLOOKUP($C38,TS3L2_HDD,11,FALSE)","v":0},{"$f":"VLOOKUP($C38,TS3L2_ALL,12,FALSE)","v":"L2N07"}]
[]
[null,null,{"$f":"ConfigurationTS3L2!A46","v":"960GB SSD SAS Read Intensive 12Gbps 2.5in Hot-plug"},null,{"$f":"VLOOKUP($C40,TS3L2_HDD,13,FALSE)","v":"TS3L2-RI800GB"},2,null,null,{"$f":"IF(F40>2,(VLOOKUP($C40,TS3L2_HDD,10,FALSE)*(F40-2)),0)","v":0},{"$f":"VLOOKUP($C40,TS3L2_HDD,11,FALSE)","v":0},{"$f":"VLOOKUP($C40,TS3L2_ALL,12,FALSE)","v":"L2N08"}]
[]
[null,null,{"$f":"ConfigurationTS3L2!A47","v":"480GB SSD SAS Read Intensive 12Gbps 2.5in Hot-plug"},null,{"$f":"VLOOKUP($C42,TS3L2_HDD,13,FALSE)","v":"TS3L2-RI400GB"},null,null,null,{"$f":"IF(F42>2,VLOOKUP($C42,TS3L2_HDD,10,FALSE)*(F42-2),0)","v":0},{"$f":"VLOOKUP($C42,TS3L2_HDD,11,FALSE)","v":0},{"$f":"VLOOKUP($C42,TS3L2_ALL,12,FALSE)","v":"L2N09"}]
[]
[null,null,"Power Supply"]
[null,null,"Dual, Hot-plug, Redundant Power Supply (1+1), 750W"]
[]
[null,null,"Embedded Systems Management",{"$f":"HYPERLINK(\"https://convenzioni.converge.it/docs/ts3_datasheet/idrac-spec-sheet.pdf\",\"i\")","v":"i"}]
[null,null,"iDRAC9,Enterprise"]
[]
[null,null,"Network Cards"]
[null,null,"On-Board Dual-Port 10GbE LOM"]
[]
[null,null,"PCI Slot 1 Processor 1 x16 PCIe Gen3 for FH/FL"]
[null,null,"",null,{"$f":"VLOOKUP($C54,TS3L2_PCI1,13,FALSE)","v":""},{"$f":"VLOOKUP($C54,TS3L2_PCI1,7,FALSE)","v":""},null,null,{"$f":"VLOOKUP($C54,TS3L2_PCI1,10,FALSE)","v":0},{"$f":"VLOOKUP($C54,TS3L2_PCI1,11,FALSE)","v":0},{"$f":"VLOOKUP($C54,TS3L2_ALL,12,FALSE)","v":""}]
[]
[null,null,"PCI Slot 2 Processor 1 x4 PCIe Gen3 for FH/FL "]
[null,null,"",null,{"$f":"VLOOKUP($C57,TS3L2_PCI2,13,FALSE)","v":""},{"$f":"VLOOKUP($C57,TS3L2_PCI2,7,FALSE)","v":""},null,null,{"$f":"VLOOKUP($C57,TS3L2_PCI2,10,FALSE)","v":0},{"$f":"VLOOKUP($C57,TS3L2_PCI2,11,FALSE)","v":0},{"$f":"VLOOKUP($C57,TS3L2_ALL,12,FALSE)","v":""}]
[]
[null,null,"PCI Slot 3 Processor 1 x16 PCIe Gen3 for FH/FL "]
[null,null,"",null,{"$f":"VLOOKUP($C60,TS3L2_PCI3,13,FALSE)","v":""},{"$f":"VLOOKUP($C60,TS3L2_PCI3,7,FALSE)","v":""},null,null,{"$f":"VLOOKUP($C60,TS3L2_PCI3,10,FALSE)","v":0},{"$f":"VLOOKUP($C60,TS3L2_PCI3,11,FALSE)","v":0},{"$f":"VLOOKUP($C60,TS3L2_ALL,12,FALSE)","v":""}]
[]
[null,null,"PCI Slot 4 Processor 2 x8 PCIe Gen3 for FH/FL "]
[null,null,"",null,{"$f":"IF($I$20>0,VLOOKUP($C63,TS3L2_PCI4,13,FALSE),\"\")","v":""},{"$f":"IF($I$20>0,VLOOKUP($C63,TS3L2_PCI4,7,FALSE),\"\")","v":""},null,null,{"$f":"IF($I$20>0,VLOOKUP($C63,TS3L2_PCI4,10,FALSE),0)","v":0},{"$f":"IF($I$20>0,VLOOKUP($C63,TS3L2_PCI4,11,FALSE),0)","v":0},{"$f":"IF($I$20>0,VLOOKUP($C63,TS3L2_ALL,12,FALSE),0)","v":0}]
[]
[null,null,"PCI Slot 5 Processor 2 x4 PCIe Gen3 for FH/FL"]
[null,null,"",null,{"$f":"IF($I$20>0,VLOOKUP($C66,TS3L2_PCI5,13,FALSE),\"\")","v":""},{"$f":"IF($I$20>0,VLOOKUP($C66,TS3L2_PCI5,7,FALSE),\"\")","v":""},null,null,{"$f":"IF($I$20>0,VLOOKUP($C66,TS3L2_PCI5,10,FALSE),0)","v":0},{"$f":"IF($I$20>0,VLOOKUP($C66,TS3L2_PCI5,11,FALSE),0)","v":0},{"$f":"IF($I$20>0,VLOOKUP($C66,TS3L2_ALL,12,FALSE),0)","v":0}]
[]
[null,null,"PCI Slot 6 Processor 2 x16 PCIe Gen3 for FH/FL"]
[null,null,"",null,{"$f":"IF($I$20>0,VLOOKUP($C69,TS3L2_PCI6,13,FALSE),\"\")","v":""},{"$f":"IF($I$20>0,VLOOKUP($C69,TS3L2_PCI6,7,FALSE),\"\")","v":""},null,null,{"$f":"IF($I$20>0,VLOOKUP($C69,TS3L2_PCI6,10,FALSE),0)","v":0},{"$f":"IF($I$20>0,VLOOKUP($C69,TS3L2_PCI6,11,FALSE),0)","v":0},{"$f":"IF($I$20>0,VLOOKUP($C69,TS3L2_ALL,12,FALSE),0)","v":0}]
[]
[null,null,"PCI Slot 7 Processor 2 x8 PCIe Gen3 for FH/FL"]
[null,null,"",null,{"$f":"IF($I$20>0,VLOOKUP($C72,TS3L2_PCI7,13,FALSE),\"\")","v":""},{"$f":"IF($I$20>0,VLOOKUP($C72,TS3L2_PCI7,7,FALSE),\"\")","v":""},null,null,{"$f":"IF($I$20>0,VLOOKUP($C72,TS3L2_PCI7,10,FALSE),0)","v":0},{"$f":"IF($I$20>0,VLOOKUP($C72,TS3L2_PCI7,11,FALSE),0)","v":0},{"$f":"IF($I$20>0,VLOOKUP($C72,TS3L2_ALL,12,FALSE),0)","v":0}]
[]
[null,null,"PCI Slot 8 Processor 2 x16 PCIe Gen3 for FH/FL"]
[null,null,"",null,{"$f":"IF($I$20>0,VLOOKUP($C75,TS3L2_PCI8,13,FALSE),\"\")","v":""},{"$f":"IF($I$20>0,VLOOKUP($C75,TS3L2_PCI8,7,FALSE),\"\")","v":""},null,null,{"$f":"IF($I$20>0,VLOOKUP($C75,TS3L2_PCI8,10,FALSE),0)","v":0},{"$f":"IF($I$20>0,VLOOKUP($C75,TS3L2_PCI8,11,FALSE),0)","v":0},{"$f":"IF(I$20>0,VLOOKUP($C75,TS3L2_ALL,12,FALSE),0)","v":0}]
[]
[null,null,"SFP+ Transceivers"]
[null,null,"Transceiver, SFP+, 10GbE, SR, 850nm Wavelength, 300m ",null,{"$f":"IF(J78>0,VLOOKUP($C78,ConfigurationTS3L2!$A$1:$M$4993,13,FALSE),\"\")","v":""},null,null,null,0,{"$f":"F78*ConfigurationTS3L2!K121","v":0},{"$f":"IF(F78>0,VLOOKUP($C78,TS3L2_ALL,12,FALSE),0)","v":0}]
[]
[null,null,"SFP+ Direct Attach Cables (Twinax)"]
[null,null,"Cable, SFP+ to SFP+, 10GbE, Copper Twinax Direct Attach Cable, 3 Meter",null,{"$f":"IF(J81>0,VLOOKUP($C81,ConfigurationTS3L2!$A$1:$M$4993,13,FALSE),\"\")","v":""},null,null,null,0,{"$f":"F81*ConfigurationTS3L2!K120","v":0},{"$f":"IF(F81>0,VLOOKUP($C81,TS3L2_ALL,12,FALSE),0)","v":0}]
[]
[null,null,"Cavi RJ45"]
[null,null,"Cavo “patch” di 3 mt RJ45 certificato per gigabit ethernet",null,{"$f":"IF(J84>0,VLOOKUP($C84,ConfigurationTS3L2!$A$1:$M$4993,13,FALSE),\"\")","v":"TS3L2-RJ453M"},3,null,null,0,{"$f":"IF(F84>1,(F84-1)*ConfigurationTS3L2!K119,0)","v":6},{"$f":"IF(F84>0,VLOOKUP($C84,TS3L2_ALL,12,FALSE),0)","v":"L2N26"}]
[]
[null,null,"Bezel"]
[null,null,"No Bezel",null,{"$f":"IF(J87>0,VLOOKUP($C87,ConfigurationTS3L2!$A$1:$M$4993,13,FALSE),\"\")","v":""},{"$f":"IF(C87=ConfigurationTS3L2!A151,\"\",VLOOKUP($C87,TS3L2_BEZEL,7,FALSE))","v":""},null,null,{"$f":"IF(C87=ConfigurationTS3L2!A151,0,VLOOKUP($C87,TS3L2_BEZEL,10,FALSE))","v":0},{"$f":"IF(C87=ConfigurationTS3L2!A151,0,VLOOKUP($C87,TS3L2_BEZEL,11,FALSE))","v":0},{"$f":"IF(C87=ConfigurationTS3L2!A151,0,VLOOKUP($C87,TS3L2_ALL,12,FALSE))","v":""}]
[]
[null,null,"Warranty",{"$f":"HYPERLINK(\"https://convenzioni.converge.it/docs/ts3_datasheet/TS3warranty.pdf\",\"i\")","v":"i"}]
[null,null,"Manutenzione in garanzia (36 mesi)",null,{"$f":"VLOOKUP($C90,TS3L2_WARRANTY,13,FALSE)","v":""},{"$f":"VLOOKUP($C90,TS3L2_WARRANTY,7,FALSE)","v":""},null,null,{"$f":"VLOOKUP($C90,TS3L2_WARRANTY,10,FALSE)","v":0},{"$f":"VLOOKUP($C90,TS3L2_WARRANTY,11,FALSE)","v":0},{"$f":"VLOOKUP($C90,TS3L2_ALL,12,FALSE)","v":""}]
[]
[null,null,"Hard Disk Retention",{"$f":"HYPERLINK(\"https://convenzioni.converge.it/docs/ts3_datasheet/DELL_HDD_KYHD.pdf\",\"i\")","v":"i"}]
[null,null,"",null,{"$f":"IFERROR($N$93,VLOOKUP($C93,TS3L2_ALL,13,FALSE))","v":""},{"$f":"IF(C93=\"\",\"\",1)","v":""},null,null,{"$f":"IFERROR($O$93,VLOOKUP($C93,TS3L2_ALL,10,FALSE))","v":0},{"$f":"IFERROR($P$93,VLOOKUP($C93,TS3L2_ALL,11,FALSE))","v":0},{"$f":"IFERROR($Q$93,VLOOKUP($C93,TS3L2_ALL,12,FALSE))","v":""},null,null,{"$f":"IF($F$90+$F$93=2,VLOOKUP(\"Hard Disk Retention (60 mesi)\",TS3L2_ALL,13,FALSE),VLOOKUP($C93,TS3L2_ALL,13,FALSE))","v":{"$error":"#VALUE!"}},{"$f":"IF($F$90+$F$93=2,VLOOKUP(\"Hard Disk Retention (60 mesi)\",TS3L2_ALL,10,FALSE),VLOOKUP($C93,TS3L2_ALL,10,FALSE))","v":{"$error":"#VALUE!"}},{"$f":"IF($F$90+$F$93=2,VLOOKUP(\"Hard Disk Retention (60 mesi)\",TS3L2_ALL,11,FALSE),VLOOKUP($C93,TS3L2_ALL,11,FALSE))","v":{"$error":"#VALUE!"}},{"$f":"IF($F$90+$F$93=2,VLOOKUP(\"Hard Disk Retention (60 mesi)\",TS3L2_ALL,12,FALSE),VLOOKUP($C93,TS3L2_ALL,12,FALSE))","v":{"$error":"#VALUE!"}}]
[]
[]
[null,null,"UPS",{"$f":"HYPERLINK(\"https://convenzioni.converge.it/docs/ts3_datasheet/RPMM_UPS.pdf\",\"i\")","v":"i"}]
[null,null,"",null,{"$f":"VLOOKUP($C97,TS3L2_UPS,13,FALSE)","v":""},{"$f":"VLOOKUP($C97,TS3L2_UPS,7,FALSE)","v":""},null,null,{"$f":"VLOOKUP($C97,TS3L2_UPS,10,FALSE)","v":0},{"$f":"VLOOKUP($C97,TS3L2_UPS,11,FALSE)","v":0},{"$f":"VLOOKUP($C97,TS3L2_ALL,12,FALSE)","v":""}]
[]
[null,null,"Kit Graphical User Interface",{"$f":"HYPERLINK(\"https://convenzioni.converge.it/docs/ts3_datasheet/Dell_E1916H.pdf\",\"i\")","v":"i"}]
[null,null,"",null,{"$f":"VLOOKUP($C100,TS3L2_GUI,13,FALSE)","v":""},{"$f":"VLOOKUP($C100,TS3L2_GUI,7,FALSE)","v":""},null,null,{"$f":"VLOOKUP($C100,TS3L2_GUI,10,FALSE)","v":0},{"$f":"VLOOKUP($C100,TS3L2_GUI,11,FALSE)","v":0},{"$f":"VLOOKUP($C100,TS3L2_ALL,12,FALSE)","v":""}]

{"sheet":"Lotto2_T640_3","index":2,"n_rows":100,"n_cols":17,"rows_kept":100,"cut":false,"hidden":false,"merged":[[29,7,39,7],[30,2,31,2],[6,3,7,3],[9,3,10,3],[15,3,16,3],[27,3,28,3],[46,3,47,3],[88,3,89,3],[91,3,92,3],[95,3,96,3],[98,3,99,3]]}
[null,null,null,null,"Convenzione",{"$f":"SUM(I8:I100)*F5","v":0}]
[null,null,null,null,0.2,{"$f":"SUM(J8:J100)*F5","v":0}]
[null,null,null,null,"Totale",{"$f":"SUM(F1:F2)","v":0}]
[]
[null,null,"POWEREDGE T640          Consulta la Guida alla Convenzione --->",{"$f":"HYPERLINK(\"https://convenzioni.converge.it/docs/L2GuidaAllaConvenzioneTecnologieServer3.pdf\",\"&\")","v":"&"},"Quantità Server",null,null,{"$f":"Riepilogo!G8","v":"Version 3.3"}]
[]
[null,null,"Base",{"$f":"HYPERLINK(\"https://convenzioni.converge.it/docs/ts3_datasheet/dell-emc-poweredge-t640-spec-sheet.pdf\",\"i\")","v":"i"}]
[null,null,"PowerEdge T640 Server",null,{"$f":"IF($F$5>0,\"TS3L2-SRV\",\"\")","v":""},{"$f":"IF($F$5>0,1,\"\")","v":""},null,null,{"$f":"VLOOKUP($C8,TS3L2_ALL,10,FALSE)","v":2088},null,{"$f":"VLOOKUP($C8,TS3L2_ALL,12,FALSE)","v":"L2N01"}]
[]
[null,null,"Chassis Configuration",{"$f":"HYPERLINK(\"https://dellservervr.dell.com/poweredge-t640/\",\"i\")","v":"i"}]
[null,null,"Chassis with up to 16 x 2.5\" SAS/ SATA Hard Drives, Tower Configuration",null,{"$f":"VLOOKUP($C$11,TS3L2_Chassis,13,FALSE)","v":""},{"$f":"VLOOKUP($C$11,TS3L2_Chassis,7,FALSE)","v":""},null,null,{"$f":"VLOOKUP($C$11,TS3L2_Chassis,10,FALSE)","v":0},{"$f":"VLOOKUP($C11,TS3L2_Chassis,11,FALSE)","v":0},{"$f":"VLOOKUP($C11,TS3L2_Chassis,12,FALSE)","v":""}]
[]
[null,null,"Trusted Platform Module (TPM)"]
[null,null,"Trusted Platform Module 2.0"]
[]
[null,null,"Processor",{"$f":"HYPERLINK(\"https://ark.intel.com/content/www/it/it/ark/products/193385/intel-xeon-silver-4214-processor-16-5m-cache-2-20-ghz.html\",\"i\")","v":"i"}]
[null,null,"Intel Xeon Silver 4214 2.2G, 12C/24T, 9.6GT/s, 16.5M Cache, Turbo, HT (85W)"]
[]
[null,null,"Additional Processor"]
[null,null,"No Additional Processor",null,{"$f":"VLOOKUP($C$20,TS3L2_CPU,13,FALSE)","v":""},{"$f":"VLOOKUP($C$20,TS3L2_CPU,7,FALSE)","v":0},null,null,{"$f":"VLOOKUP($C$20,TS3L2_CPU,10,FALSE)","v":0},null,{"$f":"VLOOKUP($C20,TS3L2_ALL,12,FALSE)","v":""}]
[]
[null,null,"Memory Capacity"]
[null,null,"32GB",null,{"$f":"VLOOKUP($C$23,TS3L2_RAM,13,FALSE)","v":""},{"$f":"VLOOKUP($C$23,TS3L2_RAM,7,FALSE)","v":0},null,null,{"$f":"VLOOKUP($C$23,TS3L2_RAM,10,FALSE)","v":0},null,{"$f":"VLOOKUP($C23,TS3L2_ALL,12,FALSE)","v":""}]
[]
[null,null,"Operating System"]
[null,null,"No Operating System",null,{"$f":"VLOOKUP($C$26,TS3L2_OS,13,FALSE)","v":""},{"$f":"VLOOKUP($C$26,TS3L2_OS,7,FALSE)","v":""},null,null,{"$f":"VLOOKUP($C$26,TS3L2_OS,10,FALSE)","v":0},null,{"$f":"VLOOKUP($C26,TS3L2_ALL,12,FALSE)","v":""}]
[null,null,null,null,{"$f":"IF(F20=1,VLOOKUP($C$26,TS3L2_OS,20,FALSE),\"\")","v":""},{"$f":"IF(F20=1,VLOOKUP($C$26,TS3L2_OS,14,FALSE),0)","v":0},null,null,{"$f":"IF(F20=1,VLOOKUP($C$26,TS3L2_OS,17,FALSE),0)","v":0},null,{"$f":"IF(F20=1,VLOOKUP($C26,TS3L2_OS,19,FALSE),\"\")","v":""}]
[null,null,"Raid Controller",{"$f":"IF(J29>0,HYPERLINK(\"https://convenzioni.converge.it/docs/ts3_datasheet/dellemc-poweredge-raid-controller-h740p.pdf\",\"i\"),HYPERLINK(\"https://convenzioni.converge.it/docs/ts3_datasheet/DELL_H730.pdf\",\"i\"))","v":"i"}]
[null,null,"PERC H730P+ Adapter RAID Controller, 2GB",null,{"$f":"VLOOKUP($C$29,TS3L2_ALL,13,FALSE)","v":""},{"$f":"VLOOKUP($C$29,TS3L2_ALL,7,FALSE)","v":""},null,"Configurazione RAID e/o NOTE",{"$f":"VLOOKUP($C$29,TS3L2_ALL,10,FALSE)","v":0},{"$f":"VLOOKUP($C$29,TS3L2_ALL,11,FALSE)","v":0},{"$f":"VLOOKUP($C29,TS3L2_ALL,12,FALSE)","v":""}]
[null,null,null,null,null,null,null,"Specificare la configurazione RAID per l'installazione del Sistema Operativo, se richiesto.\ne/o\ninserire eventuali note."]
[null,null,"Hard Drivers Bays disponibili n° 16",null,"Usati","Disponibili"]
[null,null,null,null,{"$f":"F34+F36+F38+F40+F42","v":2},{"$f":"16-E32","v":14}]
[]
[null,null,"2.4TB 10K RPM SAS 12Gbps 512e 2.5in Hot-plug",null,{"$f":"VLOOKUP($C34,TS3L2_HDD,13,FALSE)","v":"TS3L2-HDD2TB"},null,null,null,{"$f":"VLOOKUP($C34,TS3L2_HDD,10,FALSE)*F34","v":0},{"$f":"VLOOKUP($C34,TS3L2_HDD,11,FALSE)","v":0},{"$f":"VLOOKUP($C34,TS3L2_ALL,12,FALSE)","v":"L2N05"}]
[]
[null,null,{"$f":"ConfigurationTS3L2!A44","v":"1.2TB 10K RPM SAS 12Gbps 2.5in Hot-plug"},null,{"$f":"VLOOKUP($C36,TS3L2_HDD,13,FALSE)","v":"TS3L2-HDD1TB"},null,null,null,{"$f":"VLOOKUP($C36,TS3L2_HDD,10,FALSE)*F36","v":0},{"$f":"VLOOKUP($C36,TS3L2_HDD,11,FALSE)","v":0},{"$f":"VLOOKUP($C36,TS3L2_ALL,12,FALSE)","v":"L2N06"}]
[]
[null,null,{"$f":"ConfigurationTS3L2!A45","v":"300GB 15K RPM SAS 12Gbps 2.5in Hot-plug"},null,{"$f":"VLOOKUP($C38,TS3L2_HDD,13,FALSE)","v":"TS3L2-HDD300GB"},null,null,null,{"$f":"VLOOKUP($C38,TS3L2_HDD,10,FALSE)*F38","v":0},{"$f":"VLOOKUP($C38,TS3L2_HDD,11,FALSE)","v":0},{"$f":"VLOOKUP($C38,TS3L2_ALL,12,FALSE)","v":"L2N07"}]
[]
[null,null,{"$f":"ConfigurationTS3L2!A46","v":"960GB SSD SAS Read Intensive 12Gbps 2.5in Hot-plug"},null,{"$f":"VLOOKUP($C40,TS3L2_HDD,13,FALSE)","v":"TS3L2-RI800GB"},2,null,null,{"$f":"IF(F40>2,(VLOOKUP($C40,TS3L2_HDD,10,FALSE)*(F40-2)),0)","v":0},{"$f":"VLOOKUP($C40,TS3L2_HDD,11,FALSE)","v":0},{"$f":"VLOOKUP($C40,TS3L2_ALL,12,FALSE)","v":"L2N08"}]
[]
[null,null,{"$f":"ConfigurationTS3L2!A47","v":"480GB SSD SAS Read Intensive 12Gbps 2.5in Hot-plug"},null,{"$f":"VLOOKUP($C42,TS3L2_HDD,13,FALSE)","v":"TS3L2-RI400GB"},null,null,null,{"$f":"IF(F42>2,VLOOKUP($C42,TS3L2_HDD,10,FALSE)*(F42-2),0)","v":0},{"$f":"VLOOKUP($C42,TS3L2_HDD,11,FALSE)","v":0},{"$f":"VLOOKUP($C42,TS3L2_ALL,12,FALSE)","v":"L2N09"}]
[]
[null,null,"Power Supply"]
[null,null,"Dual, Hot-plug, Redundant Power Supply (1+1), 750W"]
[]
[null,null,"Embedded Systems Management",{"$f":"HYPERLINK(\"https://convenzioni.converge.it/docs/ts3_datasheet/idrac-spec-sheet.pdf\",\"i\")","v":"i"}]
[null,null,"iDRAC9,Enterprise"]
[]
[null,null,"Network Cards"]
[null,null,"On-Board Dual-Port 10GbE LOM"]
[]
[null,null,"PCI Slot 1 Processor 1 x16 PCIe Gen3 for FH/FL"]
[null,null,"",null,{"$f":"VLOOKUP($C54,TS3L2_PCI1,13,FALSE)","v":""},{"$f":"VLOOKUP($C54,TS3L2_PCI1,7,FALSE)","v":""},null,null,{"$f":"VLOOKUP($C54,TS3L2_PCI1,10,FALSE)","v":0},{"$f":"VLOOKUP($C54,TS3L2_PCI1,11,FALSE)","v":0},{"$f":"VLOOKUP($C54,TS3L2_ALL,12,FALSE)","v":""}]
[]
[null,null,"PCI Slot 2 Processor 1 x4 PCIe Gen3 for FH/FL "]
[null,null,"",null,{"$f":"VLOOKUP($C57,TS3L2_PCI2,13,FALSE)","v":""},{"$f":"VLOOKUP($C57,TS3L2_PCI2,7,FALSE)","v":""},null,null,{"$f":"VLOOKUP($C57,TS3L2_PCI2,10,FALSE)","v":0},{"$f":"VLOOKUP($C57,TS3L2_PCI2,11,FALSE)","v":0},{"$f":"VLOOKUP($C57,TS3L2_ALL,12,FALSE)","v":""}]
[]
[null,null,"PCI Slot 3 Processor 1 x16 PCIe Gen3 for FH/FL "]
[null,null,"",null,{"$f":"VLOOKUP($C60,TS3L2_PCI3,13,FALSE)","v":""},{"$f":"VLOOKUP($C60,TS3L2_PCI3,7,FALSE)","v":""},null,null,{"$f":"VLOOKUP($C60,TS3L2_PCI3,10,FALSE)","v":0},{"$f":"VLOOKUP($C60,TS3L2_PCI3,11,FALSE)","v":0},{"$f":"VLOOKUP($C60,TS3L2_ALL,12,FALSE)","v":""}]
[]
[null,null,"PCI Slot 4 Processor 2 x8 PCIe Gen3 for FH/FL "]
[null,null,"",null,{"$f":"IF($I$20>0,VLOOKUP($C63,TS3L2_PCI4,13,FALSE),\"\")","v":""},{"$f":"IF($I$20>0,VLOOKUP($C63,TS3L2_PCI4,7,FALSE),\"\")","v":""},null,null,{"$f":"IF($I$20>0,VLOOKUP($C63,TS3L2_PCI4,10,FALSE),0)","v":0},{"$f":"IF($I$20>0,VLOOKUP($C63,TS3L2_PCI4,11,FALSE),0)","v":0},{"$f":"IF($I$20>0,VLOOKUP($C63,TS3L2_ALL,12,FALSE),0)","v":0}]
[]
[null,null,"PCI Slot 5 Processor 2 x4 PCIe Gen3 for FH/FL"]
[null,null,"",null,{"$f":"IF($I$20>0,VLOOKUP($C66,TS3L2_PCI5,13,FALSE),\"\")","v":""},{"$f":"IF($I$20>0,VLOOKUP($C66,TS3L2_PCI5,7,FALSE),\"\")","v":""},null,null,{"$f":"IF($I$20>0,VLOOKUP($C66,TS3L2_PCI5,10,FALSE),0)","v":0},{"$f":"IF($I$20>0,VLOOKUP($C66,TS3L2_PCI5,11,FALSE),0)","v":0},{"$f":"IF($I$20>0,VLOOKUP($C66,TS3L2_ALL,12,FALSE),0)","v":0}]
[]
[null,null,"PCI Slot 6 Processor 2 x16 PCIe Gen3 for FH/FL"]
[null,null,"",null,{"$f":"IF($I$20>0,VLOOKUP($C69,TS3L2_PCI6,13,FALSE),\"\")","v":""},{"$f":"IF($I$20>0,VLOOKUP($C69,TS3L2_PCI6,7,FALSE),\"\")","v":""},null,null,{"$f":"IF($I$20>0,VLOOKUP($C69,TS3L2_PCI6,10,FALSE),0)","v":0},{"$f":"IF($I$20>0,VLOOKUP($C69,TS3L2_PCI6,11,FALSE),0)","v":0},{"$f":"IF($I$20>0,VLOOKUP($C69,TS3L2_ALL,12,FALSE),0)","v":0}]
[]
[null,null,"PCI Slot 7 Processor 2 x8 PCIe Gen3 for FH/FL"]
[null,null,"",null,{"$f":"IF($I$20>0,VLOOKUP($C72,TS3L2_PCI7,13,FALSE),\"\")","v":""},{"$f":"IF($I$20>0,VLOOKUP($C72,TS3L2_PCI7,7,FALSE),\"\")","v":""},null,null,{"$f":"IF($I$20>0,VLOOKUP($C72,TS3L2_PCI7,10,FALSE),0)","v":0},{"$f":"IF($I$20>0,VLOOKUP($C72,TS3L2_PCI7,11,FALSE),0)","v":0},{"$f":"IF($I$20>0,VLOOKUP($C72,TS3L2_ALL,12,FALSE),0)","v":0}]
[]
[null,null,"PCI Slot 8 Processor 2 x16 PCIe Gen3 for FH/FL"]
[null,null,"",null,{"$f":"IF($I$20>0,VLOOKUP($C75,TS3L2_PCI8,13,FALSE),\"\")","v":""},{"$f":"IF($I$20>0,VLOOKUP($C75,TS3L2_PCI8,7,FALSE),\"\")","v":""},null,null,{"$f":"IF($I$20>0,VLOOKUP($C75,TS3L2_PCI8,10,FALSE),0)","v":0},{"$f":"IF($I$20>0,VLOOKUP($C75,TS3L2_PCI8,11,FALSE),0)","v":0},{"$f":"IF(I$20>0,VLOOKUP($C75,TS3L2_ALL,12,FALSE),0)","v":0}]
[]
[null,null,"SFP+ Transceivers"]
[null,null,"Transceiver, SFP+, 10GbE, SR, 850nm Wavelength, 300m ",null,{"$f":"IF(J78>0,VLOOKUP($C78,ConfigurationTS3L2!$A$1:$M$4993,13,FALSE),\"\")","v":""},null,null,null,0,{"$f":"F78*ConfigurationTS3L2!K121","v":0},{"$f":"IF(F78>0,VLOOKUP($C78,TS3L2_ALL,12,FALSE),0)","v":0}]
[]
[null,null,"SFP+ Direct Attach Cables (Twinax)"]
[null,null,"Cable, SFP+ to SFP+, 10GbE, Copper Twinax Direct Attach Cable, 3 Meter",null,{"$f":"IF(J81>0,VLOOKUP($C81,ConfigurationTS3L2!$A$1:$M$4993,13,FALSE),\"\")","v":""},null,null,null,0,{"$f":"F81*ConfigurationTS3L2!K120","v":0},{"$f":"IF(F81>0,VLOOKUP($C81,TS3L2_ALL,12,FALSE),0)","v":0}]
[]
[null,null,"Cavi RJ45"]
[null,null,"Cavo “patch” di 3 mt RJ45 certificato per gigabit ethernet",null,{"$f":"IF(J84>0,VLOOKUP($C84,ConfigurationTS3L2!$A$1:$M$4993,13,FALSE),\"\")","v":"TS3L2-RJ453M"},3,null,null,0,{"$f":"IF(F84>1,(F84-1)*ConfigurationTS3L2!K119,0)","v":6},{"$f":"IF(F84>0,VLOOKUP($C84,TS3L2_ALL,12,FALSE),0)","v":"L2N26"}]
[]
[null,null,"Bezel"]
[null,null,"No Bezel",null,{"$f":"IF(J87>0,VLOOKUP($C87,ConfigurationTS3L2!$A$1:$M$4993,13,FALSE),\"\")","v":""},{"$f":"IF(C87=ConfigurationTS3L2!A151,\"\",VLOOKUP($C87,TS3L2_BEZEL,7,FALSE))","v":""},null,null,{"$f":"IF(C87=ConfigurationTS3L2!A151,0,VLOOKUP($C87,TS3L2_BEZEL,10,FALSE))","v":0},{"$f":"IF(C87=ConfigurationTS3L2!A151,0,VLOOKUP($C87,TS3L2_BEZEL,11,FALSE))","v":0},{"$f":"IF(C87=ConfigurationTS3L2!A151,0,VLOOKUP($C87,TS3L2_ALL,12,FALSE))","v":""}]
[]
[null,null,"Warranty",{"$f":"HYPERLINK(\"https://convenzioni.converge.it/docs/ts3_datasheet/TS3warranty.pdf\",\"i\")","v":"i"}]
[null,null,"Manutenzione in garanzia (36 mesi)",null,{"$f":"VLOOKUP($C90,TS3L2_WARRANTY,13,FALSE)","v":""},{"$f":"VLOOKUP($C90,TS3L2_WARRANTY,7,FALSE)","v":""},null,null,{"$f":"VLOOKUP($C90,TS3L2_WARRANTY,10,FALSE)","v":0},{"$f":"VLOOKUP($C90,TS3L2_WARRANTY,11,FALSE)","v":0},{"$f":"VLOOKUP($C90,TS3L2_ALL,12,FALSE)","v":""}]
[]
[null,null,"Hard Disk Retention",{"$f":"HYPERLINK(\"https://convenzioni.converge.it/docs/ts3_datasheet/DELL_HDD_KYHD.pdf\",\"i\")","v":"i"}]
[null,null,"",null,{"$f":"IFERROR($N$93,VLOOKUP($C93,TS3L2_ALL,13,FALSE))","v":""},{"$f":"IF(C93=\"\",\"\",1)","v":""},null,null,{"$f":"IFERROR($O$93,VLOOKUP($C93,TS3L2_ALL,10,FALSE))","v":0},{"$f":"IFERROR($P$93,VLOOKUP($C93,TS3L2_ALL,11,FALSE))","v":0},{"$f":"IFERROR($Q$93,VLOOKUP($C93,TS3L2_ALL,12,FALSE))","v":""},null,null,{"$f":"IF($F$90+$F$93=2,VLOOKUP(\"Hard Disk Retention (60 mesi)\",TS3L2_ALL,13,FALSE),VLOOKUP($C93,TS3L2_ALL,13,FALSE))","v":{"$error":"#VALUE!"}},{"$f":"IF($F$90+$F$93=2,VLOOKUP(\"Hard Disk Retention (60 mesi)\",TS3L2_ALL,10,FALSE),VLOOKUP($C93,TS3L2_ALL,10,FALSE))","v":{"$error":"#VALUE!"}},{"$f":"IF($F$90+$F$93=2,VLOOKUP(\"Hard Disk Retention (60 mesi)\",TS3L2_ALL,11,FALSE),VLOOKUP($C93,TS3L2_ALL,11,FALSE))","v":{"$error":"#VALUE!"}},{"$f":"IF($F$90+$F$93=2,VLOOKUP(\"Hard Disk Retention (60 mesi)\",TS3L2_ALL,12,FALSE),VLOOKUP($C93,TS3L2_ALL,12,FALSE))","v":{"$error":"#VALUE!"}}]
[]
[]
[null,null,"UPS",{"$f":"HYPERLINK(\"https://convenzioni.converge.it/docs/ts3_datasheet/RPMM_UPS.pdf\",\"i\")","v":"i"}]
[null,null,"",null,{"$f":"VLOOKUP($C97,TS3L2_UPS,13,FALSE)","v":""},{"$f":"VLOOKUP($C97,TS3L2_UPS,7,FALSE)","v":""},null,null,{"$f":"VLOOKUP($C97,TS3L2_UPS,10,FALSE)","v":0},{"$f":"VLOOKUP($C97,TS3L2_UPS,11,FALSE)","v":0},{"$f":"VLOOKUP($C97,TS3L2_ALL,12,FALSE)","v":""}]
[]
[null,null,"Kit Graphical User Interface",{"$f":"HYPERLINK(\"https://convenzioni.converge.it/docs/ts3_datasheet/Dell_E1916H.pdf\",\"i\")","v":"i"}]
[null,null,"",null,{"$f":"VLOOKUP($C100,TS3L2_GUI,13,FALSE)","v":""},{"$f":"VLOOKUP($C100,TS3L2_GUI,7,FALSE)","v":""},null,null,{"$f":"VLOOKUP($C100,TS3L2_GUI,10,FALSE)","v":0},{"$f":"VLOOKUP($C100,TS3L2_GUI,11,FALSE)","v":0},{"$f":"VLOOKUP($C100,TS3L2_ALL,12,FALSE)","v":""}]

{"sheet":"ConfigurationTS3L2","index":3,"n_rows":154,"n_cols":20,"rows_kept":154,"cut":false,"hidden":true,"merged":[]}
[]
[null,"Module Name","Option ID","Option Name","Option List Price","SKUs","Qty","SKU Customer Kit","Attributo","Valore inserito",null,"N°","Codice Convenzione"]
["PowerEdge T640 Server",null,null,{"$f":"VLOOKUP(L3,Tabella_prezzi!$A$3:$J$308,8,FALSE)","v":"PowerEdge T640 Server"},null,null,null,{"$f":"VLOOKUP(L3,Tabella_prezzi!$A$3:$J$308,9,FALSE)","v":"L1N02-ServerT640"},{"$f":"VLOOKUP(L3,Tabella_prezzi!$A$3:$J$308,3,FALSE)","v":"Server Tower bi-processore"},{"$f":"VLOOKUP(L3,Tabella_prezzi!$A$3:$J$308,4,FALSE)","v":2088},null,"L2N01",{"$f":"VLOOKUP(L3,Tabella_prezzi!$A$3:$J$308,6,FALSE)","v":"TS3L2-SRV"}]
[]
["TS3L2_Chassis"]
["Chassis with up to 16 x 2.5\" SAS/ SATA Hard Drives, Tower Configuration",null,null,null,null,null,{"$f":"\"\"","v":""},null,{"$f":"\"\"","v":""},null,null,{"$f":"\"\"","v":""},{"$f":"\"\"","v":""}]
["Chassis with up to 16 x 2.5\" SAS/ SATA Hard Drives, Rack Configuration",null,null,{"$f":"VLOOKUP(L7,Tabella_prezzi!$A$3:$J$308,8,FALSE)","v":"Kit composto da: Tower to Rack Conversion Kit; Rack Standard Bezel; 3U Cable Management Arm; Ready Rails 3U Sliding Rails"},null,null,1,{"$f":"VLOOKUP(L7,Tabella_prezzi!$A$3:$J$308,9,FALSE)","v":"TS3-OpzA20T640K"},{"$f":"VLOOKUP(L7,Tabella_prezzi!$A$3:$J$308,3,FALSE)","v":"TS3-OpzA20RKit"},null,{"$f":"VLOOKUP(L7,Tabella_prezzi!$A$3:$J$308,4,FALSE)","v":270},"L2N22",{"$f":"VLOOKUP(L7,Tabella_prezzi!$A$3:$J$308,6,FALSE)","v":"TS3L2-RACKKIT"}]
[]
["TS3L2_CPU"]
["No Additional Processor",null,null,null,null,null,null,null,{"$f":"\"\"","v":""},null,null,{"$f":"\"\"","v":""},{"$f":"\"\"","v":""}]
["Intel Xeon Silver 4214 2.2G, 12C/24T, 9.6GT/s, 16.5M Cache, Turbo, HT (85W)",null,null,{"$f":"VLOOKUP(L11,Tabella_prezzi!$A$3:$J$308,8,FALSE)","v":"Intel® Xeon® Silver 4214 Processor 2.20 GHz, 12C/24T"},null,null,1,{"$f":"VLOOKUP(L11,Tabella_prezzi!$A$3:$J$308,9,FALSE)","v":"L2N02-OpzCPU"},{"$f":"VLOOKUP(L11,Tabella_prezzi!$A$3:$J$308,3,FALSE)","v":"Kit n. 1 Processore aggiuntivo"},{"$f":"VLOOKUP(L11,Tabella_prezzi!$A$3:$J$308,4,FALSE)","v":590},null,"L2N02",{"$f":"VLOOKUP(L11,Tabella_prezzi!$A$3:$J$308,6,FALSE)","v":"TS3L2-CPU"}]
[]
["TS3L2_RAM (1CPU)"]
["32GB","Memory Capacity",null,{"$f":"D15","v":"16GB 2Rx8 DDR4 RDIMM 3200MHz"},null,{"$f":"F15","v":"370-AEQF"},0,{"$f":"H15","v":"L2N03-OpzRAM16GB"},{"$f":"\"\"","v":""},null,null,{"$f":"\"\"","v":""},{"$f":"\"\"","v":""}]
["48GB","Memory Capacity",null,{"$f":"VLOOKUP(L15,Tabella_prezzi!$A$3:$J$308,8,FALSE)","v":"16GB 2Rx8 DDR4 RDIMM 3200MHz"},null,"370-AEQF",1,{"$f":"VLOOKUP(L15,Tabella_prezzi!$A$3:$J$308,9,FALSE)","v":"L2N03-OpzRAM16GB"},{"$f":"VLOOKUP(L15,Tabella_prezzi!$A$3:$J$308,3,FALSE)","v":"OpzRAM16GB"},{"$f":"VLOOKUP(L15,Tabella_prezzi!$A$3:$J$308,4,FALSE)*G15","v":99},null,"L2N03",{"$f":"VLOOKUP(L15,Tabella_prezzi!$A$3:$J$308,6,FALSE)","v":"TS3L2-RAM16"}]
["64GB","Memory Capacity",null,{"$f":"VLOOKUP(L16,Tabella_prezzi!$A$3:$J$308,8,FALSE)","v":"16GB 2Rx8 DDR4 RDIMM 3200MHz"},null,"370-AEQF",2,{"$f":"VLOOKUP(L16,Tabella_prezzi!$A$3:$J$308,9,FALSE)","v":"L2N03-OpzRAM16GB"},{"$f":"VLOOKUP(L16,Tabella_prezzi!$A$3:$J$308,3,FALSE)","v":"OpzRAM16GB"},{"$f":"VLOOKUP(L16,Tabella_prezzi!$A$3:$J$308,4,FALSE)*G16","v":198},null,"L2N03",{"$f":"VLOOKUP(L16,Tabella_prezzi!$A$3:$J$308,6,FALSE)","v":"TS3L2-RAM16"}]
["96GB","Memory Capacity",null,{"$f":"VLOOKUP(L17,Tabella_prezzi!$A$3:$J$308,8,FALSE)","v":"16GB 2Rx8 DDR4 RDIMM 3200MHz"},null,"370-AEQF",4,{"$f":"VLOOKUP(L17,Tabella_prezzi!$A$3:$J$308,9,FALSE)","v":"L2N03-OpzRAM16GB"},{"$f":"VLOOKUP(L17,Tabella_prezzi!$A$3:$J$308,3,FALSE)","v":"OpzRAM16GB"},{"$f":"VLOOKUP(L17,Tabella_prezzi!$A$3:$J$308,4,FALSE)*G17","v":396},null,"L2N03",{"$f":"VLOOKUP(L17,Tabella_prezzi!$A$3:$J$308,6,FALSE)","v":"TS3L2-RAM16"}]
["128GB","Memory Capacity",null,{"$f":"VLOOKUP(L18,Tabella_prezzi!$A$3:$J$308,8,FALSE)","v":"16GB 2Rx8 DDR4 RDIMM 3200MHz"},null,"370-AEQF",6,{"$f":"VLOOKUP(L18,Tabella_prezzi!$A$3:$J$308,9,FALSE)","v":"L2N03-OpzRAM16GB"},{"$f":"VLOOKUP(L18,Tabella_prezzi!$A$3:$J$308,3,FALSE)","v":"OpzRAM16GB"},{"$f":"VLOOKUP(L18,Tabella_prezzi!$A$3:$J$308,4,FALSE)*G18","v":594},null,"L2N03",{"$f":"VLOOKUP(L18,Tabella_prezzi!$A$3:$J$308,6,FALSE)","v":"TS3L2-RAM16"}]
["160GB","Memory Capacity",null,{"$f":"VLOOKUP(L19,Tabella_prezzi!$A$3:$J$308,8,FALSE)","v":"16GB 2Rx8 DDR4 RDIMM 3200MHz"},null,"370-AEQF",8,{"$f":"VLOOKUP(L19,Tabella_prezzi!$A$3:$J$308,9,FALSE)","v":"L2N03-OpzRAM16GB"},{"$f":"VLOOKUP(L19,Tabella_prezzi!$A$3:$J$308,3,FALSE)","v":"OpzRAM16GB"},{"$f":"VLOOKUP(L19,Tabella_prezzi!$A$3:$J$308,4,FALSE)*G19","v":792},null,"L2N03",{"$f":"VLOOKUP(L19,Tabella_prezzi!$A$3:$J$308,6,FALSE)","v":"TS3L2-RAM16"}]
["192GB","Memory Capacity",null,{"$f":"VLOOKUP(L20,Tabella_prezzi!$A$3:$J$308,8,FALSE)","v":"16GB 2Rx8 DDR4 RDIMM 3200MHz"},null,"370-AEQF",10,{"$f":"VLOOKUP(L20,Tabella_prezzi!$A$3:$J$308,9,FALSE)","v":"L2N03-OpzRAM16GB"},{"$f":"VLOOKUP(L20,Tabella_prezzi!$A$3:$J$308,3,FALSE)","v":"OpzRAM16GB"},{"$f":"VLOOKUP(L20,Tabella_prezzi!$A$3:$J$308,4,FALSE)*G20","v":990},null,"L2N03",{"$f":"VLOOKUP(L20,Tabella_prezzi!$A$3:$J$308,6,FALSE)","v":"TS3L2-RAM16"}]
[]
["TS3L2_RAM (2CPU)"]
["32GB","Memory Capacity",null,{"$f":"D24","v":"16GB 2Rx8 DDR4 RDIMM 3200MHz"},null,{"$f":"F24","v":"370-AEQF"},0,{"$f":"H24","v":"L2N03-OpzRAM16GB"},{"$f":"\"\"","v":""},null,null,{"$f":"\"\"","v":""},{"$f":"\"\"","v":""}]
["48GB","Memory Capacity",null,{"$f":"VLOOKUP(L24,Tabella_prezzi!$A$3:$J$308,8,FALSE)","v":"16GB 2Rx8 DDR4 RDIMM 3200MHz"},null,"370-AEQF",1,{"$f":"VLOOKUP(L24,Tabella_prezzi!$A$3:$J$308,9,FALSE)","v":"L2N03-OpzRAM16GB"},{"$f":"VLOOKUP(L24,Tabella_prezzi!$A$3:$J$308,3,FALSE)","v":"OpzRAM16GB"},{"$f":"VLOOKUP(L24,Tabella_prezzi!$A$3:$J$308,4,FALSE)","v":99},null,"L2N03",{"$f":"VLOOKUP(L24,Tabella_prezzi!$A$3:$J$308,6,FALSE)","v":"TS3L2-RAM16"}]
["64GB","Memory Capacity",null,{"$f":"VLOOKUP(L25,Tabella_prezzi!$A$3:$J$308,8,FALSE)","v":"16GB 2Rx8 DDR4 RDIMM 3200MHz"},null,"370-AEQF",2,{"$f":"VLOOKUP(L25,Tabella_prezzi!$A$3:$J$308,9,FALSE)","v":"L2N03-OpzRAM16GB"},{"$f":"VLOOKUP(L25,Tabella_prezzi!$A$3:$J$308,3,FALSE)","v":"OpzRAM16GB"},{"$f":"VLOOKUP(L25,Tabella_prezzi!$A$3:$J$308,4,FALSE)*G25","v":198},null,"L2N03",{"$f":"VLOOKUP(L25,Tabella_prezzi!$A$3:$J$308,6,FALSE)","v":"TS3L2-RAM16"}]
["96GB","Memory Capacity",null,{"$f":"VLOOKUP(L26,Tabella_prezzi!$A$3:$J$308,8,FALSE)","v":"16GB 2Rx8 DDR4 RDIMM 3200MHz"},null,"370-AEQF",4,{"$f":"VLOOKUP(L26,Tabella_prezzi!$A$3:$J$308,9,FALSE)","v":"L2N03-OpzRAM16GB"},{"$f":"VLOOKUP(L26,Tabella_prezzi!$A$3:$J$308,3,FALSE)","v":"OpzRAM16GB"},{"$f":"VLOOKUP(L26,Tabella_prezzi!$A$3:$J$308,4,FALSE)*G26","v":396},null,"L2N03",{"$f":"VLOOKUP(L26,Tabella_prezzi!$A$3:$J$308,6,FALSE)","v":"TS3L2-RAM16"}]
["128GB","Memory Capacity",null,{"$f":"VLOOKUP(L27,Tabella_prezzi!$A$3:$J$308,8,FALSE)","v":"16GB 2Rx8 DDR4 RDIMM 3200MHz"},null,"370-AEQF",6,{"$f":"VLOOKUP(L27,Tabella_prezzi!$A$3:$J$308,9,FALSE)","v":"L2N03-OpzRAM16GB"},{"$f":"VLOOKUP(L27,Tabella_prezzi!$A$3:$J$308,3,FALSE)","v":"OpzRAM16GB"},{"$f":"VLOOKUP(L27,Tabella_prezzi!$A$3:$J$308,4,FALSE)*G27","v":594},null,"L2N03",{"$f":"VLOOKUP(L27,Tabella_prezzi!$A$3:$J$308,6,FALSE)","v":"TS3L2-RAM16"}]
["160GB","Memory Capacity",null,{"$f":"VLOOKUP(L28,Tabella_prezzi!$A$3:$J$308,8,FALSE)","v":"16GB 2Rx8 DDR4 RDIMM 3200MHz"},null,"370-AEQF",8,{"$f":"VLOOKUP(L28,Tabella_prezzi!$A$3:$J$308,9,FALSE)","v":"L2N03-OpzRAM16GB"},{"$f":"VLOOKUP(L28,Tabella_prezzi!$A$3:$J$308,3,FALSE)","v":"OpzRAM16GB"},{"$f":"VLOOKUP(L28,Tabella_prezzi!$A$3:$J$308,4,FALSE)*G28","v":792},null,"L2N03",{"$f":"VLOOKUP(L28,Tabella_prezzi!$A$3:$J$308,6,FALSE)","v":"TS3L2-RAM16"}]
["192GB","Memory Capacity",null,{"$f":"VLOOKUP(L29,Tabella_prezzi!$A$3:$J$308,8,FALSE)","v":"16GB 2Rx8 DDR4 RDIMM 3200MHz"},null,"370-AEQF",10,{"$f":"VLOOKUP(L29,Tabella_prezzi!$A$3:$J$308,9,FALSE)","v":"L2N03-OpzRAM16GB"},{"$f":"VLOOKUP(L29,Tabella_prezzi!$A$3:$J$308,3,FALSE)","v":"OpzRAM16GB"},{"$f":"VLOOKUP(L29,Tabella_prezzi!$A$3:$J$308,4,FALSE)*G29","v":990},null,"L2N03",{"$f":"VLOOKUP(L29,Tabella_prezzi!$A$3:$J$308,6,FALSE)","v":"TS3L2-RAM16"}]
["224GB","Memory Capacity",null,{"$f":"VLOOKUP(L30,Tabella_prezzi!$A$3:$J$308,8,FALSE)","v":"16GB 2Rx8 DDR4 RDIMM 3200MHz"},null,"370-AEQF",12,{"$f":"VLOOKUP(L30,Tabella_prezzi!$A$3:$J$308,9,FALSE)","v":"L2N03-OpzRAM16GB"},{"$f":"VLOOKUP(L30,Tabella_prezzi!$A$3:$J$308,3,FALSE)","v":"OpzRAM16GB"},{"$f":"VLOOKUP(L30,Tabella_prezzi!$A$3:$J$308,4,FALSE)*G30","v":1188},null,"L2N03",{"$f":"VLOOKUP(L30,Tabella_prezzi!$A$3:$J$308,6,FALSE)","v":"TS3L2-RAM16"}]
["256GB","Memory Capacity",null,{"$f":"VLOOKUP(L31,Tabella_prezzi!$A$3:$J$308,8,FALSE)","v":"16GB 2Rx8 DDR4 RDIMM 3200MHz"},null,"370-AEQF",14,{"$f":"VLOOKUP(L31,Tabella_prezzi!$A$3:$J$308,9,FALSE)","v":"L2N03-OpzRAM16GB"},{"$f":"VLOOKUP(L31,Tabella_prezzi!$A$3:$J$308,3,FALSE)","v":"OpzRAM16GB"},{"$f":"VLOOKUP(L31,Tabella_prezzi!$A$3:$J$308,4,FALSE)*G31","v":1386},null,"L2N03",{"$f":"VLOOKUP(L31,Tabella_prezzi!$A$3:$J$308,6,FALSE)","v":"TS3L2-RAM16"}]
["320GB","Memory Capacity",null,{"$f":"VLOOKUP(L32,Tabella_prezzi!$A$3:$J$308,8,FALSE)","v":"16GB 2Rx8 DDR4 RDIMM 3200MHz"},null,"370-AEQF",18,{"$f":"VLOOKUP(L32,Tabella_prezzi!$A$3:$J$308,9,FALSE)","v":"L2N03-OpzRAM16GB"},{"$f":"VLOOKUP(L32,Tabella_prezzi!$A$3:$J$308,3,FALSE)","v":"OpzRAM16GB"},{"$f":"VLOOKUP(L32,Tabella_prezzi!$A$3:$J$308,4,FALSE)*G32","v":1782},null,"L2N03",{"$f":"VLOOKUP(L32,Tabella_prezzi!$A$3:$J$308,6,FALSE)","v":"TS3L2-RAM16"}]
["352GB","Memory Capacity",null,{"$f":"VLOOKUP(L33,Tabella_prezzi!$A$3:$J$308,8,FALSE)","v":"16GB 2Rx8 DDR4 RDIMM 3200MHz"},null,"370-AEQF",20,{"$f":"VLOOKUP(L33,Tabella_prezzi!$A$3:$J$308,9,FALSE)","v":"L2N03-OpzRAM16GB"},{"$f":"VLOOKUP(L33,Tabella_prezzi!$A$3:$J$308,3,FALSE)","v":"OpzRAM16GB"},{"$f":"VLOOKUP(L33,Tabella_prezzi!$A$3:$J$308,4,FALSE)*G33","v":1980},null,"L2N03",{"$f":"VLOOKUP(L33,Tabella_prezzi!$A$3:$J$308,6,FALSE)","v":"TS3L2-RAM16"}]
["384GB","Memory Capacity",null,{"$f":"VLOOKUP(L34,Tabella_prezzi!$A$3:$J$308,8,FALSE)","v":"16GB 2Rx8 DDR4 RDIMM 3200MHz"},null,"370-AEQF",22,{"$f":"VLOOKUP(L34,Tabella_prezzi!$A$3:$J$308,9,FALSE)","v":"L2N03-OpzRAM16GB"},{"$f":"VLOOKUP(L34,Tabella_prezzi!$A$3:$J$308,3,FALSE)","v":"OpzRAM16GB"},{"$f":"VLOOKUP(L34,Tabella_prezzi!$A$3:$J$308,4,FALSE)*G34","v":2178},null,"L2N03",{"$f":"VLOOKUP(L34,Tabella_prezzi!$A$3:$J$308,6,FALSE)","v":"TS3L2-RAM16"}]
[]
["TS3L2_OS"]
["No Operating System","Operating System",null,null,null,null,{"$f":"\"\"","v":""},null,{"$f":"\"\"","v":""},null,null,{"$f":"\"\"","v":""},{"$f":"\"\"","v":""},0,null,{"$f":"\"\"","v":""},{"$f":"\"\"","v":""},{"$f":"\"\"","v":""},{"$f":"\"\"","v":""},{"$f":"\"\"","v":""}]
["[TS3L2-WINSRVSTD] Windows Server® 2019 Standard","Operating System",null,{"$f":"VLOOKUP(L38,Tabella_prezzi!$A$3:$J$308,8,FALSE)","v":"Windows Server 2019 Standard, ROK, 16CORE"},null,null,1,{"$f":"VLOOKUP(L38,Tabella_prezzi!$A$3:$J$308,9,FALSE)","v":"L2N12-OpzWinServSTD"},{"$f":"VLOOKUP(L38,Tabella_prezzi!$A$3:$J$308,3,FALSE)","v":"OpzWinServSTD"},{"$f":"VLOOKUP(L38,Tabella_prezzi!$A$3:$J$308,4,FALSE)","v":732},null,"L2N12",{"$f":"VLOOKUP(L38,Tabella_prezzi!$A$3:$J$308,6,FALSE)","v":"TS3L2-WINSRVSTD"},4,{"$f":"VLOOKUP(S38,Tabella_prezzi!$A$3:$J$308,9,FALSE)","v":"L2N13-OpzWinServSTD2core"},{"$f":"VLOOKUP(S38,Tabella_prezzi!$A$3:$J$308,3,FALSE)","v":"OpzWinServSTD2core"},{"$f":"VLOOKUP(S38,Tabella_prezzi!$A$3:$J$308,4,FALSE)*N38","v":376},null,"L2N13",{"$f":"VLOOKUP(S38,Tabella_prezzi!$A$3:$J$308,6,FALSE)","v":"TS3L2-WINSRV2C"}]
["[TS3L2-LINUX] Ubuntu 18.04 LTS 64 Bit","Operating System",null,{"$f":"VLOOKUP(L39,Tabella_prezzi!$A$3:$J$308,8,FALSE)","v":"Ubuntu 18.04 LTS 64 Bit"},null,null,1,{"$f":"VLOOKUP(L39,Tabella_prezzi!$A$3:$J$308,9,FALSE)","v":"L2N16-OpzOpenSource"},{"$f":"VLOOKUP(L39,Tabella_prezzi!$A$3:$J$308,3,FALSE)","v":"OpzOpenSource"},{"$f":"VLOOKUP(L39,Tabella_prezzi!$A$3:$J$308,4,FALSE)","v":49},null,"L2N16",{"$f":"VLOOKUP(L39,Tabella_prezzi!$A$3:$J$308,6,FALSE)","v":"TS3L2-LINUX"},0,null,{"$f":"\"\"","v":""},{"$f":"\"\"","v":""},{"$f":"\"\"","v":""},{"$f":"\"\"","v":""},{"$f":"\"\"","v":""}]
[]
["TS3L2_HDD"]
[{"$f":"\"\"","v":""},null,null,null,null,null,{"$f":"\"\"","v":""},null,{"$f":"\"\"","v":""},null,null,{"$f":"\"\"","v":""},{"$f":"\"\"","v":""}]
["2.4TB 10K RPM SAS 12Gbps 512e 2.5in Hot-plug","Hard Drives",null,{"$f":"VLOOKUP(L43,Tabella_prezzi!$A$3:$J$308,8,FALSE)","v":"2.4TB 10K RPM SAS 12Gbps 512e 2.5in Hot-plug"},null,null,1,{"$f":"VLOOKUP(L43,Tabella_prezzi!$A$3:$J$308,9,FALSE)","v":"L2N05-OpzHDD2TB"},{"$f":"VLOOKUP(L43,Tabella_prezzi!$A$3:$J$308,3,FALSE)","v":"OpzHDD2TB"},{"$f":"VLOOKUP(L43,Tabella_prezzi!$A$3:$J$308,4,FALSE)","v":226},null,"L2N05",{"$f":"VLOOKUP(L43,Tabella_prezzi!$A$3:$J$308,6,FALSE)","v":"TS3L2-HDD2TB"}]
["1.2TB 10K RPM SAS 12Gbps 2.5in Hot-plug","Hard Drives",null,{"$f":"VLOOKUP(L44,Tabella_prezzi!$A$3:$J$308,8,FALSE)","v":"1.2TB 10K RPM SAS 12Gbps 2.5in Hot-plug"},null,null,1,{"$f":"VLOOKUP(L44,Tabella_prezzi!$A$3:$J$308,9,FALSE)","v":"L2N06-OpzHDD1TB"},{"$f":"VLOOKUP(L44,Tabella_prezzi!$A$3:$J$308,3,FALSE)","v":"OpzHDD1TB"},{"$f":"VLOOKUP(L44,Tabella_prezzi!$A$3:$J$308,4,FALSE)","v":141},null,"L2N06",{"$f":"VLOOKUP(L44,Tabella_prezzi!$A$3:$J$308,6,FALSE)","v":"TS3L2-HDD1TB"}]
["300GB 15K RPM SAS 12Gbps 2.5in Hot-plug","Hard Drives",null,{"$f":"VLOOKUP(L45,Tabella_prezzi!$A$3:$J$308,8,FALSE)","v":"300GB 15K RPM SAS 12Gbps 2.5in Hot-plug"},null,null,1,{"$f":"VLOOKUP(L45,Tabella_prezzi!$A$3:$J$308,9,FALSE)","v":"L2N07-OpzHDD300GB"},{"$f":"VLOOKUP(L45,Tabella_prezzi!$A$3:$J$308,3,FALSE)","v":"OpzHDD300GB"},{"$f":"VLOOKUP(L45,Tabella_prezzi!$A$3:$J$308,4,FALSE)","v":92},null,"L2N07",{"$f":"VLOOKUP(L45,Tabella_prezzi!$A$3:$J$308,6,FALSE)","v":"TS3L2-HDD300GB"}]
["960GB SSD SAS Read Intensive 12Gbps 2.5in Hot-plug","Hard Drives",null,{"$f":"VLOOKUP(L46,Tabella_prezzi!$A$3:$J$308,8,FALSE)","v":"960GB SSD SAS Read Intensive 12Gbps 2.5in Hot-plug"},null,null,1,{"$f":"VLOOKUP(L46,Tabella_prezzi!$A$3:$J$308,9,FALSE)","v":"L2N08-OpzSSD-RI800GB"},{"$f":"VLOOKUP(L46,Tabella_prezzi!$A$3:$J$308,3,FALSE)","v":"OpzSSD-RI800GB"},{"$f":"VLOOKUP(L46,Tabella_prezzi!$A$3:$J$308,4,FALSE)","v":727},null,"L2N08",{"$f":"VLOOKUP(L46,Tabella_prezzi!$A$3:$J$308,6,FALSE)","v":"TS3L2-RI800GB"}]
["480GB SSD SAS Read Intensive 12Gbps 2.5in Hot-plug","Hard Drives",null,{"$f":"VLOOKUP(L47,Tabella_prezzi!$A$3:$J$308,8,FALSE)","v":"480GB SSD SAS Read Intensive 12Gbps 2.5in Hot-plug"},null,null,1,{"$f":"VLOOKUP(L47,Tabella_prezzi!$A$3:$J$308,9,FALSE)","v":"L2N09- OpzSSD-RI400GB"},{"$f":"VLOOKUP(L47,Tabella_prezzi!$A$3:$J$308,3,FALSE)","v":"OpzSSD-RI400GB"},{"$f":"VLOOKUP(L47,Tabella_prezzi!$A$3:$J$308,4,FALSE)","v":394},null,"L2N09",{"$f":"VLOOKUP(L47,Tabella_prezzi!$A$3:$J$308,6,FALSE)","v":"TS3L2-RI400GB"}]
[]
["TS3L2_RAID"]
["PERC H730P+ Adapter RAID Controller, 2GB","Controller Raid",null,null,null,null,{"$f":"\"\"","v":""},null,{"$f":"\"\"","v":""},null,null,{"$f":"\"\"","v":""},{"$f":"\"\"","v":""}]
["PERC H740P Adapter RAID Controller, 8GB","Controller Raid",null,{"$f":"VLOOKUP(L51,Tabella_prezzi!$A$3:$J$308,8,FALSE)","v":"Dell PERC H740P RAID Controller in sostituzione del Controller in configurazione BASE"},null,null,1,{"$f":"VLOOKUP(L51,Tabella_prezzi!$A$3:$J$308,9,FALSE)","v":"TS3-OpzA20H740P"},{"$f":"VLOOKUP(L51,Tabella_prezzi!$A$3:$J$308,3,FALSE)","v":0},null,{"$f":"VLOOKUP(L51,Tabella_prezzi!$A$3:$J$308,4,FALSE)","v":672},"L2N30",{"$f":"VLOOKUP(L51,Tabella_prezzi!$A$3:$J$308,6,FALSE)","v":"TS3L2-H740P"}]
[]
["TS3L2_PSU"]
["Single, Hot-plug Power Supply 1+0, 495W","Power Supply"," GBF3YIX","Single, Hot-plug Power Supply 1+0, 495W",null,"450-AHVN",{"$f":"\"\"","v":""},null,{"$f":"\"\"","v":""},null,null,{"$f":"\"\"","v":""},{"$f":"\"\"","v":""}]
["-=-=-=-=-=-=-=-=-=-=-=-=-=-=-=-=-20%-=-=-=-=-=-=-=-=-=-=-=-=-=-=-=-=-",null,null,null,null,null,{"$f":"\"\"","v":""},null,{"$f":"\"\"","v":""},null,null,{"$f":"\"\"","v":""},{"$f":"\"\"","v":""}]
["[TS3L1-PSU] Dual, Hot-plug, Redundant Power Supply 1+1, 495W","Power Supply","GZ8351O",{"$f":"VLOOKUP(L56,Tabella_prezzi!$A$3:$J$308,8,FALSE)","v":"Single, Hot-plug Power Supply (1+0), 495W,CusKit"},null,"450-AHVO",1,{"$f":"VLOOKUP(L56,Tabella_prezzi!$A$3:$J$308,9,FALSE)","v":0},{"$f":"VLOOKUP(L56,Tabella_prezzi!$A$3:$J$308,3,FALSE)","v":"OpzPowerSupply"},null,{"$f":"VLOOKUP(L56,Tabella_prezzi!$A$3:$J$308,4,FALSE)","v":82},"L1N18",{"$f":"VLOOKUP(L56,Tabella_prezzi!$A$3:$J$308,6,FALSE)","v":"TS3L1-PSU"}]
[]
[]
["TS3L2_AddCPU"]
[{"$f":"\"\"","v":""}]
["Aggiungere Secondo Processore"]
[]
["TS3L2_PCI1"]
[{"$f":"\"\"","v":""},null,null,null,null,null,{"$f":"\"\"","v":""},null,{"$f":"\"\"","v":""},null,null,{"$f":"\"\"","v":""},{"$f":"\"\"","v":""}]
["[TS3L2-LAN1] Broadcom 5720 Dual Port 1GbE BASE-T Adapter","Additional Network Cards","GI7RBKF",{"$f":"VLOOKUP(L65,Tabella_prezzi!$A$3:$J$308,8,FALSE)","v":"Broadcom 5720 DP 1Gb NIC,Full Height"},null,"540-BBCX",1,{"$f":"VLOOKUP(L65,Tabella_prezzi!$A$3:$J$308,9,FALSE)","v":"L2N04-OpzGigabit"},{"$f":"VLOOKUP(L65,Tabella_prezzi!$A$3:$J$308,3,FALSE)","v":"OpzGigabit"},{"$f":"VLOOKUP(L65,Tabella_prezzi!$A$3:$J$308,4,FALSE)","v":26},null,"L2N04",{"$f":"VLOOKUP(L65,Tabella_prezzi!$A$3:$J$308,6,FALSE)","v":"TS3L2-LAN1"}]
["-=-=-=-=-=-=-=-=-=-=-=-=-=-=-=-=-20%-=-=-=-=-=-=-=-=-=-=-=-=-=-=-=-=-",null,null,null,null,null,{"$f":"\"\"","v":""},null,{"$f":"\"\"","v":""},null,null,{"$f":"\"\"","v":""},{"$f":"\"\"","v":""}]
["[TS3L2-BOSS240] BOSS controller card, full height, with 2 240G M.2 Drives","BOSS Card",null,{"$f":"VLOOKUP(L67,Tabella_prezzi!$A$3:$J$308,8,FALSE)","v":"BOSS controller card, full height, with 2 240G M.2 Drives"},null,null,1,null,{"$f":"VLOOKUP(L67,Tabella_prezzi!$A$3:$J$308,3,FALSE)","v":"OpzBOSS240"},null,{"$f":"VLOOKUP(L67,Tabella_prezzi!$A$3:$J$308,4,FALSE)","v":429},"L2N20",{"$f":"VLOOKUP(L67,Tabella_prezzi!$A$3:$J$308,6,FALSE)","v":"TS3L2-BOSS240"}]
["[TS3L2-BOSS480] BOSS controller card, full height, with 2 480G M.2 Drives","BOSS Card",null,{"$f":"VLOOKUP(L68,Tabella_prezzi!$A$3:$J$308,8,FALSE)","v":"BOSS controller card, full height, with 2 480G M.2 Drives"},null,null,1,null,{"$f":"VLOOKUP(L68,Tabella_prezzi!$A$3:$J$308,3,FALSE)","v":"OpzBOSS480"},null,{"$f":"VLOOKUP(L68,Tabella_prezzi!$A$3:$J$308,4,FALSE)","v":748},"L2N21",{"$f":"VLOOKUP(L68,Tabella_prezzi!$A$3:$J$308,6,FALSE)","v":"TS3L2-BOSS480"}]
["[TS3L2-H840] PERC H840 RAID Adapter for External MD14XX Only, 8GB NV Cache","PERC",null,{"$f":"VLOOKUP(L69,Tabella_prezzi!$A$3:$J$308,8,FALSE)","v":"PERC H840 RAID Adapter for External MD14XX Only, 8GB NV Cache, Full Height"},null,null,1,{"$f":"VLOOKUP(L69,Tabella_prezzi!$A$3:$J$308,9,FALSE)","v":"TS3-OpzA20H840"},{"$f":"VLOOKUP(L69,Tabella_prezzi!$A$3:$J$308,3,FALSE)","v":"OpzH840"},null,{"$f":"VLOOKUP(L69,Tabella_prezzi!$A$3:$J$308,4,FALSE)","v":479},"L2N27",{"$f":"VLOOKUP(L69,Tabella_prezzi!$A$3:$J$308,6,FALSE)","v":"TS3L2-H840"}]
["[TS3L2-CNA10] Scheda 41112 DP 10Gb SFP+, 2 x Transceiver SFP+, 10GbE","Additional Network Cards",null,{"$f":"VLOOKUP(L70,Tabella_prezzi!$A$3:$J$308,8,FALSE)","v":"Scheda 41112 DP 10Gb SFP+, 2 x Transceiver SFP+, 10GbE"},null,null,1,{"$f":"VLOOKUP(L70,Tabella_prezzi!$A$3:$J$308,9,FALSE)","v":"TS3-OpzA20CNA"},{"$f":"VLOOKUP(L70,Tabella_prezzi!$A$3:$J$308,3,FALSE)","v":"OpzCNA10Gb"},null,{"$f":"VLOOKUP(L70,Tabella_prezzi!$A$3:$J$308,4,FALSE)","v":383},"L2N23",{"$f":"VLOOKUP(L70,Tabella_prezzi!$A$3:$J$308,6,FALSE)","v":"TS3L2-CNA10GB"}]
["[TS3L2-CNA10M3] Scheda 41112 DP 10Gb SFP+, 2 x Cable, SFP+ to SFP+, 10GbE, Copper Twinax Direct Attach Cable, 3 Meter","Additional Network Cards","Scheda 41112 DP 10Gb SFP+, 2 x Cable, SFP+ to SFP+, 10GbE, Copper Twinax Direct Attach Cable, 3 Meter",{"$f":"VLOOKUP(L71,Tabella_prezzi!$A$3:$J$308,8,FALSE)","v":"Scheda 41112 DP 10Gb SFP+, 2 x Cable, SFP+ to SFP+, 10GbE, Copper Twinax Direct Attach Cable, 3 Meter"},null,null,1,{"$f":"VLOOKUP(L71,Tabella_prezzi!$A$3:$J$308,9,FALSE)","v":"TS3-OpzA20CNA3M"},{"$f":"VLOOKUP(L71,Tabella_prezzi!$A$3:$J$308,3,FALSE)","v":"OpzCNA10Gb"},null,{"$f":"VLOOKUP(L71,Tabella_prezzi!$A$3:$J$308,4,FALSE)","v":411},"L2N29",{"$f":"VLOOKUP(L71,Tabella_prezzi!$A$3:$J$308,6,FALSE)","v":"TS3L2-CNA10M3"}]
[]
["TS3L2_PCI2"]
[{"$f":"\"\"","v":""},null,null,null,null,null,{"$f":"\"\"","v":""},null,{"$f":"\"\"","v":""},null,null,{"$f":"\"\"","v":""},{"$f":"\"\"","v":""}]
["[TS3L2-LAN1] Broadcom 5720 Dual Port 1GbE BASE-T Adapter","Additional Network Cards","GI7RBKF",{"$f":"VLOOKUP(L75,Tabella_prezzi!$A$3:$J$308,8,FALSE)","v":"Broadcom 5720 DP 1Gb NIC,Full Height"},null,"540-BBCX",1,{"$f":"VLOOKUP(L75,Tabella_prezzi!$A$3:$J$308,9,FALSE)","v":"L2N04-OpzGigabit"},{"$f":"VLOOKUP(L75,Tabella_prezzi!$A$3:$J$308,3,FALSE)","v":"OpzGigabit"},{"$f":"VLOOKUP(L75,Tabella_prezzi!$A$3:$J$308,4,FALSE)","v":26},null,"L2N04",{"$f":"VLOOKUP(L75,Tabella_prezzi!$A$3:$J$308,6,FALSE)","v":"TS3L2-LAN1"}]
[]
["TS3L2_PCI3"]
[{"$f":"\"\"","v":""},null,null,null,null,null,{"$f":"\"\"","v":""},null,{"$f":"\"\"","v":""},null,null,{"$f":"\"\"","v":""},{"$f":"\"\"","v":""}]
["[TS3L2-LAN1] Broadcom 5720 Dual Port 1GbE BASE-T Adapter","Additional Network Cards","GI7RBKF",{"$f":"VLOOKUP(L79,Tabella_prezzi!$A$3:$J$308,8,FALSE)","v":"Broadcom 5720 DP 1Gb NIC,Full Height"},null,"540-BBCX",1,{"$f":"VLOOKUP(L79,Tabella_prezzi!$A$3:$J$308,9,FALSE)","v":"L2N04-OpzGigabit"},{"$f":"VLOOKUP(L79,Tabella_prezzi!$A$3:$J$308,3,FALSE)","v":"OpzGigabit"},{"$f":"VLOOKUP(L79,Tabella_prezzi!$A$3:$J$308,4,FALSE)","v":26},null,"L2N04",{"$f":"VLOOKUP(L79,Tabella_prezzi!$A$3:$J$308,6,FALSE)","v":"TS3L2-LAN1"}]
[]
["TS3L2_PCI4"]
[{"$f":"\"\"","v":""},null,null,null,null,null,{"$f":"\"\"","v":""},null,{"$f":"\"\"","v":""},null,null,{"$f":"\"\"","v":""},{"$f":"\"\"","v":""}]
["[TS3L2-LAN1] Broadcom 5720 Dual Port 1GbE BASE-T Adapter","Additional Network Cards","GI7RBKF",{"$f":"VLOOKUP(L83,Tabella_prezzi!$A$3:$J$308,8,FALSE)","v":"Broadcom 5720 DP 1Gb NIC,Full Height"},null,"540-BBCX",1,{"$f":"VLOOKUP(L83,Tabella_prezzi!$A$3:$J$308,9,FALSE)","v":"L2N04-OpzGigabit"},{"$f":"VLOOKUP(L83,Tabella_prezzi!$A$3:$J$308,3,FALSE)","v":"OpzGigabit"},{"$f":"VLOOKUP(L83,Tabella_prezzi!$A$3:$J$308,4,FALSE)","v":26},null,"L2N04",{"$f":"VLOOKUP(L83,Tabella_prezzi!$A$3:$J$308,6,FALSE)","v":"TS3L2-LAN1"}]
["-=-=-=-=-=-=-=-=-=-=-=-=-=-=-=-=-20%-=-=-=-=-=-=-=-=-=-=-=-=-=-=-=-=-",null,null,null,null,null,{"$f":"\"\"","v":""},null,{"$f":"\"\"","v":""},null,null,{"$f":"\"\"","v":""},{"$f":"\"\"","v":""}]
["[TS3L2-BOSS240] BOSS controller card, full height, with 2 240G M.2 Drives","BOSS Card",null,{"$f":"VLOOKUP(L85,Tabella_prezzi!$A$3:$J$308,8,FALSE)","v":"BOSS controller card, full height, with 2 240G M.2 Drives"},null,null,1,null,{"$f":"VLOOKUP(L85,Tabella_prezzi!$A$3:$J$308,3,FALSE)","v":"OpzBOSS240"},null,{"$f":"VLOOKUP(L85,Tabella_prezzi!$A$3:$J$308,4,FALSE)","v":429},"L2N20",{"$f":"VLOOKUP(L85,Tabella_prezzi!$A$3:$J$308,6,FALSE)","v":"TS3L2-BOSS240"}]
["[TS3L2-BOSS480] BOSS controller card, full height, with 2 480G M.2 Drives","BOSS Card",null,{"$f":"VLOOKUP(L86,Tabella_prezzi!$A$3:$J$308,8,FALSE)","v":"BOSS controller card, full height, with 2 480G M.2 Drives"},null,null,1,null,{"$f":"VLOOKUP(L86,Tabella_prezzi!$A$3:$J$308,3,FALSE)","v":"OpzBOSS480"},null,{"$f":"VLOOKUP(L86,Tabella_prezzi!$A$3:$J$308,4,FALSE)","v":748},"L2N21",{"$f":"VLOOKUP(L86,Tabella_prezzi!$A$3:$J$308,6,FALSE)","v":"TS3L2-BOSS480"}]
["[TS3L2-H840] PERC H840 RAID Adapter for External MD14XX Only, 8GB NV Cache","PERC",null,{"$f":"VLOOKUP(L87,Tabella_prezzi!$A$3:$J$308,8,FALSE)","v":"PERC H840 RAID Adapter for External MD14XX Only, 8GB NV Cache, Full Height"},null,null,1,{"$f":"VLOOKUP(L87,Tabella_prezzi!$A$3:$J$308,9,FALSE)","v":"TS3-OpzA20H840"},{"$f":"VLOOKUP(L87,Tabella_prezzi!$A$3:$J$308,3,FALSE)","v":"OpzH840"},null,{"$f":"VLOOKUP(L87,Tabella_prezzi!$A$3:$J$308,4,FALSE)","v":479},"L2N27",{"$f":"VLOOKUP(L87,Tabella_prezzi!$A$3:$J$308,6,FALSE)","v":"TS3L2-H840"}]
["[TS3L2-CNA10] Scheda 41112 DP 10Gb SFP+, 2 x Transceiver SFP+, 10GbE","Additional Network Cards",null,{"$f":"VLOOKUP(L88,Tabella_prezzi!$A$3:$J$308,8,FALSE)","v":"Scheda 41112 DP 10Gb SFP+, 2 x Transceiver SFP+, 10GbE"},null,null,1,{"$f":"VLOOKUP(L88,Tabella_prezzi!$A$3:$J$308,9,FALSE)","v":"TS3-OpzA20CNA"},{"$f":"VLOOKUP(L88,Tabella_prezzi!$A$3:$J$308,3,FALSE)","v":"OpzCNA10Gb"},null,{"$f":"VLOOKUP(L88,Tabella_prezzi!$A$3:$J$308,4,FALSE)","v":383},"L2N23",{"$f":"VLOOKUP(L88,Tabella_prezzi!$A$3:$J$308,6,FALSE)","v":"TS3L2-CNA10GB"}]
["[TS3L2-CNA10M3] Scheda 41112 DP 10Gb SFP+, 2 x Cable, SFP+ to SFP+, 10GbE, Copper Twinax Direct Attach Cable, 3 Meter","Additional Network Cards","Scheda 41112 DP 10Gb SFP+, 2 x Cable, SFP+ to SFP+, 10GbE, Copper Twinax Direct Attach Cable, 3 Meter",{"$f":"VLOOKUP(L89,Tabella_prezzi!$A$3:$J$308,8,FALSE)","v":"Scheda 41112 DP 10Gb SFP+, 2 x Cable, SFP+ to SFP+, 10GbE, Copper Twinax Direct Attach Cable, 3 Meter"},null,null,1,{"$f":"VLOOKUP(L89,Tabella_prezzi!$A$3:$J$308,9,FALSE)","v":"TS3-OpzA20CNA3M"},{"$f":"VLOOKUP(L89,Tabella_prezzi!$A$3:$J$308,3,FALSE)","v":"OpzCNA10Gb"},null,{"$f":"VLOOKUP(L89,Tabella_prezzi!$A$3:$J$308,4,FALSE)","v":411},"L2N29",{"$f":"VLOOKUP(L89,Tabella_prezzi!$A$3:$J$308,6,FALSE)","v":"TS3L2-CNA10M3"}]
[]
["TS3L2_PCI5"]
[{"$f":"\"\"","v":""},null,null,null,null,null,{"$f":"\"\"","v":""},null,{"$f":"\"\"","v":""},null,null,{"$f":"\"\"","v":""},{"$f":"\"\"","v":""}]
["[TS3L2-LAN1] Broadcom 5720 Dual Port 1GbE BASE-T Adapter","Additional Network Cards","GI7RBKF",{"$f":"VLOOKUP(L93,Tabella_prezzi!$A$3:$J$308,8,FALSE)","v":"Broadcom 5720 DP 1Gb NIC,Full Height"},null,"540-BBCX",1,{"$f":"VLOOKUP(L93,Tabella_prezzi!$A$3:$J$308,9,FALSE)","v":"L2N04-OpzGigabit"},{"$f":"VLOOKUP(L93,Tabella_prezzi!$A$3:$J$308,3,FALSE)","v":"OpzGigabit"},{"$f":"VLOOKUP(L93,Tabella_prezzi!$A$3:$J$308,4,FALSE)","v":26},null,"L2N04",{"$f":"VLOOKUP(L93,Tabella_prezzi!$A$3:$J$308,6,FALSE)","v":"TS3L2-LAN1"}]
[]
["TS3L2_PCI6"]
[{"$f":"\"\"","v":""},null,null,null,null,null,{"$f":"\"\"","v":""},null,{"$f":"\"\"","v":""},null,null,{"$f":"\"\"","v":""},{"$f":"\"\"","v":""}]
["[TS3L2-LAN1] Broadcom 5720 Dual Port 1GbE BASE-T Adapter","Additional Network Cards","GI7RBKF",{"$f":"VLOOKUP(L97,Tabella_prezzi!$A$3:$J$308,8,FALSE)","v":"Broadcom 5720 DP 1Gb NIC,Full Height"},null,"540-BBCX",1,{"$f":"VLOOKUP(L97,Tabella_prezzi!$A$3:$J$308,9,FALSE)","v":"L2N04-OpzGigabit"},{"$f":"VLOOKUP(L97,Tabella_prezzi!$A$3:$J$308,3,FALSE)","v":"OpzGigabit"},{"$f":"VLOOKUP(L97,Tabella_prezzi!$A$3:$J$308,4,FALSE)","v":26},null,"L2N04",{"$f":"VLOOKUP(L97,Tabella_prezzi!$A$3:$J$308,6,FALSE)","v":"TS3L2-LAN1"}]
["-=-=-=-=-=-=-=-=-=-=-=-=-=-=-=-=-20%-=-=-=-=-=-=-=-=-=-=-=-=-=-=-=-=-",null,null,null,null,null,{"$f":"\"\"","v":""},null,{"$f":"\"\"","v":""},null,null,{"$f":"\"\"","v":""},{"$f":"\"\"","v":""}]
["[TS3L2-BOSS240] BOSS controller card, full height, with 2 240G M.2 Drives","BOSS Card",null,{"$f":"VLOOKUP(L99,Tabella_prezzi!$A$3:$J$308,8,FALSE)","v":"BOSS controller card, full height, with 2 240G M.2 Drives"},null,null,1,null,{"$f":"VLOOKUP(L99,Tabella_prezzi!$A$3:$J$308,3,FALSE)","v":"OpzBOSS240"},null,{"$f":"VLOOKUP(L99,Tabella_prezzi!$A$3:$J$308,4,FALSE)","v":429},"L2N20",{"$f":"VLOOKUP(L99,Tabella_prezzi!$A$3:$J$308,6,FALSE)","v":"TS3L2-BOSS240"}]
["[TS3L2-BOSS480] BOSS controller card, full height, with 2 480G M.2 Drives","BOSS Card",null,{"$f":"VLOOKUP(L100,Tabella_prezzi!$A$3:$J$308,8,FALSE)","v":"BOSS controller card, full height, with 2 480G M.2 Drives"},null,null,1,null,{"$f":"VLOOKUP(L100,Tabella_prezzi!$A$3:$J$308,3,FALSE)","v":"OpzBOSS480"},null,{"$f":"VLOOKUP(L100,Tabella_prezzi!$A$3:$J$308,4,FALSE)","v":748},"L2N21",{"$f":"VLOOKUP(L100,Tabella_prezzi!$A$3:$J$308,6,FALSE)","v":"TS3L2-BOSS480"}]
["[TS3L2-H840] PERC H840 RAID Adapter for External MD14XX Only, 8GB NV Cache","PERC",null,{"$f":"VLOOKUP(L101,Tabella_prezzi!$A$3:$J$308,8,FALSE)","v":"PERC H840 RAID Adapter for External MD14XX Only, 8GB NV Cache, Full Height"},null,null,1,{"$f":"VLOOKUP(L101,Tabella_prezzi!$A$3:$J$308,9,FALSE)","v":"TS3-OpzA20H840"},{"$f":"VLOOKUP(L101,Tabella_prezzi!$A$3:$J$308,3,FALSE)","v":"OpzH840"},null,{"$f":"VLOOKUP(L101,Tabella_prezzi!$A$3:$J$308,4,FALSE)","v":479},"L2N27",{"$f":"VLOOKUP(L101,Tabella_prezzi!$A$3:$J$308,6,FALSE)","v":"TS3L2-H840"}]
["[TS3L2-CNA10] Scheda 41112 DP 10Gb SFP+, 2 x Transceiver SFP+, 10GbE","Additional Network Cards",null,{"$f":"VLOOKUP(L102,Tabella_prezzi!$A$3:$J$308,8,FALSE)","v":"Scheda 41112 DP 10Gb SFP+, 2 x Transceiver SFP+, 10GbE"},null,null,1,{"$f":"VLOOKUP(L102,Tabella_prezzi!$A$3:$J$308,9,FALSE)","v":"TS3-OpzA20CNA"},{"$f":"VLOOKUP(L102,Tabella_prezzi!$A$3:$J$308,3,FALSE)","v":"OpzCNA10Gb"},null,{"$f":"VLOOKUP(L102,Tabella_prezzi!$A$3:$J$308,4,FALSE)","v":383},"L2N23",{"$f":"VLOOKUP(L102,Tabella_prezzi!$A$3:$J$308,6,FALSE)","v":"TS3L2-CNA10GB"}]
["[TS3L2-CNA10M3] Scheda 41112 DP 10Gb SFP+, 2 x Cable, SFP+ to SFP+, 10GbE, Copper Twinax Direct Attach Cable, 3 Meter","Additional Network Cards","Scheda 41112 DP 10Gb SFP+, 2 x Cable, SFP+ to SFP+, 10GbE, Copper Twinax Direct Attach Cable, 3 Meter",{"$f":"VLOOKUP(L103,Tabella_prezzi!$A$3:$J$308,8,FALSE)","v":"Scheda 41112 DP 10Gb SFP+, 2 x Cable, SFP+ to SFP+, 10GbE, Copper Twinax Direct Attach Cable, 3 Meter"},null,null,1,{"$f":"VLOOKUP(L103,Tabella_prezzi!$A$3:$J$308,9,FALSE)","v":"TS3-OpzA20CNA3M"},{"$f":"VLOOKUP(L103,Tabella_prezzi!$A$3:$J$308,3,FALSE)","v":"OpzCNA10Gb"},null,{"$f":"VLOOKUP(L103,Tabella_prezzi!$A$3:$J$308,4,FALSE)","v":411},"L2N29",{"$f":"VLOOKUP(L103,Tabella_prezzi!$A$3:$J$308,6,FALSE)","v":"TS3L2-CNA10M3"}]
[]
["TS3L2_PCI7"]
[{"$f":"\"\"","v":""},null,null,null,null,null,{"$f":"\"\"","v":""},null,{"$f":"\"\"","v":""},null,null,{"$f":"\"\"","v":""},{"$f":"\"\"","v":""}]
["[TS3L2-LAN1] Broadcom 5720 Dual Port 1GbE BASE-T Adapter","Additional Network Cards","GI7RBKF",{"$f":"VLOOKUP(L107,Tabella_prezzi!$A$3:$J$308,8,FALSE)","v":"Broadcom 5720 DP 1Gb NIC,Full Height"},null,"540-BBCX",1,{"$f":"VLOOKUP(L107,Tabella_prezzi!$A$3:$J$308,9,FALSE)","v":"L2N04-OpzGigabit"},{"$f":"VLOOKUP(L107,Tabella_prezzi!$A$3:$J$308,3,FALSE)","v":"OpzGigabit"},{"$f":"VLOOKUP(L107,Tabella_prezzi!$A$3:$J$308,4,FALSE)","v":26},null,"L2N04",{"$f":"VLOOKUP(L107,Tabella_prezzi!$A$3:$J$308,6,FALSE)","v":"TS3L2-LAN1"}]
["-=-=-=-=-=-=-=-=-=-=-=-=-=-=-=-=-20%-=-=-=-=-=-=-=-=-=-=-=-=-=-=-=-=-",null,null,null,null,null,{"$f":"\"\"","v":""},null,{"$f":"\"\"","v":""},null,null,{"$f":"\"\"","v":""},{"$f":"\"\"","v":""}]
["[TS3L2-BOSS240] BOSS controller card, full height, with 2 240G M.2 Drives","BOSS Card",null,{"$f":"VLOOKUP(L109,Tabella_prezzi!$A$3:$J$308,8,FALSE)","v":"BOSS controller card, full height, with 2 240G M.2 Drives"},null,null,1,null,{"$f":"VLOOKUP(L109,Tabella_prezzi!$A$3:$J$308,3,FALSE)","v":"OpzBOSS240"},{"$f":"VLOOKUP(L109,Tabella_prezzi!$A$3:$J$308,4,FALSE)","v":429},null,"L2N20",{"$f":"VLOOKUP(L109,Tabella_prezzi!$A$3:$J$308,6,FALSE)","v":"TS3L2-BOSS240"}]
["[TS3L2-BOSS480] BOSS controller card, full height, with 2 480G M.2 Drives","BOSS Card",null,{"$f":"VLOOKUP(L110,Tabella_prezzi!$A$3:$J$308,8,FALSE)","v":"BOSS controller card, full height, with 2 480G M.2 Drives"},null,null,1,null,{"$f":"VLOOKUP(L110,Tabella_prezzi!$A$3:$J$308,3,FALSE)","v":"OpzBOSS480"},{"$f":"VLOOKUP(L110,Tabella_prezzi!$A$3:$J$308,4,FALSE)","v":748},null,"L2N21",{"$f":"VLOOKUP(L110,Tabella_prezzi!$A$3:$J$308,6,FALSE)","v":"TS3L2-BOSS480"}]
["[TS3L2-H840] PERC H840 RAID Adapter for External MD14XX Only, 8GB NV Cache","PERC",null,{"$f":"VLOOKUP(L111,Tabella_prezzi!$A$3:$J$308,8,FALSE)","v":"PERC H840 RAID Adapter for External MD14XX Only, 8GB NV Cache, Full Height"},null,null,1,{"$f":"VLOOKUP(L111,Tabella_prezzi!$A$3:$J$308,9,FALSE)","v":"TS3-OpzA20H840"},{"$f":"VLOOKUP(L111,Tabella_prezzi!$A$3:$J$308,3,FALSE)","v":"OpzH840"},null,{"$f":"VLOOKUP(L111,Tabella_prezzi!$A$3:$J$308,4,FALSE)","v":479},"L2N27",{"$f":"VLOOKUP(L111,Tabella_prezzi!$A$3:$J$308,6,FALSE)","v":"TS3L2-H840"}]
["[TS3L2-CNA10] Scheda 41112 DP 10Gb SFP+, 2 x Transceiver SFP+, 10GbE","Additional Network Cards",null,{"$f":"VLOOKUP(L112,Tabella_prezzi!$A$3:$J$308,8,FALSE)","v":"Scheda 41112 DP 10Gb SFP+, 2 x Transceiver SFP+, 10GbE"},null,null,1,{"$f":"VLOOKUP(L112,Tabella_prezzi!$A$3:$J$308,9,FALSE)","v":"TS3-OpzA20CNA"},{"$f":"VLOOKUP(L112,Tabella_prezzi!$A$3:$J$308,3,FALSE)","v":"OpzCNA10Gb"},null,{"$f":"VLOOKUP(L112,Tabella_prezzi!$A$3:$J$308,4,FALSE)","v":383},"L2N23",{"$f":"VLOOKUP(L112,Tabella_prezzi!$A$3:$J$308,6,FALSE)","v":"TS3L2-CNA10GB"}]
["[TS3L2-CNA10M3] Scheda 41112 DP 10Gb SFP+, 2 x Cable, SFP+ to SFP+, 10GbE, Copper Twinax Direct Attach Cable, 3 Meter","Additional Network Cards","Scheda 41112 DP 10Gb SFP+, 2 x Cable, SFP+ to SFP+, 10GbE, Copper Twinax Direct Attach Cable, 3 Meter",{"$f":"VLOOKUP(L113,Tabella_prezzi!$A$3:$J$308,8,FALSE)","v":"Scheda 41112 DP 10Gb SFP+, 2 x Cable, SFP+ to SFP+, 10GbE, Copper Twinax Direct Attach Cable, 3 Meter"},null,null,1,{"$f":"VLOOKUP(L113,Tabella_prezzi!$A$3:$J$308,9,FALSE)","v":"TS3-OpzA20CNA3M"},{"$f":"VLOOKUP(L113,Tabella_prezzi!$A$3:$J$308,3,FALSE)","v":"OpzCNA10Gb"},null,{"$f":"VLOOKUP(L113,Tabella_prezzi!$A$3:$J$308,4,FALSE)","v":411},"L2N29",{"$f":"VLOOKUP(L113,Tabella_prezzi!$A$3:$J$308,6,FALSE)","v":"TS3L2-CNA10M3"}]
[]
["TS3L2_PCI8"]
[{"$f":"\"\"","v":""},null,null,null,null,null,{"$f":"\"\"","v":""},null,{"$f":"\"\"","v":""},null,null,{"$f":"\"\"","v":""},{"$f":"\"\"","v":""}]
["[TS3L2-LAN1] Broadcom 5720 Dual Port 1GbE BASE-T Adapter","Additional Network Cards","GI7RBKF",{"$f":"VLOOKUP(L117,Tabella_prezzi!$A$3:$J$308,8,FALSE)","v":"Broadcom 5720 DP 1Gb NIC,Full Height"},null,"540-BBCX",1,{"$f":"VLOOKUP(L117,Tabella_prezzi!$A$3:$J$308,9,FALSE)","v":"L2N04-OpzGigabit"},{"$f":"VLOOKUP(L117,Tabella_prezzi!$A$3:$J$308,3,FALSE)","v":"OpzGigabit"},{"$f":"VLOOKUP(L117,Tabella_prezzi!$A$3:$J$308,4,FALSE)","v":26},null,"L2N04",{"$f":"VLOOKUP(L117,Tabella_prezzi!$A$3:$J$308,6,FALSE)","v":"TS3L2-LAN1"}]
[]
["Cavo “patch” di 3 mt RJ45 certificato per gigabit ethernet",null,null,{"$f":"VLOOKUP(L119,Tabella_prezzi!$A$3:$J$308,8,FALSE)","v":"Cavo “patch” di 3 mt RJ45 certificato per gigabit ethernet"},null,null,{"$f":"\"\"","v":""},{"$f":"VLOOKUP(L119,Tabella_prezzi!$A$3:$J$308,9,FALSE)","v":"TS3-OpzA20RJ45"},{"$f":"VLOOKUP(L119,Tabella_prezzi!$A$3:$J$308,3,FALSE)","v":"TS3-OpzA20RJ45"},null,{"$f":"VLOOKUP(L119,Tabella_prezzi!$A$3:$J$308,4,FALSE)","v":3},"L2N26",{"$f":"VLOOKUP(L119,Tabella_prezzi!$A$3:$J$308,6,FALSE)","v":"TS3L2-RJ453M"}]
["Cable, SFP+ to SFP+, 10GbE, Copper Twinax Direct Attach Cable, 3 Meter",null,null,"Cable, SFP+ to SFP+, 10GbE, Copper Twinax Direct Attach Cable, 3 Meter",null,null,{"$f":"\"\"","v":""},{"$f":"VLOOKUP(L120,Tabella_prezzi!$A$3:$J$308,9,FALSE)","v":0},{"$f":"VLOOKUP(L120,Tabella_prezzi!$A$3:$J$308,3,FALSE)","v":"OpzDAC3M"},null,{"$f":"VLOOKUP(L120,Tabella_prezzi!$A$3:$J$308,4,FALSE)","v":9999},"L2N25",{"$f":"VLOOKUP(L120,Tabella_prezzi!$A$3:$J$308,6,FALSE)","v":"TS3L2-DAC3M"}]
["Transceiver, SFP+, 10GbE, SR, 850nm Wavelength, 300m ",null,null,"Transceiver, SFP+, 10GbE, SR, 850nm Wavelength, 300m ",null,null,null,{"$f":"VLOOKUP(L121,Tabella_prezzi!$A$3:$J$308,9,FALSE)","v":0},{"$f":"VLOOKUP(L121,Tabella_prezzi!$A$3:$J$308,3,FALSE)","v":"Opz10GBIC"},null,{"$f":"VLOOKUP(L121,Tabella_prezzi!$A$3:$J$308,4,FALSE)","v":90},"L2N24",{"$f":"VLOOKUP(L121,Tabella_prezzi!$A$3:$J$308,6,FALSE)","v":"TS3L2-10GBIC"}]
[]
["TS3L2_BEZEL"]
["No Bezel","Bezel"," GKGZ6OF","No Bezel",null,"350-BBBW",{"$f":"\"\"","v":""},null,{"$f":"\"\"","v":""},null,null,{"$f":"\"\"","v":""},{"$f":"\"\"","v":""}]
["-=-=-=-=-=-=-=-=-=-=-=-=-=-=-=-=-20%-=-=-=-=-=-=-=-=-=-=-=-=-=-=-=-=-",null,null,null,null,null,{"$f":"\"\"","v":""},null,{"$f":"\"\"","v":""},null,null,{"$f":"\"\"","v":""},{"$f":"\"\"","v":""}]
["[TS3L2-BEZEL] Tower Security Bezel","Bezel","G87WRUY","Tower Security Bezel",null,"325-BCOO",1,{"$f":"VLOOKUP(L126,Tabella_prezzi!$A$3:$J$308,9,FALSE)","v":"TS3-OpzA20BT640"},{"$f":"VLOOKUP(L126,Tabella_prezzi!$A$3:$J$308,3,FALSE)","v":"TS3-OpzA20BT640"},null,{"$f":"VLOOKUP(L126,Tabella_prezzi!$A$3:$J$308,4,FALSE)","v":99.99},"L2N19",{"$f":"VLOOKUP(L126,Tabella_prezzi!$A$3:$J$308,6,FALSE)","v":"TS3L2-BEZEL"}]
[]
["TS3L1_DVD"]
["No Internal Optical Drive","Internal Optical Drive"," G5M9GE3","No Internal Optical Drive",null,"429-ABDL",{"$f":"\"\"","v":""},null,{"$f":"\"\"","v":""},null,null,{"$f":"\"\"","v":""},{"$f":"\"\"","v":""}]
["-=-=-=-=-=-=-=-=-=-=-=-=-=-=-=-=-20%-=-=-=-=-=-=-=-=-=-=-=-=-=-=-=-=-",null,null,null,null,null,{"$f":"\"\"","v":""},null,{"$f":"\"\"","v":""},null,null,{"$f":"\"\"","v":""},{"$f":"\"\"","v":""}]
["[TS3L1-DVD] DVD +/-RW, SATA, Internal","Internal Optical Drive","GR53HYI","DVD +/-RW, SATA, Internal",null,"429-ABCJ",1,{"$f":"VLOOKUP(L131,Tabella_prezzi!$A$3:$J$308,9,FALSE)","v":0},{"$f":"VLOOKUP(L131,Tabella_prezzi!$A$3:$J$308,3,FALSE)","v":"OpzDVD"},null,{"$f":"VLOOKUP(L131,Tabella_prezzi!$A$3:$J$308,4,FALSE)","v":99.99},"L1N28",{"$f":"VLOOKUP(L131,Tabella_prezzi!$A$3:$J$308,6,FALSE)","v":"TS3L1-DVD"}]
[]
["TS3L2_WARRANTY"]
["Manutenzione in garanzia (36 mesi)","Dell Services: Extended Service"," G5IMJFP","RESTRICTED:ProSupport One Data Center and Next Business Day Onsite Service Volume Low, 39 Month(s)",null,"865-BBKY, 865-BBKZ",{"$f":"\"\"","v":""},null,{"$f":"\"\"","v":""},null,null,{"$f":"\"\"","v":""},{"$f":"\"\"","v":""}]
["[TS3L2-5Y] Manutenzione in garanzia (60 mesi)","Dell Services: Extended Service"," G5IMJFP",{"$f":"VLOOKUP(L135,Tabella_prezzi!$A$3:$J$308,8,FALSE)","v":"Estensione della manutenzione in garanzia per ulteriori 24 mesi"},null,"865-BBKY, 865-BBKZ",1,{"$f":"VLOOKUP(L135,Tabella_prezzi!$A$3:$J$503,9,FALSE)","v":"L2N18-OpzEstensione24"},{"$f":"VLOOKUP(L135,Tabella_prezzi!$A$3:$J$503,3,FALSE)","v":"OpzEstensione24"},{"$f":"VLOOKUP(L135,Tabella_prezzi!$A$3:$J$503,4,FALSE)","v":79},null,"L2N18",{"$f":"VLOOKUP(L135,Tabella_prezzi!$A$3:$J$308,6,FALSE)","v":"TS3L2-5Y"}]
[]
["TS3L2_KYHDD"]
[{"$f":"\"\"","v":""},"Keep Your Hard Drive",null,null,null,null,{"$f":"\"\"","v":""},null,{"$f":"\"\"","v":""},null,null,{"$f":"\"\"","v":""},{"$f":"\"\"","v":""}]
["Hard Disk Retention","Keep Your Hard Drive"," GPZX1KQ",{"$f":"VLOOKUP(L139,Tabella_prezzi!$A$3:$J$308,8,FALSE)","v":"Hard Disk Retention 36 mesi"},null,"711-BBBR",1,{"$f":"VLOOKUP(L139,Tabella_prezzi!$A$3:$J$503,9,FALSE)","v":"L2N17-OpzHDDRetention"},{"$f":"VLOOKUP(L139,Tabella_prezzi!$A$3:$J$503,3,FALSE)","v":"OpzHDDRetention"},{"$f":"VLOOKUP(L139,Tabella_prezzi!$A$3:$J$503,4,FALSE)","v":207},null,"L2N17",{"$f":"VLOOKUP(L139,Tabella_prezzi!$A$3:$J$308,6,FALSE)","v":"TS3L2-HDRTNTN"}]
["Hard Disk Retention (60 mesi)","Keep Your Hard Drive"," GPZX1KQ",{"$f":"VLOOKUP(L140,Tabella_prezzi!$A$3:$J$308,8,FALSE)","v":"Hard Disk Retention 60 mesi"},null,"711-BBBR",1,{"$f":"VLOOKUP(L140,Tabella_prezzi!$A$3:$J$503,9,FALSE)","v":"L2N28-OpzHDDRetention60"},{"$f":"VLOOKUP(L140,Tabella_prezzi!$A$3:$J$503,3,FALSE)","v":"OpzHDDRetention60"},{"$f":"VLOOKUP(L140,Tabella_prezzi!$A$3:$J$503,4,FALSE)","v":345},null,"L2N28",{"$f":"VLOOKUP(L140,Tabella_prezzi!$A$3:$J$308,6,FALSE)","v":"TS3L2-HDRTNTN60"}]
[]
["TS3L2_UPS"]
[{"$f":"\"\"","v":""},null,null,null,null,null,{"$f":"\"\"","v":""},null,{"$f":"\"\"","v":""},null,null,{"$f":"\"\"","v":""},{"$f":"\"\"","v":""}]
["[TS3L2-UPS] UPS PowerMe RPMM/9K - 3000VA Tower",null,null,{"$f":"VLOOKUP(L144,Tabella_prezzi!$A$3:$J$308,8,FALSE)","v":"UPS PowerMe RPMM/9K - 3000VA Tower"},null,null,1,{"$f":"VLOOKUP(L144,Tabella_prezzi!$A$3:$J$503,9,FALSE)","v":"L2N10-OpzUps"},{"$f":"VLOOKUP(L144,Tabella_prezzi!$A$3:$J$503,3,FALSE)","v":"OpzUps (3000VA)"},{"$f":"VLOOKUP(L144,Tabella_prezzi!$A$3:$J$503,4,FALSE)","v":300},null,"L2N10",{"$f":"VLOOKUP(L144,Tabella_prezzi!$A$3:$J$308,6,FALSE)","v":"TS3L2-UPS"}]
[]
["TS3L2_GUI"]
[{"$f":"\"\"","v":""},null,null,null,null,null,{"$f":"\"\"","v":""},null,{"$f":"\"\"","v":""},null,null,{"$f":"\"\"","v":""},{"$f":"\"\"","v":""}]
["[TS3L2-GUI] Monitor DELL E1920H + Keyboard + Mouse",null,null,{"$f":"VLOOKUP(L148,Tabella_prezzi!$A$3:$J$308,8,FALSE)","v":"Monitor 19\" E1920H, Mouse MS116, Tastiera KB216"},null,null,1,{"$f":"VLOOKUP(L148,Tabella_prezzi!$A$3:$J$503,9,FALSE)","v":"L2N11-OpzGUI"},{"$f":"VLOOKUP(L148,Tabella_prezzi!$A$3:$J$503,3,FALSE)","v":"OpzGUI per tower"},{"$f":"VLOOKUP(L148,Tabella_prezzi!$A$3:$J$503,4,FALSE)","v":104},null,"L2N11",{"$f":"VLOOKUP(L148,Tabella_prezzi!$A$3:$J$308,6,FALSE)","v":"TS3L2-GUI"}]
[]
["No Bezel"]
["Bezel già compreso nel Kit TS3L2-RACKKIT"]
[]
["1-pack of Windows Server 2019/2016 Device CALs (STD or DC)",null,null,{"$f":"VLOOKUP(L153,Tabella_prezzi!$A$3:$J$308,8,FALSE)","v":"Windows Server 2019 Device CAL (STD or DC)"},null,null,1,{"$f":"VLOOKUP(L153,Tabella_prezzi!$A$3:$J$503,9,FALSE)","v":"L2N14-OpzDeviceCal"},{"$f":"VLOOKUP(L153,Tabella_prezzi!$A$3:$J$503,3,FALSE)","v":"OpzDeviceCal"},{"$f":"VLOOKUP(L153,Tabella_prezzi!$A$3:$J$503,4,FALSE)","v":23},null,"L2N14",{"$f":"VLOOKUP(L153,Tabella_prezzi!$A$3:$J$308,6,FALSE)","v":"TS3L2-WINDEVCAL"}]
["1-pack of Windows Server 2019/2016 User CALs (STD or DC)",null,null,{"$f":"VLOOKUP(L154,Tabella_prezzi!$A$3:$J$308,8,FALSE)","v":"Windows Server 2019 User CAL (STD or DC)"},null,null,1,{"$f":"VLOOKUP(L154,Tabella_prezzi!$A$3:$J$503,9,FALSE)","v":"L2N15-OpzUserCal"},{"$f":"VLOOKUP(L154,Tabella_prezzi!$A$3:$J$503,3,FALSE)","v":"OpzUserCal"},{"$f":"VLOOKUP(L154,Tabella_prezzi!$A$3:$J$503,4,FALSE)","v":29},null,"L2N15",{"$f":"VLOOKUP(L154,Tabella_prezzi!$A$3:$J$308,6,FALSE)","v":"TS3L2-WINUSRCAL"}]

{"sheet":"Tabella_prezzi","index":4,"n_rows":124,"n_cols":12,"rows_kept":124,"cut":false,"hidden":true,"merged":[[101,5,102,5],[101,7,102,7],[101,8,102,8],[101,0,102,0],[101,1,102,1],[101,2,102,2],[101,3,102,3],[101,4,102,4],[87,8,88,8],[85,8,86,8],[94,0,95,0],[94,1,95,1],[94,2,95,2],[94,3,95,3],[94,4,95,4],[94,5,95,5],[94,7,95,7],[94,8,95,8],[89,5,93,5],[89,0,93,0],[89,1,93,1],[89,2,93,2],[89,3,93,3],[89,4,93,4],[85,5,86,5],[85,7,86,7],[87,7,88,7],[87,0,88,0],[87,1,88,1],[87,2,88,2],[87,3,88,3],[87,4,88,4],[87,5,88,5],[85,0,86,0],[85,1,86,1],[85,2,86,2],[85,3,86,3],[85,4,86,4],[70,4,76,4],[70,5,76,5],[70,7,76,7],[60,0,61,0],[60,1,61,1],[60,2,61,2],[60,3,61,3],[60,4,61,4],[89,8,93,8],[12,7,18,7],[12,9,18,9],[12,0,18,0],[12,1,18,1],[12,2,18,2],[12,3,18,3],[12,4,18,4],[12,5,18,5],[12,6,18,6],[60,5,61,5],[60,7,61,7],[70,0,76,0],[70,1,76,1],[70,2,76,2],[70,3,76,3]]}
[]
["N°",null,"Attributo","Valore inserito","N°","Codice Convenzione","Qty:","Description:","Sku Number:","Brand",null,"Sku Number:"]
["L1N01",1,"Server Tower mono-processore",1399,"L1N01","TS3L1-SRV",1,"PowerEdge T340 Server",null,"DELL",null,"-"]
["L1N02",2,"OpzRAM16GB",98,"L1N02","TS3L1-RAM16",1,"16GB 2Rx8 DDR4 UDIMM 2666MHz",null,"DELL",null,"AA335286"]
["L1N03",3,"OpzGigabit",25,"L1N03","TS3L1-LAN1",1,"Broadcom 5720 DP 1Gb NIC,Full Height",null,"DELL",null,"540-BBGY"]
["L1N04",4,"OpzHDD8TB",285,"L1N04","TS3L1-HDD8TB",1,"8TB 7.2K RPM SATA 6Gbps 3.5in Hot-plug",null,"DELL",null,"400-AHID"]
["L1N05",5,"OpzHDD4TB",194,"L1N05","TS3L1-HDD4TB",1,"4TB 7.2K RPM SATA 6Gbps 3.5in Hot-plug",null,"DELL",null,"400-AUWY"]
["L1N06",6,"OpzHDD2TB",148,"L1N06","TS3L1-HDD2TB",1,"2TB 7.2K RPM SATA 6Gbps 3.5in Hot-plug",null,"DELL",null,"400-AUWX"]
["L1N07",7,"OpzHDD1TB",80,"L1N07","TS3L1-HDD1TB",1,"1TB 7.2K RPM SATA 6Gbps 3.5in Hot-plug",null,"DELL",null,"400-AURS"]
["L1N08",8,"OpzSSD-RI800GB",216,"L1N08","TS3L1-RI960GB",1,"960GB SSD SATA Read Intensive 6Gbps 2.5in Drive in 3.5in Hybrid Carrier, 1 DWPD",null,"DELL",null,"400-BDPC"]
["L1N09",9,"OpzSSD-RI400GB",160,"L1N09","TS3L1-RI480GB",1,"480GB SSD SATA Read Intensive 6Gbps 2.5in Drive in 3.5in Hybrid Carrier, 1 DWPD",null,"DELL",null,"400-BDQT"]
["L1N10",10,"OpzUps (3000VA)",302,"L1N10","TS3L1-UPS",1,"Powerme Online UPS RPMM/9 3K, Tower, SNMP card",null,"PowerME",null,"TPMM/ 3K"]
["L1N11",11,"OpzGUI per tower",69,"L1N11","TS3L1-GUI",1,"Monitor 19\" E1920H, Mouse MS116, Tastiera KB216",null,"DELL",null,"580-ADHM"]
[null,null,null,null,null,null,1,"Mouse ottico Dell MS116 - nero",null,null,null,"570-AAIS"]
[null,null,null,null,null,null,1,"BASE,DIS,MON,E1920H,EMEA",null,null,null,"210-AURI"]
[null,null,null,null,null,null,1,"Italian 220V Power Cord",null,null,null,"450-ABCK"]
[null,null,null,null,null,null,1,"SnP order - EMEA.",null,null,null,"800-10243"]
[null,null,null,null,null,null,1,"39M Basic with Advanced Exchange Channel",null,null,null,"709-17931"]
[null,null,null,null,null,null,1,"No Warranty Upgrade",null,null,null,"710-10844"]
["L1N12",12,"OpzWinServESS",256,"L1N12","TS3L1-WINSRVESS",1,"Windows Server 2019,Essentials, ROK",null,"DELL",null,"634-BSFZ"]
["L1N13",13,null,null,"L1N13"]
["L1N14",14,null,null,"L1N14"]
["L1N15",15,"OpzOpenSource",49,"L1N15","TS3L1-LINUX",1,"Ubuntu 18.04 LTS 64 Bit"]
["L1N16",16,"OpzHDDRetention",38,"L1N16","TS3L1-HDRTNTN",1,"Hard Disk Retention",null,"DELL",null,"785-10921"]
["L1N17",17,"OpzEstensione24",79,"L1N17","TS3L1-5Y",1,"Estensione della manutenzione in garanzia per ulteriori 24 mesi",null,"DELL",null,"742-10105"]
["L1N18",18,"OpzPowerSupply",82,"L1N18","TS3L1-PSU",1,"Single, Hot-plug Power Supply (1+0), 495W,CusKit",null,"DELL",null,"450-AEBM"]
["L1N19",19,"OpzGigabit 4p",50,"L1N19","TS3L1-LAN1QP",1,"Broadcom 5719 QP 1Gb Network Interface Card,Full Height,CusKit",null,"DELL",null,"540-BBGX"]
["L1N20",20,"OpzGigabit I350 2p",99.99,"L1N20","TS3L1-I3502P",1,"Intel Ethernet I350 Dual Port 1GbE BASE-T Adapter, PCIe Full Height",null,"DELL",null,"540-BBGZ"]
["L1N21",21,"OpzGigabit I350 4p",99.99,"L1N21","TS3L1-I3504P",1,"Intel Ethernet I350 Quad Port 1GbE BASE-T Adapter, PCIe Full Height",null,"DELL",null,"540-BBDS"]
["L1N22",22,"OpzGigabit10Gbps X550 2p T",99.99,"L1N22","TS3L1-X550",1,"Intel X550 Dual Port 10GbE BASE-T Adapter, PCIe Full Height",null,"DELL",null,"540-BBRK"]
["L1N23",23,"OpzGigabit10Gbps X710 2p SFP+",99.99,"L1N23","TS3L1-X710",1,"Intel X710 Dual Port 10GbE SFP+ Adapter, PCIe Full Height",null,"DELL",null,"540-BBIV"]
["L1N24",24,"OpzFibreChannel Emulex LPE12002",99.99,"L1N24","TS3L1-E12002",1,"Emulex LPE 12002 Dual Port 8Gb Fibre Channel HBA, PCIe Full Height",null,"DELL",null,"406-BBGR"]
["L1N25",25,"OpzControllerSAS ",99,"L1N25","TS3L1-CtrlSAS",1,"SAS 12Gbps HBA External Controller",null,"DELL",null,"405-AADZ"]
["L1N26",26,"OpzRJ45 3m",2,"L1N26","TS3L1-RJ453M",1,"cavo “patch” di 3 mt RJ45 certificato per gigabit ethernet"]
["L1N27",27,"OpzBezel",99.99,"L1N27","TS3L1-BEZEL",1,"Tower Bezel, PowerEdge, T340",null,"DELL",null,"470-ACNV"]
["L1N28",28,"OpzDVD",99.99,"L1N28","TS3L1-DVD",1,"DVD+/-RW, SATA, Internal",null,"DELL",null,"429-ABIE"]
["L1N29",29,"OpzHDMiniSAS2M",80,"L1N29","TS3L1-SAS2M",1,"12Gb HD-Mini to HD-Mini SAS Cable, 2M, Customer Kit",null,"DELL",null,"470-AATP"]
["L1N30",30,"OpzHDMiniSAS6M",120,"L1N30","TS3L1-SAS6M",1,"12Gb HD-Mini to HD-Mini SAS Cable, 6M, Customer Kit",null,"DELL",null,"470-AATR"]
["L1N31",31,"OpzHDMiniSAS05M",50,"L1N31","TS3L1-SAS05M",1,"12Gb HD-Mini SAS cable, 0.5m, Customer Kit",null,"DELL",null,"470-ABDQ"]
["L1N32",32,"OpzHDMiniSAS2MB",80,"L1N32","TS3L1-SAS2MB",1,"12Gb HD-Mini SAS cable, 2m, Customer Kit",null,"DELL",null,"470-ABDR"]
["L1N33",33,"OpzHDMiniSAS4M",100,"L1N33","TS3L1-SAS4M",1,"12Gb Mini-SAS HD to Mini-SAS HD Cable, 4m, Customer Kit",null,"DELL",null,"470-ACIS"]
["L1N34",34,"OpzSFPALL",40,"L1N34","TS3L1-SFPALL",1,"SFP+ SR Optic for all SFP+ ",null,"DELL",null,"407-BCBN"]
["L1N35",35,"OpzDAC1M",120,"L1N35","TS3L1-DAC1M",1,"Cable, SFP+ to SFP+, 10GbE, Copper Twinax Direct Attach Cable, 1 Meter",null,"DELL",null,"470-AAVG"]
["L1N36",36,"OpzDAC3M",150,"L1N36","TS3L1-DAC3M",1,"Cable, SFP+ to SFP+, 10GbE, Copper Twinax Direct Attach Cable, 3 Meter",null,"DELL",null,"470-AAVH"]
["L1N37",37,"OpzDAC5M",170,"L1N37","TS3L1-DAC5M",1,"Cable, SFP+ to SFP+, 10GbE, Copper Twinax Direct Attach Cable, 5 Meter",null,"DELL",null,"470-AAVJ"]
["L1N38",38,null,null,"L1N38"]
["L1N39",39,null,null,"L1N39"]
["L1N40",40,null,null,"L1N40"]
["L1N41",41,null,null,"L1N41"]
["L1N42",42,null,null,"L1N42"]
["L1N43",43,null,null,"L1N43"]
["L1N44",44,null,null,"L1N44"]
["L1N45",45,null,null,"L1N45"]
["L1N46",46,null,null,"L1N46"]
["L1N47",47,null,null,"L1N47"]
["L1N48",48,null,null,"L1N48"]
["L1N49",49,null,null,"L1N49"]
["L1N50",50,null,null,"L1N50"]
["N°",null,"Attributo","Valore inserito","N°","Codice Convenzione","Qty:","Description:","Sku Number:",null,null,"Sku Number:"]
["L2N01",1,"Server Tower bi-processore",2088,"L2N01","TS3L2-SRV",1,"PowerEdge T640 Server","L1N02-ServerT640",null,null,"-"]
["L2N02",2,"Kit n. 1 Processore aggiuntivo",590,"L2N02","TS3L2-CPU",1,"Intel® Xeon® Silver 4214 Processor 2.20 GHz, 12C/24T","L2N02-OpzCPU",null,null,"338-BSDR"]
[null,null,null,null,null,null,1,null,null,null,null,"412-AAMS"]
["L2N03",3,"OpzRAM16GB",99,"L2N03","TS3L2-RAM16",1,"16GB 2Rx8 DDR4 RDIMM 3200MHz","L2N03-OpzRAM16GB",null,null,"AA799064"]
["L2N04",4,"OpzGigabit",26,"L2N04","TS3L2-LAN1",1,"Broadcom 5720 DP 1Gb NIC,Full Height","L2N04-OpzGigabit",null,null,"540-BBGY"]
["L2N05",5,"OpzHDD2TB",226,"L2N05","TS3L2-HDD2TB",1,"2.4TB 10K RPM SAS 12Gbps 512e 2.5in Hot-plug","L2N05-OpzHDD2TB",null,null,"400-AUQX"]
["L2N06",6,"OpzHDD1TB",141,"L2N06","TS3L2-HDD1TB",1,"1.2TB 10K RPM SAS 12Gbps 2.5in Hot-plug","L2N06-OpzHDD1TB",null,null,"400-AJPD"]
["L2N07",7,"OpzHDD300GB",92,"L2N07","TS3L2-HDD300GB",1,"300GB 15K RPM SAS 12Gbps 2.5in Hot-plug","L2N07-OpzHDD300GB",null,null,"400-AUXN"]
["L2N08",8,"OpzSSD-RI800GB",727,"L2N08","TS3L2-RI800GB",1,"960GB SSD SAS Read Intensive 12Gbps 2.5in Hot-plug","L2N08-OpzSSD-RI800GB",null,null,"400-BBOU"]
["L2N09",9,"OpzSSD-RI400GB",394,"L2N09","TS3L2-RI400GB",1,"480GB SSD SAS Read Intensive 12Gbps 2.5in Hot-plug","L2N09- OpzSSD-RI400GB",null,null,"400-BKSC"]
["L2N10",10,"OpzUps (3000VA)",300,"L2N10","TS3L2-UPS",1,"UPS PowerMe RPMM/9K - 3000VA Tower","L2N10-OpzUps",null,null,"TPMM/ 3K"]
["L2N11",11,"OpzGUI per tower",104,"L2N11","TS3L2-GUI",1,"Monitor 19\" E1920H, Mouse MS116, Tastiera KB216","L2N11-OpzGUI",null,null,"580-ADHM"]
[null,null,null,null,null,null,1,null,null,null,null,"570-AAIS"]
[null,null,null,null,null,null,1,null,null,null,null,"210-AURI"]
[null,null,null,null,null,null,1,null,null,null,null,"450-ABCK"]
[null,null,null,null,null,null,1,null,null,null,null,"800-10243"]
[null,null,null,null,null,null,1,null,null,null,null,"709-17931"]
[null,null,null,null,null,null,1,null,null,null,null,"710-10844"]
["L2N12",12,"OpzWinServSTD",732,"L2N12","TS3L2-WINSRVSTD",1,"Windows Server 2019 Standard, ROK, 16CORE","L2N12-OpzWinServSTD",null,null,"634-BSFX"]
["L2N13",13,"OpzWinServSTD2core",94,"L2N13","TS3L2-WINSRV2C",1,"Windows Server 2019 Standard, Additional License, 2CORE","L2N13-OpzWinServSTD2core",null,null,"634-BSGS"]
["L2N14",14,"OpzDeviceCal",23,"L2N14","TS3L2-WINDEVCAL",1,"Windows Server 2019 Device CAL (STD or DC)","L2N14-OpzDeviceCal",null,null,"623-BBCV"]
["L2N15",15,"OpzUserCal",29,"L2N15","TS3L2-WINUSRCAL",1,"Windows Server 2019 User CAL (STD or DC)","L2N15-OpzUserCal",null,null,"623-BBCT"]
["L2N16",16,"OpzOpenSource",49,"L2N16","TS3L2-LINUX",1,"Ubuntu 18.04 LTS 64 Bit","L2N16-OpzOpenSource"]
["L2N17",17,"OpzHDDRetention",207,"L2N17","TS3L2-HDRTNTN",1,"Hard Disk Retention 36 mesi","L2N17-OpzHDDRetention",null,null,"785-10921"]
["L2N18",18,"OpzEstensione24",79,"L2N18","TS3L2-5Y",1,"Estensione della manutenzione in garanzia per ulteriori 24 mesi","L2N18-OpzEstensione24",null,null,"742-10105"]
["L2N19",19,"TS3-OpzA20BT640",99.99,"L2N19","TS3L2-BEZEL",1,"Tower Standard Bezel for T640","TS3-OpzA20BT640","DELL",null,"325-BCMV"]
["L2N20",20,"OpzBOSS240",429,"L2N20","TS3L2-BOSS240",1,"BOSS controller card, full height, with 2 240G M.2 Drives","TS3-OpzA20B240G","DELL",null,"403-BBVQ"]
[null,null,null,null,null,null,2,null,null,"DELL",null,"400-ASDQ"]
["L2N21",21,"OpzBOSS480",748,"L2N21","TS3L2-BOSS480",1,"BOSS controller card, full height, with 2 480G M.2 Drives","TS3-OpzA20B480G","DELL",null,"403-BBVQ"]
[null,null,null,null,null,null,2,null,null,"DELL",null,"400-AVSS"]
["L2N22",22,"TS3-OpzA20RKit",270,"L2N22","TS3L2-RACKKIT",1,"Kit composto da: Tower to Rack Conversion Kit; Rack Standard Bezel; 3U Cable Management Arm; Ready Rails 3U Sliding Rails","TS3-OpzA20T640K"]
[null,null,null,null,null,null,1,"Rack Standard Bezel for T640",null,"DELL",null,"325-BCOZ"]
[null,null,null,null,null,null,1,"Tower to Rack,Conversion Kit T640",null,"DELL",null,"770-BCJK"]
[null,null,null,null,null,null,1,"3U Cable Management Arm",null,"DELL",null,"770-BBKV"]
[null,null,null,null,null,null,1,"Ready Rails 3U Sliding Rails",null,"DELL",null,"770-BBJJ"]
["L2N23",23,"OpzCNA10Gb",383,"L2N23","TS3L2-CNA10GB",1,"Scheda 41112 DP 10Gb SFP+, 2 x Transceiver SFP+, 10GbE","TS3-OpzA20CNA","DELL",null,"540-BBYH"]
[null,null,null,null,null,null,2,null,null,"DELL",null,"407-BBOU"]
["L2N24",24,"Opz10GBIC",90,"L2N24","TS3L2-10GBIC",1,"Transceiver, SFP+, 10GbE, SR, 850nm Wavelength, 300m Reach",null,"DELL",null,"407-BBOU"]
["L2N25",25,"OpzDAC3M",9999,"L2N25","TS3L2-DAC3M",1,"Cable, SFP+ to SFP+, 10GbE, Copper Twinax Direct Attach Cable, 3 Meter",null,"DELL",null,"470-AAVJ"]
["L2N26",26,"TS3-OpzA20RJ45",3,"L2N26","TS3L2-RJ453M",1,"Cavo “patch” di 3 mt RJ45 certificato per gigabit ethernet","TS3-OpzA20RJ45"]
["L2N27",27,"OpzH840",479,"L2N27","TS3L2-H840",1,"PERC H840 RAID Adapter for External MD14XX Only, 8GB NV Cache, Full Height","TS3-OpzA20H840","DELL",null,"405-AAMZ"]
["L2N28",28,"OpzHDDRetention60",345,"L2N28","TS3L2-HDRTNTN60",1,"Hard Disk Retention 60 mesi","L2N28-OpzHDDRetention60"]
["L2N29",29,"OpzCNA10Gb",411,"L2N29","TS3L2-CNA10M3",1,"Scheda 41112 DP 10Gb SFP+, 2 x Cable, SFP+ to SFP+, 10GbE, Copper Twinax Direct Attach Cable, 3 Meter","TS3-OpzA20CNA3M","DELL",null,"540-BBYH"]
[null,null,null,null,null,null,2,null,null,"DELL",null,"470-AAVJ"]
["L2N30",30,null,672,"L2N30","TS3L2-H740P",1,"Dell PERC H740P RAID Controller in sostituzione del Controller in configurazione BASE","TS3-OpzA20H740P","DELL"]
["L2N31",31,null,null,"L2N31",null,null,null,null,"DELL"]
["L2N32",32,null,null,"L2N32",null,null,null,null,"DELL"]
["L2N33",33,null,null,"L2N33",null,null,null,null,"DELL"]
["L2N34",34,null,null,"L2N34"]
["L2N35",35,null,null,"L2N35"]
["L2N36",36,"OpzLCLC1M",null,"L2N36","TS3L2-LCLC1M",2,"Networking Cable, OM4 LC/LC Fiber Cable, (Optics required), 1 Meter",null,"DELL",null,"470-ACLV"]
["L2N37",37,"OpzLCLC2M",null,"L2N37","TS3L2-LCLC2M",2,"Networking Cable, OM4 LC/LC Fiber Cable, (Optics required), 2 Meter",null,"DELL",null,"470-ACLT"]
["L2N38",38,"OpzLCLC3M",null,"L2N38","TS3L2-LCLC3M",2,"Networking Cable, OM4 LC/LC Fiber Cable, (Optics required), 3 Meter",null,"DELL",null,"470-ACMO"]
["L2N39",39,"OpzLCLC5M",null,"L2N39","TS3L2-LCLC5M",2,"Networking Cable, OM4 LC/LC Fiber Cable, (Optics required), 5 Meter",null,"DELL",null,"470-ACLY"]
["L2N40",40,"OpzLCLC10M",null,"L2N40","TS3L2-LCLC10M",2,"Networking Cable, OM4 LC/LC Fiber Cable, (Optics required), 10 Meter",null,"DELL",null,"470-ACMN"]
["L2N41",41,"OpzLCLC30M",null,"L2N41","TS3L2-LCLC30M",2,"Networking Cable, OM4 LC/LC Fiber Cable, (Optics required), 30 Meter",null,"DELL",null,"470-ACLM"]
["L2N42",42,null,null,"L2N42"]
["L2N43",43,null,null,"L2N43"]
["L2N44",44,null,null,"L2N44"]
["L2N45",45,null,null,"L2N45"]
["L2N46",46,null,null,"L2N46"]
["L2N47",47,null,null,"L2N47"]
["L2N48",48,null,null,"L2N48"]
["L2N49",49,null,null,"L2N49"]
["L2N50",50,"OpzCodiceNATO",200,"L2N50","TS3L2-NATO",1,"Codifica NATO"]

{"sheet":"Altre_Opzioni","index":5,"n_rows":24,"n_cols":12,"rows_kept":24,"cut":false,"hidden":false,"merged":[[22,3,23,3],[7,3,8,3],[10,3,11,3],[13,3,14,3],[16,3,17,3],[19,3,20,3]]}
[null,null,null,null,"Convenzione",{"$f":"SUM(J9:J117)","v":0}]
[null,null,null,null,0.2,{"$f":"SUM(K9:K117)","v":0}]
[null,null,null,null,"Totale",{"$f":"SUM(F1:F2)","v":0}]
[]
[null,null,"Opzioni in Convenzione"]
[]
[]
[null,null,"OpzRack"]
[null,null,"Rack 42U con portata 1000 KG e 4 ruote + coppia PDU 12 prese Shuko bipasso ITA"]
[]
[null,null,"OpzUps (3000VA)"]
[null,null,"BUNDLE PMEUPS3RTSER Comprensivo di UPS e scheda SNMP + Kit Rack incluso"]
[]
[null,null,"OpzGUI"]
[null,null,"Unità KVM - monitor 17\", cavo combi PS2 e USB da 1,8mt, tastiera ita, touch pad"]
[]
[null,null,"OpzKVM"]
[null,null,"Switch 16 porte IP con relativi cavi combi PS/2 e USB inclusi"]
[]
[null,null,{"$f":"IF(Riepilogo!P34>0,\"OpzDeviceCal\",\"\")","v":""}]
[null,null,{"$f":"IF(Riepilogo!P34>0,\"1-pack of Windows Server 2019/2016 Device CALs (STD or DC)\",\"\")","v":""},null,{"$f":"VLOOKUP($C21,TS3L2_ALL,13,FALSE)","v":""},null,null,null,null,{"$f":"VLOOKUP($C21,TS3L2_ALL,10,FALSE)*F21","v":0},{"$f":"VLOOKUP($C21,TS3L2_ALL,11,FALSE)","v":0},{"$f":"VLOOKUP($C21,TS3L2_ALL,12,FALSE)","v":""}]
[]
[null,null,{"$f":"IF(Riepilogo!P34>0,\"OpzUserCal\",\"\")","v":""}]
[null,null,{"$f":"IF(Riepilogo!P34>0,\"1-pack of Windows Server 2019/2016 User CALs (STD or DC)\",\"\")","v":""},null,{"$f":"VLOOKUP($C24,TS3L2_ALL,13,FALSE)","v":""},null,null,null,null,{"$f":"VLOOKUP($C24,TS3L2_ALL,10,FALSE)*F24","v":0},{"$f":"VLOOKUP($C24,TS3L2_ALL,11,FALSE)","v":0},{"$f":"VLOOKUP($C24,TS3L2_ALL,12,FALSE)","v":""}]

{"sheet":"Riepilogo","index":6,"n_rows":60,"n_cols":25,"rows_kept":60,"cut":false,"hidden":false,"merged":[[41,1,41,6],[20,1,20,6],[17,4,17,6],[1,3,1,6],[15,1,15,2],[10,3,10,6],[15,3,15,6],[12,4,12,6],[1,1,1,2],[3,1,3,2],[5,1,5,2],[7,1,7,2],[10,1,10,2],[58,1,58,5],[55,4,55,5],[55,1,55,2],[54,1,54,5],[56,1,56,5],[57,1,57,5]]}
[null,null,null,null,null,null,null,null,null,1]
[null,"Ente:",null,null,null,null,null,null,null,1,null,"ente",{"$f":"IF(D2>0,0,1)","v":1}]
[null,null,null,null,null,null,null,null,null,1]
[null,"Ordine N.",null,null,{"$f":"M7","v":"ERRORE DI MANCATA COMPILAZIONE DATI NECESSARI PER L'ORDINATIVO"},null,null,null,null,1,null,"N°ordine",{"$f":"IF(D4>0,0,1)","v":1}]
[null,null,null,null,{"$f":"M8","v":""},null,null,null,null,1]
[null,"Data",null,null,{"$f":"M9","v":""},null,null,null,null,1,null,"data",{"$f":"IF(D6>0,0,1)","v":1}]
[null,null,null,null,{"$f":"M10","v":""},null,null,null,null,1,"Campi non compilati","ERRORE1",{"$f":"IF(M2+M4+M6+M11+M13+M16+M18+O18+O13,\"ERRORE DI MANCATA COMPILAZIONE DATI NECESSARI PER L'ORDINATIVO\",\"\")","v":"ERRORE DI MANCATA COMPILAZIONE DATI NECESSARI PER L'ORDINATIVO"},{"$f":"IF(M7=\"\",0,1)","v":1}]
[null,"Totale IVA incl.",null,{"$f":"G59","v":0},{"$f":"IF(Q11=0,\"CONFIGURATORE OK\", \"\")","v":""},null,"Version 3.3",null,null,1,"Avvertimento 20%","Warning2",{"$f":"IF(G56>D56,\"!!! ATTENZIONE !!! L'IMPORTO 20% SUPERA IL VALORE MASSIMO CONSENTITO\",\"\")","v":""},{"$f":"IF(M8=\"\",0,1)","v":0}]
[null,null,null,null,null,null,null,null,null,1,null,"ERRORE3",{"$f":"\"\"","v":""},0]
[null,null,null,null,null,null,null,null,null,1,"Avvertimento Note/Raid","Waning4",{"$f":"IF(N10>0,\"!!! ATTENZIONE !!! COMPLETARE IL CAMPO NOTE NELLE CONFIGURAZIONI\",\"\")","v":""},{"$f":"IF(M22>0,O10,0)+IF(N22>0,P10,0)+IF(O22>0,Q10,0)","v":0},{"$f":"IF(Lotto2_T640_1!$H$30=\"Specificare la configurazione RAID per l'installazione del Sistema Operativo, se richiesto.\ne/o\ninserire eventuali note.\",1,0)","v":1},{"$f":"IF(Lotto2_T640_2!$H$30=\"Specificare la configurazione RAID per l'installazione del Sistema Operativo, se richiesto.\ne/o\ninserire eventuali note.\",1,0)","v":1},{"$f":"IF(Lotto2_T640_3!$H$30=\"Specificare la configurazione RAID per l'installazione del Sistema Operativo, se richiesto.\ne/o\ninserire eventuali note.\",1,0)","v":1}]
[null,"Referente Consegna",null,null,null,null,null,null,null,1,null,"ref1",{"$f":"IF(D11>0,0,1)","v":1},null,"Verifica Errori",null,{"$f":"N7+N9","v":1}]
[null,null,null,null,null,null,null,null,null,1]
[null,"Telefono",null,"email",null,null,null,null,null,1,null,"tel1",{"$f":"IF(C13>0,0,1)","v":1},"mail1",{"$f":"IF(E13>0,0,1)","v":1}]
[null,null,null,null,null,null,null,null,null,1]
[null,null,null,null,null,null,null,null,null,1]
[null,"Referente Installazione",null,null,null,null,null,null,null,1,null,"ref2",{"$f":"IF(D16>0,0,1)","v":1}]
[null,null,null,null,null,null,null,null,null,1]
[null,"Telefono",null,"email",null,null,null,null,null,1,null,"tel2",{"$f":"IF(C18>0,0,1)","v":1},"mail2",{"$f":"IF(E18>0,0,1)","v":1}]
[null,null,null,null,null,null,null,null,null,1]
[null,null,null,null,null,null,null,null,null,1,null,null,"Server1","Server2","Server3","Totale"]
[null,"TECNOLOGIE SERVER 3 LOTTO 2 - LISTA ARTICOLI IN CONVENZIONE -",null,null,null,null,null,null,null,{"$f":"IF($G$55>0,1,0)","v":0}]
[null,"Quantità","Codice Articolo Produttore","Codice Articolo Convenzione","Descrizione","Costo unitario","Costo complessivo",null,null,{"$f":"IF($G$55>0,1,0)","v":0},"Codice Convenzione","N°",{"$f":"Lotto2_T640_1!F5","v":0},{"$f":"Lotto2_T640_2!F5","v":0},{"$f":"Lotto2_T640_3!F5","v":0}]
[null,{"$f":"IF(P23>0,P23,\"\")","v":""},{"$f":"IF(B23=\"\",\"\",VLOOKUP(L23,Tabella_prezzi!$A$3:$J$308,9,FALSE))","v":""},{"$f":"IF(B23=\"\",\"\",VLOOKUP(L23,Tabella_prezzi!$A$3:$J$308,6,FALSE))","v":""},{"$f":"IF(B23=\"\",\"\",VLOOKUP(L23,Tabella_prezzi!$A$3:$J$308,8,FALSE))","v":""},{"$f":"IF(B23=\"\",\"\",VLOOKUP(L23,Tabella_prezzi!$A$3:$J$308,4,FALSE))","v":""},{"$f":"IF(C23=\"\",\"\",F23*B23)","v":""},null,null,{"$f":"IF(B23=\"\",0,1)","v":0},{"$f":"VLOOKUP(L23,Tabella_prezzi!A2:J308,6,FALSE)","v":"TS3L2-SRV"},"L2N01",{"$f":"COUNTIF($Q$23:$Q$61,L23)*$M$22","v":0},{"$f":"COUNTIF($S$23:$S$61,L23)*$N$22","v":0},{"$f":"COUNTIF($U$23:$U$61,L23)*$O$22","v":0},{"$f":"SUM(M23:O23)","v":0},{"$f":"Lotto2_T640_1!K8","v":"L2N01"},{"$f":"Lotto2_T640_1!F8","v":""},{"$f":"Lotto2_T640_2!K8","v":"L2N01"},{"$f":"Lotto2_T640_2!F8","v":""},{"$f":"Lotto2_T640_3!K8","v":"L2N01"},{"$f":"Lotto2_T640_3!F8","v":""},null,{"$f":"ISODD(J23)","v":false},"server"]
[null,{"$f":"IF(P24>0,P24,\"\")","v":""},{"$f":"IF(B24=\"\",\"\",VLOOKUP(L24,Tabella_prezzi!$A$3:$J$308,9,FALSE))","v":""},{"$f":"IF(B24=\"\",\"\",VLOOKUP(L24,Tabella_prezzi!$A$3:$J$308,6,FALSE))","v":""},{"$f":"IF(B24=\"\",\"\",VLOOKUP(L24,Tabella_prezzi!$A$3:$J$308,8,FALSE))","v":""},{"$f":"IF(B24=\"\",\"\",VLOOKUP(L24,Tabella_prezzi!$A$3:$J$308,4,FALSE))","v":""},{"$f":"IF(C24=\"\",\"\",F24*B24)","v":""},null,null,{"$f":"IF(B24=\"\",0,1)","v":0},{"$f":"VLOOKUP(L24,Tabella_prezzi!A3:J309,6,FALSE)","v":"TS3L2-CPU"},"L2N02",{"$f":"COUNTIF($Q$23:$Q$61,L24)*$M$22*R24","v":0},{"$f":"COUNTIF($S$23:$S$61,L24)*$N$22*T24","v":0},{"$f":"COUNTIF($U$23:$U$61,L24)*$O$22*V24","v":0},{"$f":"SUM(M24:O24)","v":0},{"$f":"Lotto2_T640_1!K20","v":""},{"$f":"Lotto2_T640_1!F20","v":0},{"$f":"Lotto2_T640_2!K20","v":""},{"$f":"Lotto2_T640_2!F20","v":0},{"$f":"Lotto2_T640_3!K20","v":""},{"$f":"Lotto2_T640_3!F20","v":0},null,{"$f":"ISODD(SUM($J$23:J24))","v":false},"Cpu"]
[null,"",{"$f":"IF(B25=\"\",\"\",VLOOKUP(L25,Tabella_prezzi!$A$3:$J$308,9,FALSE))","v":""},{"$f":"IF(B25=\"\",\"\",VLOOKUP(L25,Tabella_prezzi!$A$3:$J$308,6,FALSE))","v":""},{"$f":"IF(B25=\"\",\"\",VLOOKUP(L25,Tabella_prezzi!$A$3:$J$308,8,FALSE))","v":""},{"$f":"IF(B25=\"\",\"\",VLOOKUP(L25,Tabella_prezzi!$A$3:$J$308,4,FALSE))","v":""},"",null,null,0,{"$f":"VLOOKUP(L25,Tabella_prezzi!A4:J310,6,FALSE)","v":"TS3L2-RAM16"},"L2N03",{"$f":"COUNTIF($Q$23:$Q$61,L25)*$M$22*R25","v":0},{"$f":"COUNTIF($S$23:$S$61,L25)*$N$22*T25","v":0},{"$f":"COUNTIF($U$23:$U$61,L25)*$O$22*V25","v":0},0,{"$f":"Lotto2_T640_1!K23","v":""},{"$f":"Lotto2_T640_1!F23","v":0},{"$f":"Lotto2_T640_2!K23","v":""},{"$f":"Lotto2_T640_2!F23","v":0},{"$f":"Lotto2_T640_3!K23","v":""},{"$f":"Lotto2_T640_3!F23","v":0},null,{"$f":"ISODD(SUM($J$23:J25))","v":false},"ram"]
[null,"",{"$f":"IF(B26=\"\",\"\",VLOOKUP(L26,Tabella_prezzi!$A$3:$J$308,9,FALSE))","v":""},{"$f":"IF(B26=\"\",\"\",VLOOKUP(L26,Tabella_prezzi!$A$3:$J$308,6,FALSE))","v":""},{"$f":"IF(B26=\"\",\"\",VLOOKUP(L26,Tabella_prezzi!$A$3:$J$308,8,FALSE))","v":""},{"$f":"IF(B26=\"\",\"\",VLOOKUP(L26,Tabella_prezzi!$A$3:$J$308,4,FALSE))","v":""},"",null,null,0,{"$f":"VLOOKUP(L26,Tabella_prezzi!A5:J311,6,FALSE)","v":"TS3L2-LAN1"},"L2N04",{"$f":"COUNTIF($Q$23:$Q$61,L26)*$M$22","v":0},{"$f":"COUNTIF($S$23:$S$61,L26)*$N$22","v":0},{"$f":"COUNTIF($U$23:$U$61,L26)*$O$22","v":0},0,{"$f":"Lotto2_T640_1!K26","v":""},{"$f":"Lotto2_T640_1!F26","v":""},{"$f":"Lotto2_T640_2!K26","v":""},{"$f":"Lotto2_T640_2!F26","v":""},{"$f":"Lotto2_T640_3!K26","v":""},{"$f":"Lotto2_T640_3!F26","v":""},null,{"$f":"ISODD(SUM($J$23:J26))","v":false},"Sist Op"]
[null,"",{"$f":"IF(B27=\"\",\"\",VLOOKUP(L27,Tabella_prezzi!$A$3:$J$308,9,FALSE))","v":""},{"$f":"IF(B27=\"\",\"\",VLOOKUP(L27,Tabella_prezzi!$A$3:$J$308,6,FALSE))","v":""},{"$f":"IF(B27=\"\",\"\",VLOOKUP(L27,Tabella_prezzi!$A$3:$J$308,8,FALSE))","v":""},{"$f":"IF(B27=\"\",\"\",VLOOKUP(L27,Tabella_prezzi!$A$3:$J$308,4,FALSE))","v":""},"",null,null,0,{"$f":"VLOOKUP(L27,Tabella_prezzi!A6:J312,6,FALSE)","v":"TS3L2-HDD2TB"},"L2N05",{"$f":"COUNTIF($Q$23:$Q$61,L27)*$M$22*R27","v":0},{"$f":"COUNTIF($S$23:$S$61,L27)*$N$22*T27","v":0},{"$f":"COUNTIF($U$23:$U$61,L27)*$O$22*V27","v":0},0,{"$f":"Lotto2_T640_1!K34","v":"L2N05"},{"$f":"Lotto2_T640_1!F34","v":0},{"$f":"Lotto2_T640_2!K34","v":"L2N05"},{"$f":"Lotto2_T640_2!F34","v":0},{"$f":"Lotto2_T640_3!K34","v":"L2N05"},{"$f":"Lotto2_T640_3!F34","v":0},null,{"$f":"ISODD(SUM($J$23:J27))","v":false},"hd2tb"]
[null,"",{"$f":"IF(B28=\"\",\"\",VLOOKUP(L28,Tabella_prezzi!$A$3:$J$308,9,FALSE))","v":""},{"$f":"IF(B28=\"\",\"\",VLOOKUP(L28,Tabella_prezzi!$A$3:$J$308,6,FALSE))","v":""},{"$f":"IF(B28=\"\",\"\",VLOOKUP(L28,Tabella_prezzi!$A$3:$J$308,8,FALSE))","v":""},{"$f":"IF(B28=\"\",\"\",VLOOKUP(L28,Tabella_prezzi!$A$3:$J$308,4,FALSE))","v":""},"",null,null,0,{"$f":"VLOOKUP(L28,Tabella_prezzi!A7:J313,6,FALSE)","v":"TS3L2-HDD1TB"},"L2N06",{"$f":"COUNTIF($Q$23:$Q$61,L28)*$M$22*R28","v":0},{"$f":"COUNTIF($S$23:$S$61,L28)*$N$22*T28","v":0},{"$f":"COUNTIF($U$23:$U$61,L28)*$O$22*V28","v":0},0,{"$f":"Lotto2_T640_1!K36","v":"L2N06"},{"$f":"Lotto2_T640_1!F36","v":0},{"$f":"Lotto2_T640_2!K36","v":"L2N06"},{"$f":"Lotto2_T640_2!F36","v":0},{"$f":"Lotto2_T640_3!K36","v":"L2N06"},{"$f":"Lotto2_T640_3!F36","v":0},null,{"$f":"ISODD(SUM($J$23:J28))","v":false},"hd1tb"]
[null,"",{"$f":"IF(B29=\"\",\"\",VLOOKUP(L29,Tabella_prezzi!$A$3:$J$308,9,FALSE))","v":""},{"$f":"IF(B29=\"\",\"\",VLOOKUP(L29,Tabella_prezzi!$A$3:$J$308,6,FALSE))","v":""},{"$f":"IF(B29=\"\",\"\",VLOOKUP(L29,Tabella_prezzi!$A$3:$J$308,8,FALSE))","v":""},{"$f":"IF(B29=\"\",\"\",VLOOKUP(L29,Tabella_prezzi!$A$3:$J$308,4,FALSE))","v":""},"",null,null,0,{"$f":"VLOOKUP(L29,Tabella_prezzi!A8:J314,6,FALSE)","v":"TS3L2-HDD300GB"},"L2N07",{"$f":"COUNTIF($Q$23:$Q$61,L29)*$M$22*R29","v":0},{"$f":"COUNTIF($S$23:$S$61,L29)*$N$22*T29","v":0},{"$f":"COUNTIF($U$23:$U$61,L29)*$O$22*V29","v":0},0,{"$f":"Lotto2_T640_1!K38","v":"L2N07"},{"$f":"Lotto2_T640_1!F38","v":0},{"$f":"Lotto2_T640_2!K38","v":"L2N07"},{"$f":"Lotto2_T640_2!F38","v":0},{"$f":"Lotto2_T640_3!K38","v":"L2N07"},{"$f":"Lotto2_T640_3!F38","v":0},null,{"$f":"ISODD(SUM($J$23:J29))","v":false},"hd300gb"]
[null,"",{"$f":"IF(B30=\"\",\"\",VLOOKUP(L30,Tabella_prezzi!$A$3:$J$308,9,FALSE))","v":""},{"$f":"IF(B30=\"\",\"\",VLOOKUP(L30,Tabella_prezzi!$A$3:$J$308,6,FALSE))","v":""},{"$f":"IF(B30=\"\",\"\",VLOOKUP(L30,Tabella_prezzi!$A$3:$J$308,8,FALSE))","v":""},{"$f":"IF(B30=\"\",\"\",VLOOKUP(L30,Tabella_prezzi!$A$3:$J$308,4,FALSE))","v":""},"",null,null,0,{"$f":"VLOOKUP(L30,Tabella_prezzi!A9:J315,6,FALSE)","v":"TS3L2-RI800GB"},"L2N08",{"$f":"COUNTIF($Q$23:$Q$61,L30)*$M$22*R30","v":0},{"$f":"COUNTIF($S$23:$S$61,L30)*$N$22*T30","v":0},{"$f":"COUNTIF($U$23:$U$61,L30)*$O$22*V30","v":0},0,{"$f":"Lotto2_T640_1!K40","v":"L2N08"},{"$f":"IF(Lotto2_T640_1!F40>2,Lotto2_T640_1!F40-2,0)","v":0},{"$f":"Lotto2_T640_2!K40","v":"L2N08"},{"$f":"IF(Lotto2_T640_2!F40>2,Lotto2_T640_2!F40-2,0)","v":0},{"$f":"Lotto2_T640_3!K40","v":"L2N08"},{"$f":"IF(Lotto2_T640_3!F40>2,Lotto2_T640_3!F40-2,0)","v":0},null,{"$f":"ISODD(SUM($J$23:J30))","v":false},"ssd960GB"]
[null,"",{"$f":"IF(B31=\"\",\"\",VLOOKUP(L31,Tabella_prezzi!$A$3:$J$308,9,FALSE))","v":""},{"$f":"IF(B31=\"\",\"\",VLOOKUP(L31,Tabella_prezzi!$A$3:$J$308,6,FALSE))","v":""},{"$f":"IF(B31=\"\",\"\",VLOOKUP(L31,Tabella_prezzi!$A$3:$J$308,8,FALSE))","v":""},{"$f":"IF(B31=\"\",\"\",VLOOKUP(L31,Tabella_prezzi!$A$3:$J$308,4,FALSE))","v":""},"",null,null,0,{"$f":"VLOOKUP(L31,Tabella_prezzi!A10:J316,6,FALSE)","v":"TS3L2-RI400GB"},"L2N09",{"$f":"IF(R31>2,COUNTIF($Q$23:$Q$61,L31)*$M$22*R31-2,0)","v":0},{"$f":"IF(T31>2,COUNTIF($S$23:$S$61,L31)*$N$22*T31-2,0)","v":0},{"$f":"IF(T31>2,COUNTIF($U$23:$U$61,L31)*$O$22*V31-2,0)","v":0},0,{"$f":"Lotto2_T640_1!K42","v":"L2N09"},{"$f":"Lotto2_T640_1!F42","v":0},{"$f":"Lotto2_T640_2!K42","v":"L2N09"},{"$f":"Lotto2_T640_2!F42","v":0},{"$f":"Lotto2_T640_3!K42","v":"L2N09"},{"$f":"Lotto2_T640_3!F42","v":0},null,{"$f":"ISODD(SUM($J$23:J31))","v":false},"ssd480GB"]
[null,"",{"$f":"IF(B32=\"\",\"\",VLOOKUP(L32,Tabella_prezzi!$A$3:$J$308,9,FALSE))","v":""},{"$f":"IF(B32=\"\",\"\",VLOOKUP(L32,Tabella_prezzi!$A$3:$J$308,6,FALSE))","v":""},{"$f":"IF(B32=\"\",\"\",VLOOKUP(L32,Tabella_prezzi!$A$3:$J$308,8,FALSE))","v":""},{"$f":"IF(B32=\"\",\"\",VLOOKUP(L32,Tabella_prezzi!$A$3:$J$308,4,FALSE))","v":""},"",null,null,0,{"$f":"VLOOKUP(L32,Tabella_prezzi!A11:J317,6,FALSE)","v":"TS3L2-UPS"},"L2N10",{"$f":"COUNTIF($Q$23:$Q$61,L32)*$M$22","v":0},0,0,0,{"$f":"Lotto2_T640_1!K54","v":""},{"$f":"Lotto2_T640_1!F54","v":""},{"$f":"Lotto2_T640_2!K54","v":""},{"$f":"Lotto2_T640_2!F54","v":""},{"$f":"Lotto2_T640_3!K54","v":""},{"$f":"Lotto2_T640_3!F54","v":""},null,{"$f":"ISODD(SUM($J$23:J32))","v":false},"pci1"]
[null,"",{"$f":"IF(B33=\"\",\"\",VLOOKUP(L33,Tabella_prezzi!$A$3:$J$308,9,FALSE))","v":""},{"$f":"IF(B33=\"\",\"\",VLOOKUP(L33,Tabella_prezzi!$A$3:$J$308,6,FALSE))","v":""},{"$f":"IF(B33=\"\",\"\",VLOOKUP(L33,Tabella_prezzi!$A$3:$J$308,8,FALSE))","v":""},{"$f":"IF(B33=\"\",\"\",VLOOKUP(L33,Tabella_prezzi!$A$3:$J$308,4,FALSE))","v":""},"",null,null,0,{"$f":"VLOOKUP(L33,Tabella_prezzi!A12:J318,6,FALSE)","v":"TS3L2-GUI"},"L2N11",{"$f":"COUNTIF($Q$23:$Q$61,L33)*$M$22","v":0},0,0,0,{"$f":"Lotto2_T640_1!K57","v":""},{"$f":"Lotto2_T640_1!F57","v":""},{"$f":"Lotto2_T640_2!K57","v":""},{"$f":"Lotto2_T640_2!F57","v":""},{"$f":"Lotto2_T640_3!K57","v":""},{"$f":"Lotto2_T640_3!F57","v":""},null,{"$f":"ISODD(SUM($J$23:J33))","v":false},"pci2"]
[null,"",{"$f":"IF(B34=\"\",\"\",VLOOKUP(L34,Tabella_prezzi!$A$3:$J$308,9,FALSE))","v":""},{"$f":"IF(B34=\"\",\"\",VLOOKUP(L34,Tabella_prezzi!$A$3:$J$308,6,FALSE))","v":""},{"$f":"IF(B34=\"\",\"\",VLOOKUP(L34,Tabella_prezzi!$A$3:$J$308,8,FALSE))","v":""},{"$f":"IF(B34=\"\",\"\",VLOOKUP(L34,Tabella_prezzi!$A$3:$J$308,4,FALSE))","v":""},"",null,null,0,{"$f":"VLOOKUP(L34,Tabella_prezzi!A13:J319,6,FALSE)","v":"TS3L2-WINSRVSTD"},"L2N12",{"$f":"COUNTIF($Q$23:$Q$61,L34)*$M$22","v":0},0,0,0,{"$f":"Lotto2_T640_1!K60","v":""},{"$f":"Lotto2_T640_1!F60","v":""},{"$f":"Lotto2_T640_2!K60","v":""},{"$f":"Lotto2_T640_2!F60","v":""},{"$f":"Lotto2_T640_3!K60","v":""},{"$f":"Lotto2_T640_3!F60","v":""},null,{"$f":"ISODD(SUM($J$23:J34))","v":false},"pci3"]
[null,"",{"$f":"IF(B35=\"\",\"\",VLOOKUP(L35,Tabella_prezzi!$A$3:$J$308,9,FALSE))","v":""},{"$f":"IF(B35=\"\",\"\",VLOOKUP(L35,Tabella_prezzi!$A$3:$J$308,6,FALSE))","v":""},{"$f":"IF(B35=\"\",\"\",VLOOKUP(L35,Tabella_prezzi!$A$3:$J$308,8,FALSE))","v":""},{"$f":"IF(B35=\"\",\"\",VLOOKUP(L35,Tabella_prezzi!$A$3:$J$308,4,FALSE))","v":""},"",null,null,0,{"$f":"VLOOKUP(L35,Tabella_prezzi!A14:J320,6,FALSE)","v":"TS3L2-WINSRV2C"},"L2N13",{"$f":"COUNTIF($Q$23:$Q$61,L35)*$M$22*R40","v":0},{"$f":"COUNTIF($S$23:$S$61,L35)*$N$22*T40","v":0},{"$f":"COUNTIF($U$23:$U$61,L35)*$O$22*V40","v":0},0,{"$f":"Lotto2_T640_1!K63","v":0},{"$f":"Lotto2_T640_1!F63","v":""},{"$f":"Lotto2_T640_2!K63","v":0},{"$f":"Lotto2_T640_2!F63","v":""},{"$f":"Lotto2_T640_3!K63","v":0},{"$f":"Lotto2_T640_3!F63","v":""},null,{"$f":"ISODD(SUM($J$23:J35))","v":false},"pci4"]
[null,"",{"$f":"IF(B36=\"\",\"\",VLOOKUP(L36,Tabella_prezzi!$A$3:$J$308,9,FALSE))","v":""},{"$f":"IF(B36=\"\",\"\",VLOOKUP(L36,Tabella_prezzi!$A$3:$J$308,6,FALSE))","v":""},{"$f":"IF(B36=\"\",\"\",VLOOKUP(L36,Tabella_prezzi!$A$3:$J$308,8,FALSE))","v":""},{"$f":"IF(B36=\"\",\"\",VLOOKUP(L36,Tabella_prezzi!$A$3:$J$308,4,FALSE))","v":""},"",null,null,0,{"$f":"VLOOKUP(L36,Tabella_prezzi!A15:J321,6,FALSE)","v":"TS3L2-WINDEVCAL"},"L2N14",null,null,null,{"$f":"Altre_Opzioni!F21","v":0},{"$f":"Lotto2_T640_1!K66","v":0},{"$f":"Lotto2_T640_1!F66","v":""},{"$f":"Lotto2_T640_2!K66","v":0},{"$f":"Lotto2_T640_2!F66","v":""},{"$f":"Lotto2_T640_3!K66","v":0},{"$f":"Lotto2_T640_3!F66","v":""},null,{"$f":"ISODD(SUM($J$23:J36))","v":false},"pci5"]
[null,"",{"$f":"IF(B37=\"\",\"\",VLOOKUP(L37,Tabella_prezzi!$A$3:$J$308,9,FALSE))","v":""},{"$f":"IF(B37=\"\",\"\",VLOOKUP(L37,Tabella_prezzi!$A$3:$J$308,6,FALSE))","v":""},{"$f":"IF(B37=\"\",\"\",VLOOKUP(L37,Tabella_prezzi!$A$3:$J$308,8,FALSE))","v":""},{"$f":"IF(B37=\"\",\"\",VLOOKUP(L37,Tabella_prezzi!$A$3:$J$308,4,FALSE))","v":""},"",null,null,0,{"$f":"VLOOKUP(L37,Tabella_prezzi!A16:J322,6,FALSE)","v":"TS3L2-WINUSRCAL"},"L2N15",null,null,null,{"$f":"Altre_Opzioni!F24","v":0},{"$f":"Lotto2_T640_1!K69","v":0},{"$f":"Lotto2_T640_1!F69","v":""},{"$f":"Lotto2_T640_2!K69","v":0},{"$f":"Lotto2_T640_2!F69","v":""},{"$f":"Lotto2_T640_3!K69","v":0},{"$f":"Lotto2_T640_3!F69","v":""},null,{"$f":"ISODD(SUM($J$23:J37))","v":false},"pci6"]
[null,"",{"$f":"IF(B38=\"\",\"\",VLOOKUP(L38,Tabella_prezzi!$A$3:$J$308,9,FALSE))","v":""},{"$f":"IF(B38=\"\",\"\",VLOOKUP(L38,Tabella_prezzi!$A$3:$J$308,6,FALSE))","v":""},{"$f":"IF(B38=\"\",\"\",VLOOKUP(L38,Tabella_prezzi!$A$3:$J$308,8,FALSE))","v":""},{"$f":"IF(B38=\"\",\"\",VLOOKUP(L38,Tabella_prezzi!$A$3:$J$308,4,FALSE))","v":""},"",null,null,0,{"$f":"VLOOKUP(L38,Tabella_prezzi!A17:J323,6,FALSE)","v":"TS3L2-LINUX"},"L2N16",{"$f":"COUNTIF($Q$23:$Q$61,L38)*$M$22","v":0},{"$f":"COUNTIF($S$23:$S$61,L38)*$N$22","v":0},{"$f":"COUNTIF($U$23:$U$61,L38)*$O$22","v":0},0,{"$f":"Lotto2_T640_1!K72","v":0},{"$f":"Lotto2_T640_1!F72","v":""},{"$f":"Lotto2_T640_2!K72","v":0},{"$f":"Lotto2_T640_2!F72","v":""},{"$f":"Lotto2_T640_3!K72","v":0},{"$f":"Lotto2_T640_3!F72","v":""},null,{"$f":"ISODD(SUM($J$23:J38))","v":false},"pci7"]
[null,"",{"$f":"IF(B39=\"\",\"\",VLOOKUP(L39,Tabella_prezzi!$A$3:$J$308,9,FALSE))","v":""},{"$f":"IF(B39=\"\",\"\",VLOOKUP(L39,Tabella_prezzi!$A$3:$J$308,6,FALSE))","v":""},{"$f":"IF(B39=\"\",\"\",VLOOKUP(L39,Tabella_prezzi!$A$3:$J$308,8,FALSE))","v":""},{"$f":"IF(B39=\"\",\"\",VLOOKUP(L39,Tabella_prezzi!$A$3:$J$308,4,FALSE))","v":""},"",null,null,0,{"$f":"VLOOKUP(L39,Tabella_prezzi!A18:J324,6,FALSE)","v":"TS3L2-HDRTNTN"},"L2N17",0,0,0,0,{"$f":"Lotto2_T640_1!K75","v":0},{"$f":"Lotto2_T640_1!F75","v":""},{"$f":"Lotto2_T640_2!K75","v":0},{"$f":"Lotto2_T640_2!F75","v":""},{"$f":"Lotto2_T640_3!K75","v":0},{"$f":"Lotto2_T640_3!F75","v":""},null,{"$f":"ISODD(SUM($J$23:J39))","v":false},"pci8"]
[null,{"$f":"IF(P40>0,P40,\"\")","v":""},{"$f":"IF(B40=\"\",\"\",VLOOKUP(L40,Tabella_prezzi!$A$3:$J$308,9,FALSE))","v":""},{"$f":"IF(B40=\"\",\"\",VLOOKUP(L40,Tabella_prezzi!$A$3:$J$308,6,FALSE))","v":""},{"$f":"IF(B40=\"\",\"\",VLOOKUP(L40,Tabella_prezzi!$A$3:$J$308,8,FALSE))","v":""},{"$f":"IF(B40=\"\",\"\",VLOOKUP(L40,Tabella_prezzi!$A$3:$J$308,4,FALSE))","v":""},{"$f":"IF(C40=\"\",\"\",F40*B40)","v":""},null,null,0,{"$f":"VLOOKUP(L40,Tabella_prezzi!A19:J325,6,FALSE)","v":"TS3L2-5Y"},"L2N18",0,0,0,{"$f":"SUM(M40:O40)","v":0},{"$f":"Lotto2_T640_1!K27","v":""},{"$f":"Lotto2_T640_1!F27","v":0},{"$f":"Lotto2_T640_2!K27","v":""},{"$f":"Lotto2_T640_2!F27","v":0},{"$f":"Lotto2_T640_3!K27","v":""},{"$f":"Lotto2_T640_3!F27","v":0},null,{"$f":"ISODD(SUM($J$23:J40))","v":false},"win2core"]
[null,"",{"$f":"IF(B41=\"\",\"\",VLOOKUP(L41,Tabella_prezzi!$A$3:$J$308,9,FALSE))","v":""},{"$f":"IF(B41=\"\",\"\",VLOOKUP(L41,Tabella_prezzi!$A$3:$J$308,6,FALSE))","v":""},{"$f":"IF(B41=\"\",\"\",VLOOKUP(L41,Tabella_prezzi!$A$3:$J$308,8,FALSE))","v":""},{"$f":"IF(B41=\"\",\"\",VLOOKUP(L41,Tabella_prezzi!$A$3:$J$308,4,FALSE))","v":""},"",null,null,0,{"$f":"VLOOKUP(L41,Tabella_prezzi!A31:J337,6,FALSE)","v":"TS3L2-HDRTNTN60"},"L2N28",0,0,0,{"$f":"SUM(M41:O41)","v":0},null,null,null,null,null,null,null,{"$f":"ISODD(SUM($J$23:J41))","v":false}]
[null,"TECNOLOGIE SERVER 3 LOTTO 2 - LISTA ULTERIORI ARTICOLI IN CONVENZIONE (20%) -",null,null,null,null,null,null,null,{"$f":"IF($G$56>0,1,0)","v":0},null,null,null,null,null,null,{"$f":"Lotto2_T640_1!K93","v":""},{"$f":"Lotto2_T640_1!F93","v":""},{"$f":"Lotto2_T640_2!K93","v":""},{"$f":"Lotto2_T640_2!F93","v":""},{"$f":"Lotto2_T640_3!K93","v":""},{"$f":"Lotto2_T640_3!F93","v":""},null,null,"retention"]
[null,"Quantità","Codice Articolo Produttore","Codice Articolo Convenzione","Descrizione","Costo unitario","Costo complessivo",null,null,{"$f":"IF($G$56>0,1,0)","v":0},null,null,null,null,null,null,{"$f":"Lotto2_T640_1!$K$90","v":""},{"$f":"Lotto2_T640_1!$F$90","v":""},{"$f":"Lotto2_T640_2!$K$90","v":""},{"$f":"Lotto2_T640_2!$F$90","v":""},{"$f":"Lotto2_T640_3!$K$90","v":""},{"$f":"Lotto2_T640_3!$F$90","v":""},null,null,"warranty"]
[null,"",{"$f":"IF(B44=\"\",\"\",VLOOKUP(L44,Tabella_prezzi!$A$3:$J$308,9,FALSE))","v":""},{"$f":"IF(B44=\"\",\"\",VLOOKUP(L44,Tabella_prezzi!$A$3:$J$308,6,FALSE))","v":""},{"$f":"IF(B44=\"\",\"\",VLOOKUP(L44,Tabella_prezzi!$A$3:$J$308,8,FALSE))","v":""},{"$f":"IF(B44=\"\",\"\",VLOOKUP(L44,Tabella_prezzi!$A$3:$J$308,4,FALSE))","v":""},{"$f":"IF(C44=\"\",\"\",F44*B44)","v":""},null,null,{"$f":"IF(B44=\"\",0,1)","v":0},{"$f":"VLOOKUP(L44,Tabella_prezzi!A22:J328,6,FALSE)","v":"TS3L2-BEZEL"},"L2N19",{"$f":"COUNTIF($Q$23:$Q$61,L44)*$M$22","v":0},{"$f":"COUNTIF($S$23:$S$61,L44)*$N$22","v":0},{"$f":"COUNTIF($U$23:$U$61,L44)*$O$22","v":0},0,{"$f":"Lotto2_T640_1!K97","v":""},{"$f":"Lotto2_T640_1!F97","v":""},{"$f":"Lotto2_T640_2!K97","v":""},{"$f":"Lotto2_T640_2!F97","v":""},{"$f":"Lotto2_T640_3!K97","v":""},{"$f":"Lotto2_T640_3!F97","v":""},null,{"$f":"ISODD(SUM($J$23:J44))","v":false},"ups"]
[null,"",{"$f":"IF(B45=\"\",\"\",VLOOKUP(L45,Tabella_prezzi!$A$3:$J$308,9,FALSE))","v":""},{"$f":"IF(B45=\"\",\"\",VLOOKUP(L45,Tabella_prezzi!$A$3:$J$308,6,FALSE))","v":""},{"$f":"IF(B45=\"\",\"\",VLOOKUP(L45,Tabella_prezzi!$A$3:$J$308,8,FALSE))","v":""},{"$f":"IF(B45=\"\",\"\",VLOOKUP(L45,Tabella_prezzi!$A$3:$J$308,4,FALSE))","v":""},"",null,null,0,{"$f":"VLOOKUP(L45,Tabella_prezzi!A23:J329,6,FALSE)","v":"TS3L2-BOSS240"},"L2N20",0,0,0,0,{"$f":"Lotto2_T640_1!K100","v":""},{"$f":"Lotto2_T640_1!F100","v":""},{"$f":"Lotto2_T640_2!K100","v":""},{"$f":"Lotto2_T640_2!F100","v":""},{"$f":"Lotto2_T640_3!K100","v":""},{"$f":"Lotto2_T640_3!F100","v":""},null,{"$f":"ISODD(SUM($J$23:J45))","v":false},"gui"]
[null,"",{"$f":"IF(B46=\"\",\"\",VLOOKUP(L46,Tabella_prezzi!$A$3:$J$308,9,FALSE))","v":""},{"$f":"IF(B46=\"\",\"\",VLOOKUP(L46,Tabella_prezzi!$A$3:$J$308,6,FALSE))","v":""},{"$f":"IF(B46=\"\",\"\",VLOOKUP(L46,Tabella_prezzi!$A$3:$J$308,8,FALSE))","v":""},{"$f":"IF(B46=\"\",\"\",VLOOKUP(L46,Tabella_prezzi!$A$3:$J$308,4,FALSE))","v":""},"",null,null,0,{"$f":"VLOOKUP(L46,Tabella_prezzi!A24:J330,6,FALSE)","v":"TS3L2-BOSS480"},"L2N21",0,0,0,0,{"$f":"Lotto2_T640_1!K87","v":""},{"$f":"Lotto2_T640_1!F87","v":""},{"$f":"Lotto2_T640_2!K87","v":""},{"$f":"Lotto2_T640_2!F87","v":""},{"$f":"Lotto2_T640_3!K87","v":""},{"$f":"Lotto2_T640_3!F87","v":""},null,{"$f":"ISODD(SUM($J$23:J46))","v":false}]
[null,"",{"$f":"IF(B47=\"\",\"\",VLOOKUP(L47,Tabella_prezzi!$A$3:$J$308,9,FALSE))","v":""},{"$f":"IF(B47=\"\",\"\",VLOOKUP(L47,Tabella_prezzi!$A$3:$J$308,6,FALSE))","v":""},{"$f":"IF(B47=\"\",\"\",VLOOKUP(L47,Tabella_prezzi!$A$3:$J$308,8,FALSE))","v":""},{"$f":"IF(B47=\"\",\"\",VLOOKUP(L47,Tabella_prezzi!$A$3:$J$308,4,FALSE))","v":""},"",null,null,0,{"$f":"VLOOKUP(L47,Tabella_prezzi!A25:J331,6,FALSE)","v":"TS3L2-RACKKIT"},"L2N22",0,0,0,0,{"$f":"Lotto2_T640_1!K84","v":"L2N26"},{"$f":"Lotto2_T640_1!F84","v":3},{"$f":"Lotto2_T640_2!K84","v":"L2N26"},{"$f":"Lotto2_T640_2!F84","v":3},{"$f":"Lotto2_T640_3!K84","v":"L2N26"},{"$f":"Lotto2_T640_3!F84","v":3},null,{"$f":"ISODD(SUM($J$23:J47))","v":false}]
[null,"",{"$f":"IF(B48=\"\",\"\",VLOOKUP(L48,Tabella_prezzi!$A$3:$J$308,9,FALSE))","v":""},{"$f":"IF(B48=\"\",\"\",VLOOKUP(L48,Tabella_prezzi!$A$3:$J$308,6,FALSE))","v":""},{"$f":"IF(B48=\"\",\"\",VLOOKUP(L48,Tabella_prezzi!$A$3:$J$308,8,FALSE))","v":""},{"$f":"IF(B48=\"\",\"\",VLOOKUP(L48,Tabella_prezzi!$A$3:$J$308,4,FALSE))","v":""},"",null,null,0,{"$f":"VLOOKUP(L48,Tabella_prezzi!A26:J332,6,FALSE)","v":"TS3L2-CNA10GB"},"L2N23",0,0,0,0,{"$f":"Lotto2_T640_1!K81","v":0},{"$f":"Lotto2_T640_1!F81","v":0},{"$f":"Lotto2_T640_2!K81","v":0},{"$f":"Lotto2_T640_2!F81","v":0},{"$f":"Lotto2_T640_3!K81","v":0},{"$f":"Lotto2_T640_3!F81","v":0},null,{"$f":"ISODD(SUM($J$23:J48))","v":false}]
[null,"",{"$f":"IF(B49=\"\",\"\",VLOOKUP(L49,Tabella_prezzi!$A$3:$J$308,9,FALSE))","v":""},{"$f":"IF(B49=\"\",\"\",VLOOKUP(L49,Tabella_prezzi!$A$3:$J$308,6,FALSE))","v":""},{"$f":"IF(B49=\"\",\"\",VLOOKUP(L49,Tabella_prezzi!$A$3:$J$308,8,FALSE))","v":""},{"$f":"IF(B49=\"\",\"\",VLOOKUP(L49,Tabella_prezzi!$A$3:$J$308,4,FALSE))","v":""},"",null,null,0,{"$f":"VLOOKUP(L49,Tabella_prezzi!A27:J333,6,FALSE)","v":"TS3L2-10GBIC"},"L2N24",0,0,0,0,{"$f":"Lotto2_T640_1!K78","v":0},{"$f":"Lotto2_T640_1!F78","v":0},{"$f":"Lotto2_T640_2!K78","v":0},{"$f":"Lotto2_T640_2!F78","v":0},{"$f":"Lotto2_T640_3!K78","v":0},{"$f":"Lotto2_T640_3!F78","v":0},null,{"$f":"ISODD(SUM($J$23:J49))","v":false}]
[null,"",{"$f":"IF(B50=\"\",\"\",VLOOKUP(L50,Tabella_prezzi!$A$3:$J$308,9,FALSE))","v":""},{"$f":"IF(B50=\"\",\"\",VLOOKUP(L50,Tabella_prezzi!$A$3:$J$308,6,FALSE))","v":""},{"$f":"IF(B50=\"\",\"\",VLOOKUP(L50,Tabella_prezzi!$A$3:$J$308,8,FALSE))","v":""},{"$f":"IF(B50=\"\",\"\",VLOOKUP(L50,Tabella_prezzi!$A$3:$J$308,4,FALSE))","v":""},"",null,null,0,{"$f":"VLOOKUP(L50,Tabella_prezzi!A28:J334,6,FALSE)","v":"TS3L2-DAC3M"},"L2N25",0,0,0,0,{"$f":"Lotto2_T640_1!K11","v":""},{"$f":"Lotto2_T640_1!F11","v":""},{"$f":"Lotto2_T640_2!K11","v":""},{"$f":"Lotto2_T640_2!F11","v":""},{"$f":"Lotto2_T640_3!K11","v":""},{"$f":"Lotto2_T640_3!F11","v":""},null,{"$f":"ISODD(SUM($J$23:J50))","v":false}]
[null,"",{"$f":"IF(B51=\"\",\"\",VLOOKUP(L51,Tabella_prezzi!$A$3:$J$308,9,FALSE))","v":""},{"$f":"IF(B51=\"\",\"\",VLOOKUP(L51,Tabella_prezzi!$A$3:$J$308,6,FALSE))","v":""},{"$f":"IF(B51=\"\",\"\",VLOOKUP(L51,Tabella_prezzi!$A$3:$J$308,8,FALSE))","v":""},{"$f":"IF(B51=\"\",\"\",VLOOKUP(L51,Tabella_prezzi!$A$3:$J$308,4,FALSE))","v":""},"",null,null,0,{"$f":"VLOOKUP(L51,Tabella_prezzi!A29:J335,6,FALSE)","v":"TS3L2-RJ453M"},"L2N26",{"$f":"IF(R47>1,(R47)*$M$22,0)","v":0},{"$f":"IF(T47>1,(T47)*$N$22,0)","v":0},{"$f":"IF(V47>1,(V47)*$O$22,0)","v":0},0,null,null,null,null,null,null,null,{"$f":"ISODD(SUM($J$23:J51))","v":false}]
[null,"",{"$f":"IF(B52=\"\",\"\",VLOOKUP(L52,Tabella_prezzi!$A$3:$J$308,9,FALSE))","v":""},{"$f":"IF(B52=\"\",\"\",VLOOKUP(L52,Tabella_prezzi!$A$3:$J$308,6,FALSE))","v":""},{"$f":"IF(B52=\"\",\"\",VLOOKUP(L52,Tabella_prezzi!$A$3:$J$308,8,FALSE))","v":""},{"$f":"IF(B52=\"\",\"\",VLOOKUP(L52,Tabella_prezzi!$A$3:$J$308,4,FALSE))","v":""},"",null,null,0,{"$f":"VLOOKUP(L52,Tabella_prezzi!A30:J336,6,FALSE)","v":"TS3L2-H840"},"L2N27",0,0,0,{"$f":"SUM(M52:O52)","v":0},null,null,null,null,null,null,null,{"$f":"ISODD(SUM($J$23:J52))","v":false}]
[null,"",{"$f":"IF(B53=\"\",\"\",VLOOKUP(L53,Tabella_prezzi!$A$3:$J$308,9,FALSE))","v":""},{"$f":"IF(B53=\"\",\"\",VLOOKUP(L53,Tabella_prezzi!$A$3:$J$308,6,FALSE))","v":""},{"$f":"IF(B53=\"\",\"\",VLOOKUP(L53,Tabella_prezzi!$A$3:$J$308,8,FALSE))","v":""},{"$f":"IF(B53=\"\",\"\",VLOOKUP(L53,Tabella_prezzi!$A$3:$J$308,4,FALSE))","v":""},{"$f":"IF(C53=\"\",\"\",F53*B53)","v":""},null,null,0,{"$f":"VLOOKUP(L53,Tabella_prezzi!A31:J337,6,FALSE)","v":"TS3L2-H740P"},"L2N30",{"$f":"COUNTIF(L2N_1,L53)*$M$22","v":0},{"$f":"COUNTIF(L2N_2,L53)*$N$22","v":0},{"$f":"COUNTIF(L2N_3,L53)*$O$22","v":0},0,null,null,null,null,null,null,null,{"$f":"ISODD(SUM($J$23:J53))","v":false}]
[null,"",{"$f":"IF(B54=\"\",\"\",VLOOKUP(L54,Tabella_prezzi!$A$3:$J$308,9,FALSE))","v":""},{"$f":"IF(B54=\"\",\"\",VLOOKUP(L54,Tabella_prezzi!$A$3:$J$308,6,FALSE))","v":""},{"$f":"IF(B54=\"\",\"\",VLOOKUP(L54,Tabella_prezzi!$A$3:$J$308,8,FALSE))","v":""},{"$f":"IF(B54=\"\",\"\",VLOOKUP(L54,Tabella_prezzi!$A$3:$J$308,4,FALSE))","v":""},"",null,null,0,{"$f":"VLOOKUP(L54,Tabella_prezzi!A32:J338,6,FALSE)","v":"TS3L2-CNA10M3"},"L2N29",0,0,0,0,null,null,null,null,null,null,null,{"$f":"ISODD(SUM($J$23:J54))","v":false}]
[null,"Convenzione",null,null,null,null,{"$f":"SUM(G23:G41)","v":0},null,null,{"$f":"IF(G55=0,0,1)","v":0}]
[null,"Valore economico 20% consentito",null,{"$f":"G55/100*20","v":0},"Ulteriori componenti opzionali (20%)",null,{"$f":"SUM(G44:G54)","v":0},null,null,{"$f":"IF(G56=0,0,1)","v":0}]
[null,"Totale iva esclusa",null,null,null,null,{"$f":"G56+G55","v":0},null,null,0]
[null,"I.V.A.",null,null,null,null,{"$f":"G57/100*22","v":0},null,null,0]
[null,"TOTALE ORDINE",null,null,null,null,{"$f":"G57+G58","v":0},null,null,0]
[null,null,null,null,null,null,null,null,null,1]

{"sheet":"Configurazione","index":7,"n_rows":56,"n_cols":23,"rows_kept":56,"cut":false,"hidden":false,"merged":[[49,1,49,8],[51,1,51,3],[51,6,51,8],[34,1,34,2],[35,1,46,2],[34,4,34,5],[35,4,46,5],[34,7,34,8],[35,7,46,8]]}
[null,null,null,null,null,null,null,null,null,null,null,null,null,null,null,null,null,null,null,null,null,1]
[null,{"$f":"Riepilogo!M22","v":0},"PowerEdge T640 Configurazione 1",null,{"$f":"Riepilogo!N22","v":0},"PowerEdge T640 Configurazione 2",null,{"$f":"Riepilogo!O22","v":0},"PowerEdge T640 Configurazione 3",null,null,null,null,null,null,null,null,null,null,null,null,1]
[null,null,null,null,null,null,null,null,null,null,null,null,null,null,null,null,null,null,null,null,null,{"$f":"IF($U$4>0,1,0)","v":0}]
[null,{"$f":"IF(Riepilogo!M23>0,Riepilogo!M23/$B$2,\"\")","v":""},{"$f":"IF(B4=\"\",\"\",Riepilogo!K23)","v":""},null,{"$f":"IF(Riepilogo!N23>0,Riepilogo!N23/$E$2,\"\")","v":""},{"$f":"IF(E4=\"\",\"\",Riepilogo!K23)","v":""},null,{"$f":"IF(Riepilogo!O23>0,Riepilogo!O23/$H$2,\"\")","v":""},{"$f":"IF(H4=\"\",\"\",Riepilogo!K23)","v":""},null,null,{"$f":"IF(B4=\"\",0,B4)","v":0},null,null,{"$f":"IF(E4=\"\",0,E4)","v":0},null,null,{"$f":"IF(H4=\"\",0,H4)","v":0},null,null,{"$f":"SUM(L4:T4)","v":0},{"$f":"IF(U4>0,1,0)","v":0},{"$f":"ISODD(V4)","v":false}]
[null,{"$f":"IF(Riepilogo!M24>0,Riepilogo!M24/$B$2,\"\")","v":""},{"$f":"IF(B5=\"\",\"\",Riepilogo!K24)","v":""},null,{"$f":"IF(Riepilogo!N24>0,Riepilogo!N24/$E$2,\"\")","v":""},{"$f":"IF(E5=\"\",\"\",Riepilogo!K24)","v":""},null,{"$f":"IF(Riepilogo!O24>0,Riepilogo!O24/$H$2,\"\")","v":""},{"$f":"IF(H5=\"\",\"\",Riepilogo!K24)","v":""},null,null,{"$f":"IF(B5=\"\",0,B5)","v":0},null,null,{"$f":"IF(E5=\"\",0,E5)","v":0},null,null,{"$f":"IF(H5=\"\",0,H5)","v":0},null,null,{"$f":"SUM(L5:T5)","v":0},{"$f":"IF(U5>0,1,0)","v":0},{"$f":"ISODD(SUM($V$4:V5))","v":false}]
[null,{"$f":"IF(Riepilogo!M25>0,Riepilogo!M25/$B$2,\"\")","v":""},{"$f":"IF(B6=\"\",\"\",Riepilogo!K25)","v":""},null,{"$f":"IF(Riepilogo!N25>0,Riepilogo!N25/$E$2,\"\")","v":""},{"$f":"IF(E6=\"\",\"\",Riepilogo!K25)","v":""},null,{"$f":"IF(Riepilogo!O25>0,Riepilogo!O25/$H$2,\"\")","v":""},{"$f":"IF(H6=\"\",\"\",Riepilogo!K25)","v":""},null,null,0,null,null,0,null,null,0,null,null,0,0,{"$f":"ISODD(SUM($V$4:V6))","v":false}]
[null,{"$f":"IF(Riepilogo!M26>0,Riepilogo!M26/$B$2,\"\")","v":""},{"$f":"IF(B7=\"\",\"\",Riepilogo!K26)","v":""},null,{"$f":"IF(Riepilogo!N26>0,Riepilogo!N26/$E$2,\"\")","v":""},{"$f":"IF(E7=\"\",\"\",Riepilogo!K26)","v":""},null,{"$f":"IF(Riepilogo!O26>0,Riepilogo!O26/$H$2,\"\")","v":""},{"$f":"IF(H7=\"\",\"\",Riepilogo!K26)","v":""},null,null,0,null,null,0,null,null,0,null,null,0,0,{"$f":"ISODD(SUM($V$4:V7))","v":false}]
[null,{"$f":"IF(Riepilogo!M27>0,Riepilogo!M27/$B$2,\"\")","v":""},{"$f":"IF(B8=\"\",\"\",Riepilogo!K27)","v":""},null,{"$f":"IF(Riepilogo!N27>0,Riepilogo!N27/$E$2,\"\")","v":""},{"$f":"IF(E8=\"\",\"\",Riepilogo!K27)","v":""},null,{"$f":"IF(Riepilogo!O27>0,Riepilogo!O27/$H$2,\"\")","v":""},{"$f":"IF(H8=\"\",\"\",Riepilogo!K27)","v":""},null,null,0,null,null,0,null,null,0,null,null,0,0,{"$f":"ISODD(SUM($V$4:V8))","v":false}]
[null,{"$f":"IF(Riepilogo!M28>0,Riepilogo!M28/$B$2,\"\")","v":""},{"$f":"IF(B9=\"\",\"\",Riepilogo!K28)","v":""},null,{"$f":"IF(Riepilogo!N28>0,Riepilogo!N28/$E$2,\"\")","v":""},{"$f":"IF(E9=\"\",\"\",Riepilogo!K28)","v":""},null,{"$f":"IF(Riepilogo!O28>0,Riepilogo!O28/$H$2,\"\")","v":""},{"$f":"IF(H9=\"\",\"\",Riepilogo!K28)","v":""},null,null,0,null,null,0,null,null,0,null,null,0,0,{"$f":"ISODD(SUM($V$4:V9))","v":false}]
[null,{"$f":"IF(Riepilogo!M29>0,Riepilogo!M29/$B$2,\"\")","v":""},{"$f":"IF(B10=\"\",\"\",Riepilogo!K29)","v":""},null,{"$f":"IF(Riepilogo!N29>0,Riepilogo!N29/$E$2,\"\")","v":""},{"$f":"IF(E10=\"\",\"\",Riepilogo!K29)","v":""},null,{"$f":"IF(Riepilogo!O29>0,Riepilogo!O29/$H$2,\"\")","v":""},{"$f":"IF(H10=\"\",\"\",Riepilogo!K29)","v":""},null,null,0,null,null,0,null,null,0,null,null,0,0,{"$f":"ISODD(SUM($V$4:V10))","v":false}]
[null,{"$f":"IF(Riepilogo!M30>0,Riepilogo!M30/$B$2,\"\")","v":""},{"$f":"IF(B11=\"\",\"\",Riepilogo!K30)","v":""},null,{"$f":"IF(Riepilogo!N30>0,Riepilogo!N30/$E$2,\"\")","v":""},{"$f":"IF(E11=\"\",\"\",Riepilogo!K30)","v":""},null,{"$f":"IF(Riepilogo!O30>0,Riepilogo!O30/$H$2,\"\")","v":""},{"$f":"IF(H11=\"\",\"\",Riepilogo!K30)","v":""},null,null,0,null,null,0,null,null,0,null,null,0,0,{"$f":"ISODD(SUM($V$4:V11))","v":false}]
[null,{"$f":"IF(Riepilogo!M31>0,Riepilogo!M31/$B$2,\"\")","v":""},{"$f":"IF(B12=\"\",\"\",Riepilogo!K31)","v":""},null,{"$f":"IF(Riepilogo!N31>0,Riepilogo!N31/$E$2,\"\")","v":""},{"$f":"IF(E12=\"\",\"\",Riepilogo!K31)","v":""},null,{"$f":"IF(Riepilogo!O31>0,Riepilogo!O31/$H$2,\"\")","v":""},{"$f":"IF(H12=\"\",\"\",Riepilogo!K31)","v":""},null,null,0,null,null,0,null,null,0,null,null,0,0,{"$f":"ISODD(SUM($V$4:V12))","v":false}]
[null,{"$f":"IF(Riepilogo!M32>0,Riepilogo!M32/$B$2,\"\")","v":""},{"$f":"IF(B13=\"\",\"\",Riepilogo!K32)","v":""},null,{"$f":"IF(Riepilogo!N32>0,Riepilogo!N32/$E$2,\"\")","v":""},{"$f":"IF(E13=\"\",\"\",Riepilogo!K32)","v":""},null,{"$f":"IF(Riepilogo!O32>0,Riepilogo!O32/$H$2,\"\")","v":""},{"$f":"IF(H13=\"\",\"\",Riepilogo!K32)","v":""},null,null,0,null,null,0,null,null,0,null,null,0,0,{"$f":"ISODD(SUM($V$4:V13))","v":false}]
[null,{"$f":"IF(Riepilogo!M33>0,Riepilogo!M33/$B$2,\"\")","v":""},{"$f":"IF(B14=\"\",\"\",Riepilogo!K33)","v":""},null,{"$f":"IF(Riepilogo!N33>0,Riepilogo!N33/$E$2,\"\")","v":""},{"$f":"IF(E14=\"\",\"\",Riepilogo!K33)","v":""},null,{"$f":"IF(Riepilogo!O33>0,Riepilogo!O33/$H$2,\"\")","v":""},{"$f":"IF(H14=\"\",\"\",Riepilogo!K33)","v":""},null,null,0,null,null,0,null,null,0,null,null,0,0,{"$f":"ISODD(SUM($V$4:V14))","v":false}]
[null,{"$f":"IF(Riepilogo!M34>0,Riepilogo!M34/$B$2,\"\")","v":""},{"$f":"IF(B15=\"\",\"\",Riepilogo!K34)","v":""},null,{"$f":"IF(Riepilogo!N34>0,Riepilogo!N34/$E$2,\"\")","v":""},{"$f":"IF(E15=\"\",\"\",Riepilogo!K34)","v":""},null,{"$f":"IF(Riepilogo!O34>0,Riepilogo!O34/$H$2,\"\")","v":""},{"$f":"IF(H15=\"\",\"\",Riepilogo!K34)","v":""},null,null,0,null,null,0,null,null,0,null,null,0,0,{"$f":"ISODD(SUM($V$4:V15))","v":false}]
[null,{"$f":"IF(Riepilogo!M35>0,Riepilogo!M35/$B$2,\"\")","v":""},{"$f":"IF(B16=\"\",\"\",Riepilogo!K35)","v":""},null,{"$f":"IF(Riepilogo!N35>0,Riepilogo!N35/$E$2,\"\")","v":""},{"$f":"IF(E16=\"\",\"\",Riepilogo!K35)","v":""},null,{"$f":"IF(Riepilogo!O35>0,Riepilogo!O35/$H$2,\"\")","v":""},{"$f":"IF(H16=\"\",\"\",Riepilogo!K35)","v":""},null,null,0,null,null,0,null,null,0,null,null,0,0,{"$f":"ISODD(SUM($V$4:V16))","v":false}]
[null,{"$f":"IF(Riepilogo!M36>0,Riepilogo!M36/$B$2,\"\")","v":""},{"$f":"IF(B17=\"\",\"\",Riepilogo!K36)","v":""},null,{"$f":"IF(Riepilogo!N36>0,Riepilogo!N36/$E$2,\"\")","v":""},{"$f":"IF(E17=\"\",\"\",Riepilogo!K36)","v":""},null,{"$f":"IF(Riepilogo!O36>0,Riepilogo!O36/$H$2,\"\")","v":""},{"$f":"IF(H17=\"\",\"\",Riepilogo!K36)","v":""},null,null,0,null,null,0,null,null,0,null,null,0,0,{"$f":"ISODD(SUM($V$4:V17))","v":false}]
[null,{"$f":"IF(Riepilogo!M37>0,Riepilogo!M37/$B$2,\"\")","v":""},{"$f":"IF(B18=\"\",\"\",Riepilogo!K37)","v":""},null,{"$f":"IF(Riepilogo!N37>0,Riepilogo!N37/$E$2,\"\")","v":""},{"$f":"IF(E18=\"\",\"\",Riepilogo!K37)","v":""},null,{"$f":"IF(Riepilogo!O37>0,Riepilogo!O37/$H$2,\"\")","v":""},{"$f":"IF(H18=\"\",\"\",Riepilogo!K37)","v":""},null,null,0,null,null,0,null,null,0,null,null,0,0,{"$f":"ISODD(SUM($V$4:V18))","v":false}]
[null,{"$f":"IF(Riepilogo!M38>0,Riepilogo!M38/$B$2,\"\")","v":""},{"$f":"IF(B19=\"\",\"\",Riepilogo!K38)","v":""},null,{"$f":"IF(Riepilogo!N38>0,Riepilogo!N38/$E$2,\"\")","v":""},{"$f":"IF(E19=\"\",\"\",Riepilogo!K38)","v":""},null,{"$f":"IF(Riepilogo!O38>0,Riepilogo!O38/$H$2,\"\")","v":""},{"$f":"IF(H19=\"\",\"\",Riepilogo!K38)","v":""},null,null,0,null,null,0,null,null,0,null,null,0,0,{"$f":"ISODD(SUM($V$4:V19))","v":false}]
[null,{"$f":"IF(Riepilogo!M39>0,Riepilogo!M39/$B$2,\"\")","v":""},{"$f":"IF(B20=\"\",\"\",Riepilogo!K39)","v":""},null,{"$f":"IF(Riepilogo!N39>0,Riepilogo!N39/$E$2,\"\")","v":""},{"$f":"IF(E20=\"\",\"\",Riepilogo!K39)","v":""},null,{"$f":"IF(Riepilogo!O39>0,Riepilogo!O39/$H$2,\"\")","v":""},{"$f":"IF(H20=\"\",\"\",Riepilogo!K39)","v":""},null,null,0,null,null,0,null,null,0,null,null,0,0,{"$f":"ISODD(SUM($V$4:V20))","v":false}]
[null,{"$f":"IF(Riepilogo!M40>0,Riepilogo!M40/$B$2,\"\")","v":""},{"$f":"IF(B21=\"\",\"\",Riepilogo!K40)","v":""},null,{"$f":"IF(Riepilogo!N40>0,Riepilogo!N40/$E$2,\"\")","v":""},{"$f":"IF(E21=\"\",\"\",Riepilogo!K40)","v":""},null,{"$f":"IF(Riepilogo!O40>0,Riepilogo!O40/$H$2,\"\")","v":""},{"$f":"IF(H21=\"\",\"\",Riepilogo!K40)","v":""},null,null,{"$f":"IF(B21=\"\",0,B21)","v":0},null,null,{"$f":"IF(E21=\"\",0,E21)","v":0},null,null,{"$f":"IF(H21=\"\",0,H21)","v":0},null,null,{"$f":"SUM(L21:T21)","v":0},{"$f":"IF(U21>0,1,0)","v":0},{"$f":"ISODD(SUM($V$4:V21))","v":false}]
[null,{"$f":"IF(Riepilogo!M41>0,Riepilogo!M41/$B$2,\"\")","v":""},{"$f":"IF(B22=\"\",\"\",Riepilogo!K41)","v":""},null,{"$f":"IF(Riepilogo!N41>0,Riepilogo!N41/$E$2,\"\")","v":""},{"$f":"IF(E22=\"\",\"\",Riepilogo!K41)","v":""},null,{"$f":"IF(Riepilogo!O41>0,Riepilogo!O41/$H$2,\"\")","v":""},{"$f":"IF(H22=\"\",\"\",Riepilogo!K41)","v":""},null,null,{"$f":"IF(B22=\"\",0,B22)","v":0},null,null,{"$f":"IF(E22=\"\",0,E22)","v":0},null,null,{"$f":"IF(H22=\"\",0,H22)","v":0},null,null,{"$f":"SUM(L22:T22)","v":0},{"$f":"IF(U22>0,1,0)","v":0},{"$f":"ISODD(SUM($V$4:V22))","v":false}]
[null,{"$f":"IF(Riepilogo!M44>0,Riepilogo!M44/$B$2,\"\")","v":""},{"$f":"IF(B23=\"\",\"\",CONCATENATE(Riepilogo!C44,\" - \",Riepilogo!K44))","v":""},null,{"$f":"IF(Riepilogo!N44>0,Riepilogo!N44/$E$2,\"\")","v":""},{"$f":"IF(E23=\"\",\"\",CONCATENATE(Riepilogo!C44,\" - \",Riepilogo!K44))","v":""},null,{"$f":"IF(Riepilogo!O44>0,Riepilogo!O44/$H$2,\"\")","v":""},{"$f":"IF(H23=\"\",\"\",CONCATENATE(Riepilogo!C44,\" - \",Riepilogo!K44))","v":""},null,null,0,null,null,0,null,null,0,null,null,0,0,{"$f":"ISODD(SUM($V$4:V23))","v":false}]
[null,{"$f":"IF(Riepilogo!M45>0,Riepilogo!M45/$B$2,\"\")","v":""},{"$f":"IF(B24=\"\",\"\",CONCATENATE(Riepilogo!C45,\" - \",Riepilogo!K45))","v":""},null,{"$f":"IF(Riepilogo!N45>0,Riepilogo!N45/$E$2,\"\")","v":""},{"$f":"IF(E24=\"\",\"\",CONCATENATE(Riepilogo!C45,\" - \",Riepilogo!K45))","v":""},null,{"$f":"IF(Riepilogo!O45>0,Riepilogo!O45/$H$2,\"\")","v":""},{"$f":"IF(H24=\"\",\"\",CONCATENATE(Riepilogo!C45,\" - \",Riepilogo!K45))","v":""},null,null,0,null,null,0,null,null,0,null,null,0,0,{"$f":"ISODD(SUM($V$4:V24))","v":false}]
[null,{"$f":"IF(Riepilogo!M46>0,Riepilogo!M46/$B$2,\"\")","v":""},{"$f":"IF(B25=\"\",\"\",CONCATENATE(Riepilogo!C46,\" - \",Riepilogo!K46))","v":""},null,{"$f":"IF(Riepilogo!N46>0,Riepilogo!N46/$E$2,\"\")","v":""},{"$f":"IF(E25=\"\",\"\",CONCATENATE(Riepilogo!C46,\" - \",Riepilogo!K46))","v":""},null,{"$f":"IF(Riepilogo!O46>0,Riepilogo!O46/$H$2,\"\")","v":""},{"$f":"IF(H25=\"\",\"\",CONCATENATE(Riepilogo!C46,\" - \",Riepilogo!K46))","v":""},null,null,0,null,null,0,null,null,0,null,null,0,0,{"$f":"ISODD(SUM($V$4:V25))","v":false}]
[null,{"$f":"IF(Riepilogo!M47>0,Riepilogo!M47/$B$2,\"\")","v":""},{"$f":"IF(B26=\"\",\"\",CONCATENATE(Riepilogo!C47,\" - \",Riepilogo!K47))","v":""},null,{"$f":"IF(Riepilogo!N47>0,Riepilogo!N47/$E$2,\"\")","v":""},{"$f":"IF(E26=\"\",\"\",CONCATENATE(Riepilogo!C47,\" - \",Riepilogo!K47))","v":""},null,{"$f":"IF(Riepilogo!O47>0,Riepilogo!O47/$H$2,\"\")","v":""},{"$f":"IF(H26=\"\",\"\",CONCATENATE(Riepilogo!C47,\" - \",Riepilogo!K47))","v":""},null,null,0,null,null,0,null,null,0,null,null,0,0,{"$f":"ISODD(SUM($V$4:V26))","v":false}]
[null,{"$f":"IF(Riepilogo!M48>0,Riepilogo!M48/$B$2,\"\")","v":""},{"$f":"IF(B27=\"\",\"\",CONCATENATE(Riepilogo!C48,\" - \",Riepilogo!K48))","v":""},null,{"$f":"IF(Riepilogo!N48>0,Riepilogo!N48/$E$2,\"\")","v":""},{"$f":"IF(E27=\"\",\"\",CONCATENATE(Riepilogo!C48,\" - \",Riepilogo!K48))","v":""},null,{"$f":"IF(Riepilogo!O48>0,Riepilogo!O48/$H$2,\"\")","v":""},{"$f":"IF(H27=\"\",\"\",CONCATENATE(Riepilogo!C48,\" - \",Riepilogo!K48))","v":""},null,null,0,null,null,0,null,null,0,null,null,0,0,{"$f":"ISODD(SUM($V$4:V27))","v":false}]
[null,{"$f":"IF(Riepilogo!M49>0,Riepilogo!M49/$B$2,\"\")","v":""},{"$f":"IF(B28=\"\",\"\",CONCATENATE(Riepilogo!C49,\" - \",Riepilogo!K49))","v":""},null,{"$f":"IF(Riepilogo!N49>0,Riepilogo!N49/$E$2,\"\")","v":""},{"$f":"IF(E28=\"\",\"\",CONCATENATE(Riepilogo!C49,\" - \",Riepilogo!K49))","v":""},null,{"$f":"IF(Riepilogo!O49>0,Riepilogo!O49/$H$2,\"\")","v":""},{"$f":"IF(H28=\"\",\"\",CONCATENATE(Riepilogo!C49,\" - \",Riepilogo!K49))","v":""},null,null,0,null,null,0,null,null,0,null,null,0,0,{"$f":"ISODD(SUM($V$4:V28))","v":false}]
[null,{"$f":"IF(Riepilogo!M50>0,Riepilogo!M50/$B$2,\"\")","v":""},{"$f":"IF(B29=\"\",\"\",CONCATENATE(Riepilogo!C50,\" - \",Riepilogo!K50))","v":""},null,{"$f":"IF(Riepilogo!N50>0,Riepilogo!N50/$E$2,\"\")","v":""},{"$f":"IF(E29=\"\",\"\",CONCATENATE(Riepilogo!C50,\" - \",Riepilogo!K50))","v":""},null,{"$f":"IF(Riepilogo!O50>0,Riepilogo!O50/$H$2,\"\")","v":""},{"$f":"IF(H29=\"\",\"\",CONCATENATE(Riepilogo!C50,\" - \",Riepilogo!K50))","v":""},null,null,0,null,null,0,null,null,0,null,null,0,0,{"$f":"ISODD(SUM($V$4:V29))","v":false}]
[null,{"$f":"IF(Riepilogo!M51>0,Riepilogo!M51/$B$2,\"\")","v":""},{"$f":"IF(B30=\"\",\"\",CONCATENATE(Riepilogo!C51,\" - \",Riepilogo!K51))","v":""},null,{"$f":"IF(Riepilogo!N51>0,Riepilogo!N51/$E$2,\"\")","v":""},{"$f":"IF(E30=\"\",\"\",CONCATENATE(Riepilogo!C51,\" - \",Riepilogo!K51))","v":""},null,{"$f":"IF(Riepilogo!O51>0,Riepilogo!O51/$H$2,\"\")","v":""},{"$f":"IF(H30=\"\",\"\",CONCATENATE(Riepilogo!C51,\" - \",Riepilogo!K51))","v":""},null,null,0,null,null,0,null,null,0,null,null,0,0,{"$f":"ISODD(SUM($V$4:V30))","v":false}]
[null,{"$f":"IF(Riepilogo!M52>0,Riepilogo!M52/$B$2,\"\")","v":""},{"$f":"IF(B31=\"\",\"\",CONCATENATE(Riepilogo!C52,\" - \",Riepilogo!K52))","v":""},null,{"$f":"IF(Riepilogo!N52>0,Riepilogo!N52/$E$2,\"\")","v":""},{"$f":"IF(E31=\"\",\"\",CONCATENATE(Riepilogo!C52,\" - \",Riepilogo!K52))","v":""},null,{"$f":"IF(Riepilogo!O52>0,Riepilogo!O52/$H$2,\"\")","v":""},{"$f":"IF(H31=\"\",\"\",CONCATENATE(Riepilogo!C52,\" - \",Riepilogo!K52))","v":""},null,null,0,null,null,0,null,null,0,null,null,0,0,{"$f":"ISODD(SUM($V$4:V31))","v":false}]
[null,{"$f":"IF(Riepilogo!M53>0,Riepilogo!M53/$B$2,\"\")","v":""},{"$f":"IF(B32=\"\",\"\",CONCATENATE(Riepilogo!C53,\" - \",Riepilogo!K53))","v":""},null,{"$f":"IF(Riepilogo!N53>0,Riepilogo!N53/$E$2,\"\")","v":""},{"$f":"IF(E32=\"\",\"\",CONCATENATE(Riepilogo!C53,\" - \",Riepilogo!K53))","v":""},null,{"$f":"IF(Riepilogo!O53>0,Riepilogo!O53/$H$2,\"\")","v":""},{"$f":"IF(H32=\"\",\"\",CONCATENATE(Riepilogo!C53,\" - \",Riepilogo!K53))","v":""},null,null,0,null,null,0,null,null,0,null,null,0,0,{"$f":"ISODD(SUM($V$4:V32))","v":false}]
[null,{"$f":"IF(Riepilogo!M54>0,Riepilogo!M54/$B$2,\"\")","v":""},{"$f":"IF(B33=\"\",\"\",CONCATENATE(Riepilogo!C54,\" - \",Riepilogo!K54))","v":""},null,{"$f":"IF(Riepilogo!N54>0,Riepilogo!N54/$E$2,\"\")","v":""},{"$f":"IF(E33=\"\",\"\",CONCATENATE(Riepilogo!C54,\" - \",Riepilogo!K54))","v":""},null,{"$f":"IF(Riepilogo!O54>0,Riepilogo!O54/$H$2,\"\")","v":""},{"$f":"IF(H33=\"\",\"\",CONCATENATE(Riepilogo!C54,\" - \",Riepilogo!K54))","v":""},null,null,0,null,null,0,null,null,0,null,null,0,0,{"$f":"ISODD(SUM($V$4:V33))","v":false}]
[null,null,null,null,null,null,null,null,null,null,null,null,null,null,null,null,null,null,null,null,null,{"$f":"IF($U$4>0,1,0)","v":0}]
[null,"Configurazione RAID e/o NOTE",null,null,"Configurazione RAID e/o NOTE",null,null,"Configurazione RAID e/o NOTE",null,null,null,null,null,null,null,null,null,null,null,null,null,{"$f":"IF($U$4>0,1,0)","v":0}]
[null,{"$f":"Lotto2_T640_1!H30","v":"Specificare la configurazione RAID per l'installazione del Sistema Operativo, se richiesto.\ne/o\ninserire eventuali note."},null,null,{"$f":"Lotto2_T640_2!H30","v":"Specificare la configurazione RAID per l'installazione del Sistema Operativo, se richiesto.\ne/o\ninserire eventuali note."},null,null,{"$f":"Lotto2_T640_3!H30","v":"Specificare la configurazione RAID per l'installazione del Sistema Operativo, se richiesto.\ne/o\ninserire eventuali note."},null,null,null,null,null,null,null,null,null,null,null,null,null,0]
[null,null,null,null,null,null,null,null,null,null,null,null,null,null,null,null,null,null,null,null,null,0]
[null,null,null,null,null,null,null,null,null,null,null,null,null,null,null,null,null,null,null,null,null,0]
[null,null,null,null,null,null,null,null,null,null,null,null,null,null,null,null,null,null,null,null,null,0]
[null,null,null,null,null,null,null,null,null,null,null,null,null,null,null,null,null,null,null,null,null,0]
[null,null,null,null,null,null,null,null,null,null,null,null,null,null,null,null,null,null,null,null,null,0]
[null,null,null,null,null,null,null,null,null,null,null,null,null,null,null,null,null,null,null,null,null,0]
[null,null,null,null,null,null,null,null,null,null,null,null,null,null,null,null,null,null,null,null,null,0]
[null,null,null,null,null,null,null,null,null,null,null,null,null,null,null,null,null,null,null,null,null,0]
[null,null,null,null,null,null,null,null,null,null,null,null,null,null,null,null,null,null,null,null,null,0]
[null,null,null,null,null,null,null,null,null,null,null,null,null,null,null,null,null,null,null,null,null,0]
[null,null,null,null,null,null,null,null,null,null,null,null,null,null,null,null,null,null,null,null,null,0]
[null,null,null,null,null,null,null,null,null,null,null,null,null,null,null,null,null,null,null,null,null,1]
[null,null,null,null,null,null,null,null,null,null,null,null,null,null,null,null,null,null,null,null,null,1]
[null,"AREA RISERVATA AL FORNITORE",null,null,null,null,null,null,null,null,null,null,null,null,null,null,null,null,null,null,null,1]
[null,null,null,null,null,null,null,null,null,null,null,null,null,null,null,null,null,null,null,null,null,1]
[null,"VERIFICA STAGING",null,null,null,null,"VERIFICA INSTALLATORE",null,null,null,null,null,null,null,null,null,null,null,null,null,null,1]
[null,null,null,null,null,null,null,null,null,null,null,null,null,null,null,null,null,null,null,null,null,1]
[null,null,null,null,null,null,null,null,null,null,null,null,null,null,null,null,null,null,null,null,null,1]
[null,null,null,null,null,null,null,null,null,null,null,null,null,null,null,null,null,null,null,null,null,1]
[null,null,null,null,null,null,null,null,null,null,null,null,null,null,null,null,null,null,null,null,null,1]