{"text_format":"1","workbook":"xlsx","n_sheets":8,"sheets":["Lotto2_T640_1","Lotto2_T640_2","Lotto2_T640_3","ConfigurationTS3L2","Tabella_prezzi","Altre_Opzioni","Riepilogo","Configurazione"],"not_rendered":{"charts":0,"images":16,"macros":1,"external_links":0,"defined_names":26,"comments":0,"pivot_tables":0},"unopened":[],"bounds":{"document_bytes":16777216,"sheet_cells":100000,"rows_first":2000,"rows_last":500,"rows_between":2000,"halvings":0,"cell_chars":16384,"cell_head_chars":4096},"cells_cut":0,"cells_raw":0,"read":"whole","date_system":"1900"}

{"sheet":"Lotto2_T640_1","index":0,"n_rows":100,"n_cols":17,"rows_kept":100,"cut":false,"hidden":false,"merged":[[29,7,39,7],[30,2,31,2],[6,3,7,3],[9,3,10,3],[15,3,16,3],[27,3,28,3],[46,3,47,3],[88,3,89,3],[91,3,92,3],[95,3,96,3],[98,3,99,3]]}
[null,null,null,null,"Convenzione",{"$f":"SUM(I8:I100)*F5","v":0}]
[null,null,null,null,0.2,{"$f":"SUM(J8:J100)*F5","v":0}]
[null,null,null,null,"Totale",{"$f":"SUM(F1:F2)","v":0}]
[]
[null,null,"POWEREDGE T640          Consulta la Guida alla Convenzione --->",{"$f":"HYPERLINK(\"https://convenzioni.converge.it/docs/L2GuidaAllaConvenzioneTecnologieServer3.pdf\",\"&\")","v":"&"},"Quantità Server",null,null,{"$f":"Riepilogo!G8","v":"Version 3.3"}]
[]
[null,null,"Base",{"$f":"HYPERLINK(\"https://convenzioni.converge.it/docs/ts3_datasheet/dell-emc-poweredge-t640-spec-sheet.pdf\",\"i\")","v":"i"}]
[null,null,"PowerEdge T640 Server",null,{"$f":"IF($F$5>0,\"TS3L2-SRV\",\"\")","v":""},{"$f":"IF($F$5>0,1,\"\")","v":""},null,null,{"$f":"VLOOKUP($C8,TS3L2_ALL,10,FALSE)","v":2088},null,{"$f":"VLOOKUP($C8,TS3L2_ALL,12,FALSE)","v":"L2N01"}]
[]
[null,null,"Chassis Configuration",{"$f":"HYPERLINK(\"https://dellservervr.dell.com/poweredge-t640/\",\"i\")","v":"i"}]
[null,null,"Chassis with up to 16 x 2.5\" SAS/ SATA Hard Drives, Tower Configuration",null,{"$f":"VLOOKUP($C$11,TS3L2_Chassis,13,FALSE)","v":""},{"$f":"VLOOKUP($C$11,TS3L2_Chassis,7,FALSE)","v":""},null,null,{"$f":"VLOOKUP($C$11,TS3L2_Chassis,10,FALSE)","v":0},{"$f":"VLOOKUP($C11,TS3L2_Chassis,11,FALSE)","v":0},{"$f":"VLOOKUP($C11,TS3L2_Chassis,12,FALSE)","v":""}]
[]
[null,null,"Trusted Platform Module (TPM)"]
[null,null,"Trusted Platform Module 2.0"]
[]
{"$rows_left_out":86}
{"sheet":"Lotto2_T640_2","index":1,"n_rows":100,"n_cols":17,"rows_kept":100,"cut":false,"hidden":false,"merged":[[29,7,39,7],[30,2,31,2],[6,3,7,3],[9,3,10,3],[15,3,16,3],[27,3,28,3],[46,3,47,3],[88,3,89,3],[91,3,92,3],[95,3,96,3],[98,3,99,3]]}
[null,null,null,null,"Convenzione",{"$f":"SUM(I8:I100)*F5","v":0}]
[null,null,null,null,0.2,{"$f":"SUM(J8:J100)*F5","v":0}]
[null,null,null,null,"Totale",{"$f":"SUM(F1:F2)","v":0}]
[]
[null,null,"POWEREDGE T640          Consulta la Guida alla Convenzione --->",{"$f":"HYPERLINK(\"https://convenzioni.converge.it/docs/L2GuidaAllaConvenzioneTecnologieServer3.pdf\",\"&\")","v":"&"},"Quantità Server",null,null,{"$f":"Riepilogo!G8","v":"Version 3.3"}]
[]
[null,null,"Base",{"$f":"HYPERLINK(\"https://convenzioni.converge.it/docs/ts3_datasheet/dell-emc-poweredge-t640-spec-sheet.pdf\",\"i\")","v":"i"}]
[null,null,"PowerEdge T640 Server",null,{"$f":"IF($F$5>0,\"TS3L2-SRV\",\"\")","v":""},{"$f":"IF($F$5>0,1,\"\")","v":""},null,null,{"$f":"VLOOKUP($C8,TS3L2_ALL,10,FALSE)","v":2088},null,{"$f":"VLOOKUP($C8,TS3L2_ALL,12,FALSE)","v":"L2N01"}]
[]
[null,null,"Chassis Configuration",{"$f":"HYPERLINK(\"https://dellservervr.dell.com/poweredge-t640/\",\"i\")","v":"i"}]
[null,null,"Chassis with up to 16 x 2.5\" SAS/ SATA Hard Drives, Tower Configuration",null,{"$f":"VLOOKUP($C$11,TS3L2_Chassis,13,FALSE)","v":""},{"$f":"VLOOKUP($C$11,TS3L2_Chassis,7,FALSE)","v":""},null,null,{"$f":"VLOOKUP($C$11,TS3L2_Chassis,10,FALSE)","v":0},{"$f":"VLOOKUP($C11,TS3L2_Chassis,11,FALSE)","v":0},{"$f":"VLOOKUP($C11,TS3L2_Chassis,12,FALSE)","v":""}]
[]
[null,null,"Trusted Platform Module (TPM)"]
[null,null,"Trusted Platform Module 2.0"]
[]
{"$rows_left_out":86}
{"sheet":"Lotto2_T640_3","index":2,"n_rows":100,"n_cols":17,"rows_kept":100,"cut":false,"hidden":false,"merged":[[29,7,39,7],[30,2,31,2],[6,3,7,3],[9,3,10,3],[15,3,16,3],[27,3,28,3],[46,3,47,3],[88,3,89,3],[91,3,92,3],[95,3,96,3],[98,3,99,3]]}
[null,null,null,null,"Convenzione",{"$f":"SUM(I8:I100)*F5","v":0}]
[null,null,null,null,0.2,{"$f":"SUM(J8:J100)*F5","v":0}]
[null,null,null,null,"Totale",{"$f":"SUM(F1:F2)","v":0}]
[]
[null,null,"POWEREDGE T640          Consulta la Guida alla Convenzione --->",{"$f":"HYPERLINK(\"https://convenzioni.converge.it/docs/L2GuidaAllaConvenzioneTecnologieServer3.pdf\",\"&\")","v":"&"},"Quantità Server",null,null,{"$f":"Riepilogo!G8","v":"Version 3.3"}]
[]
[null,null,"Base",{"$f":"HYPERLINK(\"https://convenzioni.converge.it/docs/ts3_datasheet/dell-emc-poweredge-t640-spec-sheet.pdf\",\"i\")","v":"i"}]
[null,null,"PowerEdge T640 Server",null,{"$f":"IF($F$5>0,\"TS3L2-SRV\",\"\")","v":""},{"$f":"IF($F$5>0,1,\"\")","v":""},null,null,{"$f":"VLOOKUP($C8,TS3L2_ALL,10,FALSE)","v":2088},null,{"$f":"VLOOKUP($C8,TS3L2_ALL,12,FALSE)","v":"L2N01"}]
[]
[null,null,"Chassis Configuration",{"$f":"HYPERLINK(\"https://dellservervr.dell.com/poweredge-t640/\",\"i\")","v":"i"}]
[null,null,"Chassis with up to 16 x 2.5\" SAS/ SATA Hard Drives, Tower Configuration",null,{"$f":"VLOOKUP($C$11,TS3L2_Chassis,13,FALSE)","v":""},{"$f":"VLOOKUP($C$11,TS3L2_Chassis,7,FALSE)","v":""},null,null,{"$f":"VLOOKUP($C$11,TS3L2_Chassis,10,FALSE)","v":0},{"$f":"VLOOKUP($C11,TS3L2_Chassis,11,FALSE)","v":0},{"$f":"VLOOKUP($C11,TS3L2_Chassis,12,FALSE)","v":""}]
[]
[null,null,"Trusted Platform Module (TPM)"]
[null,null,"Trusted Platform Module 2.0"]
[]
{"$rows_left_out":86}
{"sheet":"ConfigurationTS3L2","index":3,"n_rows":154,"n_cols":20,"rows_kept":154,"cut":false,"hidden":true,"merged":[]}
[]
[null,"Module Name","Option ID","Option Name","Option List Price","SKUs","Qty","SKU Customer Kit","Attributo","Valore inserito",null,"N°","Codice Convenzione"]
["PowerEdge T640 Server",null,null,{"$f":"VLOOKUP(L3,Tabella_prezzi!$A$3:$J$308,8,FALSE)","v":"PowerEdge T640 Server"},null,null,null,{"$f":"VLOOKUP(L3,Tabella_prezzi!$A$3:$J$308,9,FALSE)","v":"L1N02-ServerT640"},{"$f":"VLOOKUP(L3,Tabella_prezzi!$A$3:$J$308,3,FALSE)","v":"Server Tower bi-processore"},{"$f":"VLOOKUP(L3,Tabella_prezzi!$A$3:$J$308,4,FALSE)","v":2088},null,"L2N01",{"$f":"VLOOKUP(L3,Tabella_prezzi!$A$3:$J$308,6,FALSE)","v":"TS3L2-SRV"}]
[]
["TS3L2_Chassis"]
["Chassis with up to 16 x 2.5\" SAS/ SATA Hard Drives, Tower Configuration",null,null,null,null,null,{"$f":"\"\"","v":""},null,{"$f":"\"\"","v":""},null,null,{"$f":"\"\"","v":""},{"$f":"\"\"","v":""}]
["Chassis with up to 16 x 2.5\" SAS/ SATA Hard Drives, Rack Configuration",null,null,{"$f":"VLOOKUP(L7,Tabella_prezzi!$A$3:$J$308,8,FALSE)","v":"Kit composto da: Tower to Rack Conversion Kit; Rack Standard Bezel; 3U Cable Management Arm; Ready Rails 3U Sliding Rails"},null,null,1,{"$f":"VLOOKUP(L7,Tabella_prezzi!$A$3:$J$308,9,FALSE)","v":"TS3-OpzA20T640K"},{"$f":"VLOOKUP(L7,Tabella_prezzi!$A$3:$J$308,3,FALSE)","v":"TS3-OpzA20RKit"},null,{"$f":"VLOOKUP(L7,Tabella_prezzi!$A$3:$J$308,4,FALSE)","v":270},"L2N22",{"$f":"VLOOKUP(L7,Tabella_prezzi!$A$3:$J$308,6,FALSE)","v":"TS3L2-RACKKIT"}]
[]
["TS3L2_CPU"]
["No Additional Processor",null,null,null,null,null,null,null,{"$f":"\"\"","v":""},null,null,{"$f":"\"\"","v":""},{"$f":"\"\"","v":""}]
["Intel Xeon Silver 4214 2.2G, 12C/24T, 9.6GT/s, 16.5M Cache, Turbo, HT (85W)",null,null,{"$f":"VLOOKUP(L11,Tabella_prezzi!$A$3:$J$308,8,FALSE)","v":"Intel® Xeon® Silver 4214 Processor 2.20 GHz, 12C/24T"},null,null,1,{"$f":"VLOOKUP(L11,Tabella_prezzi!$A$3:$J$308,9,FALSE)","v":"L2N02-OpzCPU"},{"$f":"VLOOKUP(L11,Tabella_prezzi!$A$3:$J$308,3,FALSE)","v":"Kit n. 1 Processore aggiuntivo"},{"$f":"VLOOKUP(L11,Tabella_prezzi!$A$3:$J$308,4,FALSE)","v":590},null,"L2N02",{"$f":"VLOOKUP(L11,Tabella_prezzi!$A$3:$J$308,6,FALSE)","v":"TS3L2-CPU"}]
[]
["TS3L2_RAM (1CPU)"]
["32GB","Memory Capacity",null,{"$f":"D15","v":"16GB 2Rx8 DDR4 RDIMM 3200MHz"},null,{"$f":"F15","v":"370-AEQF"},0,{"$f":"H15","v":"L2N03-OpzRAM16GB"},{"$f":"\"\"","v":""},null,null,{"$f":"\"\"","v":""},{"$f":"\"\"","v":""}]
["48GB","Memory Capacity",null,{"$f":"VLOOKUP(L15,Tabella_prezzi!$A$3:$J$308,8,FALSE)","v":"16GB 2Rx8 DDR4 RDIMM 3200MHz"},null,"370-AEQF",1,{"$f":"VLOOKUP(L15,Tabella_prezzi!$A$3:$J$308,9,FALSE)","v":"L2N03-OpzRAM16GB"},{"$f":"VLOOKUP(L15,Tabella_prezzi!$A$3:$J$308,3,FALSE)","v":"OpzRAM16GB"},{"$f":"VLOOKUP(L15,Tabella_prezzi!$A$3:$J$308,4,FALSE)*G15","v":99},null,"L2N03",{"$f":"VLOOKUP(L15,Tabella_prezzi!$A$3:$J$308,6,FALSE)","v":"TS3L2-RAM16"}]
{"$rows_left_out":140}
{"sheet":"Tabella_prezzi","index":4,"n_rows":124,"n_cols":12,"rows_kept":124,"cut":false,"hidden":true,"merged":[[101,5,102,5],[101,7,102,7],[101,8,102,8],[101,0,102,0],[101,1,102,1],[101,2,102,2],[101,3,102,3],[101,4,102,4],[87,8,88,8],[85,8,86,8],[94,0,95,0],[94,1,95,1],[94,2,95,2],[94,3,95,3],[94,4,95,4],[94,5,95,5],[94,7,95,7],[94,8,95,8],[89,5,93,5],[89,0,93,0],[89,1,93,1],[89,2,93,2],[89,3,93,3],[89,4,93,4],[85,5,86,5],[85,7,86,7],[87,7,88,7],[87,0,88,0],[87,1,88,1],[87,2,88,2],[87,3,88,3],[87,4,88,4],[87,5,88,5],[85,0,86,0],[85,1,86,1],[85,2,86,2],[85,3,86,3],[85,4,86,4],[70,4,76,4],[70,5,76,5],[70,7,76,7],[60,0,61,0],[60,1,61,1],[60,2,61,2],[60,3,61,3],[60,4,61,4],[89,8,93,8],[12,7,18,7],[12,9,18,9],[12,0,18,0],[12,1,18,1],[12,2,18,2],[12,3,18,3],[12,4,18,4],[12,5,18,5],[12,6,18,6],[60,5,61,5],[60,7,61,7],[70,0,76,0],[70,1,76,1],[70,2,76,2],[70,3,76,3]]}
[]
["N°",null,"Attributo","Valore inserito","N°","Codice Convenzione","Qty:","Description:","Sku Number:","Brand",null,"Sku Number:"]
["L1N01",1,"Server Tower mono-processore",1399,"L1N01","TS3L1-SRV",1,"PowerEdge T340 Server",null,"DELL",null,"-"]
["L1N02",2,"OpzRAM16GB",98,"L1N02","TS3L1-RAM16",1,"16GB 2Rx8 DDR4 UDIMM 2666MHz",null,"DELL",null,"AA335286"]
["L1N03",3,"OpzGigabit",25,"L1N03","TS3L1-LAN1",1,"Broadcom 5720 DP 1Gb NIC,Full Height",null,"DELL",null,"540-BBGY"]
["L1N04",4,"OpzHDD8TB",285,"L1N04","TS3L1-HDD8TB",1,"8TB 7.2K RPM SATA 6Gbps 3.5in Hot-plug",null,"DELL",null,"400-AHID"]
["L1N05",5,"OpzHDD4TB",194,"L1N05","TS3L1-HDD4TB",1,"4TB 7.2K RPM SATA 6Gbps 3.5in Hot-plug",null,"DELL",null,"400-AUWY"]
["L1N06",6,"OpzHDD2TB",148,"L1N06","TS3L1-HDD2TB",1,"2TB 7.2K RPM SATA 6Gbps 3.5in Hot-plug",null,"DELL",null,"400-AUWX"]
["L1N07",7,"OpzHDD1TB",80,"L1N07","TS3L1-HDD1TB",1,"1TB 7.2K RPM SATA 6Gbps 3.5in Hot-plug",null,"DELL",null,"400-AURS"]
["L1N08",8,"OpzSSD-RI800GB",216,"L1N08","TS3L1-RI960GB",1,"960GB SSD SATA Read Intensive 6Gbps 2.5in Drive in 3.5in Hybrid Carrier, 1 DWPD",null,"DELL",null,"400-BDPC"]
["L1N09",9,"OpzSSD-RI400GB",160,"L1N09","TS3L1-RI480GB",1,"480GB SSD SATA Read Intensive 6Gbps 2.5in Drive in 3.5in Hybrid Carrier, 1 DWPD",null,"DELL",null,"400-BDQT"]
["L1N10",10,"OpzUps (3000VA)",302,"L1N10","TS3L1-UPS",1,"Powerme Online UPS RPMM/9 3K, Tower, SNMP card",null,"PowerME",null,"TPMM/ 3K"]
["L1N11",11,"OpzGUI per tower",69,"L1N11","TS3L1-GUI",1,"Monitor 19\" E1920H, Mouse MS116, Tastiera KB216",null,"DELL",null,"580-ADHM"]
[null,null,null,null,null,null,1,"Mouse ottico Dell MS116 - nero",null,null,null,"570-AAIS"]
[null,null,null,null,null,null,1,"BASE,DIS,MON,E1920H,EMEA",null,null,null,"210-AURI"]
{"$rows_left_out":110}
{"sheet":"Altre_Opzioni","index":5,"n_rows":24,"n_cols":12,"rows_kept":24,"cut":false,"hidden":false,"merged":[[22,3,23,3],[7,3,8,3],[10,3,11,3],[13,3,14,3],[16,3,17,3],[19,3,20,3]]}
[null,null,null,null,"Convenzione",{"$f":"SUM(J9:J117)","v":0}]
[null,null,null,null,0.2,{"$f":"SUM(K9:K117)","v":0}]
[null,null,null,null,"Totale",{"$f":"SUM(F1:F2)","v":0}]
[]
[null,null,"Opzioni in Convenzione"]
[]
[]
[null,null,"OpzRack"]
[null,null,"Rack 42U con portata 1000 KG e 4 ruote + coppia PDU 12 prese Shuko bipasso ITA"]
[]
[null,null,"OpzUps (3000VA)"]
[null,null,"BUNDLE PMEUPS3RTSER Comprensivo di UPS e scheda SNMP + Kit Rack incluso"]
[]
[null,null,"OpzGUI"]
[null,null,"Unità KVM - monitor 17\", cavo combi PS2 e USB da 1,8mt, tastiera ita, touch pad"]
{"$rows_left_out":10}
{"sheet":"Riepilogo","index":6,"n_rows":60,"n_cols":25,"rows_kept":60,"cut":false,"hidden":false,"merged":[[41,1,41,6],[20,1,20,6],[17,4,17,6],[1,3,1,6],[15,1,15,2],[10,3,10,6],[15,3,15,6],[12,4,12,6],[1,1,1,2],[3,1,3,2],[5,1,5,2],[7,1,7,2],[10,1,10,2],[58,1,58,5],[55,4,55,5],[55,1,55,2],[54,1,54,5],[56,1,56,5],[57,1,57,5]]}
[null,null,null,null,null,null,null,null,null,1]
[null,"Ente:",null,null,null,null,null,null,null,1,null,"ente",{"$f":"IF(D2>0,0,1)","v":1}]
[null,null,null,null,null,null,null,null,null,1]
[null,"Ordine N.",null,null,{"$f":"M7","v":"ERRORE DI MANCATA COMPILAZIONE DATI NECESSARI PER L'ORDINATIVO"},null,null,null,null,1,null,"N°ordine",{"$f":"IF(D4>0,0,1)","v":1}]
[null,null,null,null,{"$f":"M8","v":""},null,null,null,null,1]
[null,"Data",null,null,{"$f":"M9","v":""},null,null,null,null,1,null,"data",{"$f":"IF(D6>0,0,1)","v":1}]
[null,null,null,null,{"$f":"M10","v":""},null,null,null,null,1,"Campi non compilati","ERRORE1",{"$f":"IF(M2+M4+M6+M11+M13+M16+M18+O18+O13,\"ERRORE DI MANCATA COMPILAZIONE DATI NECESSARI PER L'ORDINATIVO\",\"\")","v":"ERRORE DI MANCATA COMPILAZIONE DATI NECESSARI PER L'ORDINATIVO"},{"$f":"IF(M7=\"\",0,1)","v":1}]
[null,"Totale IVA incl.",null,{"$f":"G59","v":0},{"$f":"IF(Q11=0,\"CONFIGURATORE OK\", \"\")","v":""},null,"Version 3.3",null,null,1,"Avvertimento 20%","Warning2",{"$f":"IF(G56>D56,\"!!! ATTENZIONE !!! L'IMPORTO 20% SUPERA IL VALORE MASSIMO CONSENTITO\",\"\")","v":""},{"$f":"IF(M8=\"\",0,1)","v":0}]
[null,null,null,null,null,null,null,null,null,1,null,"ERRORE3",{"$f":"\"\"","v":""},0]
[null,null,null,null,null,null,null,null,null,1,"Avvertimento Note/Raid","Waning4",{"$f":"IF(N10>0,\"!!! ATTENZIONE !!! COMPLETARE IL CAMPO NOTE NELLE CONFIGURAZIONI\",\"\")","v":""},{"$f":"IF(M22>0,O10,0)+IF(N22>0,P10,0)+IF(O22>0,Q10,0)","v":0},{"$f":"IF(Lotto2_T640_1!$H$30=\"Specificare la configurazione RAID per l'installazione del Sistema Operativo, se richiesto.\ne/o\ninserire eventuali note.\",1,0)","v":1},{"$f":"IF(Lotto2_T640_2!$H$30=\"Specificare la configurazione RAID per l'installazione del Sistema Operativo, se richiesto.\ne/o\ninserire eventuali note.\",1,0)","v":1},{"$f":"IF(Lotto2_T640_3!$H$30=\"Specificare la configurazione RAID per l'installazione del Sistema Operativo, se richiesto.\ne/o\ninserire eventuali note.\",1,0)","v":1}]
[null,"Referente Consegna",null,null,null,null,null,null,null,1,null,"ref1",{"$f":"IF(D11>0,0,1)","v":1},null,"Verifica Errori",null,{"$f":"N7+N9","v":1}]
[null,null,null,null,null,null,null,null,null,1]
[null,"Telefono",null,"email",null,null,null,null,null,1,null,"tel1",{"$f":"IF(C13>0,0,1)","v":1},"mail1",{"$f":"IF(E13>0,0,1)","v":1}]
[null,null,null,null,null,null,null,null,null,1]
[null,null,null,null,null,null,null,null,null,1]
{"$rows_left_out":46}
{"sheet":"Configurazione","index":7,"n_rows":56,"n_cols":23,"rows_kept":56,"cut":false,"hidden":false,"merged":[[49,1,49,8],[51,1,51,3],[51,6,51,8],[34,1,34,2],[35,1,46,2],[34,4,34,5],[35,4,46,5],[34,7,34,8],[35,7,46,8]]}
[null,null,null,null,null,null,null,null,null,null,null,null,null,null,null,null,null,null,null,null,null,1]
[null,{"$f":"Riepilogo!M22","v":0},"PowerEdge T640 Configurazione 1",null,{"$f":"Riepilogo!N22","v":0},"PowerEdge T640 Configurazione 2",null,{"$f":"Riepilogo!O22","v":0},"PowerEdge T640 Configurazione 3",null,null,null,null,null,null,null,null,null,null,null,null,1]
[null,null,null,null,null,null,null,null,null,null,null,null,null,null,null,null,null,null,null,null,null,{"$f":"IF($U$4>0,1,0)","v":0}]
[null,{"$f":"IF(Riepilogo!M23>0,Riepilogo!M23/$B$2,\"\")","v":""},{"$f":"IF(B4=\"\",\"\",Riepilogo!K23)","v":""},null,{"$f":"IF(Riepilogo!N23>0,Riepilogo!N23/$E$2,\"\")","v":""},{"$f":"IF(E4=\"\",\"\",Riepilogo!K23)","v":""},null,{"$f":"IF(Riepilogo!O23>0,Riepilogo!O23/$H$2,\"\")","v":""},{"$f":"IF(H4=\"\",\"\",Riepilogo!K23)","v":""},null,null,{"$f":"IF(B4=\"\",0,B4)","v":0},null,null,{"$f":"IF(E4=\"\",0,E4)","v":0},null,null,{"$f":"IF(H4=\"\",0,H4)","v":0},null,null,{"$f":"SUM(L4:T4)","v":0},{"$f":"IF(U4>0,1,0)","v":0},{"$f":"ISODD(V4)","v":false}]
[null,{"$f":"IF(Riepilogo!M24>0,Riepilogo!M24/$B$2,\"\")","v":""},{"$f":"IF(B5=\"\",\"\",Riepilogo!K24)","v":""},null,{"$f":"IF(Riepilogo!N24>0,Riepilogo!N24/$E$2,\"\")","v":""},{"$f":"IF(E5=\"\",\"\",Riepilogo!K24)","v":""},null,{"$f":"IF(Riepilogo!O24>0,Riepilogo!O24/$H$2,\"\")","v":""},{"$f":"IF(H5=\"\",\"\",Riepilogo!K24)","v":""},null,null,{"$f":"IF(B5=\"\",0,B5)","v":0},null,null,{"$f":"IF(E5=\"\",0,E5)","v":0},null,null,{"$f":"IF(H5=\"\",0,H5)","v":0},null,null,{"$f":"SUM(L5:T5)","v":0},{"$f":"IF(U5>0,1,0)","v":0},{"$f":"ISODD(SUM($V$4:V5))","v":false}]
[null,{"$f":"IF(Riepilogo!M25>0,Riepilogo!M25/$B$2,\"\")","v":""},{"$f":"IF(B6=\"\",\"\",Riepilogo!K25)","v":""},null,{"$f":"IF(Riepilogo!N25>0,Riepilogo!N25/$E$2,\"\")","v":""},{"$f":"IF(E6=\"\",\"\",Riepilogo!K25)","v":""},null,{"$f":"IF(Riepilogo!O25>0,Riepilogo!O25/$H$2,\"\")","v":""},{"$f":"IF(H6=\"\",\"\",Riepilogo!K25)","v":""},null,null,0,null,null,0,null,null,0,null,null,0,0,{"$f":"ISODD(SUM($V$4:V6))","v":false}]
[null,{"$f":"IF(Riepilogo!M26>0,Riepilogo!M26/$B$2,\"\")","v":""},{"$f":"IF(B7=\"\",\"\",Riepilogo!K26)","v":""},null,{"$f":"IF(Riepilogo!N26>0,Riepilogo!N26/$E$2,\"\")","v":""},{"$f":"IF(E7=\"\",\"\",Riepilogo!K26)","v":""},null,{"$f":"IF(Riepilogo!O26>0,Riepilogo!O26/$H$2,\"\")","v":""},{"$f":"IF(H7=\"\",\"\",Riepilogo!K26)","v":""},null,null,0,null,null,0,null,null,0,null,null,0,0,{"$f":"ISODD(SUM($V$4:V7))","v":false}]
[null,{"$f":"IF(Riepilogo!M27>0,Riepilogo!M27/$B$2,\"\")","v":""},{"$f":"IF(B8=\"\",\"\",Riepilogo!K27)","v":""},null,{"$f":"IF(Riepilogo!N27>0,Riepilogo!N27/$E$2,\"\")","v":""},{"$f":"IF(E8=\"\",\"\",Riepilogo!K27)","v":""},null,{"$f":"IF(Riepilogo!O27>0,Riepilogo!O27/$H$2,\"\")","v":""},{"$f":"IF(H8=\"\",\"\",Riepilogo!K27)","v":""},null,null,0,null,null,0,null,null,0,null,null,0,0,{"$f":"ISODD(SUM($V$4:V8))","v":false}]
[null,{"$f":"IF(Riepilogo!M28>0,Riepilogo!M28/$B$2,\"\")","v":""},{"$f":"IF(B9=\"\",\"\",Riepilogo!K28)","v":""},null,{"$f":"IF(Riepilogo!N28>0,Riepilogo!N28/$E$2,\"\")","v":""},{"$f":"IF(E9=\"\",\"\",Riepilogo!K28)","v":""},null,{"$f":"IF(Riepilogo!O28>0,Riepilogo!O28/$H$2,\"\")","v":""},{"$f":"IF(H9=\"\",\"\",Riepilogo!K28)","v":""},null,null,0,null,null,0,null,null,0,null,null,0,0,{"$f":"ISODD(SUM($V$4:V9))","v":false}]
[null,{"$f":"IF(Riepilogo!M29>0,Riepilogo!M29/$B$2,\"\")","v":""},{"$f":"IF(B10=\"\",\"\",Riepilogo!K29)","v":""},null,{"$f":"IF(Riepilogo!N29>0,Riepilogo!N29/$E$2,\"\")","v":""},{"$f":"IF(E10=\"\",\"\",Riepilogo!K29)","v":""},null,{"$f":"IF(Riepilogo!O29>0,Riepilogo!O29/$H$2,\"\")","v":""},{"$f":"IF(H10=\"\",\"\",Riepilogo!K29)","v":""},null,null,0,null,null,0,null,null,0,null,null,0,0,{"$f":"ISODD(SUM($V$4:V10))","v":false}]
[null,{"$f":"IF(Riepilogo!M30>0,Riepilogo!M30/$B$2,\"\")","v":""},{"$f":"IF(B11=\"\",\"\",Riepilogo!K30)","v":""},null,{"$f":"IF(Riepilogo!N30>0,Riepilogo!N30/$E$2,\"\")","v":""},{"$f":"IF(E11=\"\",\"\",Riepilogo!K30)","v":""},null,{"$f":"IF(Riepilogo!O30>0,Riepilogo!O30/$H$2,\"\")","v":""},{"$f":"IF(H11=\"\",\"\",Riepilogo!K30)","v":""},null,null,0,null,null,0,null,null,0,null,null,0,0,{"$f":"ISODD(SUM($V$4:V11))","v":false}]
[null,{"$f":"IF(Riepilogo!M31>0,Riepilogo!M31/$B$2,\"\")","v":""},{"$f":"IF(B12=\"\",\"\",Riepilogo!K31)","v":""},null,{"$f":"IF(Riepilogo!N31>0,Riepilogo!N31/$E$2,\"\")","v":""},{"$f":"IF(E12=\"\",\"\",Riepilogo!K31)","v":""},null,{"$f":"IF(Riepilogo!O31>0,Riepilogo!O31/$H$2,\"\")","v":""},{"$f":"IF(H12=\"\",\"\",Riepilogo!K31)","v":""},null,null,0,null,null,0,null,null,0,null,null,0,0,{"$f":"ISODD(SUM($V$4:V12))","v":false}]
[null,{"$f":"IF(Riepilogo!M32>0,Riepilogo!M32/$B$2,\"\")","v":""},{"$f":"IF(B13=\"\",\"\",Riepilogo!K32)","v":""},null,{"$f":"IF(Riepilogo!N32>0,Riepilogo!N32/$E$2,\"\")","v":""},{"$f":"IF(E13=\"\",\"\",Riepilogo!K32)","v":""},null,{"$f":"IF(Riepilogo!O32>0,Riepilogo!O32/$H$2,\"\")","v":""},{"$f":"IF(H13=\"\",\"\",Riepilogo!K32)","v":""},null,null,0,null,null,0,null,null,0,null,null,0,0,{"$f":"ISODD(SUM($V$4:V13))","v":false}]
[null,{"$f":"IF(Riepilogo!M33>0,Riepilogo!M33/$B$2,\"\")","v":""},{"$f":"IF(B14=\"\",\"\",Riepilogo!K33)","v":""},null,{"$f":"IF(Riepilogo!N33>0,Riepilogo!N33/$E$2,\"\")","v":""},{"$f":"IF(E14=\"\",\"\",Riepilogo!K33)","v":""},null,{"$f":"IF(Riepilogo!O33>0,Riepilogo!O33/$H$2,\"\")","v":""},{"$f":"IF(H14=\"\",\"\",Riepilogo!K33)","v":""},null,null,0,null,null,0,null,null,0,null,null,0,0,{"$f":"ISODD(SUM($V$4:V14))","v":false}]
[null,{"$f":"IF(Riepilogo!M34>0,Riepilogo!M34/$B$2,\"\")","v":""},{"$f":"IF(B15=\"\",\"\",Riepilogo!K34)","v":""},null,{"$f":"IF(Riepilogo!N34>0,Riepilogo!N34/$E$2,\"\")","v":""},{"$f":"IF(E15=\"\",\"\",Riepilogo!K34)","v":""},null,{"$f":"IF(Riepilogo!O34>0,Riepilogo!O34/$H$2,\"\")","v":""},{"$f":"IF(H15=\"\",\"\",Riepilogo!K34)","v":""},null,null,0,null,null,0,null,null,0,null,null,0,0,{"$f":"ISODD(SUM($V$4:V15))","v":false}]
{"$rows_left_out":41}