{"text_format":"1","workbook":"xlsx","n_sheets":8,"sheets":["Lotto4_R740XD_1","Lotto4_R740XD_2","Lotto4_R740XD_3","Altre_Opzioni","ConfigurationTS3L4","Tabella_prezzi","Riepilogo","Configurazione"],"not_rendered":{"charts":0,"images":26,"macros":1,"external_links":0,"defined_names":46,"comments":0,"pivot_tables":0},"unopened":[],"bounds":{"document_bytes":16777216,"sheet_cells":100000,"rows_first":2000,"rows_last":500,"rows_between":2000,"halvings":0,"cell_chars":16384,"cell_head_chars":4096},"cells_cut":0,"cells_raw":0,"read":"whole","date_system":"1900"}

{"sheet":"Lotto4_R740XD_1","index":0,"n_rows":142,"n_cols":24,"rows_kept":142,"cut":false,"hidden":false,"merged":[[11,7,14,7],[31,2,32,2],[7,3,8,3],[10,3,11,3],[16,3,17,3],[28,3,29,3],[28,7,31,7],[29,0,29,1],[34,0,34,1],[35,0,35,1],[36,0,36,1],[37,0,37,1],[42,0,42,1],[130,3,131,3],[133,3,134,3],[53,0,53,1],[54,0,54,1],[55,0,55,1],[56,0,56,1],[57,0,57,1],[67,3,68,3],[64,3,65,3],[61,3,62,3],[61,0,62,1],[43,0,43,1],[44,0,44,1],[3,4,3,5],[61,7,62,7],[63,7,67,8],[48,0,48,1],[49,0,49,1],[50,0,50,1],[51,0,51,1],[52,0,52,1],[34,7,52,7],[45,0,45,1],[46,0,46,1],[47,0,47,1],[38,0,38,1],[39,0,39,1],[40,0,40,1],[41,0,41,1]]}
[null,null,null,null,"Convenzione",{"$f":"SUM(J9:J135)*F5","v":0}]
[null,null,null,null,0.2,{"$f":"SUM(K9:K135)*F5","v":0}]
[null,null,null,null,"Totale",{"$f":"SUM(F1:F2)","v":0}]
[null,null,null,null,{"$f":"IF(M98>1,\"ERRORE NELLA CONFIGURAZIONE\",\"\")","v":""},null,null,{"$f":"IF($E$12=\"TS3L4-VSAN\",\"vSAN Server Ready\",IF($E$12=\"TS3L4-GPUDW\",\"GPU Double-Wide Server Ready\",IF($E$12=\"TS3L4-GPUSW\",\"GPU Single-Wide Server Ready\",IF(N9=\"VxFlex\",\"PowerFlex Server\",\"\"))))","v":""}]
[null,null,"POWEREDGE R740XD     Consulta la Guida alla Convenzione --->",{"$f":"HYPERLINK(\"https://convenzioni.converge.it/docs/L4GuidaAllaConvenzioneTecnologieServer3.pdf\",\"&\")","v":"&"},"Quantità Server",null,null,{"$f":"Riepilogo!G8","v":"Version 5.1"}]
[]
[]
[null,null,"Base",{"$f":"HYPERLINK(\"https://convenzioni.converge.it/docs/ts3_datasheet/dell-emc-poweredge-r740xd-spec-sheet.pdf\",\"i\")","v":"i"}]
[null,null,"PowerEdge R740XD Server (General Purpose)",null,{"$f":"IF($F$5>0,\"TS3L4-SRV-U\",\"\")","v":""},{"$f":"IF($F$5>0,1,\"\")","v":""},null,null,null,{"$f":"VLOOKUP($C9,TS3L4_ALL,10,FALSE)","v":2530},null,{"$f":"VLOOKUP($C9,TS3L4_ALL,12,FALSE)","v":"L4N01"},null,{"$f":"IF(C9=ConfigurationTS3L4!A14,\"VxFlex\",\"\")","v":""},null,{"$f":"IF(E12=\"TS3L4-GPUSW\",1,IF(E12=\"TS3L4-GPUDW\",1,\"\"))","v":""}]
[]
{"$rows_left_out":133}
{"sheet":"Lotto4_R740XD_2","index":1,"n_rows":142,"n_cols":24,"rows_kept":142,"cut":false,"hidden":false,"merged":[[130,3,131,3],[133,3,134,3],[29,0,29,1],[34,0,34,1],[35,0,35,1],[36,0,36,1],[37,0,37,1],[38,0,38,1],[39,0,39,1],[40,0,40,1],[41,0,41,1],[42,0,42,1],[43,0,43,1],[54,0,54,1],[67,3,68,3],[64,3,65,3],[3,4,3,5],[11,7,14,7],[61,7,62,7],[61,3,62,3],[56,0,56,1],[61,0,62,1],[28,7,31,7],[57,0,57,1],[53,0,53,1],[44,0,44,1],[34,7,52,7],[28,3,29,3],[55,0,55,1],[31,2,32,2],[45,0,45,1],[46,0,46,1],[52,0,52,1],[7,3,8,3],[10,3,11,3],[16,3,17,3],[51,0,51,1],[47,0,47,1],[48,0,48,1],[49,0,49,1],[50,0,50,1]]}
[null,null,null,null,"Convenzione",{"$f":"SUM(J9:J135)*F5","v":0}]
[null,null,null,null,0.2,{"$f":"SUM(K9:K135)*F5","v":0}]
[null,null,null,null,"Totale",{"$f":"SUM(F1:F2)","v":0}]
[null,null,null,null,{"$f":"IF(M98>1,\"ERRORE NELLA CONFIGURAZIONE\",\"\")","v":""},null,null,{"$f":"IF($E$12=\"TS3L4-VSAN\",\"vSAN Server Ready\",IF($E$12=\"TS3L4-GPUDW\",\"GPU Double-Wide Server Ready\",IF($E$12=\"TS3L4-GPUSW\",\"GPU Single-Wide Server Ready\",IF(N9=\"VxFlex\",\"PowerFlex Server\",\"\"))))","v":""}]
[null,null,"POWEREDGE R740XD     Consulta la Guida alla Convenzione --->",{"$f":"HYPERLINK(\"https://convenzioni.converge.it/docs/L4GuidaAllaConvenzioneTecnologieServer3.pdf\",\"&\")","v":"&"},"Quantità Server",null,null,{"$f":"Riepilogo!G8","v":"Version 5.1"}]
[]
[]
[null,null,"Base",{"$f":"HYPERLINK(\"https://convenzioni.converge.it/docs/ts3_datasheet/dell-emc-poweredge-r740xd-spec-sheet.pdf\",\"i\")","v":"i"}]
[null,null,"PowerEdge R740XD Server (General Purpose)",null,{"$f":"IF($F$5>0,\"TS3L4-SRV-U\",\"\")","v":""},{"$f":"IF($F$5>0,1,\"\")","v":""},null,null,null,{"$f":"VLOOKUP($C9,TS3L4_ALL,10,FALSE)","v":2530},null,{"$f":"VLOOKUP($C9,TS3L4_ALL,12,FALSE)","v":"L4N01"},null,{"$f":"IF(C9=ConfigurationTS3L4!A14,\"VxFlex\",\"\")","v":""},null,{"$f":"IF(E12=\"TS3L4-GPUSW\",1,IF(E12=\"TS3L4-GPUDW\",1,\"\"))","v":""}]
[]
{"$rows_left_out":133}
{"sheet":"Lotto4_R740XD_3","index":2,"n_rows":142,"n_cols":24,"rows_kept":142,"cut":false,"hidden":false,"merged":[[7,3,8,3],[10,3,11,3],[16,3,17,3],[28,3,29,3],[11,7,14,7],[28,7,31,7],[31,2,32,2],[45,0,45,1],[46,0,46,1],[47,0,47,1],[48,0,48,1],[41,0,41,1],[42,0,42,1],[34,0,34,1],[38,0,38,1],[39,0,39,1],[40,0,40,1],[35,0,35,1],[36,0,36,1],[37,0,37,1],[130,3,131,3],[133,3,134,3],[67,3,68,3],[56,0,56,1],[64,3,65,3],[3,4,3,5],[61,7,62,7],[61,3,62,3],[43,0,43,1],[54,0,54,1],[53,0,53,1],[44,0,44,1],[50,0,50,1],[51,0,51,1],[61,0,62,1],[57,0,57,1],[55,0,55,1],[49,0,49,1],[52,0,52,1],[34,7,52,7],[29,0,29,1]]}
[null,null,null,null,"Convenzione",{"$f":"SUM(J9:J135)*F5","v":0}]
[null,null,null,null,0.2,{"$f":"SUM(K9:K135)*F5","v":0}]
[null,null,null,null,"Totale",{"$f":"SUM(F1:F2)","v":0}]
[null,null,null,null,{"$f":"IF(M98>1,\"ERRORE NELLA CONFIGURAZIONE\",\"\")","v":""},null,null,{"$f":"IF($E$12=\"TS3L4-VSAN\",\"vSAN Server Ready\",IF($E$12=\"TS3L4-GPUDW\",\"GPU Double-Wide Server Ready\",IF($E$12=\"TS3L4-GPUSW\",\"GPU Single-Wide Server Ready\",IF(N9=\"VxFlex\",\"VxFlex Server\",\"\"))))","v":""}]
[null,null,"POWEREDGE R740XD     Consulta la Guida alla Convenzione --->",{"$f":"HYPERLINK(\"https://convenzioni.converge.it/docs/L4GuidaAllaConvenzioneTecnologieServer3.pdf\",\"&\")","v":"&"},"Quantità Server",null,null,{"$f":"Riepilogo!G8","v":"Version 5.1"}]
[]
[]
[null,null,"Base",{"$f":"HYPERLINK(\"https://convenzioni.converge.it/docs/ts3_datasheet/dell-emc-poweredge-r740xd-spec-sheet.pdf\",\"i\")","v":"i"}]
[null,null,"PowerEdge R740XD Server (General Purpose)",null,{"$f":"IF($F$5>0,\"TS3L4-SRV-U\",\"\")","v":""},{"$f":"IF($F$5>0,1,\"\")","v":""},null,null,null,{"$f":"VLOOKUP($C9,TS3L4_ALL,10,FALSE)","v":2530},null,{"$f":"VLOOKUP($C9,TS3L4_ALL,12,FALSE)","v":"L4N01"},null,{"$f":"IF(C9=ConfigurationTS3L4!A14,\"VxFlex\",\"\")","v":""},null,{"$f":"IF(E12=\"TS3L4-GPUSW\",1,IF(E12=\"TS3L4-GPUDW\",1,\"\"))","v":""}]
[]
{"$rows_left_out":133}
{"sheet":"Altre_Opzioni","index":3,"n_rows":86,"n_cols":12,"rows_kept":86,"cut":false,"hidden":false,"merged":[[7,3,8,3],[10,3,11,3],[84,3,85,3],[14,3,15,3],[70,3,71,3],[74,3,75,3],[78,3,79,3],[81,3,82,3],[47,3,48,3],[31,3,33,3]]}
[null,null,null,null,"Convenzione",{"$f":"SUM(J9:J179)","v":0}]
[null,null,null,null,0.2,{"$f":"SUM(K9:K179)","v":0}]
[null,null,null,null,"Totale",{"$f":"SUM(F1:F2)","v":0}]
[]
[null,null,"Opzioni"]
[]
[]
[null,null,"Opzione Rack APC con PDU Monofase",{"$f":"HYPERLINK(\"https://convenzioni.converge.it/docs/ts3_datasheet/RACK_APC_MONO.pdf\",\"i\")","v":"i"}]
[null,null,"Armadio Rack 42U 600x1200, 2 x PDU Monofase 2G, ZeroU, 32A, 230V, (36) C13 & (6) C19",null,{"$f":"VLOOKUP($C9,TS3L4_ALL,13,FALSE)","v":"TS3L4-RACKM32A"},null,null,null,null,{"$f":"VLOOKUP($C9,TS3L4_ALL,10,FALSE)*F9","v":0},{"$f":"VLOOKUP($C9,TS3L4_ALL,11,FALSE)*F9","v":0},{"$f":"VLOOKUP($C9,TS3L4_ALL,12,FALSE)","v":"L4N89"}]
[]
{"$rows_left_out":77}
{"sheet":"ConfigurationTS3L4","index":4,"n_rows":527,"n_cols":30,"rows_kept":527,"cut":false,"hidden":true,"merged":[]}
[]
[null,"Module Name","Option ID","Option Name","Option List Price","SKUs","Qty","SKU Customer Kit","Attributo","Valore inserito",null,"N°","Codice Convenzione"]
["PowerEdge R740XD Server (General Purpose)","Chassis with Up to 24 x 2.5 Hard Drives for 1CPU Configuration",null,{"$f":"VLOOKUP(L3,Tabella_prezzi!$A$3:$K$303,8,FALSE)","v":"PowerEdge R740xd Server"},null,null,null,{"$f":"VLOOKUP(L3,Tabella_prezzi!$A$3:$K$303,9,FALSE)","v":"L4N01-ServerR740XD"},{"$f":"VLOOKUP(L3,Tabella_prezzi!$A$3:$K$303,3,FALSE)","v":"Server rackable bi-processore prest."},{"$f":"VLOOKUP(L3,Tabella_prezzi!$A$3:$K$303,4,FALSE)","v":2530},null,"L4N01",{"$f":"VLOOKUP(L3,Tabella_prezzi!$A$3:$K$303,6,FALSE)","v":"TS3L4-SRV-U"}]
["PowerEdge R740XD Server (vSAN Ready)","Chassis with Up to 24 x 2.5\" Hard Drives for 2CPU Configuration",null,{"$f":"VLOOKUP(L4,Tabella_prezzi!$A$3:$K$303,8,FALSE)","v":"PowerEdge R740xd Server"},null,null,null,{"$f":"VLOOKUP(L4,Tabella_prezzi!$A$3:$K$303,9,FALSE)","v":"L4N01-ServerR740XD"},{"$f":"VLOOKUP(L4,Tabella_prezzi!$A$3:$K$303,3,FALSE)","v":"Server rackable bi-processore prest."},{"$f":"VLOOKUP(L4,Tabella_prezzi!$A$3:$K$303,4,FALSE)","v":2530},null,"L4N01",{"$f":"VLOOKUP(L4,Tabella_prezzi!$A$3:$K$303,6,FALSE)","v":"TS3L4-SRV-U"}]
["PowerEdge R740XD Server (GPU Single-Wide Ready)","Chassis with Up to 24 x 2.5 Hard Drives for 2CPU, GPU Single-Wide Configuration",null,{"$f":"VLOOKUP(L5,Tabella_prezzi!$A$3:$K$303,8,FALSE)","v":"PowerEdge R740xd Server"},null,null,null,{"$f":"VLOOKUP(L5,Tabella_prezzi!$A$3:$K$303,9,FALSE)","v":"L4N01-ServerR740XD"},{"$f":"VLOOKUP(L5,Tabella_prezzi!$A$3:$K$303,3,FALSE)","v":"Server rackable bi-processore prest."},{"$f":"VLOOKUP(L5,Tabella_prezzi!$A$3:$K$303,4,FALSE)","v":2530},null,"L4N01",{"$f":"VLOOKUP(L5,Tabella_prezzi!$A$3:$K$303,6,FALSE)","v":"TS3L4-SRV-U"}]
["PowerEdge R740XD Server (GPU Double-Wide Ready)","Chassis with Up to 24 x 2.5 Hard Drives for 2CPU, GPU Double-Wide Configuration",null,{"$f":"VLOOKUP(L6,Tabella_prezzi!$A$3:$K$303,8,FALSE)","v":"PowerEdge R740xd Server"},null,null,null,{"$f":"VLOOKUP(L6,Tabella_prezzi!$A$3:$K$303,9,FALSE)","v":"L4N01-ServerR740XD"},{"$f":"VLOOKUP(L6,Tabella_prezzi!$A$3:$K$303,3,FALSE)","v":"Server rackable bi-processore prest."},{"$f":"VLOOKUP(L6,Tabella_prezzi!$A$3:$K$303,4,FALSE)","v":2530},null,"L4N01",{"$f":"VLOOKUP(L6,Tabella_prezzi!$A$3:$K$303,6,FALSE)","v":"TS3L4-SRV-U"}]
["PowerEdge R740XD Server (PowerFlex)","Chassis with Up to 24 x 2.5\" Hard Drives for 2CPU Configuration",null,{"$f":"VLOOKUP(L7,Tabella_prezzi!$A$3:$K$303,8,FALSE)","v":"PowerEdge R740xd Server"},null,null,null,{"$f":"VLOOKUP(L7,Tabella_prezzi!$A$3:$K$303,9,FALSE)","v":"L4N01-ServerR740XD"},{"$f":"VLOOKUP(L7,Tabella_prezzi!$A$3:$K$303,3,FALSE)","v":"Server rackable bi-processore prest."},{"$f":"VLOOKUP(L7,Tabella_prezzi!$A$3:$K$303,4,FALSE)","v":2530},null,"L4N01",{"$f":"VLOOKUP(L7,Tabella_prezzi!$A$3:$K$303,6,FALSE)","v":"TS3L4-SRV-U"}]
[]
["TS3L4_Chassis"]
["PowerEdge R740XD Server (General Purpose)","Chassis with Up to 24 x 2.5 Hard Drives for 1CPU Configuration",null,null,null,null,{"$f":"\"\"","v":""},null,{"$f":"\"\"","v":""},null,null,{"$f":"\"\"","v":""},{"$f":"\"\"","v":""}]
{"$rows_left_out":518}
{"sheet":"Tabella_prezzi","index":5,"n_rows":271,"n_cols":16,"rows_kept":271,"cut":false,"hidden":true,"merged":[[209,8,210,8],[155,8,156,8],[209,0,210,0],[209,1,210,1],[209,2,210,2],[209,3,210,3],[209,4,210,4],[209,5,210,5],[12,7,18,7],[89,5,93,5],[89,0,93,0],[89,1,93,1],[89,2,93,2],[89,3,93,3],[89,4,93,4],[85,5,86,5],[85,7,86,7],[87,7,88,7],[87,0,88,0],[87,1,88,1],[87,2,88,2],[87,3,88,3],[87,4,88,4],[87,5,88,5],[12,10,18,10],[12,0,18,0],[12,1,18,1],[12,2,18,2],[12,3,18,3],[12,4,18,4],[12,5,18,5],[12,6,18,6],[70,4,76,4],[70,5,76,5],[70,7,76,7],[60,0,61,0],[60,1,61,1],[60,2,61,2],[60,3,61,3],[60,4,61,4],[60,5,61,5],[60,7,61,7],[70,0,76,0],[70,1,76,1],[70,2,76,2],[70,3,76,3],[85,0,86,0],[85,1,86,1],[85,2,86,2],[155,5,156,5],[155,2,156,2],[155,3,156,3],[134,5,135,5],[136,2,137,2],[136,3,137,3],[136,4,137,4],[140,2,141,2],[140,3,141,3],[140,4,141,4],[140,5,141,5],[138,4,139,4],[85,3,86,3],[85,4,86,4],[123,5,127,5],[132,5,133,5],[136,5,137,5],[138,5,139,5],[132,4,133,4],[123,0,127,0],[123,1,127,1],[123,4,127,4],[123,3,127,3],[123,2,127,2],[134,1,135,1],[134,2,135,2],[134,3,135,3],[134,4,135,4],[169,2,170,2],[169,3,170,3],[171,2,172,2],[171,3,172,3],[169,0,170,0],[140,0,141,0],[140,1,141,1],[132,0,133,0],[132,1,133,1],[132,2,133,2],[132,3,133,3],[138,0,139,0],[138,1,139,1],[138,2,139,2],[138,3,139,3],[136,0,137,0],[136,1,137,1],[134,0,135,0],[171,0,172,0],[169,8,170,8],[171,8,172,8],[142,0,143,0],[142,1,143,1],[142,2,143,2],[142,3,143,3],[142,4,143,4],[142,5,143,5],[123,8,127,8],[132,8,133,8],[134,8,135,8],[136,8,137,8],[138,8,139,8],[140,8,141,8],[142,8,143,8],[155,0,156,0],[155,1,156,1],[155,4,156,4],[169,4,170,4],[171,4,172,4],[169,1,170,1],[171,1,172,1],[169,5,170,5],[171,5,172,5]]}
[]
["N°",null,"Attributo","Valore inserito","N°","Codice Convenzione","Qty:","Description:","Manufacturer Part","Sku Number:","Brand"]
["L1N01",1,"Server Tower mono-processore",1399,"L1N01","TS3L1-SRV",1,"PowerEdge T340 Server","-","-","DELL"]
["L1N02",2,"OpzRAM16GB",98,"L1N02","TS3L1-RAM16",1,"16GB 2Rx8 DDR4 UDIMM 2666MHz","AA335286","AA335286","DELL"]
["L1N03",3,"OpzGigabit",25,"L1N03","TS3L1-LAN1",1,"Broadcom 5720 DP 1Gb NIC,Full Height","540-BBGY","540-BBGY","DELL"]
["L1N04",4,"OpzHDD8TB",285,"L1N04","TS3L1-HDD8TB",1,"8TB 7.2K RPM SATA 6Gbps 3.5in Hot-plug","400-AHID","400-AHID","DELL"]
["L1N05",5,"OpzHDD4TB",194,"L1N05","TS3L1-HDD4TB",1,"4TB 7.2K RPM SATA 6Gbps 3.5in Hot-plug","400-AUWY","400-AUWY","DELL"]
["L1N06",6,"OpzHDD2TB",148,"L1N06","TS3L1-HDD2TB",1,"2TB 7.2K RPM SATA 6Gbps 3.5in Hot-plug","400-AUWX","400-AUWX","DELL"]
["L1N07",7,"OpzHDD1TB",80,"L1N07","TS3L1-HDD1TB",1,"1TB 7.2K RPM SATA 6Gbps 3.5in Hot-plug","400-AURS","400-AURS","DELL"]
["L1N08",8,"OpzSSD-RI800GB",216,"L1N08","TS3L1-RI960GB",1,"960GB SSD SATA Read Intensive 6Gbps 2.5in Drive in 3.5in Hybrid Carrier, 1 DWPD","400-BDPC","400-BDPC","DELL"]
{"$rows_left_out":262}
{"sheet":"Riepilogo","index":6,"n_rows":166,"n_cols":28,"rows_kept":166,"cut":false,"hidden":false,"merged":[[164,1,164,5],[161,4,161,5],[161,1,161,2],[160,1,160,5],[163,1,163,5],[162,4,162,5],[162,1,162,3],[57,1,57,6],[20,1,20,6],[17,4,17,6],[1,3,1,6],[15,1,15,2],[10,3,10,6],[15,3,15,6],[12,4,12,6],[1,1,1,2],[3,1,3,2],[5,1,5,2],[7,1,7,2],[10,1,10,2]]}
[null,null,null,null,null,null,null,null,null,1]
[null,"Ente:",null,null,null,null,null,null,null,1,null,"ente",{"$f":"IF(D2>0,0,1)","v":1}]
[null,null,null,null,null,null,null,null,null,1,null,null,null,null,"Conf 1","Conf 2","Conf 3"]
[null,"Ordine N.",null,null,{"$f":"M7","v":"ERRORE DI MANCATA COMPILAZIONE DATI NECESSARI PER L'ORDINATIVO"},null,null,null,null,1,null,"N°ordine",{"$f":"IF(D4>0,0,1)","v":1},"Vsan Boot Check",{"$f":"IF(M68>0,IF(M63+M101=0,\"ERRORE vSAN Config 1\",\"\"),\"\")","v":""},{"$f":"IF(N68>0,IF(N63+N101=0,\" - ERRORE vSAN Config 2 - \",\"\"),\"\")","v":""},{"$f":"IF(O68>0,IF(O63+O101=0,\"ERRORE vSAN Config 3\",\"\"),\"\")","v":""},{"$f":"IF(R5>0,\" - ERRORE BOSS CARD\",\"\")","v":""}]
[null,null,null,null,{"$f":"M8","v":""},null,null,null,null,1,null,null,null,"Check BOSS card",{"$f":"IF(Lotto4_R740XD_1!M98>1,1,0)","v":0},{"$f":"IF(Lotto4_R740XD_2!M98>1,1,0)","v":0},{"$f":"IF(Lotto4_R740XD_3!M98>1,1,0)","v":0},{"$f":"SUM(O5:Q5)","v":0}]
[null,"Data",null,null,{"$f":"M9","v":""},null,null,null,null,1,null,"data",{"$f":"IF(D6>0,0,1)","v":1}]
[null,null,null,null,{"$f":"M10","v":""},null,null,null,null,1,null,"ERRORE1",{"$f":"IF(M2+M4+M6+M11+M13+M16+M18+O18+O13,\"ERRORE DI MANCATA COMPILAZIONE DATI NECESSARI PER L'ORDINATIVO\",\"\")","v":"ERRORE DI MANCATA COMPILAZIONE DATI NECESSARI PER L'ORDINATIVO"},{"$f":"IF(M7=\"\",0,1)","v":1}]
[null,"Totale IVA incl.",null,{"$f":"G165","v":0},{"$f":"IF(Q11=0,\"CONFIGURATORE OK\", \"\")","v":""},null,"Version 5.1",null,null,1,null,"Warning2",{"$f":"IF(G162>D162,\"!!! ATTENZIONE !!! L'IMPORTO 20% SUPERA IL VALORE MASSIMO CONSENTITO\",\"\")","v":""},{"$f":"IF(M8=\"\",0,1)","v":0}]
[null,null,null,null,null,null,null,null,null,1,null,"ERRORE3",{"$f":"CONCATENATE(O4,P4,Q4,R4)","v":""},{"$f":"IF(M9=\"\",0,1)","v":0}]
[null,null,null,null,null,null,null,null,null,1,null,"Waning4",{"$f":"IF(N10>0,\"!!! ATTENZIONE !!! COMPLETARE IL CAMPO NOTE NELLE CONFIGURAZIONI\",\"\")","v":""},{"$f":"IF(M22>0,O10,0)+IF(N22>0,P10,0)+IF(O22>0,Q10,0)","v":0},{"$f":"IF(Lotto4_R740XD_1!$H$35=\"Specificare la configurazione RAID per l'installazione del Sistema Operativo, se richiesto.\ne/o\ninserire eventuali note.\",1,0)","v":1},{"$f":"IF(Lotto4_R740XD_2!$H$30=\"Specificare la configurazione RAID per l'installazione del Sistema Operativo, se richiesto.\ne/o\ninserire eventuali note.\",1,0)","v":0},{"$f":"IF(Lotto4_R740XD_3!$H$30=\"Specificare la configurazione RAID per l'installazione del Sistema Operativo, se richiesto.\ne/o\ninserire eventuali note.\",1,0)","v":0}]
{"$rows_left_out":157}
{"sheet":"Configurazione","index":7,"n_rows":175,"n_cols":29,"rows_kept":175,"cut":false,"hidden":false,"merged":[[2,1,2,2],[2,4,2,5],[2,7,2,8],[154,1,154,8],[156,1,156,3],[156,6,156,8],[139,1,139,2],[140,1,151,2],[139,4,139,5],[140,4,151,5],[139,7,139,8],[140,7,151,8]]}
[null,null,null,null,null,null,null,null,null,null,null,null,null,null,null,null,null,null,null,null,null,1,null,"TS3L4-GPUSW","TS3L4-GPUDW","TS3L4-GPUSW","TS3L4-GPUDW","TS3L4-GPUSW","TS3L4-GPUDW"]
[null,{"$f":"Riepilogo!M22","v":0},"PowerEdge R740xd Configurazione 1",null,{"$f":"Riepilogo!N22","v":0},"PowerEdge R740xd Configurazione 2",null,{"$f":"Riepilogo!O22","v":0},"PowerEdge R740xd Configurazione 3",null,null,null,null,null,null,null,null,null,null,null,null,1]
[null,{"$f":"IF(X3=1,\"Configurazione Single-Wide\",IF(Y3=1,\"Configurazione Double-Wide\",\"\"))","v":""},null,null,{"$f":"IF(Z3=1,\"Configurazione Single-Wide\",IF(AA3=1,\"Configurazione Double-Wide\",\"\"))","v":""},null,null,{"$f":"IF(AB3=1,\"Configurazione Single-Wide\",IF(AC3=1,\"Configurazione Double-Wide\",\"\"))","v":""},null,null,null,null,null,null,null,null,null,null,null,null,{"$f":"SUM(X3:AC3)","v":0},{"$f":"IF(U3>0,1,0)","v":0},null,{"$f":"COUNTIF($C$5:$C$106,X1)","v":0},{"$f":"COUNTIF($C$5:$C$106,Y1)","v":0},{"$f":"COUNTIF($F$5:$F$106,Z1)","v":0},{"$f":"COUNTIF($F$5:$F$106,AA1)","v":0},{"$f":"COUNTIF($I$5:$I$106,AB1)","v":0},{"$f":"COUNTIF($I$5:$I$106,AC1)","v":0}]
[null,null,null,null,null,null,null,null,null,null,null,null,null,null,null,null,null,null,null,null,null,{"$f":"IF($U$5>0,1,0)","v":0}]
[null,{"$f":"IF(Riepilogo!M23>0,Riepilogo!M23/$B$2,\"\")","v":""},{"$f":"IF(B5=\"\",\"\",CONCATENATE(Riepilogo!K23,ConfigurationTS3L4!J420))","v":""},null,{"$f":"IF(Riepilogo!N23>0,Riepilogo!N23/$E$2,\"\")","v":""},{"$f":"IF(E5=\"\",\"\",CONCATENATE(Riepilogo!K23,ConfigurationTS3L4!T420))","v":""},null,{"$f":"IF(Riepilogo!O23>0,Riepilogo!O23/$H$2,\"\")","v":""},{"$f":"IF(H5=\"\",\"\",CONCATENATE(Riepilogo!K23,ConfigurationTS3L4!AD420))","v":""},null,null,{"$f":"IF(B5=\"\",0,B5)","v":0},null,null,{"$f":"IF(E5=\"\",0,E5)","v":0},null,null,{"$f":"IF(H5=\"\",0,H5)","v":0},null,null,{"$f":"SUM(L5:T5)","v":0},{"$f":"IF(U5>0,1,0)","v":0},{"$f":"ISODD(V5)","v":false}]
[null,{"$f":"IF(Riepilogo!M24>0,Riepilogo!M24/$B$2,\"\")","v":""},{"$f":"IF(B6=\"\",\"\",CONCATENATE(Riepilogo!K24,ConfigurationTS3L4!J421))","v":""},null,{"$f":"IF(Riepilogo!N24>0,Riepilogo!N24/$E$2,\"\")","v":""},{"$f":"IF(E6=\"\",\"\",CONCATENATE(Riepilogo!K24,ConfigurationTS3L4!T421))","v":""},null,{"$f":"IF(Riepilogo!O24>0,Riepilogo!O24/$H$2,\"\")","v":""},{"$f":"IF(H6=\"\",\"\",CONCATENATE(Riepilogo!K24,ConfigurationTS3L4!AD421))","v":""},null,null,{"$f":"IF(B6=\"\",0,B6)","v":0},null,null,{"$f":"IF(E6=\"\",0,E6)","v":0},null,null,{"$f":"IF(H6=\"\",0,H6)","v":0},null,null,{"$f":"SUM(L6:T6)","v":0},{"$f":"IF(U6>0,1,0)","v":0},{"$f":"ISODD(SUM($V$5:V6))","v":false}]
[null,{"$f":"IF(Riepilogo!M25>0,Riepilogo!M25/$B$2,\"\")","v":""},{"$f":"IF(B7=\"\",\"\",CONCATENATE(Riepilogo!K25,ConfigurationTS3L4!J422))","v":""},null,{"$f":"IF(Riepilogo!N25>0,Riepilogo!N25/$E$2,\"\")","v":""},{"$f":"IF(E7=\"\",\"\",CONCATENATE(Riepilogo!K25,ConfigurationTS3L4!T422))","v":""},null,{"$f":"IF(Riepilogo!O25>0,Riepilogo!O25/$H$2,\"\")","v":""},{"$f":"IF(H7=\"\",\"\",CONCATENATE(Riepilogo!K25,ConfigurationTS3L4!AD422))","v":""},null,null,0,null,null,0,null,null,0,null,null,0,0,{"$f":"ISODD(SUM($V$5:V7))","v":false}]
[null,{"$f":"IF(Riepilogo!M26>0,Riepilogo!M26/$B$2,\"\")","v":""},{"$f":"IF(B8=\"\",\"\",CONCATENATE(Riepilogo!K26,ConfigurationTS3L4!J423))","v":""},null,{"$f":"IF(Riepilogo!N26>0,Riepilogo!N26/$E$2,\"\")","v":""},{"$f":"IF(E8=\"\",\"\",CONCATENATE(Riepilogo!K26,ConfigurationTS3L4!T423))","v":""},null,{"$f":"IF(Riepilogo!O26>0,Riepilogo!O26/$H$2,\"\")","v":""},{"$f":"IF(H8=\"\",\"\",CONCATENATE(Riepilogo!K26,ConfigurationTS3L4!AD423))","v":""},null,null,0,null,null,0,null,null,0,null,null,0,0,{"$f":"ISODD(SUM($V$5:V8))","v":false}]
[null,{"$f":"IF(Riepilogo!M27>0,Riepilogo!M27/$B$2,\"\")","v":""},{"$f":"IF(B9=\"\",\"\",CONCATENATE(Riepilogo!K27,ConfigurationTS3L4!J424))","v":""},null,{"$f":"IF(Riepilogo!N27>0,Riepilogo!N27/$E$2,\"\")","v":""},{"$f":"IF(E9=\"\",\"\",CONCATENATE(Riepilogo!K27,ConfigurationTS3L4!T424))","v":""},null,{"$f":"IF(Riepilogo!O27>0,Riepilogo!O27/$H$2,\"\")","v":""},{"$f":"IF(H9=\"\",\"\",CONCATENATE(Riepilogo!K27,ConfigurationTS3L4!AD424))","v":""},null,null,0,null,null,0,null,null,0,null,null,0,0,{"$f":"ISODD(SUM($V$5:V9))","v":false}]
[null,{"$f":"IF(Riepilogo!M28>0,Riepilogo!M28/$B$2,\"\")","v":""},{"$f":"IF(B10=\"\",\"\",CONCATENATE(Riepilogo!K28,ConfigurationTS3L4!J425))","v":""},null,{"$f":"IF(Riepilogo!N28>0,Riepilogo!N28/$E$2,\"\")","v":""},{"$f":"IF(E10=\"\",\"\",CONCATENATE(Riepilogo!K28,ConfigurationTS3L4!T425))","v":""},null,{"$f":"IF(Riepilogo!O28>0,Riepilogo!O28/$H$2,\"\")","v":""},{"$f":"IF(H10=\"\",\"\",CONCATENATE(Riepilogo!K28,ConfigurationTS3L4!AD425))","v":""},null,null,0,null,null,0,null,null,0,null,null,0,0,{"$f":"ISODD(SUM($V$5:V10))","v":false}]
{"$rows_left_out":165}