{"text_format":"1","workbook":"xlsx","n_sheets":8,"sheets":["Lotto4_R740XD_1","Lotto4_R740XD_2","Lotto4_R740XD_3","Altre_Opzioni","ConfigurationTS3L4","Tabella_prezzi","Riepilogo","Configurazione"],"not_rendered":{"charts":0,"images":26,"macros":1,"external_links":0,"defined_names":46,"comments":0,"pivot_tables":0},"unopened":[],"bounds":{"document_bytes":16777216,"sheet_cells":100000,"rows_first":2000,"rows_last":500,"rows_between":2000,"halvings":0,"cell_chars":16384,"cell_head_chars":4096},"cells_cut":0,"cells_raw":0,"read":"whole","date_system":"1900"}

{"sheet":"Lotto4_R740XD_1","index":0,"n_rows":142,"n_cols":24,"rows_kept":142,"cut":false,"hidden":false,"merged":[[11,7,14,7],[31,2,32,2],[7,3,8,3],[10,3,11,3],[16,3,17,3],[28,3,29,3],[28,7,31,7],[29,0,29,1],[34,0,34,1],[35,0,35,1],[36,0,36,1],[37,0,37,1],[42,0,42,1],[130,3,131,3],[133,3,134,3],[53,0,53,1],[54,0,54,1],[55,0,55,1],[56,0,56,1],[57,0,57,1],[67,3,68,3],[64,3,65,3],[61,3,62,3],[61,0,62,1],[43,0,43,1],[44,0,44,1],[3,4,3,5],[61,7,62,7],[63,7,67,8],[48,0,48,1],[49,0,49,1],[50,0,50,1],[51,0,51,1],[52,0,52,1],[34,7,52,7],[45,0,45,1],[46,0,46,1],[47,0,47,1],[38,0,38,1],[39,0,39,1],[40,0,40,1],[41,0,41,1]]}
[null,null,null,null,"Convenzione",{"$f":"SUM(J9:J135)*F5","v":0}]
[null,null,null,null,0.2,{"$f":"SUM(K9:K135)*F5","v":0}]
[null,null,null,null,"Totale",{"$f":"SUM(F1:F2)","v":0}]
[null,null,null,null,{"$f":"IF(M98>1,\"ERRORE NELLA CONFIGURAZIONE\",\"\")","v":""},null,null,{"$f":"IF($E$12=\"TS3L4-VSAN\",\"vSAN Server Ready\",IF($E$12=\"TS3L4-GPUDW\",\"GPU Double-Wide Server Ready\",IF($E$12=\"TS3L4-GPUSW\",\"GPU Single-Wide Server Ready\",IF(N9=\"VxFlex\",\"PowerFlex Server\",\"\"))))","v":""}]
[null,null,"POWEREDGE R740XD     Consulta la Guida alla Convenzione --->",{"$f":"HYPERLINK(\"https://convenzioni.converge.it/docs/L4GuidaAllaConvenzioneTecnologieServer3.pdf\",\"&\")","v":"&"},"Quantità Server",null,null,{"$f":"Riepilogo!G8","v":"Version 5.1"}]
[]
[]
[null,null,"Base",{"$f":"HYPERLINK(\"https://convenzioni.converge.it/docs/ts3_datasheet/dell-emc-poweredge-r740xd-spec-sheet.pdf\",\"i\")","v":"i"}]
[null,null,"PowerEdge R740XD Server (General Purpose)",null,{"$f":"IF($F$5>0,\"TS3L4-SRV-U\",\"\")","v":""},{"$f":"IF($F$5>0,1,\"\")","v":""},null,null,null,{"$f":"VLOOKUP($C9,TS3L4_ALL,10,FALSE)","v":2530},null,{"$f":"VLOOKUP($C9,TS3L4_ALL,12,FALSE)","v":"L4N01"},null,{"$f":"IF(C9=ConfigurationTS3L4!A14,\"VxFlex\",\"\")","v":""},null,{"$f":"IF(E12=\"TS3L4-GPUSW\",1,IF(E12=\"TS3L4-GPUDW\",1,\"\"))","v":""}]
[]
[null,null,"Chassis Configuration",{"$f":"HYPERLINK(\"https://dellservervr.dell.com/poweredge-r740/\",\"i\")","v":"i"},{"$f":"IF($N$75=\"SW\",\"MAX 4 GPU\",IF($N$75=\"DW\",\"MAX 2 GPU\",\"\"))","v":""}]
[null,null,{"$f":"VLOOKUP($C$9,TS3L4_Chassis,2,FALSE)","v":"Chassis with Up to 24 x 2.5 Hard Drives for 1CPU Configuration"},null,{"$f":"VLOOKUP($C$9,TS3L4_Chassis,13,FALSE)","v":""},{"$f":"VLOOKUP($C$9,TS3L4_Chassis,7,FALSE)","v":""},null,{"$f":"IF(E12=\"TS3L4-VSAN\",\"ATTENZIONE SELEZIONARE UNA COMPONENTE PER IL BOOT A SCELTA TRA ''ISDM Module'' \noppure \n''BOSS Controller Card''\",\"\")","v":""},null,{"$f":"VLOOKUP($C$9,TS3L4_Chassis,10,FALSE)","v":0},{"$f":"VLOOKUP($C9,TS3L4_Chassis,11,FALSE)","v":0},{"$f":"VLOOKUP($C9,TS3L4_Chassis,12,FALSE)","v":""},null,"Chassis with Up to 24 x 2.5'' Hard Drives for 2CPU Configuration",{"$f":"IF(C12=N12,1,0)","v":0}]
[]
[null,null,"Trusted Platform Module (TPM)"]
[null,null,"Trusted Platform Module 2.0"]
[]
[null,null,"Processor",{"$f":"HYPERLINK(\"https://ark.intel.com/content/www/it/it/ark/products/199345/intel-xeon-gold-6238r-processor-38-5m-cache-2-20-ghz.html\",\"i\")","v":"i"}]
[null,null,"Intel Xeon Gold 6238R 2.2G, 28C/56T, 10.4GT/s, 38.5 M Cache, Turbo, HT (165W)",null,{"$f":"IF(F12=1,VLOOKUP($C$18,TS3L4_CPU8core,13,FALSE),VLOOKUP($C$18,TS3L4_CPU8core,13,FALSE))","v":""},{"$f":"IF(F12=1,VLOOKUP($C$18,TS3L4_CPU8core,7,FALSE),VLOOKUP($C$18,TS3L4_CPU8core,7,FALSE))","v":0},null,null,null,{"$f":"IF(F12=1,VLOOKUP($C$18,TS3L4_CPU8core,10,FALSE),VLOOKUP($C$18,TS3L4_CPU8core,10,FALSE))","v":0},{"$f":"IF(F12=1,VLOOKUP($C$18,TS3L4_CPU8core,11,FALSE),VLOOKUP($C$18,TS3L4_CPU8core,11,FALSE))","v":0},{"$f":"IF(K18=0,0,VLOOKUP($C18,TS3L4_CPU8core,12,FALSE))","v":0}]
[]
[null,null,"Additional Processor"]
[null,null,"No Additional Processor",null,{"$f":"IF(F12=1,VLOOKUP($C$18,TS3L4_CPU,13,FALSE),VLOOKUP($C$21,TS3L4_CPU,13,FALSE))","v":""},{"$f":"IF(F12=1,VLOOKUP($C$18,TS3L4_CPU,7,FALSE),VLOOKUP($C$21,TS3L4_CPU,7,FALSE))","v":0},null,null,null,{"$f":"IF(F12=1,VLOOKUP($C$18,TS3L4_CPU,10,FALSE),VLOOKUP($C$21,TS3L4_CPU,10,FALSE))","v":0},{"$f":"IF(F12=1,VLOOKUP($C$18,TS3L4_CPU,11,FALSE),VLOOKUP($C$21,TS3L4_CPU,11,FALSE))","v":0},{"$f":"IF(F12=1,VLOOKUP(C18,TS3L4_ALL,12,FALSE),VLOOKUP($C21,TS3L4_CPU,12,FALSE))","v":""},null,{"$f":"IF(F12=1,\"Intel Xeon Gold 6238R 2.2G, 28C/56T, 10.4GT/s, 38.5 M Cache, Turbo, HT (165W)\",C21)","v":"No Additional Processor"}]
[null,null,null,null,{"$f":"IF(E21=\"TS3L4-CPU8CORE\",\"TS3L4-CPU\",\"\")","v":""},{"$f":"IFERROR(O22,\"\")","v":""},null,null,null,{"$f":"IFERROR(N22,0)","v":0},null,{"$f":"IF(E22=\"TS3L4-CPU\",\"L4N02\",0)","v":0},null,{"$f":"VLOOKUP($L$22,Tabella_prezzi!$A$3:$K$496,4,FALSE)","v":{"$error":"#N/A"}},{"$f":"VLOOKUP($L$22,Tabella_prezzi!$A$3:$K$496,7,FALSE)","v":{"$error":"#N/A"}}]
[null,null,"Memory Capacity"]
[null,null,"64GB",null,{"$f":"IFERROR(N24,\"TS3L4-RAM64\")","v":""},{"$f":"IFERROR(O24,IF($N$9=\"VxFlex\",5,1))","v":0},null,null,null,{"$f":"IFERROR(P24,444)","v":0},null,{"$f":"IFERROR(Q24,\"L4N04\")","v":""},null,{"$f":"IF($F$21=1,VLOOKUP($C$24,TS3L4_RAM2CPU,13,FALSE),VLOOKUP($C$24,TS3L4_RAM1CPU,13,FALSE))","v":""},{"$f":"IF($F$21=1,VLOOKUP($C$24,TS3L4_RAM2CPU,7,FALSE),VLOOKUP($C$24,TS3L4_RAM1CPU,7,FALSE))","v":0},{"$f":"IF($F$21=1,VLOOKUP($C$24,TS3L4_RAM2CPU,10,FALSE),VLOOKUP($C$24,TS3L4_RAM1CPU,10,FALSE))","v":0},{"$f":"IF($F$21=1,VLOOKUP($C$24,TS3L4_RAM2CPU,12,FALSE),VLOOKUP($C$24,TS3L4_RAM1CPU,12,FALSE))","v":""},null,"384GB",{"$f":"IF(N9=\"VxFlex\",0,1)","v":1},{"$f":"IF(N9=\"VxFlex\",VLOOKUP(C24,ConfigurationTS3L4!A60:A63,1,FALSE),\"192GB\")","v":"192GB"},{"$f":"IFERROR(U24,1)","v":"192GB"},{"$f":"IF(C24=\"64GB\",1,0)","v":1},{"$f":"W24*F12","v":{"$error":"#VALUE!"}}]
[]
[null,null,"Operating System"]
[null,null,"No Operating System",null,{"$f":"VLOOKUP($C$27,TS3L4_OS,13,FALSE)","v":""},{"$f":"VLOOKUP($C$27,TS3L4_OS,7,FALSE)","v":0},null,null,null,{"$f":"VLOOKUP($C$27,TS3L4_OS,10,FALSE)","v":0},{"$f":"VLOOKUP($C$27,TS3L4_OS,11,FALSE)","v":0},{"$f":"VLOOKUP($C27,TS3L4_ALL,12,FALSE)","v":""}]
[null,null,null,null,{"$f":"IF($F$27+$F$18=2,\"\",IF($F$18+$F$21+$F$27=2,VLOOKUP($C$27,TS3L4_OS,23,FALSE),VLOOKUP($C$27,TS3L4_OS,23,FALSE)))","v":""},{"$f":"IF($F$27+$F$18=2,0,IF($F$18+$F$21+$F$27=2,VLOOKUP($C$27,TS3L4_OS,14,FALSE),VLOOKUP($C$27,TS3L4_OS,19,FALSE)))","v":0},null,null,null,{"$f":"IF($F$27+$F$18=2,0,IF($F$18+$F$21+$F$27=2,VLOOKUP($C$27,TS3L4_OS,17,FALSE),VLOOKUP($C$27,TS3L4_OS,21,FALSE)))","v":0},{"$f":"IF($F$27+$F$18=2,0,IF($F$18+$F$21+$F$27=2,VLOOKUP($C$27,TS3L4_OS,18,FALSE),VLOOKUP($C$27,TS3L4_OS,22,FALSE)))","v":0},{"$f":"IF($F$27+$F$18=2,0,IF($F$18+$F$21+$F$27=2,VLOOKUP($C$27,TS3L4_OS,20,FALSE),VLOOKUP($C$27,TS3L4_OS,20,FALSE)))","v":0}]
[null,null,"Disk Controller",{"$f":"IF(L30=\"\",HYPERLINK(\"https://convenzioni.converge.it/docs/ts3_datasheet/dellemc-poweredge-raid-controller-h740p.pdf\",\"i\"),HYPERLINK(\"https://convenzioni.converge.it/docs/ts3_datasheet/dellemc-poweredge-hba330.pdf\",\"i\"))","v":"i"},null,null,null,{"$f":"IF(F30=1,\"Selezionando questo controller in una soluzione vSAN, per il boot si deve utilizzare la componentete 'ISDM Module'' \noppure \n''BOSS Controller Card''\",\"\")","v":""}]
[{"$f":"IF($E$12=\"TS3L4-VSAN\",\"vSAN HCL\",\"\")","v":""},null,"PERC H740P RAID Controller, 8GB NV Cache",null,{"$f":"IF(C12=\"Chassis with Up to 24 x 2.5'' Hard Drives for 2CPU Configuration\",\"TS3L4-HBA330-L\",IF(N9=\"VxFlex\",\"TS3L4-HBA330-L\",VLOOKUP($C30,TS3L4_CRTL,13,FALSE)))","v":""},{"$f":"IF(C12=\"Chassis with Up to 24 x 2.5'' Hard Drives for 2CPU Configuration\",\"1\",IF(N9=\"VxFlex\",\"1\",VLOOKUP($C30,TS3L4_CRTL,7,FALSE)))","v":""},null,null,null,{"$f":"IF(C30=ConfigurationTS3L4!A48,0,VLOOKUP($C30,TS3L4_CRTL,10,FALSE))","v":0},{"$f":"IF(C12=\"Chassis with Up to 24 x 2.5'' Hard Drives for 2CPU Configuration\",180,IF(N9=\"VxFlex\",180,IF(H4=\"\",0,VLOOKUP($C30,TS3L4_CRTL,11,FALSE))))","v":0},{"$f":"IF(C12=\"Chassis with Up to 24 x 2.5'' Hard Drives for 2CPU Configuration\",\"L4N34\",IF(N9=\"VxFlex\",\"L4N34\",IF(H4=\"\",\"\",VLOOKUP($C30,TS3L4_ALL,12,FALSE))))","v":""},null,{"$f":"IF(E30=\"TS3L4-HBA330-L\",1,0)","v":0},{"$f":"IF(C30=\"PERC H740P RAID Controller, 8GB NV Cache\",1,0)","v":1},{"$f":"IF(Q30=1,Q30*N30,O30*N30)","v":0},{"$f":"IF(H4=\"\",1,0)","v":1}]
[]
[null,null,"Hard Drivers Bays disponibili n° 24",null,"Usati","Disponibili",null,null,null,null,null,null,{"$f":"IF(C12=\"Chassis with Up to 24 x 2.5'' Hard Drives for 2CPU Configuration\",ConfigurationTS3L4!$A$110,IF($H$4=\"\",ConfigurationTS3L4!$A$109,ConfigurationTS3L4!$A$109:$A$110))","v":"PERC H740P RAID Controller, 8GB NV Cache"}]
[null,null,null,null,{"$f":"F35+F37+F39+F45+F47+F49+F51+F57+F41+F43+F53","v":2},{"$f":"24-E33","v":22}]
[null,null,null,null,null,null,null,"Configurazione RAID e/o NOTE"]
[{"$f":"IF($E$12=\"TS3L4-VSAN\",\"vSAN HCL\",\"\")","v":""},null,{"$f":"ConfigurationTS3L4!A73","v":"300GB 15K RPM SAS 12Gbps 2.5in Hot-plug"},null,{"$f":"VLOOKUP($C35,TS3L4_HDD,13,FALSE)","v":"TS3L4-HDD300GB"},null,null,"Specificare la configurazione RAID per l'installazione del Sistema Operativo, se richiesto.\ne/o\ninserire eventuali note.",null,{"$f":"VLOOKUP($C35,TS3L4_HDD,10,FALSE)*F35","v":0},{"$f":"VLOOKUP($C35,TS3L4_HDD,11,FALSE)","v":0},{"$f":"VLOOKUP($C35,TS3L4_ALL,12,FALSE)","v":"L4N12"}]
[]
[{"$f":"IF($E$12=\"TS3L4-VSAN\",\"vSAN HCL\",\"\")","v":""},null,{"$f":"ConfigurationTS3L4!A74","v":"1.2TB 10K RPM SAS 12Gbps 2.5in Hot-plug"},null,{"$f":"VLOOKUP($C37,TS3L4_HDD,13,FALSE)","v":"TS3L4-HDD1TB"},null,null,null,null,{"$f":"VLOOKUP($C37,TS3L4_HDD,10,FALSE)*F37","v":0},{"$f":"VLOOKUP($C37,TS3L4_HDD,11,FALSE)","v":0},{"$f":"VLOOKUP($C37,TS3L4_ALL,12,FALSE)","v":"L4N11"}]
[]
[{"$f":"IF($E$12=\"TS3L4-VSAN\",\"vSAN HCL\",\"\")","v":""},null,{"$f":"ConfigurationTS3L4!A75","v":"2.4TB 10K RPM SAS 12Gbps 2.5in Hot-plug"},null,{"$f":"VLOOKUP($C39,TS3L4_HDD,13,FALSE)","v":"TS3L4-HDD2TB"},null,null,null,null,{"$f":"VLOOKUP($C39,TS3L4_HDD,10,FALSE)*F39","v":0},{"$f":"VLOOKUP($C39,TS3L4_HDD,11,FALSE)","v":0},{"$f":"VLOOKUP($C39,TS3L4_ALL,12,FALSE)","v":"L4N10"}]
[]
[{"$f":"IF($E$12=\"TS3L4-VSAN\",\"vSAN HCL\",\"\")","v":""},null,{"$f":"ConfigurationTS3L4!A76","v":"960GB SSD SAS Read Intensive 12Gbps 2.5in Hot-plug"},null,{"$f":"VLOOKUP($C41,TS3L4_HDD,13,FALSE)","v":"TS3L4-RI800GB"},2,null,null,null,{"$f":"IF(F41>2,(VLOOKUP($C41,TS3L4_HDD,10,FALSE)*(F41-2)),0)","v":0},{"$f":"VLOOKUP($C41,TS3L4_HDD,11,FALSE)","v":0},{"$f":"VLOOKUP($C41,TS3L4_ALL,12,FALSE)","v":"L4N15"}]
[]
[{"$f":"IF($E$12=\"TS3L4-VSAN\",\"vSAN HCL\",\"\")","v":""},null,{"$f":"ConfigurationTS3L4!A77","v":"1.92TB SSD SAS Read Intensive 12Gbps 2.5in Hot-plug"},null,{"$f":"VLOOKUP($C43,TS3L4_HDD,13,FALSE)","v":"TS3L4-RI1600GB"},null,null,null,null,{"$f":"VLOOKUP($C43,TS3L4_HDD,10,FALSE)*F43","v":0},{"$f":"VLOOKUP($C43,TS3L4_HDD,11,FALSE)","v":0},{"$f":"VLOOKUP($C43,TS3L4_ALL,12,FALSE)","v":"L4N13"}]
[]
[{"$f":"IF($E$12=\"TS3L4-VSAN\",\"vSAN HCL\",\"\")","v":""},null,{"$f":"ConfigurationTS3L4!A78","v":"3.84TB SSD SAS Read Intensive 12Gbps 2.5in Hot-plug"},null,{"$f":"VLOOKUP($C45,TS3L4_HDD,13,FALSE)","v":"TS3L4-RI3840GB"},null,null,null,null,{"$f":"VLOOKUP($C45,TS3L4_HDD,10,FALSE)*F45","v":0},{"$f":"VLOOKUP($C45,TS3L4_HDD,11,FALSE)*F45","v":0},{"$f":"VLOOKUP($C45,TS3L4_ALL,12,FALSE)","v":"L4N51"}]
[]
[{"$f":"IF($E$12=\"TS3L4-VSAN\",\"vSAN HCL\",\"\")","v":""},null,{"$f":"ConfigurationTS3L4!A79","v":"7.68TB SSD SAS Read Intensive 12Gbps 2.5in Hot-plug"},null,{"$f":"VLOOKUP($C47,TS3L4_HDD,13,FALSE)","v":"TS3L4-RI7680GB"},null,null,null,null,{"$f":"VLOOKUP($C47,TS3L4_HDD,10,FALSE)*F47","v":0},{"$f":"VLOOKUP($C47,TS3L4_HDD,11,FALSE)*F47","v":0},{"$f":"VLOOKUP($C47,TS3L4_ALL,12,FALSE)","v":"L4N52"}]
[]
[{"$f":"IF($E$12=\"TS3L4-VSAN\",\"vSAN HCL\",\"\")","v":""},null,{"$f":"ConfigurationTS3L4!A80","v":"960GB SSD SAS Mixed Use 12Gbps 512e 2.5in Hot-Plug"},null,{"$f":"VLOOKUP($C49,TS3L4_HDD,13,FALSE)","v":"TS3L4-MU800GB"},null,null,null,null,{"$f":"VLOOKUP($C49,TS3L4_HDD,10,FALSE)*F49","v":0},{"$f":"VLOOKUP($C49,TS3L4_HDD,11,FALSE)","v":0},{"$f":"VLOOKUP($C49,TS3L4_ALL,12,FALSE)","v":"L4N16"}]
[]
[{"$f":"IF($E$12=\"TS3L4-VSAN\",\"vSAN HCL\",\"\")","v":""},null,{"$f":"ConfigurationTS3L4!A81","v":"1.6TB SSD SAS Mix Use 12Gbps 2.5in Hot-plug"},null,{"$f":"VLOOKUP($C51,TS3L4_HDD,13,FALSE)","v":"TS3L4-MU1600GB"},null,null,null,null,{"$f":"VLOOKUP($C51,TS3L4_HDD,10,FALSE)*F51","v":0},{"$f":"VLOOKUP($C51,TS3L4_HDD,11,FALSE)","v":0},{"$f":"VLOOKUP($C51,TS3L4_ALL,12,FALSE)","v":"L4N14"}]
[]
[{"$f":"IF($E$12=\"TS3L4-VSAN\",\"vSAN HCL\",\"\")","v":""},null,{"$f":"ConfigurationTS3L4!A82","v":"800GB SSD SAS Write Intensive 12Gbps 2.5in Hot Plug "},null,{"$f":"VLOOKUP($C53,TS3L4_HDD,13,FALSE)","v":"TS3L4-WI800GB"},null,null,null,null,{"$f":"VLOOKUP($C53,TS3L4_HDD,10,FALSE)*F53","v":0},{"$f":"VLOOKUP($C53,TS3L4_HDD,11,FALSE)*F53","v":0},{"$f":"VLOOKUP($C53,TS3L4_ALL,12,FALSE)","v":"L4N53"}]
[]
[null,null,{"$f":"ConfigurationTS3L4!A83","v":"1.6TB SSD SAS Write Intensive 12Gbps 2.5in Hot Plug"},null,{"$f":"VLOOKUP($C55,TS3L4_HDD,13,FALSE)","v":"TS3L4-WI1600GB"},null,null,null,null,{"$f":"IF(F55>2,VLOOKUP($C55,TS3L4_HDD,10,FALSE)*(F55-2),0)","v":0},{"$f":"VLOOKUP($C55,TS3L4_HDD,11,FALSE)*F55","v":0},{"$f":"VLOOKUP($C55,TS3L4_ALL,12,FALSE)","v":"L4N54"}]
[]
[{"$f":"IF($E$12=\"TS3L4-VSAN\",\"vSAN HCL\",\"\")","v":""},null,"480GB SSD SAS Read Intensive 12Gbps 2.5in Hot-plug"]
[]
[null,null,"ISDM Module"]
[null,null,"No ISDM",null,{"$f":"IF(K60>0,VLOOKUP($C60,TS3L4_ISDM,13,FALSE),\"\")","v":""},{"$f":"VLOOKUP($C60,TS3L4_ISDM,7,FALSE)","v":""},null,null,null,{"$f":"VLOOKUP($C60,TS3L4_ISDM,10,FALSE)","v":0},{"$f":"VLOOKUP($C60,TS3L4_ISDM,11,FALSE)","v":0},{"$f":"VLOOKUP($C60,TS3L4_ALL,12,FALSE)","v":""}]
[]
[{"$f":"IF(H62=\"\",\"\",M63)","v":""},null,"Power Supply",{"$f":"IF(H62=\"\",\"\",M63)","v":""},null,null,null,{"$f":"IF(E63=\"TS3L4-PSU2000W\",\"Verificare, per ogni Server, la disponibilità di 2 prese C19 sulle PDU\",\"\")","v":""}]
[null,null,{"$f":"IF(O12=1,\"Dual, Hot-plug Power Supply (1+1), 1100W\",IF($E$12=\"TS3L4-GPUDW\",\"Dual, Hot-plug Power Supply (1+1), 2000W\",IF($E$12=\"TS3L4-GPUSW\",\"Dual, Hot-plug Power Supply (1+1), 2000W\",\"Dual, Hot-plug, Redundant Power Supply (1+1), 750W\")))","v":"Dual, Hot-plug, Redundant Power Supply (1+1), 750W"},null,{"$f":"VLOOKUP($C63,TS3L4_PSU,13,FALSE)","v":""},{"$f":"VLOOKUP($C63,TS3L4_PSU,7,FALSE)","v":""},null,null,null,{"$f":"VLOOKUP($C63,TS3L4_PSU,10,FALSE)","v":0},{"$f":"VLOOKUP($C63,TS3L4_PSU,11,FALSE)","v":0},{"$f":"VLOOKUP($C63,TS3L4_ALL,12,FALSE)","v":""},"⚠",{"$f":"IF(H62=\"\",ConfigurationTS3L4!A526,ConfigurationTS3L4!A527)","v":"_C14C13"}]
[]
[null,null,"Embedded Systems Management",{"$f":"HYPERLINK(\"https://convenzioni.converge.it/docs/ts3_datasheet/idrac-spec-sheet.pdf\",\"i\")","v":"i"}]
[null,null,"iDRAC9,Enterprise"]
[]
[null,null,"Infrastructure Management Console",{"$f":"HYPERLINK(\"https://www.dell.com/support/kbdoc/en-it/000175879/support-for-openmanage-enterprise#OME-Resources\",\"i\")","v":"i"}]
[null,null,"No OMEA",null,{"$f":"IF(N9=\"VxFlex\",\"TS3L4-OMEA\",VLOOKUP($C69,TS3L4_ALL,13,FALSE))","v":""},{"$f":"IF(N9=\"VxFlex\",1,VLOOKUP($C69,TS3L4_ALL,7,FALSE))","v":""},null,null,null,{"$f":"VLOOKUP($C69,TS3L4_ALL,10,FALSE)","v":0},{"$f":"IF(N9=\"VxFlex\",214,VLOOKUP($C69,TS3L4_ALL,11,FALSE))","v":0},{"$f":"IF(N9=\"VxFlex\",\"L4N96\",VLOOKUP($C69,TS3L4_ALL,12,FALSE))","v":""}]
[]
[null,null,"Network Cards"]
[null,null,"Broadcom 5720 QP 1Gb Network Daughter Card"]
[]
[]
[null,null,null,null,null,null,null,null,null,null,null,null,{"$f":"IF($E$12=\"TS3L4-GPUDW\",\"1\",IF($E$12=\"TS3L4-GPUSW\",\"20\",IF($F$21=1,\"300\",\"4000\")))","v":"4000"},{"$f":"IF($E$12=\"TS3L4-GPUDW\",\"DW\",IF($E$12=\"TS3L4-GPUSW\",\"SW\",IF($E$12=\"TS3L4-PWRFLEX\",\"PX\",IF($F$21=1,\"2CPU\",\"1CPU\"))))","v":"1CPU"}]
[null,null,"PCI Slot 1 Processor 1 x8 PCIe Gen3 for FL/FH",null,null,null,null,null,null,null,null,null,null,{"$f":"IF(N75=\"DW\",\"DW\",IF(N75=\"SW\",\"SW\",0))","v":0},"Selected","1CPU","2CPU","PX","DW","SW"]
[null,null,"",null,{"$f":"IF($N$9=\"VxFlex\",\"TS3L4-MCX4DP\",VLOOKUP($C77,TS3L4_ALL,13,))","v":""},{"$f":"IF($N$9=\"VxFlex\",1,VLOOKUP($C77,TS3L4_ALL,7,FALSE))","v":""},null,{"$f":"IF(M77=\"Errore\",\"ERRORE nella selezione del PCI Slot\",IFERROR(O78,\"ERRORE nella selezione del PCI Slot\"))","v":""},null,{"$f":"VLOOKUP($C77,TS3L4_ALL,10,FALSE)","v":0},{"$f":"IF($N$9=\"VxFlex\",419,VLOOKUP($C77,TS3L4_ALL,11,FALSE))","v":0},{"$f":"IF($N$9=\"VxFlex\",\"L4N94\",VLOOKUP($C77,TS3L4_ALL,12,FALSE))","v":""},null,{"$f":"IF(L77=\"L4N56\",\"DW\",IF(L77=\"L4N57\",\"DW\",IF(L77=\"L4N58\",\"DW\",IF(L77=\"L4N55\",\"SW\",\"CPU\"))))","v":"CPU"},{"$f":"HLOOKUP($N$75,$P$76:$T$99,2,FALSE)","v":"TS3L2_PCI_A"},"TS3L2_PCI_A","TS3L2_PCI_A","TS3L2_PCI_A","TS3L2_PCI_A","TS3L2_PCI_A",null,"PCI-1",{"$f":"IF($N$75=\"SW\",ConfigurationTS3L4!$A$290:$A$309,IF($N$75=\"DW\",ConfigurationTS3L4!$A$239:$A$262,ConfigurationTS3L4!$A$166:$A$181))","v":{"$error":"#VALUE!"}}]
[null,null,null,null,null,null,null,{"$f":"IF(L77=\"L4N33\",IF($M$98>1,\"ERRORE: SOLO UNA BOSS CARD PUO' ESSERE CONFIGURATA\",\"\"),\"\")","v":""},null,null,null,null,null,null,{"$f":"HLOOKUP($N$75,$P$76:$T$99,3,FALSE)","v":""},{"$f":"VLOOKUP(C77,TS3L4_PCI_A,12,FALSE)","v":""},{"$f":"VLOOKUP(C77,TS3L4_PCI_A,12,FALSE)","v":""},{"$f":"VLOOKUP(C77,TS3L4_PCI_A,12,FALSE)","v":""},{"$f":"VLOOKUP(C77,TS3L4_PCI_A,12,FALSE)","v":""},{"$f":"VLOOKUP(C77,TS3L4_PCI_A,12,FALSE)","v":""}]
[null,null,"PCI Slot 2 Processor 1 x8 PCIe Gen3 for FL/FH"]
[null,null,"",null,{"$f":"VLOOKUP($C80,TS3L4_ALL,13,FALSE)","v":""},{"$f":"VLOOKUP($C80,TS3L4_ALL,7,FALSE)","v":""},null,{"$f":"IFERROR(O81,\"ERRORE nella selezione del PCI Slot\")","v":""},null,{"$f":"VLOOKUP($C80,TS3L4_ALL,10,FALSE)","v":0},{"$f":"VLOOKUP($C80,TS3L4_ALL,11,FALSE)","v":0},{"$f":"VLOOKUP($C80,TS3L4_ALL,12,FALSE)","v":""},{"$f":"IF(F80=\"\",\"OK\",IF(N80+F80=2,\"Errore\",\"OK\"))","v":"OK"},{"$f":"IF(N77=\"dw\",1,0)","v":0},{"$f":"HLOOKUP($N$75,$P$76:$T$99,5,FALSE)","v":"TS3L2_PCI_A"},"TS3L2_PCI_A","TS3L2_PCI_A","TS3L2_PCI_A","TS3L2_PCI_A","TS3L2_PCI_A",null,"PCI-2"]
[null,null,null,null,null,null,null,{"$f":"IF(L80=\"L4N33\",IF($M$98>1,\"ERRORE: SOLO UNA BOSS CARD PUO' ESSERE CONFIGURATA\",\"\"),\"\")","v":""},null,null,null,null,null,null,{"$f":"HLOOKUP($N$75,$P$76:$T$99,6,FALSE)","v":""},{"$f":"VLOOKUP(C80,TS3L4_PCI_A,12,FALSE)","v":""},{"$f":"VLOOKUP(C80,TS3L4_PCI_A,12,FALSE)","v":""},{"$f":"VLOOKUP(C80,TS3L4_PCI_A,12,FALSE)","v":""},{"$f":"VLOOKUP(C80,TS3L4_PCI_A,12,FALSE)","v":""},{"$f":"VLOOKUP(C80,TS3L4_PCI_A,12,FALSE)","v":""}]
[null,null,"PCI Slot 3 Processor 1 x8 PCIe Gen3 for HL/FH"]
[null,null,"",null,{"$f":"IF($N$9=\"VxFlex\",\"TS3L4-BOSS480\",VLOOKUP($C83,TS3L4_ALL,13,))","v":""},{"$f":"IF($N$9=\"VxFlex\",1,VLOOKUP($C83,TS3L4_ALL,7,FALSE))","v":""},null,{"$f":"IFERROR(O84,\"ERRORE nella selezione del PCI Slot\")","v":""},null,{"$f":"VLOOKUP($C83,TS3L4_ALL,10,FALSE)","v":0},{"$f":"IF($N$9=\"VxFlex\",748,VLOOKUP($C83,TS3L4_ALL,11,FALSE))","v":0},{"$f":"IF($N$9=\"VxFlex\",\"L4N33\",VLOOKUP($C83,TS3L4_ALL,12,FALSE))","v":""},null,null,{"$f":"HLOOKUP($N$75,$P$76:$T$99,8,FALSE)","v":"TS3L2_PCI_A"},"TS3L2_PCI_A","TS3L2_PCI_A","TS3L2_PCI_A","TS3L2_PCI_A","TS3L2_PCI_A",null,"PCI-3"]
[null,null,null,null,null,null,null,{"$f":"IF(L83=\"L4N33\",IF($M$98>1,\"ERRORE: SOLO UNA BOSS CARD PUO' ESSERE CONFIGURATA\",\"\"),\"\")","v":""},null,null,null,null,null,null,{"$f":"HLOOKUP($N$75,$P$76:$T$99,9,FALSE)","v":""},{"$f":"VLOOKUP(C83,TS3L4_PCI_A,12,FALSE)","v":""},{"$f":"VLOOKUP(C83,TS3L4_PCI_A,12,FALSE)","v":""},{"$f":"VLOOKUP(C83,TS3L4_PCI_A,12,FALSE)","v":""},{"$f":"VLOOKUP(C83,TS3L4_PCI_A,12,FALSE)","v":""},{"$f":"VLOOKUP(C83,TS3L4_PCI_A,12,FALSE)","v":""}]
[null,null,"PCI Slot 4 Processor 2 x16 PCIe Gen3 for FL/FH",{"$f":"IF($N$75=\"SW\",\"GPU Slot\",IF($N$75=\"DW\",\"GPU Slot\",\"\"))","v":""}]
[null,null,"",null,{"$f":"VLOOKUP($C86,TS3L4_ALL,13,FALSE)","v":""},{"$f":"VLOOKUP($C86,TS3L4_ALL,7,FALSE)","v":""},null,{"$f":"IFERROR(O87,\"ERRORE nella selezione del PCI Slot\")","v":""},null,{"$f":"VLOOKUP($C86,TS3L4_ALL,10,FALSE)","v":0},{"$f":"VLOOKUP($C86,TS3L4_ALL,11,FALSE)","v":0},{"$f":"VLOOKUP($C86,TS3L4_ALL,12,FALSE)","v":""},null,{"$f":"IF(L86=\"L4N56\",\"DW\",IF(L86=\"L4N57\",\"DW\",IF(L86=\"L4N108\",\"DW\",IF(L86=\"L4N55\",\"SW\",1))))","v":1},{"$f":"HLOOKUP($N$75,$P$76:$T$99,11,FALSE)","v":"-"},"-","TS3L2_PCI_B","TS3L2_PCI_I","TS3L2_PCI_F","TS3L2_PCI_H",null,"PCI-4"]
[null,null,null,null,null,null,null,{"$f":"IF(L86=\"L4N33\",IF($M$98>1,\"ERRORE: SOLO UNA BOSS CARD PUO' ESSERE CONFIGURATA\",\"\"),\"\")","v":""},null,null,null,null,null,null,{"$f":"HLOOKUP($N$75,$P$76:$T$99,12,FALSE)","v":""},{"$f":"VLOOKUP(C86,TS3L4_PCI_A,12,FALSE)","v":""},{"$f":"VLOOKUP(C86,TS3L4_PCI_B,12,FALSE)","v":""},{"$f":"VLOOKUP(C86,TS3L4_PCI_I,12,FALSE)","v":""},{"$f":"VLOOKUP(C86,TS3L4_PCI_F,12,FALSE)","v":""},{"$f":"VLOOKUP(C86,TS3L4_PCI_H,12,FALSE)","v":""}]
[null,null,"PCI Slot 5 Processor 2 x8 PCIe Gen3 for FL/FH",{"$f":"IF($N$75=\"SW\",\"GPU Slot\",\"\")","v":""}]
[null,null,"",null,{"$f":"VLOOKUP($C89,TS3L4_ALL,13,FALSE)","v":""},{"$f":"VLOOKUP($C89,TS3L4_ALL,7,FALSE)","v":""},null,{"$f":"IF(M89=\"Errore\",\"ERRORE nella selezione del PCI Slot\",IFERROR(O90,\"ERRORE nella selezione del PCI Slot\"))","v":""},null,{"$f":"VLOOKUP($C89,TS3L4_ALL,10,FALSE)","v":0},{"$f":"VLOOKUP($C89,TS3L4_ALL,11,FALSE)","v":0},{"$f":"VLOOKUP($C89,TS3L4_ALL,12,FALSE)","v":""},{"$f":"IF(F89=\"\",\"OK\",IF(N89+F89=2,\"Errore\",\"OK\"))","v":"OK"},{"$f":"IF(N86=\"dw\",1,0)","v":0},{"$f":"HLOOKUP($N$75,$P$76:$T$99,14,FALSE)","v":"-"},"-","TS3L2_PCI_A","TS3L2_PCI_I","TS3L2_PCI_A","TS3L2_PCI_L",null,"PCI-5"]
[null,null,null,null,null,null,null,{"$f":"IF(L89=\"L4N33\",IF($M$98>1,\"ERRORE: SOLO UNA BOSS CARD PUO' ESSERE CONFIGURATA\",\"\"),\"\")","v":""},null,null,null,null,null,null,{"$f":"HLOOKUP($N$75,$P$76:$T$99,15,FALSE)","v":""},{"$f":"VLOOKUP(C89,TS3L4_PCI_A,12,FALSE)","v":""},{"$f":"VLOOKUP(C89,TS3L4_PCI_A,12,FALSE)","v":""},{"$f":"VLOOKUP(C89,TS3L4_PCI_I,12,FALSE)","v":""},{"$f":"VLOOKUP(C89,TS3L4_PCI_A,12,FALSE)","v":""},{"$f":"VLOOKUP(C89,TS3L4_PCI_L,12,FALSE)","v":""}]
[null,null,"PCI Slot 6 Processor 1 x8 PCIe Gen3 for HL/LP"]
[null,null,"",null,{"$f":"IF($N$9=\"VxFlex\",\"TS3L4-MCX4DP-L\",VLOOKUP($C92,TS3L4_ALL,13,))","v":""},{"$f":"IF($N$9=\"VxFlex\",1,VLOOKUP($C92,TS3L4_ALL,7,FALSE))","v":""},null,{"$f":"IF(M92=\"Errore\",\"ERRORE nella selezione del PCI Slot\",IFERROR(O93,\"ERRORE nella selezione del PCI Slot\"))","v":""},null,{"$f":"VLOOKUP($C92,TS3L4_ALL,10,FALSE)","v":0},{"$f":"IF($N$9=\"VxFlex\",419,VLOOKUP($C92,TS3L4_ALL,11,FALSE))","v":0},{"$f":"IF($N$9=\"VxFlex\",\"L4N95\",VLOOKUP($C92,TS3L4_ALL,12,FALSE))","v":""},null,null,{"$f":"HLOOKUP($N$75,$P$76:$T$99,17,FALSE)","v":"TS3L2_PCI_C"},"TS3L2_PCI_C","TS3L2_PCI_C","TS3L2_PCI_C","TS3L2_PCI_C","TS3L2_PCI_C",null,"PCI-6"]
[null,null,null,null,null,null,null,null,null,null,null,null,null,null,{"$f":"HLOOKUP($N$75,$P$76:$T$99,18,FALSE)","v":""},{"$f":"VLOOKUP(C92,TS3L4_PCI_C,12,FALSE)","v":""},{"$f":"VLOOKUP(C92,TS3L4_PCI_C,12,FALSE)","v":""},{"$f":"VLOOKUP(C92,TS3L4_PCI_C,12,FALSE)","v":""},{"$f":"VLOOKUP(C92,TS3L4_PCI_C,12,FALSE)","v":""},{"$f":"VLOOKUP(C92,TS3L4_PCI_C,12,FALSE)","v":""}]
[null,null,"PCI Slot 7 Processor 2 x8 PCIe Gen3 for FL/FH",{"$f":"IF($N$75=\"SW\",\"GPU Slot\",\"\")","v":""}]
[null,null,"",null,{"$f":"VLOOKUP($C95,TS3L4_ALL,13,FALSE)","v":""},{"$f":"VLOOKUP($C95,TS3L4_ALL,7,FALSE)","v":""},null,{"$f":"IF(M95=\"Errore\",\"ERRORE nella selezione del PCI Slot\",IFERROR(O96,\"ERRORE nella selezione del PCI Slot\"))","v":""},null,{"$f":"VLOOKUP($C95,TS3L4_ALL,10,FALSE)","v":0},{"$f":"VLOOKUP($C95,TS3L4_ALL,11,FALSE)","v":0},{"$f":"VLOOKUP($C95,TS3L4_ALL,12,FALSE)","v":""},{"$f":"IF(F95=\"\",\"OK\",IF(N95+F95=2,\"Errore\",\"OK\"))","v":"OK"},{"$f":"IF(N98=\"dw\",1,0)","v":0},{"$f":"HLOOKUP($N$75,$P$76:$T$99,20,FALSE)","v":"-"},"-","TS3L2_PCI_A","TS3L2_PCI_I","TS3L2_PCI_A","TS3L2_PCI_L",null,"PCI-7"]
[null,null,null,null,null,null,null,{"$f":"IF(L95=\"L4N33\",IF($M$98>1,\"ERRORE: SOLO UNA BOSS CARD PUO' ESSERE CONFIGURATA\",\"\"),\"\")","v":""},null,null,null,null,null,null,{"$f":"HLOOKUP($N$75,$P$76:$T$99,21,FALSE)","v":""},{"$f":"VLOOKUP(C95,TS3L4_PCI_A,12,FALSE)","v":""},{"$f":"VLOOKUP(C95,TS3L4_PCI_A,12,FALSE)","v":""},{"$f":"VLOOKUP(C95,TS3L4_PCI_I,12,FALSE)","v":""},{"$f":"VLOOKUP(C95,TS3L4_PCI_A,12,FALSE)","v":""},{"$f":"VLOOKUP(C95,TS3L4_PCI_L,12,FALSE)","v":""}]
[null,null,"PCI Slot 8 Processor 2 x16 PCIe Gen3 for FL/FH",{"$f":"IF($N$75=\"SW\",\"GPU Slot\",IF($N$75=\"DW\",\"GPU Slot\",\"\"))","v":""},null,null,null,null,null,null,null,null,"boss card"]
[null,null,"",null,{"$f":"VLOOKUP($C98,TS3L4_ALL,13,FALSE)","v":""},{"$f":"VLOOKUP($C98,TS3L4_ALL,7,FALSE)","v":""},null,{"$f":"IF(M98=\"Errore\",\"ERRORE nella selezione del PCI Slot\",IFERROR(O99,\"ERRORE nella selezione del PCI Slot\"))","v":""},null,{"$f":"VLOOKUP($C98,TS3L4_ALL,10,FALSE)","v":0},{"$f":"VLOOKUP($C98,TS3L4_ALL,11,FALSE)","v":0},{"$f":"VLOOKUP($C98,TS3L4_ALL,12,FALSE)","v":""},{"$f":"COUNTIF(L77:L98,\"L4N33\")","v":0},{"$f":"IF(L98=\"L4N56\",\"DW\",IF(L98=\"L4N57\",\"DW\",IF(L98=\"L4N108\",\"DW\",IF(L98=\"L4N55\",\"SW\",1))))","v":1},{"$f":"HLOOKUP($N$75,$P$76:$T$99,23,FALSE)","v":"-"},"-","TS3L2_PCI_D","TS3L2_PCI_I","TS3L2_PCI_E","TS3L2_PCI_G",null,"PCI-8"]
[null,null,null,null,null,null,null,{"$f":"IF(L98=\"L4N33\",IF($M$98>1,\"ERRORE: SOLO UNA BOSS CARD PUO' ESSERE CONFIGURATA\",\"\"),\"\")","v":""},null,null,null,null,null,null,{"$f":"HLOOKUP($N$75,$P$76:$T$99,24,FALSE)","v":""},{"$f":"VLOOKUP(C98,TS3L4_PCI_A,12,FALSE)","v":""},{"$f":"VLOOKUP(C98,TS3L4_PCI_D,12,FALSE)","v":""},{"$f":"VLOOKUP(C98,TS3L4_PCI_I,12,FALSE)","v":""},{"$f":"VLOOKUP(C98,TS3L4_PCI_E,12,FALSE)","v":""},{"$f":"VLOOKUP(C98,TS3L4_PCI_G,12,FALSE)","v":""}]
[null,null,"SFP+ Transceivers"]
[null,null,"Transceiver, SFP+ SR Optic for SFP+ ports (Intel X710)",null,{"$f":"IF(K101>0,VLOOKUP($C101,ConfigurationTS3L4!$A$1:$M$4832,13,FALSE),\"\")","v":""},null,null,null,null,0,{"$f":"IF(F101>0,VLOOKUP($C101,TS3L4_ALL,11,FALSE)*(F101),0)","v":0},{"$f":"IF(F101>0,VLOOKUP($C101,TS3L4_ALL,12,FALSE),0)","v":0}]
[]
[null,null,"SFP+ Direct Attach Cables (Twinax)"]
[null,null,"Cable, SFP+ to SFP+, 10GbE, Copper Twinax Direct Attach Cable, 3 Meter",null,{"$f":"IF(K104>0,VLOOKUP($C104,ConfigurationTS3L4!$A$1:$M$4832,13,FALSE),\"\")","v":""},null,null,null,null,0,{"$f":"IF(F104>0,VLOOKUP($C104,TS3L4_ALL,11,FALSE)*F104,0)","v":0},{"$f":"IF(F104>0,VLOOKUP($C104,TS3L4_ALL,12,FALSE),0)","v":0}]
[]
[null,null,"QSFP28 Transceivers"]
[null,null,"Dell EMC PowerEdge QSFP28 SR4 100GbE 85C optic",null,{"$f":"IF(K107>0,VLOOKUP($C107,ConfigurationTS3L4!$A$1:$M$4832,13,FALSE),\"\")","v":""},null,null,null,null,0,{"$f":"IF(F107>0,VLOOKUP($C107,TS3L4_ALL,11,FALSE)*F107,0)","v":0},{"$f":"IF(F107>0,VLOOKUP($C107,TS3L4_ALL,12,FALSE),0)","v":0}]
[]
[null,null,"Mellanox LinkX 100Gb/s Passive Copper Cables"]
[null,null,"Mellanox LinkX 100Gb/s Passive Copper Cables - attacco cavo diretto - 3 m - nero",null,{"$f":"IF(K110>0,VLOOKUP($C110,ConfigurationTS3L4!$A$1:$M$4832,13,FALSE),\"\")","v":""},null,null,null,null,0,{"$f":"IF(F110>0,VLOOKUP($C110,TS3L4_ALL,11,FALSE)*F110,0)","v":0},{"$f":"IF(F110>0,VLOOKUP($C110,TS3L4_ALL,12,FALSE),0)","v":0}]
[]
[null,null,"Mellanox LinkX 100Gb/s VCSEL-Based Active Optical Cables - cavo InfiniBand - 10 m",null,{"$f":"IF(K112>0,VLOOKUP($C112,ConfigurationTS3L4!$A$1:$M$4832,13,FALSE),\"\")","v":""},null,null,null,null,0,{"$f":"IF(F112>0,VLOOKUP($C112,TS3L4_ALL,11,FALSE)*F112,0)","v":0},{"$f":"IF(F112>0,VLOOKUP($C112,TS3L4_ALL,12,FALSE),0)","v":0}]
[]
[null,null,"Cavi RJ45"]
[null,null,"Cavo “patch” di 3 mt RJ45 certificato per gigabit ethernet",null,{"$f":"IF(K115>0,VLOOKUP($C115,ConfigurationTS3L4!$A$1:$M$4832,13,FALSE),\"\")","v":"TS3L4-RJ453M"},5,null,null,null,0,{"$f":"IF(F115>0,VLOOKUP($C115,TS3L4_ALL,11,FALSE)*(F115),0)","v":15},{"$f":"IF(F115>0,VLOOKUP($C115,TS3L4_ALL,12,FALSE),0)","v":"L4N62"}]
[]
[null,null,"Cavi LC-LC"]
[null,null,"Dell Networking Cable, OM4 LC/LC Fiber Cable, 3 Meter",null,{"$f":"IF(K118>0,VLOOKUP($C118,ConfigurationTS3L4!$A$1:$M$4832,13,FALSE),\"\")","v":""},null,null,null,null,0,{"$f":"IF(F118>0,VLOOKUP($C118,TS3L4_ALL,11,FALSE)*(F118),0)","v":0},{"$f":"IF(F118>0,VLOOKUP($C118,TS3L4_ALL,12,FALSE),0)","v":0}]
[]
[null,null,"Cavi DAC"]
[null,null,"Dell Networking, Cable, SFP+ to SFP+, 10GbE, Copper Twinax Direct Attach Cable, 3 Meter",null,{"$f":"IF(K121>0,VLOOKUP($C121,ConfigurationTS3L4!$A$1:$M$4832,13,FALSE),\"\")","v":""},null,null,null,null,0,{"$f":"IF(F121>0,VLOOKUP($C121,TS3L4_ALL,11,FALSE)*(F121),0)","v":0},{"$f":"IF(F121>0,VLOOKUP($C121,TS3L4_ALL,12,FALSE),0)","v":0}]
[null,null,"Mellanox LinkX 100Gb/s Passive Copper DAC 3m per scheda TS3L4-CONX6DP",null,{"$f":"IF(K122>0,VLOOKUP($C122,ConfigurationTS3L4!$A$1:$M$4832,13,FALSE),\"\")","v":""},null,null,null,null,0,{"$f":"IF(F122>0,VLOOKUP($C122,TS3L4_ALL,11,FALSE)*(F122),0)","v":0},{"$f":"IF(F122>0,VLOOKUP($C122,TS3L4_ALL,12,FALSE),0)","v":0}]
[null,null,"Dell Cable SFP28 to SFP28 25GbE Passive Copper Twinax Direct Attach Cable 3 Meter ",null,{"$f":"IF(K123>0,VLOOKUP($C123,ConfigurationTS3L4!$A$1:$M$4832,13,FALSE),\"\")","v":""},null,null,null,null,0,{"$f":"IF(F123>0,VLOOKUP($C123,TS3L4_ALL,11,FALSE)*(F123),0)","v":0},{"$f":"IF(F123>0,VLOOKUP($C123,TS3L4_ALL,12,FALSE),0)","v":0}]
[null,null,null,null,null,null,null,null,null,null,null,null,null,null,{"$f":"IF($N$9=\"VxFlex\",ConfigurationTS3L4!$A$236,IF($N$98=\"DW\",ConfigurationTS3L4!$A$333,IF($N$75=\"1CPU\",ConfigurationTS3L4!$A$92:$A$93,ConfigurationTS3L4!$A$166:$A$181)))","v":{"$error":"#VALUE!"}}]
[null,null,"Cable Management Arm"]
[null,null,"No ",null,{"$f":"IF($N$9=\"VxFlex\",\"TS3L4-BZLSTD\",VLOOKUP($C126,TS3L4_ALL,13,))","v":""},{"$f":"IF($N$9=\"VxFlex\",1,VLOOKUP($C126,TS3L4_ALL,7,FALSE))","v":""},null,null,null,{"$f":"VLOOKUP($C126,TS3L4_ALL,10,FALSE)","v":0},{"$f":"IF($N$9=\"VxFlex\",42,VLOOKUP($C126,TS3L4_ALL,11,FALSE))","v":0},{"$f":"IF($N$9=\"VxFlex\",\"L4N69\",VLOOKUP($C126,TS3L4_ALL,12,FALSE))","v":""}]
[]
[null,null,"Bezel"]
[null,null,"No Bezel",null,{"$f":"IF($N$9=\"VxFlex\",\"TS3L4-BZLSTD\",VLOOKUP($C129,TS3L4_ALL,13,))","v":""},{"$f":"IF($N$9=\"VxFlex\",1,VLOOKUP($C129,TS3L4_ALL,7,FALSE))","v":""},null,null,null,{"$f":"VLOOKUP($C129,TS3L4_ALL,10,FALSE)","v":0},{"$f":"IF($N$9=\"VxFlex\",42,VLOOKUP($C129,TS3L4_ALL,11,FALSE))","v":0},{"$f":"IF($N$9=\"VxFlex\",\"L4N69\",VLOOKUP($C129,TS3L4_ALL,12,FALSE))","v":""}]
[]
[null,null,"Warranty",{"$f":"HYPERLINK(\"https://convenzioni.converge.it/docs/ts3_datasheet/TS3warranty.pdf\",\"i\")","v":"i"}]
[null,null,"Manutenzione in garanzia (36 mesi)",null,{"$f":"VLOOKUP($C132,TS3L4_WARRANTY,13,FALSE)","v":""},{"$f":"VLOOKUP($C132,TS3L4_WARRANTY,7,FALSE)","v":""},null,null,null,{"$f":"VLOOKUP($C132,TS3L4_WARRANTY,10,FALSE)","v":0},{"$f":"VLOOKUP($C132,TS3L4_WARRANTY,11,FALSE)","v":0},{"$f":"VLOOKUP($C132,TS3L4_ALL,12,FALSE)","v":""}]
[]
[null,null,"Hard Disk Retention",{"$f":"HYPERLINK(\"https://convenzioni.converge.it/docs/ts3_datasheet/DELL_HDD_KYHD.pdf\",\"i\")","v":"i"}]
[null,null,"",null,{"$f":"IFERROR(N135,VLOOKUP(C135,TS3L4_ALL,13,FALSE))","v":""},{"$f":"IF(C135=\"\",\"\",1)","v":""},null,null,null,{"$f":"IFERROR(O135,VLOOKUP(C135,TS3L4_ALL,10,FALSE))","v":0},{"$f":"IFERROR(P135,VLOOKUP(C135,TS3L4_ALL,11,FALSE))","v":0},{"$f":"IFERROR(Q135,VLOOKUP(C135,TS3L4_ALL,12,FALSE))","v":""},null,{"$f":"IF(F132+F135=2,VLOOKUP(\"Hard Disk Retention (60 mesi)\",TS3L4_ALL,13,FALSE),VLOOKUP(C135,TS3L4_ALL,13,FALSE))","v":{"$error":"#VALUE!"}},{"$f":"IF(F132+F135=2,VLOOKUP(\"Hard Disk Retention (60 mesi)\",TS3L4_ALL,10,FALSE),VLOOKUP(C135,TS3L4_ALL,10,FALSE))","v":{"$error":"#VALUE!"}},{"$f":"IF(F132+F135=2,VLOOKUP(\"Hard Disk Retention (60 mesi)\",TS3L4_ALL,11,FALSE),VLOOKUP(C135,TS3L4_ALL,11,FALSE))","v":{"$error":"#VALUE!"}},{"$f":"IF(F132+F135=2,VLOOKUP(\"Hard Disk Retention (60 mesi)\",TS3L4_ALL,12,FALSE),VLOOKUP(C135,TS3L4_ALL,12,FALSE))","v":{"$error":"#VALUE!"}}]
[]
[]
[null,null,"UPS"]
[null,null,"",null,{"$f":"VLOOKUP($C139,TS3L4_UPS,13,FALSE)","v":{"$error":"#NAME?"}},{"$f":"VLOOKUP($C139,TS3L4_UPS,7,FALSE)","v":{"$error":"#NAME?"}},null,null,null,{"$f":"VLOOKUP($C139,TS3L4_UPS,10,FALSE)","v":{"$error":"#NAME?"}},{"$f":"VLOOKUP($C139,TS3L4_UPS,11,FALSE)","v":{"$error":"#NAME?"}},{"$f":"VLOOKUP($C139,TS3L4_ALL,12,FALSE)","v":""}]
[]
[null,null,"Kit Graphical User Interface"]
[null,null,"",null,{"$f":"VLOOKUP($C142,TS3L4_GUI,13,FALSE)","v":{"$error":"#NAME?"}},{"$f":"VLOOKUP($C142,TS3L4_GUI,7,FALSE)","v":{"$error":"#NAME?"}},null,null,null,{"$f":"VLOOKUP($C142,TS3L4_GUI,10,FALSE)","v":{"$error":"#NAME?"}},{"$f":"VLOOKUP($C142,TS3L4_GUI,11,FALSE)","v":{"$error":"#NAME?"}},{"$f":"VLOOKUP($C142,TS3L4_ALL,12,FALSE)","v":""}]

{"sheet":"Lotto4_R740XD_2","index":1,"n_rows":142,"n_cols":24,"rows_kept":142,"cut":false,"hidden":false,"merged":[[130,3,131,3],[133,3,134,3],[29,0,29,1],[34,0,34,1],[35,0,35,1],[36,0,36,1],[37,0,37,1],[38,0,38,1],[39,0,39,1],[40,0,40,1],[41,0,41,1],[42,0,42,1],[43,0,43,1],[54,0,54,1],[67,3,68,3],[64,3,65,3],[3,4,3,5],[11,7,14,7],[61,7,62,7],[61,3,62,3],[56,0,56,1],[61,0,62,1],[28,7,31,7],[57,0,57,1],[53,0,53,1],[44,0,44,1],[34,7,52,7],[28,3,29,3],[55,0,55,1],[31,2,32,2],[45,0,45,1],[46,0,46,1],[52,0,52,1],[7,3,8,3],[10,3,11,3],[16,3,17,3],[51,0,51,1],[47,0,47,1],[48,0,48,1],[49,0,49,1],[50,0,50,1]]}
[null,null,null,null,"Convenzione",{"$f":"SUM(J9:J135)*F5","v":0}]
[null,null,null,null,0.2,{"$f":"SUM(K9:K135)*F5","v":0}]
[null,null,null,null,"Totale",{"$f":"SUM(F1:F2)","v":0}]
[null,null,null,null,{"$f":"IF(M98>1,\"ERRORE NELLA CONFIGURAZIONE\",\"\")","v":""},null,null,{"$f":"IF($E$12=\"TS3L4-VSAN\",\"vSAN Server Ready\",IF($E$12=\"TS3L4-GPUDW\",\"GPU Double-Wide Server Ready\",IF($E$12=\"TS3L4-GPUSW\",\"GPU Single-Wide Server Ready\",IF(N9=\"VxFlex\",\"PowerFlex Server\",\"\"))))","v":""}]
[null,null,"POWEREDGE R740XD     Consulta la Guida alla Convenzione --->",{"$f":"HYPERLINK(\"https://convenzioni.converge.it/docs/L4GuidaAllaConvenzioneTecnologieServer3.pdf\",\"&\")","v":"&"},"Quantità Server",null,null,{"$f":"Riepilogo!G8","v":"Version 5.1"}]
[]
[]
[null,null,"Base",{"$f":"HYPERLINK(\"https://convenzioni.converge.it/docs/ts3_datasheet/dell-emc-poweredge-r740xd-spec-sheet.pdf\",\"i\")","v":"i"}]
[null,null,"PowerEdge R740XD Server (General Purpose)",null,{"$f":"IF($F$5>0,\"TS3L4-SRV-U\",\"\")","v":""},{"$f":"IF($F$5>0,1,\"\")","v":""},null,null,null,{"$f":"VLOOKUP($C9,TS3L4_ALL,10,FALSE)","v":2530},null,{"$f":"VLOOKUP($C9,TS3L4_ALL,12,FALSE)","v":"L4N01"},null,{"$f":"IF(C9=ConfigurationTS3L4!A14,\"VxFlex\",\"\")","v":""},null,{"$f":"IF(E12=\"TS3L4-GPUSW\",1,IF(E12=\"TS3L4-GPUDW\",1,\"\"))","v":""}]
[]
[null,null,"Chassis Configuration",{"$f":"HYPERLINK(\"https://dellservervr.dell.com/poweredge-r740/\",\"i\")","v":"i"},{"$f":"IF($N$75=\"SW\",\"MAX 4 GPU\",IF($N$75=\"DW\",\"MAX 2 GPU\",\"\"))","v":""}]
[null,null,{"$f":"VLOOKUP($C$9,TS3L4_Chassis,2,FALSE)","v":"Chassis with Up to 24 x 2.5 Hard Drives for 1CPU Configuration"},null,{"$f":"VLOOKUP($C$9,TS3L4_Chassis,13,FALSE)","v":""},{"$f":"VLOOKUP($C$9,TS3L4_Chassis,7,FALSE)","v":""},null,{"$f":"IF(E12=\"TS3L4-VSAN\",\"ATTENZIONE SELEZIONARE UNA COMPONENTE PER IL BOOT A SCELTA TRA ''ISDM Module'' \noppure \n''BOSS Controller Card''\",\"\")","v":""},null,{"$f":"VLOOKUP($C$9,TS3L4_Chassis,10,FALSE)","v":0},{"$f":"VLOOKUP($C9,TS3L4_Chassis,11,FALSE)","v":0},{"$f":"VLOOKUP($C9,TS3L4_Chassis,12,FALSE)","v":""},null,"Chassis with Up to 24 x 2.5'' Hard Drives for 2CPU Configuration",{"$f":"IF(C12=N12,1,0)","v":0}]
[]
[null,null,"Trusted Platform Module (TPM)"]
[null,null,"Trusted Platform Module 2.0"]
[]
[null,null,"Processor",{"$f":"HYPERLINK(\"https://ark.intel.com/content/www/it/it/ark/products/199345/intel-xeon-gold-6238r-processor-38-5m-cache-2-20-ghz.html\",\"i\")","v":"i"}]
[null,null,"Intel Xeon Gold 6238R 2.2G, 28C/56T, 10.4GT/s, 38.5 M Cache, Turbo, HT (165W)",null,{"$f":"IF(F12=1,VLOOKUP($C$18,TS3L4_CPU8core,13,FALSE),VLOOKUP($C$18,TS3L4_CPU8core,13,FALSE))","v":""},{"$f":"IF(F12=1,VLOOKUP($C$18,TS3L4_CPU8core,7,FALSE),VLOOKUP($C$18,TS3L4_CPU8core,7,FALSE))","v":0},null,null,null,{"$f":"IF(F12=1,VLOOKUP($C$18,TS3L4_CPU8core,10,FALSE),VLOOKUP($C$18,TS3L4_CPU8core,10,FALSE))","v":0},{"$f":"IF(F12=1,VLOOKUP($C$18,TS3L4_CPU8core,11,FALSE),VLOOKUP($C$18,TS3L4_CPU8core,11,FALSE))","v":0},{"$f":"IF(K18=0,0,VLOOKUP($C18,TS3L4_CPU8core,12,FALSE))","v":0}]
[]
[null,null,"Additional Processor"]
[null,null,"No Additional Processor",null,{"$f":"IF(F12=1,VLOOKUP($C$18,TS3L4_CPU,13,FALSE),VLOOKUP($C$21,TS3L4_CPU,13,FALSE))","v":""},{"$f":"IF(F12=1,VLOOKUP($C$18,TS3L4_CPU,7,FALSE),VLOOKUP($C$21,TS3L4_CPU,7,FALSE))","v":0},null,null,null,{"$f":"IF(F12=1,VLOOKUP($C$18,TS3L4_CPU,10,FALSE),VLOOKUP($C$21,TS3L4_CPU,10,FALSE))","v":0},{"$f":"IF(F12=1,VLOOKUP($C$18,TS3L4_CPU,11,FALSE),VLOOKUP($C$21,TS3L4_CPU,11,FALSE))","v":0},{"$f":"IF(F12=1,VLOOKUP(C18,TS3L4_ALL,12,FALSE),VLOOKUP($C21,TS3L4_CPU,12,FALSE))","v":""},null,{"$f":"IF(F12=1,\"Intel Xeon Gold 6238R 2.2G, 28C/56T, 10.4GT/s, 38.5 M Cache, Turbo, HT (165W)\",C21)","v":"No Additional Processor"}]
[null,null,null,null,{"$f":"IF(E21=\"TS3L4-CPU8CORE\",\"TS3L4-CPU\",\"\")","v":""},{"$f":"IFERROR(O22,\"\")","v":""},null,null,null,{"$f":"IFERROR(N22,0)","v":0},null,{"$f":"IF(E22=\"TS3L4-CPU\",\"L4N02\",0)","v":0},null,{"$f":"VLOOKUP($L$22,Tabella_prezzi!$A$3:$K$496,4,FALSE)","v":{"$error":"#N/A"}},{"$f":"VLOOKUP($L$22,Tabella_prezzi!$A$3:$K$496,7,FALSE)","v":{"$error":"#N/A"}}]
[null,null,"Memory Capacity"]
[null,null,"64GB",null,{"$f":"IFERROR(N24,\"TS3L4-RAM64\")","v":""},{"$f":"IFERROR(O24,IF($N$9=\"VxFlex\",5,1))","v":0},null,null,null,{"$f":"IFERROR(P24,444)","v":0},null,{"$f":"IFERROR(Q24,\"L4N04\")","v":""},null,{"$f":"IF($F$21=1,VLOOKUP($C$24,TS3L4_RAM2CPU,13,FALSE),VLOOKUP($C$24,TS3L4_RAM1CPU,13,FALSE))","v":""},{"$f":"IF($F$21=1,VLOOKUP($C$24,TS3L4_RAM2CPU,7,FALSE),VLOOKUP($C$24,TS3L4_RAM1CPU,7,FALSE))","v":0},{"$f":"IF($F$21=1,VLOOKUP($C$24,TS3L4_RAM2CPU,10,FALSE),VLOOKUP($C$24,TS3L4_RAM1CPU,10,FALSE))","v":0},{"$f":"IF($F$21=1,VLOOKUP($C$24,TS3L4_RAM2CPU,12,FALSE),VLOOKUP($C$24,TS3L4_RAM1CPU,12,FALSE))","v":""},null,"384GB",{"$f":"IF(N9=\"VxFlex\",0,1)","v":1},{"$f":"IF(N9=\"VxFlex\",VLOOKUP(C24,ConfigurationTS3L4!A60:A63,1,FALSE),\"192GB\")","v":"192GB"},{"$f":"IFERROR(U24,1)","v":"192GB"},{"$f":"IF(C24=\"64GB\",1,0)","v":1},{"$f":"W24*F12","v":{"$error":"#VALUE!"}}]
[]
[null,null,"Operating System"]
[null,null,"No Operating System",null,{"$f":"VLOOKUP($C$27,TS3L4_OS,13,FALSE)","v":""},{"$f":"VLOOKUP($C$27,TS3L4_OS,7,FALSE)","v":0},null,null,null,{"$f":"VLOOKUP($C$27,TS3L4_OS,10,FALSE)","v":0},{"$f":"VLOOKUP($C$27,TS3L4_OS,11,FALSE)","v":0},{"$f":"VLOOKUP($C27,TS3L4_ALL,12,FALSE)","v":""}]
[null,null,null,null,{"$f":"IF($F$27+$F$18=2,\"\",IF($F$18+$F$21+$F$27=2,VLOOKUP($C$27,TS3L4_OS,23,FALSE),VLOOKUP($C$27,TS3L4_OS,23,FALSE)))","v":""},{"$f":"IF($F$27+$F$18=2,0,IF($F$18+$F$21+$F$27=2,VLOOKUP($C$27,TS3L4_OS,14,FALSE),VLOOKUP($C$27,TS3L4_OS,19,FALSE)))","v":0},null,null,null,{"$f":"IF($F$27+$F$18=2,0,IF($F$18+$F$21+$F$27=2,VLOOKUP($C$27,TS3L4_OS,17,FALSE),VLOOKUP($C$27,TS3L4_OS,21,FALSE)))","v":0},{"$f":"IF($F$27+$F$18=2,0,IF($F$18+$F$21+$F$27=2,VLOOKUP($C$27,TS3L4_OS,18,FALSE),VLOOKUP($C$27,TS3L4_OS,22,FALSE)))","v":0},{"$f":"IF($F$27+$F$18=2,0,IF($F$18+$F$21+$F$27=2,VLOOKUP($C$27,TS3L4_OS,20,FALSE),VLOOKUP($C$27,TS3L4_OS,20,FALSE)))","v":0}]
[null,null,"Disk Controller",{"$f":"IF(L30=\"\",HYPERLINK(\"https://convenzioni.converge.it/docs/ts3_datasheet/dellemc-poweredge-raid-controller-h740p.pdf\",\"i\"),HYPERLINK(\"https://convenzioni.converge.it/docs/ts3_datasheet/dellemc-poweredge-hba330.pdf\",\"i\"))","v":"i"},null,null,null,{"$f":"IF(F30=1,\"Selezionando questo controller in una soluzione vSAN, per il boot si deve utilizzare la componentete 'ISDM Module'' \noppure \n''BOSS Controller Card''\",\"\")","v":""}]
[{"$f":"IF($E$12=\"TS3L4-VSAN\",\"vSAN HCL\",\"\")","v":""},null,"PERC H740P RAID Controller, 8GB NV Cache",null,{"$f":"IF(C12=\"Chassis with Up to 24 x 2.5'' Hard Drives for 2CPU Configuration\",\"TS3L4-HBA330-L\",IF(N9=\"VxFlex\",\"TS3L4-HBA330-L\",VLOOKUP($C30,TS3L4_CRTL,13,FALSE)))","v":""},{"$f":"IF(C12=\"Chassis with Up to 24 x 2.5'' Hard Drives for 2CPU Configuration\",\"1\",IF(N9=\"VxFlex\",\"1\",VLOOKUP($C30,TS3L4_CRTL,7,FALSE)))","v":""},null,null,null,{"$f":"IF(C30=ConfigurationTS3L4!A48,0,VLOOKUP($C30,TS3L4_CRTL,10,FALSE))","v":0},{"$f":"IF(C12=\"Chassis with Up to 24 x 2.5'' Hard Drives for 2CPU Configuration\",180,IF(N9=\"VxFlex\",180,IF(H4=\"\",0,VLOOKUP($C30,TS3L4_CRTL,11,FALSE))))","v":0},{"$f":"IF(C12=\"Chassis with Up to 24 x 2.5'' Hard Drives for 2CPU Configuration\",\"L4N34\",IF(N9=\"VxFlex\",\"L4N34\",IF(H4=\"\",\"\",VLOOKUP($C30,TS3L4_ALL,12,FALSE))))","v":""},null,{"$f":"IF(E30=\"TS3L4-HBA330-L\",1,0)","v":0},{"$f":"IF(C30=\"PERC H740P RAID Controller, 8GB NV Cache\",1,0)","v":1},{"$f":"IF(Q30=1,Q30*N30,O30*N30)","v":0},{"$f":"IF(H4=\"\",1,0)","v":1}]
[]
[null,null,"Hard Drivers Bays disponibili n° 24",null,"Usati","Disponibili",null,null,null,null,null,null,{"$f":"IF(C12=\"Chassis with Up to 24 x 2.5'' Hard Drives for 2CPU Configuration\",ConfigurationTS3L4!$A$110,IF($H$4=\"\",ConfigurationTS3L4!$A$109,ConfigurationTS3L4!$A$109:$A$110))","v":"PERC H740P RAID Controller, 8GB NV Cache"}]
[null,null,null,null,{"$f":"F35+F37+F39+F45+F47+F49+F51+F57+F41+F43+F53","v":2},{"$f":"24-E33","v":22}]
[null,null,null,null,null,null,null,"Configurazione RAID e/o NOTE"]
[{"$f":"IF($E$12=\"TS3L4-VSAN\",\"vSAN HCL\",\"\")","v":""},null,{"$f":"ConfigurationTS3L4!A73","v":"300GB 15K RPM SAS 12Gbps 2.5in Hot-plug"},null,{"$f":"VLOOKUP($C35,TS3L4_HDD,13,FALSE)","v":"TS3L4-HDD300GB"},null,null,"Specificare la configurazione RAID per l'installazione del Sistema Operativo, se richiesto.\ne/o\ninserire eventuali note.",null,{"$f":"VLOOKUP($C35,TS3L4_HDD,10,FALSE)*F35","v":0},{"$f":"VLOOKUP($C35,TS3L4_HDD,11,FALSE)","v":0},{"$f":"VLOOKUP($C35,TS3L4_ALL,12,FALSE)","v":"L4N12"}]
[]
[{"$f":"IF($E$12=\"TS3L4-VSAN\",\"vSAN HCL\",\"\")","v":""},null,{"$f":"ConfigurationTS3L4!A74","v":"1.2TB 10K RPM SAS 12Gbps 2.5in Hot-plug"},null,{"$f":"VLOOKUP($C37,TS3L4_HDD,13,FALSE)","v":"TS3L4-HDD1TB"},null,null,null,null,{"$f":"VLOOKUP($C37,TS3L4_HDD,10,FALSE)*F37","v":0},{"$f":"VLOOKUP($C37,TS3L4_HDD,11,FALSE)","v":0},{"$f":"VLOOKUP($C37,TS3L4_ALL,12,FALSE)","v":"L4N11"}]
[]
[{"$f":"IF($E$12=\"TS3L4-VSAN\",\"vSAN HCL\",\"\")","v":""},null,{"$f":"ConfigurationTS3L4!A75","v":"2.4TB 10K RPM SAS 12Gbps 2.5in Hot-plug"},null,{"$f":"VLOOKUP($C39,TS3L4_HDD,13,FALSE)","v":"TS3L4-HDD2TB"},null,null,null,null,{"$f":"VLOOKUP($C39,TS3L4_HDD,10,FALSE)*F39","v":0},{"$f":"VLOOKUP($C39,TS3L4_HDD,11,FALSE)","v":0},{"$f":"VLOOKUP($C39,TS3L4_ALL,12,FALSE)","v":"L4N10"}]
[]
[{"$f":"IF($E$12=\"TS3L4-VSAN\",\"vSAN HCL\",\"\")","v":""},null,{"$f":"ConfigurationTS3L4!A76","v":"960GB SSD SAS Read Intensive 12Gbps 2.5in Hot-plug"},null,{"$f":"VLOOKUP($C41,TS3L4_HDD,13,FALSE)","v":"TS3L4-RI800GB"},2,null,null,null,{"$f":"IF(F41>2,(VLOOKUP($C41,TS3L4_HDD,10,FALSE)*(F41-2)),0)","v":0},{"$f":"VLOOKUP($C41,TS3L4_HDD,11,FALSE)","v":0},{"$f":"VLOOKUP($C41,TS3L4_ALL,12,FALSE)","v":"L4N15"}]
[]
[{"$f":"IF($E$12=\"TS3L4-VSAN\",\"vSAN HCL\",\"\")","v":""},null,{"$f":"ConfigurationTS3L4!A77","v":"1.92TB SSD SAS Read Intensive 12Gbps 2.5in Hot-plug"},null,{"$f":"VLOOKUP($C43,TS3L4_HDD,13,FALSE)","v":"TS3L4-RI1600GB"},null,null,null,null,{"$f":"VLOOKUP($C43,TS3L4_HDD,10,FALSE)*F43","v":0},{"$f":"VLOOKUP($C43,TS3L4_HDD,11,FALSE)","v":0},{"$f":"VLOOKUP($C43,TS3L4_ALL,12,FALSE)","v":"L4N13"}]
[]
[{"$f":"IF($E$12=\"TS3L4-VSAN\",\"vSAN HCL\",\"\")","v":""},null,{"$f":"ConfigurationTS3L4!A78","v":"3.84TB SSD SAS Read Intensive 12Gbps 2.5in Hot-plug"},null,{"$f":"VLOOKUP($C45,TS3L4_HDD,13,FALSE)","v":"TS3L4-RI3840GB"},null,null,null,null,{"$f":"VLOOKUP($C45,TS3L4_HDD,10,FALSE)*F45","v":0},{"$f":"VLOOKUP($C45,TS3L4_HDD,11,FALSE)*F45","v":0},{"$f":"VLOOKUP($C45,TS3L4_ALL,12,FALSE)","v":"L4N51"}]
[]
[{"$f":"IF($E$12=\"TS3L4-VSAN\",\"vSAN HCL\",\"\")","v":""},null,{"$f":"ConfigurationTS3L4!A79","v":"7.68TB SSD SAS Read Intensive 12Gbps 2.5in Hot-plug"},null,{"$f":"VLOOKUP($C47,TS3L4_HDD,13,FALSE)","v":"TS3L4-RI7680GB"},null,null,null,null,{"$f":"VLOOKUP($C47,TS3L4_HDD,10,FALSE)*F47","v":0},{"$f":"VLOOKUP($C47,TS3L4_HDD,11,FALSE)*F47","v":0},{"$f":"VLOOKUP($C47,TS3L4_ALL,12,FALSE)","v":"L4N52"}]
[]
[{"$f":"IF($E$12=\"TS3L4-VSAN\",\"vSAN HCL\",\"\")","v":""},null,{"$f":"ConfigurationTS3L4!A80","v":"960GB SSD SAS Mixed Use 12Gbps 512e 2.5in Hot-Plug"},null,{"$f":"VLOOKUP($C49,TS3L4_HDD,13,FALSE)","v":"TS3L4-MU800GB"},null,null,null,null,{"$f":"VLOOKUP($C49,TS3L4_HDD,10,FALSE)*F49","v":0},{"$f":"VLOOKUP($C49,TS3L4_HDD,11,FALSE)","v":0},{"$f":"VLOOKUP($C49,TS3L4_ALL,12,FALSE)","v":"L4N16"}]
[]
[{"$f":"IF($E$12=\"TS3L4-VSAN\",\"vSAN HCL\",\"\")","v":""},null,{"$f":"ConfigurationTS3L4!A81","v":"1.6TB SSD SAS Mix Use 12Gbps 2.5in Hot-plug"},null,{"$f":"VLOOKUP($C51,TS3L4_HDD,13,FALSE)","v":"TS3L4-MU1600GB"},null,null,null,null,{"$f":"VLOOKUP($C51,TS3L4_HDD,10,FALSE)*F51","v":0},{"$f":"VLOOKUP($C51,TS3L4_HDD,11,FALSE)","v":0},{"$f":"VLOOKUP($C51,TS3L4_ALL,12,FALSE)","v":"L4N14"}]
[]
[{"$f":"IF($E$12=\"TS3L4-VSAN\",\"vSAN HCL\",\"\")","v":""},null,{"$f":"ConfigurationTS3L4!A82","v":"800GB SSD SAS Write Intensive 12Gbps 2.5in Hot Plug "},null,{"$f":"VLOOKUP($C53,TS3L4_HDD,13,FALSE)","v":"TS3L4-WI800GB"},null,null,null,null,{"$f":"VLOOKUP($C53,TS3L4_HDD,10,FALSE)*F53","v":0},{"$f":"VLOOKUP($C53,TS3L4_HDD,11,FALSE)*F53","v":0},{"$f":"VLOOKUP($C53,TS3L4_ALL,12,FALSE)","v":"L4N53"}]
[]
[null,null,{"$f":"ConfigurationTS3L4!A83","v":"1.6TB SSD SAS Write Intensive 12Gbps 2.5in Hot Plug"},null,{"$f":"VLOOKUP($C55,TS3L4_HDD,13,FALSE)","v":"TS3L4-WI1600GB"},null,null,null,null,{"$f":"IF(F55>2,VLOOKUP($C55,TS3L4_HDD,10,FALSE)*(F55-2),0)","v":0},{"$f":"VLOOKUP($C55,TS3L4_HDD,11,FALSE)*F55","v":0},{"$f":"VLOOKUP($C55,TS3L4_ALL,12,FALSE)","v":"L4N54"}]
[]
[{"$f":"IF($E$12=\"TS3L4-VSAN\",\"vSAN HCL\",\"\")","v":""},null,"480GB SSD SAS Read Intensive 12Gbps 2.5in Hot-plug"]
[]
[null,null,"ISDM Module"]
[null,null,"No ISDM",null,{"$f":"IF(K60>0,VLOOKUP($C60,TS3L4_ISDM,13,FALSE),\"\")","v":""},{"$f":"VLOOKUP($C60,TS3L4_ISDM,7,FALSE)","v":""},null,null,null,{"$f":"VLOOKUP($C60,TS3L4_ISDM,10,FALSE)","v":0},{"$f":"VLOOKUP($C60,TS3L4_ISDM,11,FALSE)","v":0},{"$f":"VLOOKUP($C60,TS3L4_ALL,12,FALSE)","v":""}]
[]
[{"$f":"IF(H62=\"\",\"\",M63)","v":""},null,"Power Supply",{"$f":"IF(H62=\"\",\"\",M63)","v":""},null,null,null,{"$f":"IF(E63=\"TS3L4-PSU2000W\",\"Verificare, per ogni Server, la disponibilità di 2 prese C19 sulle PDU\",\"\")","v":""}]
[null,null,{"$f":"IF(O12=1,\"Dual, Hot-plug Power Supply (1+1), 1100W\",IF($E$12=\"TS3L4-GPUDW\",\"Dual, Hot-plug Power Supply (1+1), 2000W\",IF($E$12=\"TS3L4-GPUSW\",\"Dual, Hot-plug Power Supply (1+1), 2000W\",\"Dual, Hot-plug, Redundant Power Supply (1+1), 750W\")))","v":"Dual, Hot-plug, Redundant Power Supply (1+1), 750W"},null,{"$f":"VLOOKUP($C63,TS3L4_PSU,13,FALSE)","v":""},{"$f":"VLOOKUP($C63,TS3L4_PSU,7,FALSE)","v":""},null,null,null,{"$f":"VLOOKUP($C63,TS3L4_PSU,10,FALSE)","v":0},{"$f":"VLOOKUP($C63,TS3L4_PSU,11,FALSE)","v":0},{"$f":"VLOOKUP($C63,TS3L4_ALL,12,FALSE)","v":""},"⚠",{"$f":"IF(H62=\"\",ConfigurationTS3L4!A526,ConfigurationTS3L4!A527)","v":"_C14C13"}]
[]
[null,null,"Embedded Systems Management",{"$f":"HYPERLINK(\"https://convenzioni.converge.it/docs/ts3_datasheet/idrac-spec-sheet.pdf\",\"i\")","v":"i"}]
[null,null,"iDRAC9,Enterprise"]
[]
[null,null,"Infrastructure Management Console",{"$f":"HYPERLINK(\"https://www.dell.com/support/kbdoc/en-it/000175879/support-for-openmanage-enterprise#OME-Resources\",\"i\")","v":"i"}]
[null,null,"No OMEA",null,{"$f":"IF(N9=\"VxFlex\",\"TS3L4-OMEA\",VLOOKUP($C69,TS3L4_ALL,13,FALSE))","v":""},{"$f":"IF(N9=\"VxFlex\",1,VLOOKUP($C69,TS3L4_ALL,7,FALSE))","v":""},null,null,null,{"$f":"VLOOKUP($C69,TS3L4_ALL,10,FALSE)","v":0},{"$f":"IF(N9=\"VxFlex\",214,VLOOKUP($C69,TS3L4_ALL,11,FALSE))","v":0},{"$f":"IF(N9=\"VxFlex\",\"L4N96\",VLOOKUP($C69,TS3L4_ALL,12,FALSE))","v":""}]
[]
[null,null,"Network Cards"]
[null,null,"Broadcom 5720 QP 1Gb Network Daughter Card"]
[]
[]
[null,null,null,null,null,null,null,null,null,null,null,null,{"$f":"IF($E$12=\"TS3L4-GPUDW\",\"1\",IF($E$12=\"TS3L4-GPUSW\",\"20\",IF($F$21=1,\"300\",\"4000\")))","v":"4000"},{"$f":"IF($E$12=\"TS3L4-GPUDW\",\"DW\",IF($E$12=\"TS3L4-GPUSW\",\"SW\",IF($E$12=\"TS3L4-PWRFLEX\",\"PX\",IF($F$21=1,\"2CPU\",\"1CPU\"))))","v":"1CPU"}]
[null,null,"PCI Slot 1 Processor 1 x8 PCIe Gen3 for FL/FH",null,null,null,null,null,null,null,null,null,null,{"$f":"IF(N75=\"DW\",\"DW\",IF(N75=\"SW\",\"SW\",0))","v":0},"Selected","1CPU","2CPU","PX","DW","SW"]
[null,null,"",null,{"$f":"IF($N$9=\"VxFlex\",\"TS3L4-MCX4DP\",VLOOKUP($C77,TS3L4_ALL,13,))","v":""},{"$f":"IF($N$9=\"VxFlex\",1,VLOOKUP($C77,TS3L4_ALL,7,FALSE))","v":""},null,{"$f":"IF(M77=\"Errore\",\"ERRORE nella selezione del PCI Slot\",IFERROR(O78,\"ERRORE nella selezione del PCI Slot\"))","v":""},null,{"$f":"VLOOKUP($C77,TS3L4_ALL,10,FALSE)","v":0},{"$f":"IF($N$9=\"VxFlex\",419,VLOOKUP($C77,TS3L4_ALL,11,FALSE))","v":0},{"$f":"IF($N$9=\"VxFlex\",\"L4N94\",VLOOKUP($C77,TS3L4_ALL,12,FALSE))","v":""},null,{"$f":"IF(L77=\"L4N56\",\"DW\",IF(L77=\"L4N57\",\"DW\",IF(L77=\"L4N58\",\"DW\",IF(L77=\"L4N55\",\"SW\",\"CPU\"))))","v":"CPU"},{"$f":"HLOOKUP($N$75,$P$76:$T$99,2,FALSE)","v":"TS3L2_PCI_A"},"TS3L2_PCI_A","TS3L2_PCI_A","TS3L2_PCI_A","TS3L2_PCI_A","TS3L2_PCI_A",null,"PCI-1",{"$f":"IF($N$75=\"SW\",ConfigurationTS3L4!$A$290:$A$309,IF($N$75=\"DW\",ConfigurationTS3L4!$A$239:$A$262,ConfigurationTS3L4!$A$166:$A$181))","v":{"$error":"#VALUE!"}}]
[null,null,null,null,null,null,null,{"$f":"IF(L77=\"L4N33\",IF($M$98>1,\"ERRORE: SOLO UNA BOSS CARD PUO' ESSERE CONFIGURATA\",\"\"),\"\")","v":""},null,null,null,null,null,null,{"$f":"HLOOKUP($N$75,$P$76:$T$99,3,FALSE)","v":""},{"$f":"VLOOKUP(C77,TS3L4_PCI_A,12,FALSE)","v":""},{"$f":"VLOOKUP(C77,TS3L4_PCI_A,12,FALSE)","v":""},{"$f":"VLOOKUP(C77,TS3L4_PCI_A,12,FALSE)","v":""},{"$f":"VLOOKUP(C77,TS3L4_PCI_A,12,FALSE)","v":""},{"$f":"VLOOKUP(C77,TS3L4_PCI_A,12,FALSE)","v":""}]
[null,null,"PCI Slot 2 Processor 1 x8 PCIe Gen3 for FL/FH"]
[null,null,"",null,{"$f":"VLOOKUP($C80,TS3L4_ALL,13,FALSE)","v":""},{"$f":"VLOOKUP($C80,TS3L4_ALL,7,FALSE)","v":""},null,{"$f":"IFERROR(O81,\"ERRORE nella selezione del PCI Slot\")","v":""},null,{"$f":"VLOOKUP($C80,TS3L4_ALL,10,FALSE)","v":0},{"$f":"VLOOKUP($C80,TS3L4_ALL,11,FALSE)","v":0},{"$f":"VLOOKUP($C80,TS3L4_ALL,12,FALSE)","v":""},{"$f":"IF(F80=\"\",\"OK\",IF(N80+F80=2,\"Errore\",\"OK\"))","v":"OK"},{"$f":"IF(N77=\"dw\",1,0)","v":0},{"$f":"HLOOKUP($N$75,$P$76:$T$99,5,FALSE)","v":"TS3L2_PCI_A"},"TS3L2_PCI_A","TS3L2_PCI_A","TS3L2_PCI_A","TS3L2_PCI_A","TS3L2_PCI_A",null,"PCI-2"]
[null,null,null,null,null,null,null,{"$f":"IF(L80=\"L4N33\",IF($M$98>1,\"ERRORE: SOLO UNA BOSS CARD PUO' ESSERE CONFIGURATA\",\"\"),\"\")","v":""},null,null,null,null,null,null,{"$f":"HLOOKUP($N$75,$P$76:$T$99,6,FALSE)","v":""},{"$f":"VLOOKUP(C80,TS3L4_PCI_A,12,FALSE)","v":""},{"$f":"VLOOKUP(C80,TS3L4_PCI_A,12,FALSE)","v":""},{"$f":"VLOOKUP(C80,TS3L4_PCI_A,12,FALSE)","v":""},{"$f":"VLOOKUP(C80,TS3L4_PCI_A,12,FALSE)","v":""},{"$f":"VLOOKUP(C80,TS3L4_PCI_A,12,FALSE)","v":""}]
[null,null,"PCI Slot 3 Processor 1 x8 PCIe Gen3 for HL/FH"]
[null,null,"",null,{"$f":"IF($N$9=\"VxFlex\",\"TS3L4-BOSS480\",VLOOKUP($C83,TS3L4_ALL,13,))","v":""},{"$f":"IF($N$9=\"VxFlex\",1,VLOOKUP($C83,TS3L4_ALL,7,FALSE))","v":""},null,{"$f":"IFERROR(O84,\"ERRORE nella selezione del PCI Slot\")","v":""},null,{"$f":"VLOOKUP($C83,TS3L4_ALL,10,FALSE)","v":0},{"$f":"IF($N$9=\"VxFlex\",748,VLOOKUP($C83,TS3L4_ALL,11,FALSE))","v":0},{"$f":"IF($N$9=\"VxFlex\",\"L4N33\",VLOOKUP($C83,TS3L4_ALL,12,FALSE))","v":""},null,null,{"$f":"HLOOKUP($N$75,$P$76:$T$99,8,FALSE)","v":"TS3L2_PCI_A"},"TS3L2_PCI_A","TS3L2_PCI_A","TS3L2_PCI_A","TS3L2_PCI_A","TS3L2_PCI_A",null,"PCI-3"]
[null,null,null,null,null,null,null,{"$f":"IF(L83=\"L4N33\",IF($M$98>1,\"ERRORE: SOLO UNA BOSS CARD PUO' ESSERE CONFIGURATA\",\"\"),\"\")","v":""},null,null,null,null,null,null,{"$f":"HLOOKUP($N$75,$P$76:$T$99,9,FALSE)","v":""},{"$f":"VLOOKUP(C83,TS3L4_PCI_A,12,FALSE)","v":""},{"$f":"VLOOKUP(C83,TS3L4_PCI_A,12,FALSE)","v":""},{"$f":"VLOOKUP(C83,TS3L4_PCI_A,12,FALSE)","v":""},{"$f":"VLOOKUP(C83,TS3L4_PCI_A,12,FALSE)","v":""},{"$f":"VLOOKUP(C83,TS3L4_PCI_A,12,FALSE)","v":""}]
[null,null,"PCI Slot 4 Processor 2 x16 PCIe Gen3 for FL/FH",{"$f":"IF($N$75=\"SW\",\"GPU Slot\",IF($N$75=\"DW\",\"GPU Slot\",\"\"))","v":""}]
[null,null,"",null,{"$f":"VLOOKUP($C86,TS3L4_ALL,13,FALSE)","v":""},{"$f":"VLOOKUP($C86,TS3L4_ALL,7,FALSE)","v":""},null,{"$f":"IFERROR(O87,\"ERRORE nella selezione del PCI Slot\")","v":""},null,{"$f":"VLOOKUP($C86,TS3L4_ALL,10,FALSE)","v":0},{"$f":"VLOOKUP($C86,TS3L4_ALL,11,FALSE)","v":0},{"$f":"VLOOKUP($C86,TS3L4_ALL,12,FALSE)","v":""},null,{"$f":"IF(L86=\"L4N56\",\"DW\",IF(L86=\"L4N57\",\"DW\",IF(L86=\"L4N108\",\"DW\",IF(L86=\"L4N55\",\"SW\",1))))","v":1},{"$f":"HLOOKUP($N$75,$P$76:$T$99,11,FALSE)","v":"-"},"-","TS3L2_PCI_B","TS3L2_PCI_I","TS3L2_PCI_F","TS3L2_PCI_H",null,"PCI-4"]
[null,null,null,null,null,null,null,{"$f":"IF(L86=\"L4N33\",IF($M$98>1,\"ERRORE: SOLO UNA BOSS CARD PUO' ESSERE CONFIGURATA\",\"\"),\"\")","v":""},null,null,null,null,null,null,{"$f":"HLOOKUP($N$75,$P$76:$T$99,12,FALSE)","v":""},{"$f":"VLOOKUP(C86,TS3L4_PCI_A,12,FALSE)","v":""},{"$f":"VLOOKUP(C86,TS3L4_PCI_B,12,FALSE)","v":""},{"$f":"VLOOKUP(C86,TS3L4_PCI_I,12,FALSE)","v":""},{"$f":"VLOOKUP(C86,TS3L4_PCI_F,12,FALSE)","v":""},{"$f":"VLOOKUP(C86,TS3L4_PCI_H,12,FALSE)","v":""}]
[null,null,"PCI Slot 5 Processor 2 x8 PCIe Gen3 for FL/FH",{"$f":"IF($N$75=\"SW\",\"GPU Slot\",\"\")","v":""}]
[null,null,"",null,{"$f":"VLOOKUP($C89,TS3L4_ALL,13,FALSE)","v":""},{"$f":"VLOOKUP($C89,TS3L4_ALL,7,FALSE)","v":""},null,{"$f":"IF(M89=\"Errore\",\"ERRORE nella selezione del PCI Slot\",IFERROR(O90,\"ERRORE nella selezione del PCI Slot\"))","v":""},null,{"$f":"VLOOKUP($C89,TS3L4_ALL,10,FALSE)","v":0},{"$f":"VLOOKUP($C89,TS3L4_ALL,11,FALSE)","v":0},{"$f":"VLOOKUP($C89,TS3L4_ALL,12,FALSE)","v":""},{"$f":"IF(F89=\"\",\"OK\",IF(N89+F89=2,\"Errore\",\"OK\"))","v":"OK"},{"$f":"IF(N86=\"dw\",1,0)","v":0},{"$f":"HLOOKUP($N$75,$P$76:$T$99,14,FALSE)","v":"-"},"-","TS3L2_PCI_A","TS3L2_PCI_I","TS3L2_PCI_A","TS3L2_PCI_L",null,"PCI-5"]
[null,null,null,null,null,null,null,{"$f":"IF(L89=\"L4N33\",IF($M$98>1,\"ERRORE: SOLO UNA BOSS CARD PUO' ESSERE CONFIGURATA\",\"\"),\"\")","v":""},null,null,null,null,null,null,{"$f":"HLOOKUP($N$75,$P$76:$T$99,15,FALSE)","v":""},{"$f":"VLOOKUP(C89,TS3L4_PCI_A,12,FALSE)","v":""},{"$f":"VLOOKUP(C89,TS3L4_PCI_A,12,FALSE)","v":""},{"$f":"VLOOKUP(C89,TS3L4_PCI_I,12,FALSE)","v":""},{"$f":"VLOOKUP(C89,TS3L4_PCI_A,12,FALSE)","v":""},{"$f":"VLOOKUP(C89,TS3L4_PCI_L,12,FALSE)","v":""}]
[null,null,"PCI Slot 6 Processor 1 x8 PCIe Gen3 for HL/LP"]
[null,null,"",null,{"$f":"IF($N$9=\"VxFlex\",\"TS3L4-MCX4DP-L\",VLOOKUP($C92,TS3L4_ALL,13,))","v":""},{"$f":"IF($N$9=\"VxFlex\",1,VLOOKUP($C92,TS3L4_ALL,7,FALSE))","v":""},null,{"$f":"IF(M92=\"Errore\",\"ERRORE nella selezione del PCI Slot\",IFERROR(O93,\"ERRORE nella selezione del PCI Slot\"))","v":""},null,{"$f":"VLOOKUP($C92,TS3L4_ALL,10,FALSE)","v":0},{"$f":"IF($N$9=\"VxFlex\",419,VLOOKUP($C92,TS3L4_ALL,11,FALSE))","v":0},{"$f":"IF($N$9=\"VxFlex\",\"L4N95\",VLOOKUP($C92,TS3L4_ALL,12,FALSE))","v":""},null,null,{"$f":"HLOOKUP($N$75,$P$76:$T$99,17,FALSE)","v":"TS3L2_PCI_C"},"TS3L2_PCI_C","TS3L2_PCI_C","TS3L2_PCI_C","TS3L2_PCI_C","TS3L2_PCI_C",null,"PCI-6"]
[null,null,null,null,null,null,null,null,null,null,null,null,null,null,{"$f":"HLOOKUP($N$75,$P$76:$T$99,18,FALSE)","v":""},{"$f":"VLOOKUP(C92,TS3L4_PCI_C,12,FALSE)","v":""},{"$f":"VLOOKUP(C92,TS3L4_PCI_C,12,FALSE)","v":""},{"$f":"VLOOKUP(C92,TS3L4_PCI_C,12,FALSE)","v":""},{"$f":"VLOOKUP(C92,TS3L4_PCI_C,12,FALSE)","v":""},{"$f":"VLOOKUP(C92,TS3L4_PCI_C,12,FALSE)","v":""}]
[null,null,"PCI Slot 7 Processor 2 x8 PCIe Gen3 for FL/FH",{"$f":"IF($N$75=\"SW\",\"GPU Slot\",\"\")","v":""}]
[null,null,"",null,{"$f":"VLOOKUP($C95,TS3L4_ALL,13,FALSE)","v":""},{"$f":"VLOOKUP($C95,TS3L4_ALL,7,FALSE)","v":""},null,{"$f":"IF(M95=\"Errore\",\"ERRORE nella selezione del PCI Slot\",IFERROR(O96,\"ERRORE nella selezione del PCI Slot\"))","v":""},null,{"$f":"VLOOKUP($C95,TS3L4_ALL,10,FALSE)","v":0},{"$f":"VLOOKUP($C95,TS3L4_ALL,11,FALSE)","v":0},{"$f":"VLOOKUP($C95,TS3L4_ALL,12,FALSE)","v":""},{"$f":"IF(F95=\"\",\"OK\",IF(N95+F95=2,\"Errore\",\"OK\"))","v":"OK"},{"$f":"IF(N98=\"dw\",1,0)","v":0},{"$f":"HLOOKUP($N$75,$P$76:$T$99,20,FALSE)","v":"-"},"-","TS3L2_PCI_A","TS3L2_PCI_I","TS3L2_PCI_A","TS3L2_PCI_L",null,"PCI-7"]
[null,null,null,null,null,null,null,{"$f":"IF(L95=\"L4N33\",IF($M$98>1,\"ERRORE: SOLO UNA BOSS CARD PUO' ESSERE CONFIGURATA\",\"\"),\"\")","v":""},null,null,null,null,null,null,{"$f":"HLOOKUP($N$75,$P$76:$T$99,21,FALSE)","v":""},{"$f":"VLOOKUP(C95,TS3L4_PCI_A,12,FALSE)","v":""},{"$f":"VLOOKUP(C95,TS3L4_PCI_A,12,FALSE)","v":""},{"$f":"VLOOKUP(C95,TS3L4_PCI_I,12,FALSE)","v":""},{"$f":"VLOOKUP(C95,TS3L4_PCI_A,12,FALSE)","v":""},{"$f":"VLOOKUP(C95,TS3L4_PCI_L,12,FALSE)","v":""}]
[null,null,"PCI Slot 8 Processor 2 x16 PCIe Gen3 for FL/FH",{"$f":"IF($N$75=\"SW\",\"GPU Slot\",IF($N$75=\"DW\",\"GPU Slot\",\"\"))","v":""},null,null,null,null,null,null,null,null,"boss card"]
[null,null,"",null,{"$f":"VLOOKUP($C98,TS3L4_ALL,13,FALSE)","v":""},{"$f":"VLOOKUP($C98,TS3L4_ALL,7,FALSE)","v":""},null,{"$f":"IF(M98=\"Errore\",\"ERRORE nella selezione del PCI Slot\",IFERROR(O99,\"ERRORE nella selezione del PCI Slot\"))","v":""},null,{"$f":"VLOOKUP($C98,TS3L4_ALL,10,FALSE)","v":0},{"$f":"VLOOKUP($C98,TS3L4_ALL,11,FALSE)","v":0},{"$f":"VLOOKUP($C98,TS3L4_ALL,12,FALSE)","v":""},{"$f":"COUNTIF(L77:L98,\"L4N33\")","v":0},{"$f":"IF(L98=\"L4N56\",\"DW\",IF(L98=\"L4N57\",\"DW\",IF(L98=\"L4N108\",\"DW\",IF(L98=\"L4N55\",\"SW\",1))))","v":1},{"$f":"HLOOKUP($N$75,$P$76:$T$99,23,FALSE)","v":"-"},"-","TS3L2_PCI_D","TS3L2_PCI_I","TS3L2_PCI_E","TS3L2_PCI_G",null,"PCI-8"]
[null,null,null,null,null,null,null,{"$f":"IF(L98=\"L4N33\",IF($M$98>1,\"ERRORE: SOLO UNA BOSS CARD PUO' ESSERE CONFIGURATA\",\"\"),\"\")","v":""},null,null,null,null,null,null,{"$f":"HLOOKUP($N$75,$P$76:$T$99,24,FALSE)","v":""},{"$f":"VLOOKUP(C98,TS3L4_PCI_A,12,FALSE)","v":""},{"$f":"VLOOKUP(C98,TS3L4_PCI_D,12,FALSE)","v":""},{"$f":"VLOOKUP(C98,TS3L4_PCI_I,12,FALSE)","v":""},{"$f":"VLOOKUP(C98,TS3L4_PCI_E,12,FALSE)","v":""},{"$f":"VLOOKUP(C98,TS3L4_PCI_G,12,FALSE)","v":""}]
[null,null,"SFP+ Transceivers"]
[null,null,"Transceiver, SFP+ SR Optic for SFP+ ports (Intel X710)",null,{"$f":"IF(K101>0,VLOOKUP($C101,ConfigurationTS3L4!$A$1:$M$4832,13,FALSE),\"\")","v":""},null,null,null,null,0,{"$f":"IF(F101>0,VLOOKUP($C101,TS3L4_ALL,11,FALSE)*(F101),0)","v":0},{"$f":"IF(F101>0,VLOOKUP($C101,TS3L4_ALL,12,FALSE),0)","v":0}]
[]
[null,null,"SFP+ Direct Attach Cables (Twinax)"]
[null,null,"Cable, SFP+ to SFP+, 10GbE, Copper Twinax Direct Attach Cable, 3 Meter",null,{"$f":"IF(K104>0,VLOOKUP($C104,ConfigurationTS3L4!$A$1:$M$4832,13,FALSE),\"\")","v":""},null,null,null,null,0,{"$f":"IF(F104>0,VLOOKUP($C104,TS3L4_ALL,11,FALSE)*F104,0)","v":0},{"$f":"IF(F104>0,VLOOKUP($C104,TS3L4_ALL,12,FALSE),0)","v":0}]
[]
[null,null,"QSFP28 Transceivers"]
[null,null,"Dell EMC PowerEdge QSFP28 SR4 100GbE 85C optic",null,{"$f":"IF(K107>0,VLOOKUP($C107,ConfigurationTS3L4!$A$1:$M$4832,13,FALSE),\"\")","v":""},null,null,null,null,0,{"$f":"IF(F107>0,VLOOKUP($C107,TS3L4_ALL,11,FALSE)*F107,0)","v":0},{"$f":"IF(F107>0,VLOOKUP($C107,TS3L4_ALL,12,FALSE),0)","v":0}]
[]
[null,null,"Mellanox LinkX 100Gb/s Passive Copper Cables"]
[null,null,"Mellanox LinkX 100Gb/s Passive Copper Cables - attacco cavo diretto - 3 m - nero",null,{"$f":"IF(K110>0,VLOOKUP($C110,ConfigurationTS3L4!$A$1:$M$4832,13,FALSE),\"\")","v":""},null,null,null,null,0,{"$f":"IF(F110>0,VLOOKUP($C110,TS3L4_ALL,11,FALSE)*F110,0)","v":0},{"$f":"IF(F110>0,VLOOKUP($C110,TS3L4_ALL,12,FALSE),0)","v":0}]
[]
[null,null,"Mellanox LinkX 100Gb/s VCSEL-Based Active Optical Cables - cavo InfiniBand - 10 m",null,{"$f":"IF(K112>0,VLOOKUP($C112,ConfigurationTS3L4!$A$1:$M$4832,13,FALSE),\"\")","v":""},null,null,null,null,0,{"$f":"IF(F112>0,VLOOKUP($C112,TS3L4_ALL,11,FALSE)*F112,0)","v":0},{"$f":"IF(F112>0,VLOOKUP($C112,TS3L4_ALL,12,FALSE),0)","v":0}]
[]
[null,null,"Cavi RJ45"]
[null,null,"Cavo “patch” di 3 mt RJ45 certificato per gigabit ethernet",null,{"$f":"IF(K115>0,VLOOKUP($C115,ConfigurationTS3L4!$A$1:$M$4832,13,FALSE),\"\")","v":"TS3L4-RJ453M"},5,null,null,null,0,{"$f":"IF(F115>0,VLOOKUP($C115,TS3L4_ALL,11,FALSE)*(F115),0)","v":15},{"$f":"IF(F115>0,VLOOKUP($C115,TS3L4_ALL,12,FALSE),0)","v":"L4N62"}]
[]
[null,null,"Cavi LC-LC"]
[null,null,"Dell Networking Cable, OM4 LC/LC Fiber Cable, 3 Meter",null,{"$f":"IF(K118>0,VLOOKUP($C118,ConfigurationTS3L4!$A$1:$M$4832,13,FALSE),\"\")","v":""},null,null,null,null,0,{"$f":"IF(F118>0,VLOOKUP($C118,TS3L4_ALL,11,FALSE)*(F118),0)","v":0},{"$f":"IF(F118>0,VLOOKUP($C118,TS3L4_ALL,12,FALSE),0)","v":0}]
[]
[null,null,"Cavi DAC"]
[null,null,"Dell Networking, Cable, SFP+ to SFP+, 10GbE, Copper Twinax Direct Attach Cable, 3 Meter",null,{"$f":"IF(K121>0,VLOOKUP($C121,ConfigurationTS3L4!$A$1:$M$4832,13,FALSE),\"\")","v":""},null,null,null,null,0,{"$f":"IF(F121>0,VLOOKUP($C121,TS3L4_ALL,11,FALSE)*(F121),0)","v":0},{"$f":"IF(F121>0,VLOOKUP($C121,TS3L4_ALL,12,FALSE),0)","v":0}]
[null,null,"Mellanox LinkX 100Gb/s Passive Copper DAC 3m per scheda TS3L4-CONX6DP",null,{"$f":"IF(K122>0,VLOOKUP($C122,ConfigurationTS3L4!$A$1:$M$4832,13,FALSE),\"\")","v":""},null,null,null,null,0,{"$f":"IF(F122>0,VLOOKUP($C122,TS3L4_ALL,11,FALSE)*(F122),0)","v":0},{"$f":"IF(F122>0,VLOOKUP($C122,TS3L4_ALL,12,FALSE),0)","v":0}]
[null,null,"Dell Cable SFP28 to SFP28 25GbE Passive Copper Twinax Direct Attach Cable 3 Meter ",null,{"$f":"IF(K123>0,VLOOKUP($C123,ConfigurationTS3L4!$A$1:$M$4832,13,FALSE),\"\")","v":""},null,null,null,null,0,{"$f":"IF(F123>0,VLOOKUP($C123,TS3L4_ALL,11,FALSE)*(F123),0)","v":0},{"$f":"IF(F123>0,VLOOKUP($C123,TS3L4_ALL,12,FALSE),0)","v":0}]
[null,null,null,null,null,null,null,null,null,null,null,null,null,null,{"$f":"IF($N$9=\"VxFlex\",ConfigurationTS3L4!$A$236,IF($N$98=\"DW\",ConfigurationTS3L4!$A$333,IF($N$75=\"1CPU\",ConfigurationTS3L4!$A$92:$A$93,ConfigurationTS3L4!$A$166:$A$181)))","v":{"$error":"#VALUE!"}}]
[null,null,"Cable Management Arm"]
[null,null,"No ",null,{"$f":"IF($N$9=\"VxFlex\",\"TS3L4-BZLSTD\",VLOOKUP($C126,TS3L4_ALL,13,))","v":""},{"$f":"IF($N$9=\"VxFlex\",1,VLOOKUP($C126,TS3L4_ALL,7,FALSE))","v":""},null,null,null,{"$f":"VLOOKUP($C126,TS3L4_ALL,10,FALSE)","v":0},{"$f":"IF($N$9=\"VxFlex\",42,VLOOKUP($C126,TS3L4_ALL,11,FALSE))","v":0},{"$f":"IF($N$9=\"VxFlex\",\"L4N69\",VLOOKUP($C126,TS3L4_ALL,12,FALSE))","v":""}]
[]
[null,null,"Bezel"]
[null,null,"No Bezel",null,{"$f":"IF($N$9=\"VxFlex\",\"TS3L4-BZLSTD\",VLOOKUP($C129,TS3L4_ALL,13,))","v":""},{"$f":"IF($N$9=\"VxFlex\",1,VLOOKUP($C129,TS3L4_ALL,7,FALSE))","v":""},null,null,null,{"$f":"VLOOKUP($C129,TS3L4_ALL,10,FALSE)","v":0},{"$f":"IF($N$9=\"VxFlex\",42,VLOOKUP($C129,TS3L4_ALL,11,FALSE))","v":0},{"$f":"IF($N$9=\"VxFlex\",\"L4N69\",VLOOKUP($C129,TS3L4_ALL,12,FALSE))","v":""}]
[]
[null,null,"Warranty",{"$f":"HYPERLINK(\"https://convenzioni.converge.it/docs/ts3_datasheet/TS3warranty.pdf\",\"i\")","v":"i"}]
[null,null,"Manutenzione in garanzia (36 mesi)",null,{"$f":"VLOOKUP($C132,TS3L4_WARRANTY,13,FALSE)","v":""},{"$f":"VLOOKUP($C132,TS3L4_WARRANTY,7,FALSE)","v":""},null,null,null,{"$f":"VLOOKUP($C132,TS3L4_WARRANTY,10,FALSE)","v":0},{"$f":"VLOOKUP($C132,TS3L4_WARRANTY,11,FALSE)","v":0},{"$f":"VLOOKUP($C132,TS3L4_ALL,12,FALSE)","v":""}]
[]
[null,null,"Hard Disk Retention",{"$f":"HYPERLINK(\"https://convenzioni.converge.it/docs/ts3_datasheet/DELL_HDD_KYHD.pdf\",\"i\")","v":"i"}]
[null,null,"",null,{"$f":"IFERROR(N135,VLOOKUP(C135,TS3L4_ALL,13,FALSE))","v":""},{"$f":"IF(C135=\"\",\"\",1)","v":""},null,null,null,{"$f":"IFERROR(O135,VLOOKUP(C135,TS3L4_ALL,10,FALSE))","v":0},{"$f":"IFERROR(P135,VLOOKUP(C135,TS3L4_ALL,11,FALSE))","v":0},{"$f":"IFERROR(Q135,VLOOKUP(C135,TS3L4_ALL,12,FALSE))","v":""},null,{"$f":"IF(F132+F135=2,VLOOKUP(\"Hard Disk Retention (60 mesi)\",TS3L4_ALL,13,FALSE),VLOOKUP(C135,TS3L4_ALL,13,FALSE))","v":{"$error":"#VALUE!"}},{"$f":"IF(F132+F135=2,VLOOKUP(\"Hard Disk Retention (60 mesi)\",TS3L4_ALL,10,FALSE),VLOOKUP(C135,TS3L4_ALL,10,FALSE))","v":{"$error":"#VALUE!"}},{"$f":"IF(F132+F135=2,VLOOKUP(\"Hard Disk Retention (60 mesi)\",TS3L4_ALL,11,FALSE),VLOOKUP(C135,TS3L4_ALL,11,FALSE))","v":{"$error":"#VALUE!"}},{"$f":"IF(F132+F135=2,VLOOKUP(\"Hard Disk Retention (60 mesi)\",TS3L4_ALL,12,FALSE),VLOOKUP(C135,TS3L4_ALL,12,FALSE))","v":{"$error":"#VALUE!"}}]
[]
[]
[null,null,"UPS"]
[null,null,"",null,{"$f":"VLOOKUP($C139,TS3L4_UPS,13,FALSE)","v":{"$error":"#NAME?"}},{"$f":"VLOOKUP($C139,TS3L4_UPS,7,FALSE)","v":{"$error":"#NAME?"}},null,null,null,{"$f":"VLOOKUP($C139,TS3L4_UPS,10,FALSE)","v":{"$error":"#NAME?"}},{"$f":"VLOOKUP($C139,TS3L4_UPS,11,FALSE)","v":{"$error":"#NAME?"}},{"$f":"VLOOKUP($C139,TS3L4_ALL,12,FALSE)","v":""}]
[]
[null,null,"Kit Graphical User Interface"]
[null,null,"",null,{"$f":"VLOOKUP($C142,TS3L4_GUI,13,FALSE)","v":{"$error":"#NAME?"}},{"$f":"VLOOKUP($C142,TS3L4_GUI,7,FALSE)","v":{"$error":"#NAME?"}},null,null,null,{"$f":"VLOOKUP($C142,TS3L4_GUI,10,FALSE)","v":{"$error":"#NAME?"}},{"$f":"VLOOKUP($C142,TS3L4_GUI,11,FALSE)","v":{"$error":"#NAME?"}},{"$f":"VLOOKUP($C142,TS3L4_ALL,12,FALSE)","v":""}]

{"sheet":"Lotto4_R740XD_3","index":2,"n_rows":142,"n_cols":24,"rows_kept":142,"cut":false,"hidden":false,"merged":[[7,3,8,3],[10,3,11,3],[16,3,17,3],[28,3,29,3],[11,7,14,7],[28,7,31,7],[31,2,32,2],[45,0,45,1],[46,0,46,1],[47,0,47,1],[48,0,48,1],[41,0,41,1],[42,0,42,1],[34,0,34,1],[38,0,38,1],[39,0,39,1],[40,0,40,1],[35,0,35,1],[36,0,36,1],[37,0,37,1],[130,3,131,3],[133,3,134,3],[67,3,68,3],[56,0,56,1],[64,3,65,3],[3,4,3,5],[61,7,62,7],[61,3,62,3],[43,0,43,1],[54,0,54,1],[53,0,53,1],[44,0,44,1],[50,0,50,1],[51,0,51,1],[61,0,62,1],[57,0,57,1],[55,0,55,1],[49,0,49,1],[52,0,52,1],[34,7,52,7],[29,0,29,1]]}
[null,null,null,null,"Convenzione",{"$f":"SUM(J9:J135)*F5","v":0}]
[null,null,null,null,0.2,{"$f":"SUM(K9:K135)*F5","v":0}]
[null,null,null,null,"Totale",{"$f":"SUM(F1:F2)","v":0}]
[null,null,null,null,{"$f":"IF(M98>1,\"ERRORE NELLA CONFIGURAZIONE\",\"\")","v":""},null,null,{"$f":"IF($E$12=\"TS3L4-VSAN\",\"vSAN Server Ready\",IF($E$12=\"TS3L4-GPUDW\",\"GPU Double-Wide Server Ready\",IF($E$12=\"TS3L4-GPUSW\",\"GPU Single-Wide Server Ready\",IF(N9=\"VxFlex\",\"VxFlex Server\",\"\"))))","v":""}]
[null,null,"POWEREDGE R740XD     Consulta la Guida alla Convenzione --->",{"$f":"HYPERLINK(\"https://convenzioni.converge.it/docs/L4GuidaAllaConvenzioneTecnologieServer3.pdf\",\"&\")","v":"&"},"Quantità Server",null,null,{"$f":"Riepilogo!G8","v":"Version 5.1"}]
[]
[]
[null,null,"Base",{"$f":"HYPERLINK(\"https://convenzioni.converge.it/docs/ts3_datasheet/dell-emc-poweredge-r740xd-spec-sheet.pdf\",\"i\")","v":"i"}]
[null,null,"PowerEdge R740XD Server (General Purpose)",null,{"$f":"IF($F$5>0,\"TS3L4-SRV-U\",\"\")","v":""},{"$f":"IF($F$5>0,1,\"\")","v":""},null,null,null,{"$f":"VLOOKUP($C9,TS3L4_ALL,10,FALSE)","v":2530},null,{"$f":"VLOOKUP($C9,TS3L4_ALL,12,FALSE)","v":"L4N01"},null,{"$f":"IF(C9=ConfigurationTS3L4!A14,\"VxFlex\",\"\")","v":""},null,{"$f":"IF(E12=\"TS3L4-GPUSW\",1,IF(E12=\"TS3L4-GPUDW\",1,\"\"))","v":""}]
[]
[null,null,"Chassis Configuration",{"$f":"HYPERLINK(\"https://dellservervr.dell.com/poweredge-r740/\",\"i\")","v":"i"},{"$f":"IF($N$75=\"SW\",\"MAX 4 GPU\",IF($N$75=\"DW\",\"MAX 2 GPU\",\"\"))","v":""}]
[null,null,{"$f":"VLOOKUP($C$9,TS3L4_Chassis,2,FALSE)","v":"Chassis with Up to 24 x 2.5 Hard Drives for 1CPU Configuration"},null,{"$f":"VLOOKUP($C$9,TS3L4_Chassis,13,FALSE)","v":""},{"$f":"VLOOKUP($C$9,TS3L4_Chassis,7,FALSE)","v":""},null,{"$f":"IF(E12=\"TS3L4-VSAN\",\"ATTENZIONE SELEZIONARE UNA COMPONENTE PER IL BOOT A SCELTA TRA ''ISDM Module'' \noppure \n''BOSS Controller Card''\",\"\")","v":""},null,{"$f":"VLOOKUP($C$9,TS3L4_Chassis,10,FALSE)","v":0},{"$f":"VLOOKUP($C9,TS3L4_Chassis,11,FALSE)","v":0},{"$f":"VLOOKUP($C9,TS3L4_Chassis,12,FALSE)","v":""},null,"Chassis with Up to 24 x 2.5'' Hard Drives for 2CPU Configuration",{"$f":"IF(C12=N12,1,0)","v":0}]
[]
[null,null,"Trusted Platform Module (TPM)"]
[null,null,"Trusted Platform Module 2.0"]
[]
[null,null,"Processor",{"$f":"HYPERLINK(\"https://ark.intel.com/content/www/it/it/ark/products/199345/intel-xeon-gold-6238r-processor-38-5m-cache-2-20-ghz.html\",\"i\")","v":"i"}]
[null,null,"Intel Xeon Gold 6238R 2.2G, 28C/56T, 10.4GT/s, 38.5 M Cache, Turbo, HT (165W)",null,{"$f":"IF(F12=1,VLOOKUP($C$18,TS3L4_CPU8core,13,FALSE),VLOOKUP($C$18,TS3L4_CPU8core,13,FALSE))","v":""},{"$f":"IF(F12=1,VLOOKUP($C$18,TS3L4_CPU8core,7,FALSE),VLOOKUP($C$18,TS3L4_CPU8core,7,FALSE))","v":0},null,null,null,{"$f":"IF(F12=1,VLOOKUP($C$18,TS3L4_CPU8core,10,FALSE),VLOOKUP($C$18,TS3L4_CPU8core,10,FALSE))","v":0},{"$f":"IF(F12=1,VLOOKUP($C$18,TS3L4_CPU8core,11,FALSE),VLOOKUP($C$18,TS3L4_CPU8core,11,FALSE))","v":0},{"$f":"IF(K18=0,0,VLOOKUP($C18,TS3L4_CPU8core,12,FALSE))","v":0}]
[]
[null,null,"Additional Processor"]
[null,null,"No Additional Processor",null,{"$f":"IF(F12=1,VLOOKUP($C$18,TS3L4_CPU,13,FALSE),VLOOKUP($C$21,TS3L4_CPU,13,FALSE))","v":""},{"$f":"IF(F12=1,VLOOKUP($C$18,TS3L4_CPU,7,FALSE),VLOOKUP($C$21,TS3L4_CPU,7,FALSE))","v":0},null,null,null,{"$f":"IF(F12=1,VLOOKUP($C$18,TS3L4_CPU,10,FALSE),VLOOKUP($C$21,TS3L4_CPU,10,FALSE))","v":0},{"$f":"IF(F12=1,VLOOKUP($C$18,TS3L4_CPU,11,FALSE),VLOOKUP($C$21,TS3L4_CPU,11,FALSE))","v":0},{"$f":"IF(F12=1,VLOOKUP(C18,TS3L4_ALL,12,FALSE),VLOOKUP($C21,TS3L4_CPU,12,FALSE))","v":""},null,{"$f":"IF(F12=1,\"Intel Xeon Gold 6238R 2.2G, 28C/56T, 10.4GT/s, 38.5 M Cache, Turbo, HT (165W)\",C21)","v":"No Additional Processor"}]
[null,null,null,null,{"$f":"IF(E21=\"TS3L4-CPU8CORE\",\"TS3L4-CPU\",\"\")","v":""},{"$f":"IFERROR(O22,\"\")","v":""},null,null,null,{"$f":"IFERROR(N22,0)","v":0},null,{"$f":"IF(E22=\"TS3L4-CPU\",\"L4N02\",0)","v":0},null,{"$f":"VLOOKUP($L$22,Tabella_prezzi!$A$3:$K$496,4,FALSE)","v":{"$error":"#N/A"}},{"$f":"VLOOKUP($L$22,Tabella_prezzi!$A$3:$K$496,7,FALSE)","v":{"$error":"#N/A"}}]
[null,null,"Memory Capacity"]
[null,null,"64GB",null,{"$f":"IFERROR(N24,\"TS3L4-RAM64\")","v":""},{"$f":"IFERROR(O24,IF($N$9=\"VxFlex\",5,1))","v":0},null,null,null,{"$f":"IFERROR(P24,444)","v":0},null,{"$f":"IFERROR(Q24,\"L4N04\")","v":""},null,{"$f":"IF($F$21=1,VLOOKUP($C$24,TS3L4_RAM2CPU,13,FALSE),VLOOKUP($C$24,TS3L4_RAM1CPU,13,FALSE))","v":""},{"$f":"IF($F$21=1,VLOOKUP($C$24,TS3L4_RAM2CPU,7,FALSE),VLOOKUP($C$24,TS3L4_RAM1CPU,7,FALSE))","v":0},{"$f":"IF($F$21=1,VLOOKUP($C$24,TS3L4_RAM2CPU,10,FALSE),VLOOKUP($C$24,TS3L4_RAM1CPU,10,FALSE))","v":0},{"$f":"IF($F$21=1,VLOOKUP($C$24,TS3L4_RAM2CPU,12,FALSE),VLOOKUP($C$24,TS3L4_RAM1CPU,12,FALSE))","v":""},null,"384GB",{"$f":"IF(N9=\"VxFlex\",0,1)","v":1},{"$f":"IF(N9=\"VxFlex\",VLOOKUP(C24,ConfigurationTS3L4!A60:A63,1,FALSE),\"192GB\")","v":"192GB"},{"$f":"IFERROR(U24,1)","v":"192GB"},{"$f":"IF(C24=\"64GB\",1,0)","v":1},{"$f":"W24*F12","v":{"$error":"#VALUE!"}}]
[]
[null,null,"Operating System"]
[null,null,"No Operating System",null,{"$f":"VLOOKUP($C$27,TS3L4_OS,13,FALSE)","v":""},{"$f":"VLOOKUP($C$27,TS3L4_OS,7,FALSE)","v":0},null,null,null,{"$f":"VLOOKUP($C$27,TS3L4_OS,10,FALSE)","v":0},{"$f":"VLOOKUP($C$27,TS3L4_OS,11,FALSE)","v":0},{"$f":"VLOOKUP($C27,TS3L4_ALL,12,FALSE)","v":""}]
[null,null,null,null,{"$f":"IF($F$27+$F$18=2,\"\",IF($F$18+$F$21+$F$27=2,VLOOKUP($C$27,TS3L4_OS,23,FALSE),VLOOKUP($C$27,TS3L4_OS,23,FALSE)))","v":""},{"$f":"IF($F$27+$F$18=2,0,IF($F$18+$F$21+$F$27=2,VLOOKUP($C$27,TS3L4_OS,14,FALSE),VLOOKUP($C$27,TS3L4_OS,19,FALSE)))","v":0},null,null,null,{"$f":"IF($F$27+$F$18=2,0,IF($F$18+$F$21+$F$27=2,VLOOKUP($C$27,TS3L4_OS,17,FALSE),VLOOKUP($C$27,TS3L4_OS,21,FALSE)))","v":0},{"$f":"IF($F$27+$F$18=2,0,IF($F$18+$F$21+$F$27=2,VLOOKUP($C$27,TS3L4_OS,18,FALSE),VLOOKUP($C$27,TS3L4_OS,22,FALSE)))","v":0},{"$f":"IF($F$27+$F$18=2,0,IF($F$18+$F$21+$F$27=2,VLOOKUP($C$27,TS3L4_OS,20,FALSE),VLOOKUP($C$27,TS3L4_OS,20,FALSE)))","v":0}]
[null,null,"Disk Controller",{"$f":"IF(L30=\"\",HYPERLINK(\"https://convenzioni.converge.it/docs/ts3_datasheet/dellemc-poweredge-raid-controller-h740p.pdf\",\"i\"),HYPERLINK(\"https://convenzioni.converge.it/docs/ts3_datasheet/dellemc-poweredge-hba330.pdf\",\"i\"))","v":"i"},null,null,null,{"$f":"IF(F30=1,\"Selezionando questo controller in una soluzione vSAN, per il boot si deve utilizzare la componentete 'ISDM Module'' \noppure \n''BOSS Controller Card''\",\"\")","v":""}]
[{"$f":"IF($E$12=\"TS3L4-VSAN\",\"vSAN HCL\",\"\")","v":""},null,"PERC H740P RAID Controller, 8GB NV Cache",null,{"$f":"IF(C12=\"Chassis with Up to 24 x 2.5'' Hard Drives for 2CPU Configuration\",\"TS3L4-HBA330-L\",IF(N9=\"VxFlex\",\"TS3L4-HBA330-L\",VLOOKUP($C30,TS3L4_CRTL,13,FALSE)))","v":""},{"$f":"IF(C12=\"Chassis with Up to 24 x 2.5'' Hard Drives for 2CPU Configuration\",\"1\",IF(N9=\"VxFlex\",\"1\",VLOOKUP($C30,TS3L4_CRTL,7,FALSE)))","v":""},null,null,null,{"$f":"IF(C30=ConfigurationTS3L4!A48,0,VLOOKUP($C30,TS3L4_CRTL,10,FALSE))","v":0},{"$f":"IF(C12=\"Chassis with Up to 24 x 2.5'' Hard Drives for 2CPU Configuration\",180,IF(N9=\"VxFlex\",180,IF(H4=\"\",0,VLOOKUP($C30,TS3L4_CRTL,11,FALSE))))","v":0},{"$f":"IF(C12=\"Chassis with Up to 24 x 2.5'' Hard Drives for 2CPU Configuration\",\"L4N34\",IF(N9=\"VxFlex\",\"L4N34\",IF(H4=\"\",\"\",VLOOKUP($C30,TS3L4_ALL,12,FALSE))))","v":""},null,{"$f":"IF(E30=\"TS3L4-HBA330-L\",1,0)","v":0},{"$f":"IF(C30=\"PERC H740P RAID Controller, 8GB NV Cache\",1,0)","v":1},{"$f":"IF(Q30=1,Q30*N30,O30*N30)","v":0},{"$f":"IF(H4=\"\",1,0)","v":1}]
[]
[null,null,"Hard Drivers Bays disponibili n° 24",null,"Usati","Disponibili",null,null,null,null,null,null,{"$f":"IF(C12=\"Chassis with Up to 24 x 2.5'' Hard Drives for 2CPU Configuration\",ConfigurationTS3L4!$A$110,IF($H$4=\"\",ConfigurationTS3L4!$A$109,ConfigurationTS3L4!$A$109:$A$110))","v":"PERC H740P RAID Controller, 8GB NV Cache"}]
[null,null,null,null,{"$f":"F35+F37+F39+F45+F47+F49+F51+F57+F41+F43+F53","v":2},{"$f":"24-E33","v":22}]
[null,null,null,null,null,null,null,"Configurazione RAID e/o NOTE"]
[{"$f":"IF($E$12=\"TS3L4-VSAN\",\"vSAN HCL\",\"\")","v":""},null,{"$f":"ConfigurationTS3L4!A73","v":"300GB 15K RPM SAS 12Gbps 2.5in Hot-plug"},null,{"$f":"VLOOKUP($C35,TS3L4_HDD,13,FALSE)","v":"TS3L4-HDD300GB"},null,null,"Specificare la configurazione RAID per l'installazione del Sistema Operativo, se richiesto.\ne/o\ninserire eventuali note.",null,{"$f":"VLOOKUP($C35,TS3L4_HDD,10,FALSE)*F35","v":0},{"$f":"VLOOKUP($C35,TS3L4_HDD,11,FALSE)","v":0},{"$f":"VLOOKUP($C35,TS3L4_ALL,12,FALSE)","v":"L4N12"}]
[]
[{"$f":"IF($E$12=\"TS3L4-VSAN\",\"vSAN HCL\",\"\")","v":""},null,{"$f":"ConfigurationTS3L4!A74","v":"1.2TB 10K RPM SAS 12Gbps 2.5in Hot-plug"},null,{"$f":"VLOOKUP($C37,TS3L4_HDD,13,FALSE)","v":"TS3L4-HDD1TB"},null,null,null,null,{"$f":"VLOOKUP($C37,TS3L4_HDD,10,FALSE)*F37","v":0},{"$f":"VLOOKUP($C37,TS3L4_HDD,11,FALSE)","v":0},{"$f":"VLOOKUP($C37,TS3L4_ALL,12,FALSE)","v":"L4N11"}]
[]
[{"$f":"IF($E$12=\"TS3L4-VSAN\",\"vSAN HCL\",\"\")","v":""},null,{"$f":"ConfigurationTS3L4!A75","v":"2.4TB 10K RPM SAS 12Gbps 2.5in Hot-plug"},null,{"$f":"VLOOKUP($C39,TS3L4_HDD,13,FALSE)","v":"TS3L4-HDD2TB"},null,null,null,null,{"$f":"VLOOKUP($C39,TS3L4_HDD,10,FALSE)*F39","v":0},{"$f":"VLOOKUP($C39,TS3L4_HDD,11,FALSE)","v":0},{"$f":"VLOOKUP($C39,TS3L4_ALL,12,FALSE)","v":"L4N10"}]
[]
[{"$f":"IF($E$12=\"TS3L4-VSAN\",\"vSAN HCL\",\"\")","v":""},null,{"$f":"ConfigurationTS3L4!A76","v":"960GB SSD SAS Read Intensive 12Gbps 2.5in Hot-plug"},null,{"$f":"VLOOKUP($C41,TS3L4_HDD,13,FALSE)","v":"TS3L4-RI800GB"},2,null,null,null,{"$f":"IF(F41>2,(VLOOKUP($C41,TS3L4_HDD,10,FALSE)*(F41-2)),0)","v":0},{"$f":"VLOOKUP($C41,TS3L4_HDD,11,FALSE)","v":0},{"$f":"VLOOKUP($C41,TS3L4_ALL,12,FALSE)","v":"L4N15"}]
[]
[{"$f":"IF($E$12=\"TS3L4-VSAN\",\"vSAN HCL\",\"\")","v":""},null,{"$f":"ConfigurationTS3L4!A77","v":"1.92TB SSD SAS Read Intensive 12Gbps 2.5in Hot-plug"},null,{"$f":"VLOOKUP($C43,TS3L4_HDD,13,FALSE)","v":"TS3L4-RI1600GB"},null,null,null,null,{"$f":"VLOOKUP($C43,TS3L4_HDD,10,FALSE)*F43","v":0},{"$f":"VLOOKUP($C43,TS3L4_HDD,11,FALSE)","v":0},{"$f":"VLOOKUP($C43,TS3L4_ALL,12,FALSE)","v":"L4N13"}]
[]
[{"$f":"IF($E$12=\"TS3L4-VSAN\",\"vSAN HCL\",\"\")","v":""},null,{"$f":"ConfigurationTS3L4!A78","v":"3.84TB SSD SAS Read Intensive 12Gbps 2.5in Hot-plug"},null,{"$f":"VLOOKUP($C45,TS3L4_HDD,13,FALSE)","v":"TS3L4-RI3840GB"},null,null,null,null,{"$f":"VLOOKUP($C45,TS3L4_HDD,10,FALSE)*F45","v":0},{"$f":"VLOOKUP($C45,TS3L4_HDD,11,FALSE)*F45","v":0},{"$f":"VLOOKUP($C45,TS3L4_ALL,12,FALSE)","v":"L4N51"}]
[]
[{"$f":"IF($E$12=\"TS3L4-VSAN\",\"vSAN HCL\",\"\")","v":""},null,{"$f":"ConfigurationTS3L4!A79","v":"7.68TB SSD SAS Read Intensive 12Gbps 2.5in Hot-plug"},null,{"$f":"VLOOKUP($C47,TS3L4_HDD,13,FALSE)","v":"TS3L4-RI7680GB"},null,null,null,null,{"$f":"VLOOKUP($C47,TS3L4_HDD,10,FALSE)*F47","v":0},{"$f":"VLOOKUP($C47,TS3L4_HDD,11,FALSE)*F47","v":0},{"$f":"VLOOKUP($C47,TS3L4_ALL,12,FALSE)","v":"L4N52"}]
[]
[{"$f":"IF($E$12=\"TS3L4-VSAN\",\"vSAN HCL\",\"\")","v":""},null,{"$f":"ConfigurationTS3L4!A80","v":"960GB SSD SAS Mixed Use 12Gbps 512e 2.5in Hot-Plug"},null,{"$f":"VLOOKUP($C49,TS3L4_HDD,13,FALSE)","v":"TS3L4-MU800GB"},null,null,null,null,{"$f":"VLOOKUP($C49,TS3L4_HDD,10,FALSE)*F49","v":0},{"$f":"VLOOKUP($C49,TS3L4_HDD,11,FALSE)","v":0},{"$f":"VLOOKUP($C49,TS3L4_ALL,12,FALSE)","v":"L4N16"}]
[]
[{"$f":"IF($E$12=\"TS3L4-VSAN\",\"vSAN HCL\",\"\")","v":""},null,{"$f":"ConfigurationTS3L4!A81","v":"1.6TB SSD SAS Mix Use 12Gbps 2.5in Hot-plug"},null,{"$f":"VLOOKUP($C51,TS3L4_HDD,13,FALSE)","v":"TS3L4-MU1600GB"},null,null,null,null,{"$f":"VLOOKUP($C51,TS3L4_HDD,10,FALSE)*F51","v":0},{"$f":"VLOOKUP($C51,TS3L4_HDD,11,FALSE)","v":0},{"$f":"VLOOKUP($C51,TS3L4_ALL,12,FALSE)","v":"L4N14"}]
[]
[{"$f":"IF($E$12=\"TS3L4-VSAN\",\"vSAN HCL\",\"\")","v":""},null,{"$f":"ConfigurationTS3L4!A82","v":"800GB SSD SAS Write Intensive 12Gbps 2.5in Hot Plug "},null,{"$f":"VLOOKUP($C53,TS3L4_HDD,13,FALSE)","v":"TS3L4-WI800GB"},null,null,null,null,{"$f":"VLOOKUP($C53,TS3L4_HDD,10,FALSE)*F53","v":0},{"$f":"VLOOKUP($C53,TS3L4_HDD,11,FALSE)*F53","v":0},{"$f":"VLOOKUP($C53,TS3L4_ALL,12,FALSE)","v":"L4N53"}]
[]
[null,null,{"$f":"ConfigurationTS3L4!A83","v":"1.6TB SSD SAS Write Intensive 12Gbps 2.5in Hot Plug"},null,{"$f":"VLOOKUP($C55,TS3L4_HDD,13,FALSE)","v":"TS3L4-WI1600GB"},null,null,null,null,{"$f":"IF(F55>2,VLOOKUP($C55,TS3L4_HDD,10,FALSE)*(F55-2),0)","v":0},{"$f":"VLOOKUP($C55,TS3L4_HDD,11,FALSE)*F55","v":0},{"$f":"VLOOKUP($C55,TS3L4_ALL,12,FALSE)","v":"L4N54"}]
[]
[{"$f":"IF($E$12=\"TS3L4-VSAN\",\"vSAN HCL\",\"\")","v":""},null,"480GB SSD SAS Read Intensive 12Gbps 2.5in Hot-plug"]
[]
[null,null,"ISDM Module"]
[null,null,"No ISDM",null,{"$f":"IF(K60>0,VLOOKUP($C60,TS3L4_ISDM,13,FALSE),\"\")","v":""},{"$f":"VLOOKUP($C60,TS3L4_ISDM,7,FALSE)","v":""},null,null,null,{"$f":"VLOOKUP($C60,TS3L4_ISDM,10,FALSE)","v":0},{"$f":"VLOOKUP($C60,TS3L4_ISDM,11,FALSE)","v":0},{"$f":"VLOOKUP($C60,TS3L4_ALL,12,FALSE)","v":""}]
[]
[{"$f":"IF(H62=\"\",\"\",M63)","v":""},null,"Power Supply",{"$f":"IF(H62=\"\",\"\",M63)","v":""},null,null,null,{"$f":"IF(E63=\"TS3L4-PSU2000W\",\"Verificare, per ogni Server, la disponibilità di 2 prese C19 sulle PDU\",\"\")","v":""}]
[null,null,{"$f":"IF(O12=1,\"Dual, Hot-plug Power Supply (1+1), 1100W\",IF($E$12=\"TS3L4-GPUDW\",\"Dual, Hot-plug Power Supply (1+1), 2000W\",IF($E$12=\"TS3L4-GPUSW\",\"Dual, Hot-plug Power Supply (1+1), 2000W\",\"Dual, Hot-plug, Redundant Power Supply (1+1), 750W\")))","v":"Dual, Hot-plug, Redundant Power Supply (1+1), 750W"},null,{"$f":"VLOOKUP($C63,TS3L4_PSU,13,FALSE)","v":""},{"$f":"VLOOKUP($C63,TS3L4_PSU,7,FALSE)","v":""},null,null,null,{"$f":"VLOOKUP($C63,TS3L4_PSU,10,FALSE)","v":0},{"$f":"VLOOKUP($C63,TS3L4_PSU,11,FALSE)","v":0},{"$f":"VLOOKUP($C63,TS3L4_ALL,12,FALSE)","v":""},"⚠",{"$f":"IF(H62=\"\",ConfigurationTS3L4!A526,ConfigurationTS3L4!A527)","v":"_C14C13"}]
[]
[null,null,"Embedded Systems Management",{"$f":"HYPERLINK(\"https://convenzioni.converge.it/docs/ts3_datasheet/idrac-spec-sheet.pdf\",\"i\")","v":"i"}]
[null,null,"iDRAC9,Enterprise"]
[]
[null,null,"Infrastructure Management Console",{"$f":"HYPERLINK(\"https://www.dell.com/support/kbdoc/en-it/000175879/support-for-openmanage-enterprise#OME-Resources\",\"i\")","v":"i"}]
[null,null,"No OMEA",null,{"$f":"IF(N9=\"VxFlex\",\"TS3L4-OMEA\",VLOOKUP($C69,TS3L4_ALL,13,FALSE))","v":""},{"$f":"IF(N9=\"VxFlex\",1,VLOOKUP($C69,TS3L4_ALL,7,FALSE))","v":""},null,null,null,{"$f":"VLOOKUP($C69,TS3L4_ALL,10,FALSE)","v":0},{"$f":"IF(N9=\"VxFlex\",214,VLOOKUP($C69,TS3L4_ALL,11,FALSE))","v":0},{"$f":"IF(N9=\"VxFlex\",\"L4N96\",VLOOKUP($C69,TS3L4_ALL,12,FALSE))","v":""}]
[]
[null,null,"Network Cards"]
[null,null,"Broadcom 5720 QP 1Gb Network Daughter Card"]
[]
[]
[null,null,null,null,null,null,null,null,null,null,null,null,{"$f":"IF($E$12=\"TS3L4-GPUDW\",\"1\",IF($E$12=\"TS3L4-GPUSW\",\"20\",IF($F$21=1,\"300\",\"4000\")))","v":"4000"},{"$f":"IF($E$12=\"TS3L4-GPUDW\",\"DW\",IF($E$12=\"TS3L4-GPUSW\",\"SW\",IF($E$12=\"TS3L4-PWRFLEX\",\"PX\",IF($F$21=1,\"2CPU\",\"1CPU\"))))","v":"1CPU"}]
[null,null,"PCI Slot 1 Processor 1 x8 PCIe Gen3 for FL/FH",null,null,null,null,null,null,null,null,null,null,{"$f":"IF(N75=\"DW\",\"DW\",IF(N75=\"SW\",\"SW\",0))","v":0},"Selected","1CPU","2CPU","PX","DW","SW"]
[null,null,"",null,{"$f":"IF($N$9=\"VxFlex\",\"TS3L4-MCX4DP\",VLOOKUP($C77,TS3L4_ALL,13,))","v":""},{"$f":"IF($N$9=\"VxFlex\",1,VLOOKUP($C77,TS3L4_ALL,7,FALSE))","v":""},null,{"$f":"IF(M77=\"Errore\",\"ERRORE nella selezione del PCI Slot\",IFERROR(O78,\"ERRORE nella selezione del PCI Slot\"))","v":""},null,{"$f":"VLOOKUP($C77,TS3L4_ALL,10,FALSE)","v":0},{"$f":"IF($N$9=\"VxFlex\",419,VLOOKUP($C77,TS3L4_ALL,11,FALSE))","v":0},{"$f":"IF($N$9=\"VxFlex\",\"L4N94\",VLOOKUP($C77,TS3L4_ALL,12,FALSE))","v":""},null,{"$f":"IF(L77=\"L4N56\",\"DW\",IF(L77=\"L4N57\",\"DW\",IF(L77=\"L4N58\",\"DW\",IF(L77=\"L4N55\",\"SW\",\"CPU\"))))","v":"CPU"},{"$f":"HLOOKUP($N$75,$P$76:$T$99,2,FALSE)","v":"TS3L2_PCI_A"},"TS3L2_PCI_A","TS3L2_PCI_A","TS3L2_PCI_A","TS3L2_PCI_A","TS3L2_PCI_A",null,"PCI-1",{"$f":"IF($N$75=\"SW\",ConfigurationTS3L4!$A$290:$A$309,IF($N$75=\"DW\",ConfigurationTS3L4!$A$239:$A$262,ConfigurationTS3L4!$A$166:$A$181))","v":{"$error":"#VALUE!"}}]
[null,null,null,null,null,null,null,null,null,null,null,null,null,null,{"$f":"HLOOKUP($N$75,$P$76:$T$99,3,FALSE)","v":""},{"$f":"VLOOKUP(C77,TS3L4_PCI_A,12,FALSE)","v":""},{"$f":"VLOOKUP(C77,TS3L4_PCI_A,12,FALSE)","v":""},{"$f":"VLOOKUP(C77,TS3L4_PCI_A,12,FALSE)","v":""},{"$f":"VLOOKUP(C77,TS3L4_PCI_A,12,FALSE)","v":""},{"$f":"VLOOKUP(C77,TS3L4_PCI_A,12,FALSE)","v":""}]
[null,null,"PCI Slot 2 Processor 1 x8 PCIe Gen3 for FL/FH"]
[null,null,"",null,{"$f":"VLOOKUP($C80,TS3L4_ALL,13,FALSE)","v":""},{"$f":"VLOOKUP($C80,TS3L4_ALL,7,FALSE)","v":""},null,{"$f":"IFERROR(O81,\"ERRORE nella selezione del PCI Slot\")","v":""},null,{"$f":"VLOOKUP($C80,TS3L4_ALL,10,FALSE)","v":0},{"$f":"VLOOKUP($C80,TS3L4_ALL,11,FALSE)","v":0},{"$f":"VLOOKUP($C80,TS3L4_ALL,12,FALSE)","v":""},{"$f":"IF(F80=\"\",\"OK\",IF(N80+F80=2,\"Errore\",\"OK\"))","v":"OK"},{"$f":"IF(N77=\"dw\",1,0)","v":0},{"$f":"HLOOKUP($N$75,$P$76:$T$99,5,FALSE)","v":"TS3L2_PCI_A"},"TS3L2_PCI_A","TS3L2_PCI_A","TS3L2_PCI_A","TS3L2_PCI_A","TS3L2_PCI_A",null,"PCI-2"]
[null,null,null,null,null,null,null,null,null,null,null,null,null,null,{"$f":"HLOOKUP($N$75,$P$76:$T$99,6,FALSE)","v":""},{"$f":"VLOOKUP(C80,TS3L4_PCI_A,12,FALSE)","v":""},{"$f":"VLOOKUP(C80,TS3L4_PCI_A,12,FALSE)","v":""},{"$f":"VLOOKUP(C80,TS3L4_PCI_A,12,FALSE)","v":""},{"$f":"VLOOKUP(C80,TS3L4_PCI_A,12,FALSE)","v":""},{"$f":"VLOOKUP(C80,TS3L4_PCI_A,12,FALSE)","v":""}]
[null,null,"PCI Slot 3 Processor 1 x8 PCIe Gen3 for HL/FH"]
[null,null,"",null,{"$f":"IF($N$9=\"VxFlex\",\"TS3L4-BOSS480\",VLOOKUP($C83,TS3L4_ALL,13,))","v":""},{"$f":"IF($N$9=\"VxFlex\",1,VLOOKUP($C83,TS3L4_ALL,7,FALSE))","v":""},null,{"$f":"IFERROR(O84,\"ERRORE nella selezione del PCI Slot\")","v":""},null,{"$f":"VLOOKUP($C83,TS3L4_ALL,10,FALSE)","v":0},{"$f":"IF($N$9=\"VxFlex\",748,VLOOKUP($C83,TS3L4_ALL,11,FALSE))","v":0},{"$f":"IF($N$9=\"VxFlex\",\"L4N33\",VLOOKUP($C83,TS3L4_ALL,12,FALSE))","v":""},null,null,{"$f":"HLOOKUP($N$75,$P$76:$T$99,8,FALSE)","v":"TS3L2_PCI_A"},"TS3L2_PCI_A","TS3L2_PCI_A","TS3L2_PCI_A","TS3L2_PCI_A","TS3L2_PCI_A",null,"PCI-3"]
[null,null,null,null,null,null,null,null,null,null,null,null,null,null,{"$f":"HLOOKUP($N$75,$P$76:$T$99,9,FALSE)","v":""},{"$f":"VLOOKUP(C83,TS3L4_PCI_A,12,FALSE)","v":""},{"$f":"VLOOKUP(C83,TS3L4_PCI_A,12,FALSE)","v":""},{"$f":"VLOOKUP(C83,TS3L4_PCI_A,12,FALSE)","v":""},{"$f":"VLOOKUP(C83,TS3L4_PCI_A,12,FALSE)","v":""},{"$f":"VLOOKUP(C83,TS3L4_PCI_A,12,FALSE)","v":""}]
[null,null,"PCI Slot 4 Processor 2 x16 PCIe Gen3 for FL/FH",{"$f":"IF($N$75=\"SW\",\"GPU Slot\",IF($N$75=\"DW\",\"GPU Slot\",\"\"))","v":""}]
[null,null,"",null,{"$f":"VLOOKUP($C86,TS3L4_ALL,13,FALSE)","v":""},{"$f":"VLOOKUP($C86,TS3L4_ALL,7,FALSE)","v":""},null,{"$f":"IFERROR(O87,\"ERRORE nella selezione del PCI Slot\")","v":""},null,{"$f":"VLOOKUP($C86,TS3L4_ALL,10,FALSE)","v":0},{"$f":"VLOOKUP($C86,TS3L4_ALL,11,FALSE)","v":0},{"$f":"VLOOKUP($C86,TS3L4_ALL,12,FALSE)","v":""},null,{"$f":"IF(L86=\"L4N56\",\"DW\",IF(L86=\"L4N57\",\"DW\",IF(L86=\"L4N108\",\"DW\",IF(L86=\"L4N55\",\"SW\",1))))","v":1},{"$f":"HLOOKUP($N$75,$P$76:$T$99,11,FALSE)","v":"-"},"-","TS3L2_PCI_B","TS3L2_PCI_I","TS3L2_PCI_F","TS3L2_PCI_H",null,"PCI-4"]
[null,null,null,null,null,null,null,null,null,null,null,null,null,null,{"$f":"HLOOKUP($N$75,$P$76:$T$99,12,FALSE)","v":""},{"$f":"VLOOKUP(C86,TS3L4_PCI_A,12,FALSE)","v":""},{"$f":"VLOOKUP(C86,TS3L4_PCI_B,12,FALSE)","v":""},{"$f":"VLOOKUP(C86,TS3L4_PCI_I,12,FALSE)","v":""},{"$f":"VLOOKUP(C86,TS3L4_PCI_F,12,FALSE)","v":""},{"$f":"VLOOKUP(C86,TS3L4_PCI_H,12,FALSE)","v":""}]
[null,null,"PCI Slot 5 Processor 2 x8 PCIe Gen3 for FL/FH",{"$f":"IF($N$75=\"SW\",\"GPU Slot\",\"\")","v":""}]
[null,null,"",null,{"$f":"VLOOKUP($C89,TS3L4_ALL,13,FALSE)","v":""},{"$f":"VLOOKUP($C89,TS3L4_ALL,7,FALSE)","v":""},null,{"$f":"IF(M89=\"Errore\",\"ERRORE nella selezione del PCI Slot\",IFERROR(O90,\"ERRORE nella selezione del PCI Slot\"))","v":""},null,{"$f":"VLOOKUP($C89,TS3L4_ALL,10,FALSE)","v":0},{"$f":"VLOOKUP($C89,TS3L4_ALL,11,FALSE)","v":0},{"$f":"VLOOKUP($C89,TS3L4_ALL,12,FALSE)","v":""},{"$f":"IF(F89=\"\",\"OK\",IF(N89+F89=2,\"Errore\",\"OK\"))","v":"OK"},{"$f":"IF(N86=\"dw\",1,0)","v":0},{"$f":"HLOOKUP($N$75,$P$76:$T$99,14,FALSE)","v":"-"},"-","TS3L2_PCI_A","TS3L2_PCI_I","TS3L2_PCI_A","TS3L2_PCI_L",null,"PCI-5"]
[null,null,null,null,null,null,null,null,null,null,null,null,null,null,{"$f":"HLOOKUP($N$75,$P$76:$T$99,15,FALSE)","v":""},{"$f":"VLOOKUP(C89,TS3L4_PCI_A,12,FALSE)","v":""},{"$f":"VLOOKUP(C89,TS3L4_PCI_A,12,FALSE)","v":""},{"$f":"VLOOKUP(C89,TS3L4_PCI_I,12,FALSE)","v":""},{"$f":"VLOOKUP(C89,TS3L4_PCI_A,12,FALSE)","v":""},{"$f":"VLOOKUP(C89,TS3L4_PCI_L,12,FALSE)","v":""}]
[null,null,"PCI Slot 6 Processor 1 x8 PCIe Gen3 for HL/LP"]
[null,null,"",null,{"$f":"IF($N$9=\"VxFlex\",\"TS3L4-MCX4DP-L\",VLOOKUP($C92,TS3L4_ALL,13,))","v":""},{"$f":"IF($N$9=\"VxFlex\",1,VLOOKUP($C92,TS3L4_ALL,7,FALSE))","v":""},null,{"$f":"IF(M92=\"Errore\",\"ERRORE nella selezione del PCI Slot\",IFERROR(O93,\"ERRORE nella selezione del PCI Slot\"))","v":""},null,{"$f":"VLOOKUP($C92,TS3L4_ALL,10,FALSE)","v":0},{"$f":"IF($N$9=\"VxFlex\",419,VLOOKUP($C92,TS3L4_ALL,11,FALSE))","v":0},{"$f":"IF($N$9=\"VxFlex\",\"L4N95\",VLOOKUP($C92,TS3L4_ALL,12,FALSE))","v":""},null,null,{"$f":"HLOOKUP($N$75,$P$76:$T$99,17,FALSE)","v":"TS3L2_PCI_C"},"TS3L2_PCI_C","TS3L2_PCI_C","TS3L2_PCI_C","TS3L2_PCI_C","TS3L2_PCI_C",null,"PCI-6"]
[null,null,null,null,null,null,null,null,null,null,null,null,null,null,{"$f":"HLOOKUP($N$75,$P$76:$T$99,18,FALSE)","v":""},{"$f":"VLOOKUP(C92,TS3L4_PCI_C,12,FALSE)","v":""},{"$f":"VLOOKUP(C92,TS3L4_PCI_C,12,FALSE)","v":""},{"$f":"VLOOKUP(C92,TS3L4_PCI_C,12,FALSE)","v":""},{"$f":"VLOOKUP(C92,TS3L4_PCI_C,12,FALSE)","v":""},{"$f":"VLOOKUP(C92,TS3L4_PCI_C,12,FALSE)","v":""}]
[null,null,"PCI Slot 7 Processor 2 x8 PCIe Gen3 for FL/FH",{"$f":"IF($N$75=\"SW\",\"GPU Slot\",\"\")","v":""}]
[null,null,"",null,{"$f":"VLOOKUP($C95,TS3L4_ALL,13,FALSE)","v":""},{"$f":"VLOOKUP($C95,TS3L4_ALL,7,FALSE)","v":""},null,{"$f":"IF(M95=\"Errore\",\"ERRORE nella selezione del PCI Slot\",IFERROR(O96,\"ERRORE nella selezione del PCI Slot\"))","v":""},null,{"$f":"VLOOKUP($C95,TS3L4_ALL,10,FALSE)","v":0},{"$f":"VLOOKUP($C95,TS3L4_ALL,11,FALSE)","v":0},{"$f":"VLOOKUP($C95,TS3L4_ALL,12,FALSE)","v":""},{"$f":"IF(F95=\"\",\"OK\",IF(N95+F95=2,\"Errore\",\"OK\"))","v":"OK"},{"$f":"IF(N98=\"dw\",1,0)","v":0},{"$f":"HLOOKUP($N$75,$P$76:$T$99,20,FALSE)","v":"-"},"-","TS3L2_PCI_A","TS3L2_PCI_I","TS3L2_PCI_A","TS3L2_PCI_L",null,"PCI-7"]
[null,null,null,null,null,null,null,null,null,null,null,null,null,null,{"$f":"HLOOKUP($N$75,$P$76:$T$99,21,FALSE)","v":""},{"$f":"VLOOKUP(C95,TS3L4_PCI_A,12,FALSE)","v":""},{"$f":"VLOOKUP(C95,TS3L4_PCI_A,12,FALSE)","v":""},{"$f":"VLOOKUP(C95,TS3L4_PCI_I,12,FALSE)","v":""},{"$f":"VLOOKUP(C95,TS3L4_PCI_A,12,FALSE)","v":""},{"$f":"VLOOKUP(C95,TS3L4_PCI_L,12,FALSE)","v":""}]
[null,null,"PCI Slot 8 Processor 2 x16 PCIe Gen3 for FL/FH",{"$f":"IF($N$75=\"SW\",\"GPU Slot\",IF($N$75=\"DW\",\"GPU Slot\",\"\"))","v":""},null,null,null,null,null,null,null,null,"boss card"]
[null,null,"",null,{"$f":"VLOOKUP($C98,TS3L4_ALL,13,FALSE)","v":""},{"$f":"VLOOKUP($C98,TS3L4_ALL,7,FALSE)","v":""},null,{"$f":"IF(M98=\"Errore\",\"ERRORE nella selezione del PCI Slot\",IFERROR(O99,\"ERRORE nella selezione del PCI Slot\"))","v":""},null,{"$f":"VLOOKUP($C98,TS3L4_ALL,10,FALSE)","v":0},{"$f":"VLOOKUP($C98,TS3L4_ALL,11,FALSE)","v":0},{"$f":"VLOOKUP($C98,TS3L4_ALL,12,FALSE)","v":""},{"$f":"COUNTIF(L77:L98,\"L4N33\")","v":0},{"$f":"IF(L98=\"L4N56\",\"DW\",IF(L98=\"L4N57\",\"DW\",IF(L98=\"L4N108\",\"DW\",IF(L98=\"L4N55\",\"SW\",1))))","v":1},{"$f":"HLOOKUP($N$75,$P$76:$T$99,23,FALSE)","v":"-"},"-","TS3L2_PCI_D","TS3L2_PCI_I","TS3L2_PCI_E","TS3L2_PCI_G",null,"PCI-8"]
[null,null,null,null,null,null,null,null,null,null,null,null,null,null,{"$f":"HLOOKUP($N$75,$P$76:$T$99,24,FALSE)","v":""},{"$f":"VLOOKUP(C98,TS3L4_PCI_A,12,FALSE)","v":""},{"$f":"VLOOKUP(C98,TS3L4_PCI_D,12,FALSE)","v":""},{"$f":"VLOOKUP(C98,TS3L4_PCI_I,12,FALSE)","v":""},{"$f":"VLOOKUP(C98,TS3L4_PCI_E,12,FALSE)","v":""},{"$f":"VLOOKUP(C98,TS3L4_PCI_G,12,FALSE)","v":""}]
[null,null,"SFP+ Transceivers"]
[null,null,"Transceiver, SFP+ SR Optic for SFP+ ports (Intel X710)",null,{"$f":"IF(K101>0,VLOOKUP($C101,ConfigurationTS3L4!$A$1:$M$4832,13,FALSE),\"\")","v":""},null,null,null,null,0,{"$f":"IF(F101>0,VLOOKUP($C101,TS3L4_ALL,11,FALSE)*(F101),0)","v":0},{"$f":"IF(F101>0,VLOOKUP($C101,TS3L4_ALL,12,FALSE),0)","v":0}]
[]
[null,null,"SFP+ Direct Attach Cables (Twinax)"]
[null,null,"Cable, SFP+ to SFP+, 10GbE, Copper Twinax Direct Attach Cable, 3 Meter",null,{"$f":"IF(K104>0,VLOOKUP($C104,ConfigurationTS3L4!$A$1:$M$4832,13,FALSE),\"\")","v":""},null,null,null,null,0,{"$f":"IF(F104>0,VLOOKUP($C104,TS3L4_ALL,11,FALSE)*F104,0)","v":0},{"$f":"IF(F104>0,VLOOKUP($C104,TS3L4_ALL,12,FALSE),0)","v":0}]
[]
[null,null,"QSFP28 Transceivers"]
[null,null,"Dell EMC PowerEdge QSFP28 SR4 100GbE 85C optic",null,{"$f":"IF(K107>0,VLOOKUP($C107,ConfigurationTS3L4!$A$1:$M$4832,13,FALSE),\"\")","v":""},null,null,null,null,0,{"$f":"IF(F107>0,VLOOKUP($C107,TS3L4_ALL,11,FALSE)*F107,0)","v":0},{"$f":"IF(F107>0,VLOOKUP($C107,TS3L4_ALL,12,FALSE),0)","v":0}]
[]
[null,null,"Mellanox LinkX 100Gb/s Passive Copper Cables"]
[null,null,"Mellanox LinkX 100Gb/s Passive Copper Cables - attacco cavo diretto - 3 m - nero",null,{"$f":"IF(K110>0,VLOOKUP($C110,ConfigurationTS3L4!$A$1:$M$4832,13,FALSE),\"\")","v":""},null,null,null,null,0,{"$f":"IF(F110>0,VLOOKUP($C110,TS3L4_ALL,11,FALSE)*F110,0)","v":0},{"$f":"IF(F110>0,VLOOKUP($C110,TS3L4_ALL,12,FALSE),0)","v":0}]
[]
[null,null,"Mellanox LinkX 100Gb/s VCSEL-Based Active Optical Cables - cavo InfiniBand - 10 m",null,{"$f":"IF(K112>0,VLOOKUP($C112,ConfigurationTS3L4!$A$1:$M$4832,13,FALSE),\"\")","v":""},null,null,null,null,0,{"$f":"IF(F112>0,VLOOKUP($C112,TS3L4_ALL,11,FALSE)*F112,0)","v":0},{"$f":"IF(F112>0,VLOOKUP($C112,TS3L4_ALL,12,FALSE),0)","v":0}]
[]
[null,null,"Cavi RJ45"]
[null,null,"Cavo “patch” di 3 mt RJ45 certificato per gigabit ethernet",null,{"$f":"IF(K115>0,VLOOKUP($C115,ConfigurationTS3L4!$A$1:$M$4832,13,FALSE),\"\")","v":"TS3L4-RJ453M"},5,null,null,null,0,{"$f":"IF(F115>0,VLOOKUP($C115,TS3L4_ALL,11,FALSE)*(F115),0)","v":15},{"$f":"IF(F115>0,VLOOKUP($C115,TS3L4_ALL,12,FALSE),0)","v":"L4N62"}]
[]
[null,null,"Cavi LC-LC"]
[null,null,"Dell Networking Cable, OM4 LC/LC Fiber Cable, 3 Meter",null,{"$f":"IF(K118>0,VLOOKUP($C118,ConfigurationTS3L4!$A$1:$M$4832,13,FALSE),\"\")","v":""},null,null,null,null,0,{"$f":"IF(F118>0,VLOOKUP($C118,TS3L4_ALL,11,FALSE)*(F118),0)","v":0},{"$f":"IF(F118>0,VLOOKUP($C118,TS3L4_ALL,12,FALSE),0)","v":0}]
[]
[null,null,"Cavi DAC"]
[null,null,"Dell Networking, Cable, SFP+ to SFP+, 10GbE, Copper Twinax Direct Attach Cable, 3 Meter",null,{"$f":"IF(K121>0,VLOOKUP($C121,ConfigurationTS3L4!$A$1:$M$4832,13,FALSE),\"\")","v":""},null,null,null,null,0,{"$f":"IF(F121>0,VLOOKUP($C121,TS3L4_ALL,11,FALSE)*(F121),0)","v":0},{"$f":"IF(F121>0,VLOOKUP($C121,TS3L4_ALL,12,FALSE),0)","v":0}]
[null,null,"Mellanox LinkX 100Gb/s Passive Copper DAC 3m per scheda TS3L4-CONX6DP",null,{"$f":"IF(K122>0,VLOOKUP($C122,ConfigurationTS3L4!$A$1:$M$4832,13,FALSE),\"\")","v":""},null,null,null,null,0,{"$f":"IF(F122>0,VLOOKUP($C122,TS3L4_ALL,11,FALSE)*(F122),0)","v":0},{"$f":"IF(F122>0,VLOOKUP($C122,TS3L4_ALL,12,FALSE),0)","v":0}]
[null,null,"Dell Cable SFP28 to SFP28 25GbE Passive Copper Twinax Direct Attach Cable 3 Meter ",null,{"$f":"IF(K123>0,VLOOKUP($C123,ConfigurationTS3L4!$A$1:$M$4832,13,FALSE),\"\")","v":""},null,null,null,null,0,{"$f":"IF(F123>0,VLOOKUP($C123,TS3L4_ALL,11,FALSE)*(F123),0)","v":0},{"$f":"IF(F123>0,VLOOKUP($C123,TS3L4_ALL,12,FALSE),0)","v":0}]
[null,null,null,null,null,null,null,null,null,null,null,null,null,null,{"$f":"IF($N$9=\"VxFlex\",ConfigurationTS3L4!$A$236,IF($N$98=\"DW\",ConfigurationTS3L4!$A$333,IF($N$75=\"1CPU\",ConfigurationTS3L4!$A$92:$A$93,ConfigurationTS3L4!$A$166:$A$181)))","v":{"$error":"#VALUE!"}}]
[null,null,"Cable Management Arm"]
[null,null,"No ",null,{"$f":"IF($N$9=\"VxFlex\",\"TS3L4-BZLSTD\",VLOOKUP($C126,TS3L4_ALL,13,))","v":""},{"$f":"IF($N$9=\"VxFlex\",1,VLOOKUP($C126,TS3L4_ALL,7,FALSE))","v":""},null,null,null,{"$f":"VLOOKUP($C126,TS3L4_ALL,10,FALSE)","v":0},{"$f":"IF($N$9=\"VxFlex\",42,VLOOKUP($C126,TS3L4_ALL,11,FALSE))","v":0},{"$f":"IF($N$9=\"VxFlex\",\"L4N69\",VLOOKUP($C126,TS3L4_ALL,12,FALSE))","v":""}]
[]
[null,null,"Bezel"]
[null,null,"No Bezel",null,{"$f":"IF($N$9=\"VxFlex\",\"TS3L4-BZLSTD\",VLOOKUP($C129,TS3L4_ALL,13,))","v":""},{"$f":"IF($N$9=\"VxFlex\",1,VLOOKUP($C129,TS3L4_ALL,7,FALSE))","v":""},null,null,null,{"$f":"VLOOKUP($C129,TS3L4_ALL,10,FALSE)","v":0},{"$f":"IF($N$9=\"VxFlex\",42,VLOOKUP($C129,TS3L4_ALL,11,FALSE))","v":0},{"$f":"IF($N$9=\"VxFlex\",\"L4N69\",VLOOKUP($C129,TS3L4_ALL,12,FALSE))","v":""}]
[]
[null,null,"Warranty",{"$f":"HYPERLINK(\"https://convenzioni.converge.it/docs/ts3_datasheet/TS3warranty.pdf\",\"i\")","v":"i"}]
[null,null,"Manutenzione in garanzia (36 mesi)",null,{"$f":"VLOOKUP($C132,TS3L4_WARRANTY,13,FALSE)","v":""},{"$f":"VLOOKUP($C132,TS3L4_WARRANTY,7,FALSE)","v":""},null,null,null,{"$f":"VLOOKUP($C132,TS3L4_WARRANTY,10,FALSE)","v":0},{"$f":"VLOOKUP($C132,TS3L4_WARRANTY,11,FALSE)","v":0},{"$f":"VLOOKUP($C132,TS3L4_ALL,12,FALSE)","v":""}]
[]
[null,null,"Hard Disk Retention",{"$f":"HYPERLINK(\"https://convenzioni.converge.it/docs/ts3_datasheet/DELL_HDD_KYHD.pdf\",\"i\")","v":"i"}]
[null,null,"",null,{"$f":"IFERROR(N135,VLOOKUP(C135,TS3L4_ALL,13,FALSE))","v":""},{"$f":"IF(C135=\"\",\"\",1)","v":""},null,null,null,{"$f":"IFERROR(O135,VLOOKUP(C135,TS3L4_ALL,10,FALSE))","v":0},{"$f":"IFERROR(P135,VLOOKUP(C135,TS3L4_ALL,11,FALSE))","v":0},{"$f":"IFERROR(Q135,VLOOKUP(C135,TS3L4_ALL,12,FALSE))","v":""},null,{"$f":"IF(F132+F135=2,VLOOKUP(\"Hard Disk Retention (60 mesi)\",TS3L4_ALL,13,FALSE),VLOOKUP(C135,TS3L4_ALL,13,FALSE))","v":{"$error":"#VALUE!"}},{"$f":"IF(F132+F135=2,VLOOKUP(\"Hard Disk Retention (60 mesi)\",TS3L4_ALL,10,FALSE),VLOOKUP(C135,TS3L4_ALL,10,FALSE))","v":{"$error":"#VALUE!"}},{"$f":"IF(F132+F135=2,VLOOKUP(\"Hard Disk Retention (60 mesi)\",TS3L4_ALL,11,FALSE),VLOOKUP(C135,TS3L4_ALL,11,FALSE))","v":{"$error":"#VALUE!"}},{"$f":"IF(F132+F135=2,VLOOKUP(\"Hard Disk Retention (60 mesi)\",TS3L4_ALL,12,FALSE),VLOOKUP(C135,TS3L4_ALL,12,FALSE))","v":{"$error":"#VALUE!"}}]
[]
[]
[null,null,"UPS"]
[null,null,"",null,{"$f":"VLOOKUP($C139,TS3L4_UPS,13,FALSE)","v":{"$error":"#NAME?"}},{"$f":"VLOOKUP($C139,TS3L4_UPS,7,FALSE)","v":{"$error":"#NAME?"}},null,null,null,{"$f":"VLOOKUP($C139,TS3L4_UPS,10,FALSE)","v":{"$error":"#NAME?"}},{"$f":"VLOOKUP($C139,TS3L4_UPS,11,FALSE)","v":{"$error":"#NAME?"}},{"$f":"VLOOKUP($C139,TS3L4_ALL,12,FALSE)","v":""}]
[]
[null,null,"Kit Graphical User Interface"]
[null,null,"",null,{"$f":"VLOOKUP($C142,TS3L4_GUI,13,FALSE)","v":{"$error":"#NAME?"}},{"$f":"VLOOKUP($C142,TS3L4_GUI,7,FALSE)","v":{"$error":"#NAME?"}},null,null,null,{"$f":"VLOOKUP($C142,TS3L4_GUI,10,FALSE)","v":{"$error":"#NAME?"}},{"$f":"VLOOKUP($C142,TS3L4_GUI,11,FALSE)","v":{"$error":"#NAME?"}},{"$f":"VLOOKUP($C142,TS3L4_ALL,12,FALSE)","v":""}]

{"sheet":"Altre_Opzioni","index":3,"n_rows":86,"n_cols":12,"rows_kept":86,"cut":false,"hidden":false,"merged":[[7,3,8,3],[10,3,11,3],[84,3,85,3],[14,3,15,3],[70,3,71,3],[74,3,75,3],[78,3,79,3],[81,3,82,3],[47,3,48,3],[31,3,33,3]]}
[null,null,null,null,"Convenzione",{"$f":"SUM(J9:J179)","v":0}]
[null,null,null,null,0.2,{"$f":"SUM(K9:K179)","v":0}]
[null,null,null,null,"Totale",{"$f":"SUM(F1:F2)","v":0}]
[]
[null,null,"Opzioni"]
[]
[]
[null,null,"Opzione Rack APC con PDU Monofase",{"$f":"HYPERLINK(\"https://convenzioni.converge.it/docs/ts3_datasheet/RACK_APC_MONO.pdf\",\"i\")","v":"i"}]
[null,null,"Armadio Rack 42U 600x1200, 2 x PDU Monofase 2G, ZeroU, 32A, 230V, (36) C13 & (6) C19",null,{"$f":"VLOOKUP($C9,TS3L4_ALL,13,FALSE)","v":"TS3L4-RACKM32A"},null,null,null,null,{"$f":"VLOOKUP($C9,TS3L4_ALL,10,FALSE)*F9","v":0},{"$f":"VLOOKUP($C9,TS3L4_ALL,11,FALSE)*F9","v":0},{"$f":"VLOOKUP($C9,TS3L4_ALL,12,FALSE)","v":"L4N89"}]
[]
[null,null,"Opzione Rack APC con PDU Trifase",{"$f":"HYPERLINK(\"https://convenzioni.converge.it/docs/ts3_datasheet/RACK_APC_3PH.pdf\",\"i\")","v":"i"}]
[null,null,"Armadio Rack 42U 600x1200, 2 x PDU Trifase 2G, ZeroU, 22.0kW(32A) 17.3kW(24A), 230V, (30) C13 & (12) C19",null,{"$f":"VLOOKUP($C12,TS3L4_ALL,13,FALSE)","v":"TS3L4-RACKT32A"},null,null,null,null,{"$f":"VLOOKUP($C12,TS3L4_ALL,10,FALSE)*F12","v":0},{"$f":"VLOOKUP($C12,TS3L4_ALL,11,FALSE)*F12","v":0},{"$f":"VLOOKUP($C12,TS3L4_ALL,12,FALSE)","v":"L4N90"}]
[]
[]
[null,null,"OpzRack",{"$f":"HYPERLINK(\"https://convenzioni.converge.it/docs/ts3_datasheet/TS3Rack.pdf\",\"i\")","v":"i"}]
[null,null,"Rack 42U con portata 1000 KG e 4 ruote + coppia PDU 12 prese Shuko bipasso ITA",null,{"$f":"VLOOKUP($C16,TS3L4_ALL,13,FALSE)","v":"TS3L4-RACK"},null,null,null,null,{"$f":"VLOOKUP($C16,TS3L4_ALL,10,FALSE)*F16","v":0},{"$f":"VLOOKUP($C16,TS3L4_ALL,11,FALSE)","v":0},{"$f":"VLOOKUP($C16,TS3L4_ALL,12,FALSE)","v":"L4N29"}]
[]
[]
[null,null,"Prodotti VMware"]
[null,null,"VMware vSphere 7 Standard Acceleration Kit OEM for 6 CPU, 3YR License and Maintenance",null,{"$f":"VLOOKUP($C20,TS3L4_ALL,13,FALSE)","v":"TS3L4-VS7STD6AK"},null,null,null,null,{"$f":"VLOOKUP($C20,TS3L4_ALL,10,FALSE)*F20","v":0},{"$f":"VLOOKUP($C20,TS3L4_ALL,11,FALSE)*F20","v":0},{"$f":"VLOOKUP($C20,TS3L4_ALL,12,FALSE)","v":"L4N72"}]
[null,null,"VMware vSphere 7 Standard OEM, 1 CPU (max 32 cores/CPU socket), 3YR License and Maintenance",null,"TS3L4-VS7STD",null,null,null,null,0,0,"L4N73"]
[null,null,"VMware vSphere 7 Enterprise Plus Acceleration Kit OEM for 6 CPU, 3YR License and Maintenance",null,"TS3L4-VS7EPL6AK",null,null,null,null,0,0,"L4N74"]
[null,null,"VMware vSphere 7 Enterprise Plus OEM, 1 CPU (max 32 cores/CPU socket), 3YR License and Maintenance",null,"TS3L4-VS7EPL",null,null,null,null,0,0,"L4N80"]
[null,null,"VMware vCenter 7 Standard OEM ,Per Instance,3YR License and Maintenance",null,"TS3L4-VCS7STD",null,null,null,null,0,0,"L4N81"]
[null,null,"VMware vSAN 7 Enterprise OEM, 1 CPU (max 32 cores/CPU socket), 3YR License and Maintenance",null,"TS3L4-ST7ENT",null,null,null,null,0,0,"L4N82"]
[null,null,"VMware Horizon 8 Advanced OEM,10 Pack,CCU, 3YR License and Maintenance",null,"TS3L4-HZ8ADC10",null,null,null,null,0,0,"L4N83"]
[null,null,"VMware Horizon 8 Enterprise OEM,10 Pack,CCU, 3YR License and Maintenance",null,"TS3L4-HZ8ENC10",null,null,null,null,0,0,"L4N84"]
[null,null,"VMware Horizon Advanced OEM, 10 Pack, Named User, 3YR License and Maintenance",null,"TS3L4-HZ8ADN10",null,null,null,null,0,0,"L4N85"]
[null,null,"VMware Horizon 8 Enterprise OEM,10 Pack, Named User, 3YR License and Maintenance",null,"TS3L4-HZ8ENN10",null,null,null,null,0,0,"L4N86"]
[]
[]
[null,null,"Enclosure Dischi SAS 3.5\" (No disk)",{"$f":"HYPERLINK(\"https://convenzioni.converge.it/docs/ts3_datasheet/MD1400_MD1420.pdf\",\"i\")","v":"i"}]
[null,null,"Enclosure SAS 12 Slot 3.5\", 3YR ProSupport and 4hr Mission Critical",null,{"$f":"VLOOKUP($C33,TS3L4_ALL,13,FALSE)","v":"TS3L4-Encl13Y4H"},null,null,null,null,{"$f":"VLOOKUP($C33,TS3L4_ALL,10,FALSE)*F33","v":0},{"$f":"VLOOKUP($C33,TS3L4_ALL,11,FALSE)*F33","v":0},{"$f":"VLOOKUP($C33,TS3L4_ALL,12,FALSE)","v":"L4N87"}]
[null,null,"Enclosure SAS 12 Slot 3.5\", 5YR ProSupport and 4hr Mission Critical",null,{"$f":"VLOOKUP($C34,TS3L4_ALL,13,FALSE)","v":"TS3L4-Encl25Y4H"},null,null,null,null,{"$f":"VLOOKUP($C34,TS3L4_ALL,10,FALSE)*F34","v":0},{"$f":"VLOOKUP($C34,TS3L4_ALL,11,FALSE)*F34","v":0},{"$f":"VLOOKUP($C34,TS3L4_ALL,12,FALSE)","v":"L4N88"}]
[null,null,"Dischi per Enclosure 3.5\""]
[null,null,"HDD 16TB SAS 12Gbps 7k 3.5in Hot-Plug per Enclosure 3.5\"",null,{"$f":"VLOOKUP($C36,TS3L4_ALL,13,FALSE)","v":"TS3L4-ED16TB"},null,null,null,null,{"$f":"VLOOKUP($C36,TS3L4_ALL,10,FALSE)*F36","v":0},{"$f":"VLOOKUP($C36,TS3L4_ALL,11,FALSE)*F36","v":0},{"$f":"VLOOKUP($C36,TS3L4_ALL,12,FALSE)","v":"L4N103"}]
[null,null,"HDD 12TB SAS 12Gbps 7k 3.5in Hot-Plug per Enclosure 3.5\"",null,{"$f":"VLOOKUP($C37,TS3L4_ALL,13,FALSE)","v":"TS3L4-ED12TB"},null,null,null,null,{"$f":"VLOOKUP($C37,TS3L4_ALL,10,FALSE)*F37","v":0},{"$f":"VLOOKUP($C37,TS3L4_ALL,11,FALSE)*F37","v":0},{"$f":"VLOOKUP($C37,TS3L4_ALL,12,FALSE)","v":"L4N104"}]
[null,null,"HDD 8TB SAS 12Gbps 7k 3.5in Hot-Plug per Enclosure 3.5\"",null,{"$f":"VLOOKUP($C38,TS3L4_ALL,13,FALSE)","v":"TS3L4-ED08TB"},null,null,null,null,{"$f":"VLOOKUP($C38,TS3L4_ALL,10,FALSE)*F38","v":0},{"$f":"VLOOKUP($C38,TS3L4_ALL,11,FALSE)*F38","v":0},{"$f":"VLOOKUP($C38,TS3L4_ALL,12,FALSE)","v":"L4N105"}]
[]
[null,null,"Enclosure Dischi SAS 2.5\" (No disk)"]
[null,null,"Enclosure SAS 12 Slot 2.5\", 3YR ProSupport and 4hr Mission Critical",null,{"$f":"VLOOKUP($C41,TS3L4_ALL,13,FALSE)","v":"TS3L4-Encl33Y4H"},null,null,null,null,{"$f":"VLOOKUP($C41,TS3L4_ALL,10,FALSE)*F41","v":0},{"$f":"VLOOKUP($C41,TS3L4_ALL,11,FALSE)*F41","v":0},{"$f":"VLOOKUP($C41,TS3L4_ALL,12,FALSE)","v":"L4N98"}]
[null,null,"Enclosure SAS 12 Slot 2.5\", 5YR ProSupport and 4hr Mission Critical",null,{"$f":"VLOOKUP($C42,TS3L4_ALL,13,FALSE)","v":"TS3L4-Encl45Y4H"},null,null,null,null,{"$f":"VLOOKUP($C42,TS3L4_ALL,10,FALSE)*F42","v":0},{"$f":"VLOOKUP($C42,TS3L4_ALL,11,FALSE)*F42","v":0},{"$f":"VLOOKUP($C42,TS3L4_ALL,12,FALSE)","v":"L4N99"}]
[null,null,"Dischi per Enclosure 2.5\""]
[null,null,"HDD 2400GB 10K SAS 12Gbps 2.5in Hot-plug per Enclosure 2.5\"",null,{"$f":"VLOOKUP($C44,TS3L4_ALL,13,FALSE)","v":"TS3L4-ED2TB"},null,null,null,null,{"$f":"VLOOKUP($C44,TS3L4_ALL,10,FALSE)*F44","v":0},{"$f":"VLOOKUP($C44,TS3L4_ALL,11,FALSE)*F44","v":0},{"$f":"VLOOKUP($C44,TS3L4_ALL,12,FALSE)","v":"L4N106"}]
[null,null,"SSD 960GB SAS RI 12Gbps 2.5in Hot-plug, 1 DWPD per Enclosure 2.5\"",null,{"$f":"VLOOKUP($C45,TS3L4_ALL,13,FALSE)","v":"TS3L2-EDRI800"},null,null,null,null,{"$f":"VLOOKUP($C45,TS3L4_ALL,10,FALSE)*F45","v":0},{"$f":"VLOOKUP($C45,TS3L4_ALL,11,FALSE)*F45","v":0},{"$f":"VLOOKUP($C45,TS3L4_ALL,12,FALSE)","v":"L4N107"}]
[]
[]
[null,null,"NVIDIA Virtual GPU Software Packaging",{"$f":"HYPERLINK(\"https://www.nvidia.com/content/dam/en-zz/Solutions/design-visualization/solutions/resources/documents1/Virtual-GPU-Packaging-and-Licensing-Guide.pdf\",\"i\")","v":"i"}]
[null,null,"NVIDIA vApps Subscription License 1 Year, 1 CCU",null,{"$f":"VLOOKUP($C49,TS3L4_ALL,13,FALSE)","v":"TS3L4-VAPPS1Y"},null,null,null,null,{"$f":"VLOOKUP($C49,TS3L4_ALL,10,FALSE)*F49","v":0},{"$f":"VLOOKUP($C49,TS3L4_ALL,11,FALSE)*F49","v":0},{"$f":"VLOOKUP($C49,TS3L4_ALL,12,FALSE)","v":"L4N110"}]
[null,null,"NVIDIA vApps Subscription License 3 Years, 1 CCU",null,"TS3L4-VAPPS3Y",null,null,null,null,0,0,"L4N111"]
[null,null,"NVIDIA vApps Subscription License 5 Years, 1 CCU",null,"TS3L4-VAPPS5Y",null,null,null,null,0,0,"L4N112"]
[null,null,"NVIDIA vPC Subscription License 1 Year, 1 CCU",null,"TS3L4-VPC1Y",null,null,null,null,0,0,"L4N113"]
[null,null,"NVIDIA vPC Subscription License 3 Years, 1 CCU",null,"TS3L4-VPC3Y",null,null,null,null,0,0,"L4N114"]
[null,null,"NVIDIA vPC Subscription License 5 Years, 1 CCU",null,"TS3L4-VPC5Y",null,null,null,null,0,0,"L4N115"]
[null,null,"NVIDIA RTX vWS Subscription License 1 Year, 1 CCU",null,"TS3L4-VWS1Y",null,null,null,null,0,0,"L4N116"]
[null,null,"NVIDIA RTX vWS Subscription License 3 Years, 1 CCU",null,"TS3L4-VWS3Y",null,null,null,null,0,0,"L4N117"]
[null,null,"NVIDIA RTX vWS Subscription License 5 Years, 1 CCU",null,"TS3L4-VWS5Y",null,null,null,null,0,0,"L4N118"]
[null,null,"NVIDIA Virtual Compute Server Subscription, 1 GPU (Max 8 CC VMs), 1 Year",null,"TS3L4-VCS1Y",null,null,null,null,0,0,"L4N119"]
[null,null,"NVIDIA Virtual Compute Server Subscription, 1 GPU (Max 8 CC VMs), 3 Years",null,"TS3L4-VCS3Y",null,null,null,null,0,0,"L4N120"]
[null,null,"NVIDIA Virtual Compute Server Subscription, 1 GPU (Max 8 CC VMs), 5 Years",null,"TS3L4-VCS5Y",null,null,null,null,0,0,"L4N121"]
[null,null,"NVIDIA vApps Bundle Perpetual License Plus 4yr vApps SUMS, 1CCU",null,"TS3L4-VAPPS-P4Y",null,null,null,null,0,0,"L4N122"]
[null,null,"NVIDIA vApps Bundle Perpetual License Plus 5yr vApps SUMS, 1CCU",null,"TS3L4-VAPPS-P5Y",null,null,null,null,0,0,"L4N123"]
[null,null,"NVIDIA vPC Bundle Perpetual License Plus 4yr vPC SUMS, 1CCU",null,"TS3L4-VPC-P4Y",null,null,null,null,0,0,"L4N124"]
[null,null,"NVIDIA vPC Bundle Perpetual License Plus 5yr vPC SUMS, 1CCU",null,"TS3L4-VPC-P5Y",null,null,null,null,0,0,"L4N125"]
[null,null,"NVIDIA RTX vWS Bundle Perpetual License Plus 4yr RTX vWS SUMS, 1CCU",null,"TS3L4-VWS-P4Y",null,null,null,null,0,0,"L4N126"]
[null,null,"NVIDIA RTX vWS Bundle Perpetual License Plus 5yr RTX vWS SUMS, 1CCU",null,"TS3L4-VWS-P5Y",null,null,null,null,0,0,"L4N127"]
[null,null,"NVIDIA vPC to NVIDIA RTX vWS Upgrade 4 year SUMS Bundle",null,"TS3L4-VWSUPG4Y",null,null,null,null,0,0,"L4N128"]
[null,null,"NVIDIA vPC to NVIDIA RTX vWS Upgrade 5 year SUMS Bundle",null,"TS3L4-VWSUPG5Y",null,null,null,null,0,0,"L4N129"]
[]
[]
[null,null,"OpzUps (3000VA)",{"$f":"HYPERLINK(\"https://convenzioni.converge.it/docs/ts3_datasheet/RPMM_UPS.pdf\",\"i\")","v":"i"}]
[null,null,"BUNDLE PMEUPS3RTSER Comprensivo di UPS e scheda SNMP + Kit Rack incluso",null,{"$f":"VLOOKUP($C72,TS3L4_ALL,13,FALSE)","v":"TS3L4-UPS"},null,null,null,null,{"$f":"VLOOKUP($C72,TS3L4_ALL,10,FALSE)*F72","v":0},{"$f":"VLOOKUP($C72,TS3L4_ALL,11,FALSE)","v":0},{"$f":"VLOOKUP($C72,TS3L4_ALL,12,FALSE)","v":"L4N19"}]
[]
[]
[null,null,"OpzGUI",{"$f":"HYPERLINK(\"https://convenzioni.converge.it/docs/ts3_datasheet/KVM_datasheet_ITA.pdf\",\"i\")","v":"i"}]
[null,null,"Unità KVM - monitor 17\", cavo combi PS2 e USB da 1,8mt, tastiera ita, touch pad",null,{"$f":"VLOOKUP($C76,TS3L4_ALL,13,FALSE)","v":"TS3L4-GUI"},null,null,null,null,{"$f":"VLOOKUP($C76,TS3L4_ALL,10,FALSE)*F76","v":0},{"$f":"VLOOKUP($C76,TS3L4_ALL,11,FALSE)","v":0},{"$f":"VLOOKUP($C76,TS3L4_ALL,12,FALSE)","v":"L4N20"}]
[]
[]
[null,null,"OpzKVM",{"$f":"HYPERLINK(\"https://convenzioni.converge.it/docs/ts3_datasheet/T9816NIP.pdf\",\"i\")","v":"i"}]
[null,null,"Switch 16 porte IP con relativi cavi combi PS/2 e USB inclusi",null,{"$f":"VLOOKUP($C80,TS3L4_ALL,13,FALSE)","v":"TS3L4-SWKVM"},null,null,null,null,{"$f":"VLOOKUP($C80,TS3L4_ALL,10,FALSE)*F80","v":0},{"$f":"VLOOKUP($C80,TS3L4_ALL,11,FALSE)","v":0},{"$f":"VLOOKUP($C80,TS3L4_ALL,12,FALSE)","v":"L4N21"}]
[]
[null,null,{"$f":"IF(Riepilogo!P49+Riepilogo!P89>0,\"OpzDeviceCal\",\"\")","v":""}]
[null,null,{"$f":"IF(Riepilogo!P49+Riepilogo!P89>0,\"1-pack of Windows Server 2019/2016 Device CALs (STD or DC)\",\"\")","v":""},null,{"$f":"VLOOKUP($C83,TS3L4_ALL,13,FALSE)","v":""},null,null,null,null,{"$f":"VLOOKUP($C83,TS3L4_ALL,10,FALSE)*F83","v":0},{"$f":"VLOOKUP($C83,TS3L4_ALL,11,FALSE)","v":0},{"$f":"VLOOKUP($C83,TS3L4_ALL,12,FALSE)","v":""}]
[]
[null,null,{"$f":"IF(Riepilogo!P49+Riepilogo!P89>0,\"OpzUserCal\",\"\")","v":""}]
[null,null,{"$f":"IF(Riepilogo!P49+Riepilogo!P89>0,\"1-pack of Windows Server 2019/2016 User CALs (STD or DC)\",\"\")","v":""},null,{"$f":"VLOOKUP($C86,TS3L4_ALL,13,FALSE)","v":""},null,null,null,null,{"$f":"VLOOKUP($C86,TS3L4_ALL,10,FALSE)*F86","v":0},{"$f":"VLOOKUP($C86,TS3L4_ALL,11,FALSE)","v":0},{"$f":"VLOOKUP($C86,TS3L4_ALL,12,FALSE)","v":""}]

{"sheet":"ConfigurationTS3L4","index":4,"n_rows":527,"n_cols":30,"rows_kept":527,"cut":false,"hidden":true,"merged":[]}
[]
[null,"Module Name","Option ID","Option Name","Option List Price","SKUs","Qty","SKU Customer Kit","Attributo","Valore inserito",null,"N°","Codice Convenzione"]
["PowerEdge R740XD Server (General Purpose)","Chassis with Up to 24 x 2.5 Hard Drives for 1CPU Configuration",null,{"$f":"VLOOKUP(L3,Tabella_prezzi!$A$3:$K$303,8,FALSE)","v":"PowerEdge R740xd Server"},null,null,null,{"$f":"VLOOKUP(L3,Tabella_prezzi!$A$3:$K$303,9,FALSE)","v":"L4N01-ServerR740XD"},{"$f":"VLOOKUP(L3,Tabella_prezzi!$A$3:$K$303,3,FALSE)","v":"Server rackable bi-processore prest."},{"$f":"VLOOKUP(L3,Tabella_prezzi!$A$3:$K$303,4,FALSE)","v":2530},null,"L4N01",{"$f":"VLOOKUP(L3,Tabella_prezzi!$A$3:$K$303,6,FALSE)","v":"TS3L4-SRV-U"}]
["PowerEdge R740XD Server (vSAN Ready)","Chassis with Up to 24 x 2.5\" Hard Drives for 2CPU Configuration",null,{"$f":"VLOOKUP(L4,Tabella_prezzi!$A$3:$K$303,8,FALSE)","v":"PowerEdge R740xd Server"},null,null,null,{"$f":"VLOOKUP(L4,Tabella_prezzi!$A$3:$K$303,9,FALSE)","v":"L4N01-ServerR740XD"},{"$f":"VLOOKUP(L4,Tabella_prezzi!$A$3:$K$303,3,FALSE)","v":"Server rackable bi-processore prest."},{"$f":"VLOOKUP(L4,Tabella_prezzi!$A$3:$K$303,4,FALSE)","v":2530},null,"L4N01",{"$f":"VLOOKUP(L4,Tabella_prezzi!$A$3:$K$303,6,FALSE)","v":"TS3L4-SRV-U"}]
["PowerEdge R740XD Server (GPU Single-Wide Ready)","Chassis with Up to 24 x 2.5 Hard Drives for 2CPU, GPU Single-Wide Configuration",null,{"$f":"VLOOKUP(L5,Tabella_prezzi!$A$3:$K$303,8,FALSE)","v":"PowerEdge R740xd Server"},null,null,null,{"$f":"VLOOKUP(L5,Tabella_prezzi!$A$3:$K$303,9,FALSE)","v":"L4N01-ServerR740XD"},{"$f":"VLOOKUP(L5,Tabella_prezzi!$A$3:$K$303,3,FALSE)","v":"Server rackable bi-processore prest."},{"$f":"VLOOKUP(L5,Tabella_prezzi!$A$3:$K$303,4,FALSE)","v":2530},null,"L4N01",{"$f":"VLOOKUP(L5,Tabella_prezzi!$A$3:$K$303,6,FALSE)","v":"TS3L4-SRV-U"}]
["PowerEdge R740XD Server (GPU Double-Wide Ready)","Chassis with Up to 24 x 2.5 Hard Drives for 2CPU, GPU Double-Wide Configuration",null,{"$f":"VLOOKUP(L6,Tabella_prezzi!$A$3:$K$303,8,FALSE)","v":"PowerEdge R740xd Server"},null,null,null,{"$f":"VLOOKUP(L6,Tabella_prezzi!$A$3:$K$303,9,FALSE)","v":"L4N01-ServerR740XD"},{"$f":"VLOOKUP(L6,Tabella_prezzi!$A$3:$K$303,3,FALSE)","v":"Server rackable bi-processore prest."},{"$f":"VLOOKUP(L6,Tabella_prezzi!$A$3:$K$303,4,FALSE)","v":2530},null,"L4N01",{"$f":"VLOOKUP(L6,Tabella_prezzi!$A$3:$K$303,6,FALSE)","v":"TS3L4-SRV-U"}]
["PowerEdge R740XD Server (PowerFlex)","Chassis with Up to 24 x 2.5\" Hard Drives for 2CPU Configuration",null,{"$f":"VLOOKUP(L7,Tabella_prezzi!$A$3:$K$303,8,FALSE)","v":"PowerEdge R740xd Server"},null,null,null,{"$f":"VLOOKUP(L7,Tabella_prezzi!$A$3:$K$303,9,FALSE)","v":"L4N01-ServerR740XD"},{"$f":"VLOOKUP(L7,Tabella_prezzi!$A$3:$K$303,3,FALSE)","v":"Server rackable bi-processore prest."},{"$f":"VLOOKUP(L7,Tabella_prezzi!$A$3:$K$303,4,FALSE)","v":2530},null,"L4N01",{"$f":"VLOOKUP(L7,Tabella_prezzi!$A$3:$K$303,6,FALSE)","v":"TS3L4-SRV-U"}]
[]
["TS3L4_Chassis"]
["PowerEdge R740XD Server (General Purpose)","Chassis with Up to 24 x 2.5 Hard Drives for 1CPU Configuration",null,null,null,null,{"$f":"\"\"","v":""},null,{"$f":"\"\"","v":""},null,null,{"$f":"\"\"","v":""},{"$f":"\"\"","v":""}]
["PowerEdge R740XD Server (vSAN Ready)","Chassis with Up to 24 x 2.5'' Hard Drives for 2CPU Configuration",null,{"$f":"VLOOKUP(L11,Tabella_prezzi!$A$3:$K$303,8,FALSE)","v":"Kit upgrade chassies for Server vSAN Ready"},null,null,1,{"$f":"VLOOKUP(L11,Tabella_prezzi!$A$3:$K$303,9,FALSE)","v":"TS3-OpzA20VSAN"},{"$f":"VLOOKUP(L11,Tabella_prezzi!$A$3:$K$303,3,FALSE)","v":0},null,{"$f":"VLOOKUP(L11,Tabella_prezzi!$A$3:$K$303,4,FALSE)","v":80},"L4N38",{"$f":"VLOOKUP(L11,Tabella_prezzi!$A$3:$K$303,6,FALSE)","v":"TS3L4-VSAN"}]
["PowerEdge R740XD Server (GPU Single-Wide Ready)","Chassis with Up to 24 x 2.5 Hard Drives for 2CPU, GPU Single-Wide Configuration",null,{"$f":"VLOOKUP(L12,Tabella_prezzi!$A$3:$K$303,8,FALSE)","v":"Kit upgrade chassies for Server GPU Single-Wide Ready"},null,null,1,{"$f":"VLOOKUP(L12,Tabella_prezzi!$A$3:$K$303,9,FALSE)","v":"TS3-OpzA20GPUSW"},{"$f":"VLOOKUP(L12,Tabella_prezzi!$A$3:$K$303,3,FALSE)","v":0},null,{"$f":"VLOOKUP(L12,Tabella_prezzi!$A$3:$K$303,4,FALSE)","v":299},"L4N36",{"$f":"VLOOKUP(L12,Tabella_prezzi!$A$3:$K$303,6,FALSE)","v":"TS3L4-GPUSW"}]
["PowerEdge R740XD Server (GPU Double-Wide Ready)","Chassis with Up to 24 x 2.5 Hard Drives for 2CPU, GPU Double-Wide Configuration",null,{"$f":"VLOOKUP(L13,Tabella_prezzi!$A$3:$K$303,8,FALSE)","v":"Kit upgrade chassies for Server GPU Double-Wide Ready"},null,null,1,{"$f":"VLOOKUP(L13,Tabella_prezzi!$A$3:$K$303,9,FALSE)","v":"TS3-OpzA20GPUDW"},{"$f":"VLOOKUP(L13,Tabella_prezzi!$A$3:$K$303,3,FALSE)","v":0},null,{"$f":"VLOOKUP(L13,Tabella_prezzi!$A$3:$K$303,4,FALSE)","v":299},"L4N37",{"$f":"VLOOKUP(L13,Tabella_prezzi!$A$3:$K$303,6,FALSE)","v":"TS3L4-GPUDW"}]
["PowerEdge R740XD Server (PowerFlex)","Chassis with Up to 24 x 2.5'' Hard Drives for 2CPU Configuration",null,"Kit upgrade chassies for Server PowerFlex",null,null,1,{"$f":"VLOOKUP(L14,Tabella_prezzi!$A$3:$K$303,9,FALSE)","v":"TS3-OpzA20PWRFLX"},{"$f":"VLOOKUP(L14,Tabella_prezzi!$A$3:$K$303,3,FALSE)","v":0},null,{"$f":"VLOOKUP(L14,Tabella_prezzi!$A$3:$K$303,4,FALSE)","v":80},"L4N97",{"$f":"VLOOKUP(L14,Tabella_prezzi!$A$3:$K$303,6,FALSE)","v":"TS3L4-PWRFLEX"}]
[]
["TS3L4_CPU"]
["No Additional Processor",null,null,null,null,null,0,null,{"$f":"\"\"","v":""},null,null,{"$f":"\"\"","v":""},{"$f":"\"\"","v":""}]
["Intel Xeon Gold 6238R 2.2G, 28C/56T, 10.4GT/s, 38.5 M Cache, Turbo, HT (165W)",null,null,{"$f":"VLOOKUP(L18,Tabella_prezzi!$A$3:$K$303,8,FALSE)","v":"Processore INTEL XEON GOLD 6238R 28C"},null,null,1,{"$f":"VLOOKUP(L18,Tabella_prezzi!$A$3:$K$303,9,FALSE)","v":"L4N02-OpzCPU"},{"$f":"VLOOKUP(L18,Tabella_prezzi!$A$3:$K$303,3,FALSE)","v":"Kit n. 1 Processore aggiuntivo"},{"$f":"VLOOKUP(L18,Tabella_prezzi!$A$3:$K$303,4,FALSE)","v":730},null,"L4N02",{"$f":"VLOOKUP(L18,Tabella_prezzi!$A$3:$K$303,6,FALSE)","v":"TS3L4-CPU"}]
["Intel Xeon Gold 6234 3.3G, 8C/16T, 10.4GT/s, 24.75M Cache, Turbo, HT (130W)",null,null,{"$f":"VLOOKUP(L19,Tabella_prezzi!$A$3:$K$303,8,FALSE)","v":"Upgrade da Processore aggiuntivo a Processore 8 core"},null,null,1,{"$f":"VLOOKUP(L19,Tabella_prezzi!$A$3:$K$303,9,FALSE)","v":"TS3-OpzA20CPU8C"},{"$f":"VLOOKUP(L19,Tabella_prezzi!$A$3:$K$303,3,FALSE)","v":"Kit n. 1 Processore 8 Core aggiuntivo"},null,{"$f":"VLOOKUP(L19,Tabella_prezzi!$A$3:$K$303,4,FALSE)","v":99999},"L4N48",{"$f":"VLOOKUP(L19,Tabella_prezzi!$A$3:$K$303,6,FALSE)","v":"TS3L4-CPU8CORE"}]
[]
["TS3L4_CPU8core"]
["Intel Xeon Gold 6238R 2.2G, 28C/56T, 10.4GT/s, 38.5 M Cache, Turbo, HT (165W)",null,null,null,null,null,0,null,{"$f":"\"\"","v":""},null,null,{"$f":"\"\"","v":""},{"$f":"\"\"","v":""}]
["Intel Xeon Gold 6234 3.3G, 8C/16T, 10.4GT/s, 24.75M Cache, Turbo, HT (130W)",null,null,{"$f":"VLOOKUP(L23,Tabella_prezzi!$A$3:$K$303,8,FALSE)","v":"Upgrade da Processore base a Processore 8 core"},null,null,1,{"$f":"VLOOKUP(L23,Tabella_prezzi!$A$3:$K$303,9,FALSE)","v":"TS3-OpzA20SRV8C"},{"$f":"VLOOKUP(L23,Tabella_prezzi!$A$3:$K$303,3,FALSE)","v":"Kit n. 1 Processore 8 Core base"},null,{"$f":"VLOOKUP(L23,Tabella_prezzi!$A$3:$K$303,4,FALSE)","v":99999},"L4N47",{"$f":"VLOOKUP(L23,Tabella_prezzi!$A$3:$K$303,6,FALSE)","v":"TS3L4-SRV8CORE"}]
[]
["TS3L4_CPU8coreadd"]
["No Additional Processor",null,null,null,null,null,0,null,{"$f":"\"\"","v":""},null,null,{"$f":"\"\"","v":""},{"$f":"\"\"","v":""}]
["Intel Xeon Gold 6234 3.3G, 8C/16T, 10.4GT/s, 24.75M Cache, Turbo, HT (130W)",null,null,{"$f":"VLOOKUP(L27,Tabella_prezzi!$A$3:$K$303,8,FALSE)","v":"Upgrade da Processore aggiuntivo a Processore 8 core"},null,null,1,{"$f":"VLOOKUP(L27,Tabella_prezzi!$A$3:$K$303,9,FALSE)","v":"TS3-OpzA20CPU8C"},{"$f":"VLOOKUP(L27,Tabella_prezzi!$A$3:$K$303,3,FALSE)","v":"Kit n. 1 Processore 8 Core aggiuntivo"},null,{"$f":"VLOOKUP(L27,Tabella_prezzi!$A$3:$K$303,4,FALSE)","v":99999},"L4N48",{"$f":"VLOOKUP(L27,Tabella_prezzi!$A$3:$K$303,6,FALSE)","v":"TS3L4-CPU8CORE"}]
[]
[]
["TS3L4_RAM (1CPU)"]
["64GB","Memory Capacity",null,{"$f":"D32","v":"64GB - 2RX4 DDR4 RDIMM 3200MHz"},null,"370-AEVP",0,{"$f":"H32","v":"L4N04-OpzRAM64GB"},{"$f":"\"\"","v":""},null,null,{"$f":"\"\"","v":""},{"$f":"\"\"","v":""}]
["128GB","Memory Capacity",null,{"$f":"VLOOKUP(L32,Tabella_prezzi!$A$3:$K$303,8,FALSE)","v":"64GB - 2RX4 DDR4 RDIMM 3200MHz"},null,"370-AEVP",1,{"$f":"VLOOKUP(L32,Tabella_prezzi!$A$3:$K$303,9,FALSE)","v":"L4N04-OpzRAM64GB"},{"$f":"VLOOKUP(L32,Tabella_prezzi!$A$3:$K$303,3,FALSE)","v":"OpzRAM64GB"},{"$f":"VLOOKUP(L32,Tabella_prezzi!$A$3:$K$303,4,FALSE)*G32","v":444},null,"L4N04",{"$f":"VLOOKUP(L32,Tabella_prezzi!$A$3:$K$303,6,FALSE)","v":"TS3L4-RAM64"}]
["192GB","Memory Capacity",null,{"$f":"VLOOKUP(L33,Tabella_prezzi!$A$3:$K$303,8,FALSE)","v":"64GB - 2RX4 DDR4 RDIMM 3200MHz"},null,"370-AEVP",2,{"$f":"VLOOKUP(L33,Tabella_prezzi!$A$3:$K$303,9,FALSE)","v":"L4N04-OpzRAM64GB"},{"$f":"VLOOKUP(L33,Tabella_prezzi!$A$3:$K$303,3,FALSE)","v":"OpzRAM64GB"},{"$f":"VLOOKUP(L33,Tabella_prezzi!$A$3:$K$303,4,FALSE)*G33","v":888},null,"L4N04",{"$f":"VLOOKUP(L33,Tabella_prezzi!$A$3:$K$303,6,FALSE)","v":"TS3L4-RAM64"}]
["256GB","Memory Capacity",null,{"$f":"VLOOKUP(L34,Tabella_prezzi!$A$3:$K$303,8,FALSE)","v":"64GB - 2RX4 DDR4 RDIMM 3200MHz"},null,"370-AEVP",3,{"$f":"VLOOKUP(L34,Tabella_prezzi!$A$3:$K$303,9,FALSE)","v":"L4N04-OpzRAM64GB"},{"$f":"VLOOKUP(L34,Tabella_prezzi!$A$3:$K$303,3,FALSE)","v":"OpzRAM64GB"},{"$f":"VLOOKUP(L34,Tabella_prezzi!$A$3:$K$303,4,FALSE)*G34","v":1332},null,"L4N04",{"$f":"VLOOKUP(L34,Tabella_prezzi!$A$3:$K$303,6,FALSE)","v":"TS3L4-RAM64"}]
["320GB","Memory Capacity",null,{"$f":"VLOOKUP(L35,Tabella_prezzi!$A$3:$K$303,8,FALSE)","v":"64GB - 2RX4 DDR4 RDIMM 3200MHz"},null,"370-AEVP",4,{"$f":"VLOOKUP(L35,Tabella_prezzi!$A$3:$K$303,9,FALSE)","v":"L4N04-OpzRAM64GB"},{"$f":"VLOOKUP(L35,Tabella_prezzi!$A$3:$K$303,3,FALSE)","v":"OpzRAM64GB"},{"$f":"VLOOKUP(L35,Tabella_prezzi!$A$3:$K$303,4,FALSE)*G35","v":1776},null,"L4N04",{"$f":"VLOOKUP(L35,Tabella_prezzi!$A$3:$K$303,6,FALSE)","v":"TS3L4-RAM64"}]
["384GB","Memory Capacity",null,{"$f":"VLOOKUP(L36,Tabella_prezzi!$A$3:$K$303,8,FALSE)","v":"64GB - 2RX4 DDR4 RDIMM 3200MHz"},null,"370-AEVP",5,{"$f":"VLOOKUP(L36,Tabella_prezzi!$A$3:$K$303,9,FALSE)","v":"L4N04-OpzRAM64GB"},{"$f":"VLOOKUP(L36,Tabella_prezzi!$A$3:$K$303,3,FALSE)","v":"OpzRAM64GB"},{"$f":"VLOOKUP(L36,Tabella_prezzi!$A$3:$K$303,4,FALSE)*G36","v":2220},null,"L4N04",{"$f":"VLOOKUP(L36,Tabella_prezzi!$A$3:$K$303,6,FALSE)","v":"TS3L4-RAM64"}]
["448GB","Memory Capacity",null,{"$f":"VLOOKUP(L37,Tabella_prezzi!$A$3:$K$303,8,FALSE)","v":"64GB - 2RX4 DDR4 RDIMM 3200MHz"},null,"370-AEVP",6,{"$f":"VLOOKUP(L37,Tabella_prezzi!$A$3:$K$303,9,FALSE)","v":"L4N04-OpzRAM64GB"},{"$f":"VLOOKUP(L37,Tabella_prezzi!$A$3:$K$303,3,FALSE)","v":"OpzRAM64GB"},{"$f":"VLOOKUP(L37,Tabella_prezzi!$A$3:$K$303,4,FALSE)*G37","v":2664},null,"L4N04",{"$f":"VLOOKUP(L37,Tabella_prezzi!$A$3:$K$303,6,FALSE)","v":"TS3L4-RAM64"}]
["512GB","Memory Capacity",null,{"$f":"VLOOKUP(L38,Tabella_prezzi!$A$3:$K$303,8,FALSE)","v":"64GB - 2RX4 DDR4 RDIMM 3200MHz"},null,"370-AEVP",7,{"$f":"VLOOKUP(L38,Tabella_prezzi!$A$3:$K$303,9,FALSE)","v":"L4N04-OpzRAM64GB"},{"$f":"VLOOKUP(L38,Tabella_prezzi!$A$3:$K$303,3,FALSE)","v":"OpzRAM64GB"},{"$f":"VLOOKUP(L38,Tabella_prezzi!$A$3:$K$303,4,FALSE)*G38","v":3108},null,"L4N04",{"$f":"VLOOKUP(L38,Tabella_prezzi!$A$3:$K$303,6,FALSE)","v":"TS3L4-RAM64"}]
["576GB","Memory Capacity",null,{"$f":"VLOOKUP(L39,Tabella_prezzi!$A$3:$K$303,8,FALSE)","v":"64GB - 2RX4 DDR4 RDIMM 3200MHz"},null,"370-AEVP",8,{"$f":"VLOOKUP(L39,Tabella_prezzi!$A$3:$K$303,9,FALSE)","v":"L4N04-OpzRAM64GB"},{"$f":"VLOOKUP(L39,Tabella_prezzi!$A$3:$K$303,3,FALSE)","v":"OpzRAM64GB"},{"$f":"VLOOKUP(L39,Tabella_prezzi!$A$3:$K$303,4,FALSE)*G39","v":3552},null,"L4N04",{"$f":"VLOOKUP(L39,Tabella_prezzi!$A$3:$K$303,6,FALSE)","v":"TS3L4-RAM64"}]
["640GB","Memory Capacity",null,{"$f":"VLOOKUP(L40,Tabella_prezzi!$A$3:$K$303,8,FALSE)","v":"64GB - 2RX4 DDR4 RDIMM 3200MHz"},null,"370-AEVP",9,{"$f":"VLOOKUP(L40,Tabella_prezzi!$A$3:$K$303,9,FALSE)","v":"L4N04-OpzRAM64GB"},{"$f":"VLOOKUP(L40,Tabella_prezzi!$A$3:$K$303,3,FALSE)","v":"OpzRAM64GB"},{"$f":"VLOOKUP(L40,Tabella_prezzi!$A$3:$K$303,4,FALSE)*G40","v":3996},null,"L4N04",{"$f":"VLOOKUP(L40,Tabella_prezzi!$A$3:$K$303,6,FALSE)","v":"TS3L4-RAM64"}]
["704GB","Memory Capacity",null,{"$f":"VLOOKUP(L41,Tabella_prezzi!$A$3:$K$303,8,FALSE)","v":"64GB - 2RX4 DDR4 RDIMM 3200MHz"},null,"370-AEVP",10,{"$f":"VLOOKUP(L41,Tabella_prezzi!$A$3:$K$303,9,FALSE)","v":"L4N04-OpzRAM64GB"},{"$f":"VLOOKUP(L41,Tabella_prezzi!$A$3:$K$303,3,FALSE)","v":"OpzRAM64GB"},{"$f":"VLOOKUP(L41,Tabella_prezzi!$A$3:$K$303,4,FALSE)*G41","v":4440},null,"L4N04",{"$f":"VLOOKUP(L41,Tabella_prezzi!$A$3:$K$303,6,FALSE)","v":"TS3L4-RAM64"}]
["768GB","Memory Capacity",null,{"$f":"VLOOKUP(L42,Tabella_prezzi!$A$3:$K$303,8,FALSE)","v":"64GB - 2RX4 DDR4 RDIMM 3200MHz"},null,"370-AEVP",11,{"$f":"VLOOKUP(L42,Tabella_prezzi!$A$3:$K$303,9,FALSE)","v":"L4N04-OpzRAM64GB"},{"$f":"VLOOKUP(L42,Tabella_prezzi!$A$3:$K$303,3,FALSE)","v":"OpzRAM64GB"},{"$f":"VLOOKUP(L42,Tabella_prezzi!$A$3:$K$303,4,FALSE)*G42","v":4884},null,"L4N04",{"$f":"VLOOKUP(L42,Tabella_prezzi!$A$3:$K$303,6,FALSE)","v":"TS3L4-RAM64"}]
[]
["TS3L4_RAM (2CPU)"]
["128GB","Memory Capacity",null,{"$f":"VLOOKUP(L45,Tabella_prezzi!$A$3:$K$303,8,FALSE)","v":"64GB - 2RX4 DDR4 RDIMM 3200MHz"},null,"370-AEVP",1,{"$f":"VLOOKUP(L45,Tabella_prezzi!$A$3:$K$303,9,FALSE)","v":"L4N04-OpzRAM64GB"},{"$f":"VLOOKUP(L45,Tabella_prezzi!$A$3:$K$303,3,FALSE)","v":"OpzRAM64GB"},{"$f":"VLOOKUP(L45,Tabella_prezzi!$A$3:$K$303,4,FALSE)*G45","v":444},null,"L4N04",{"$f":"VLOOKUP(L45,Tabella_prezzi!$A$3:$K$303,6,FALSE)","v":"TS3L4-RAM64"}]
["256GB","Memory Capacity",null,{"$f":"VLOOKUP(L46,Tabella_prezzi!$A$3:$K$303,8,FALSE)","v":"64GB - 2RX4 DDR4 RDIMM 3200MHz"},null,"370-AEVP",3,{"$f":"VLOOKUP(L46,Tabella_prezzi!$A$3:$K$303,9,FALSE)","v":"L4N04-OpzRAM64GB"},{"$f":"VLOOKUP(L46,Tabella_prezzi!$A$3:$K$303,3,FALSE)","v":"OpzRAM64GB"},{"$f":"VLOOKUP(L46,Tabella_prezzi!$A$3:$K$303,4,FALSE)*G46","v":1332},null,"L4N04",{"$f":"VLOOKUP(L46,Tabella_prezzi!$A$3:$K$303,6,FALSE)","v":"TS3L4-RAM64"}]
["384GB","Memory Capacity",null,{"$f":"VLOOKUP(L47,Tabella_prezzi!$A$3:$K$303,8,FALSE)","v":"64GB - 2RX4 DDR4 RDIMM 3200MHz"},null,"370-AEVP",5,{"$f":"VLOOKUP(L47,Tabella_prezzi!$A$3:$K$303,9,FALSE)","v":"L4N04-OpzRAM64GB"},{"$f":"VLOOKUP(L47,Tabella_prezzi!$A$3:$K$303,3,FALSE)","v":"OpzRAM64GB"},{"$f":"VLOOKUP(L47,Tabella_prezzi!$A$3:$K$303,4,FALSE)*G47","v":2220},null,"L4N04",{"$f":"VLOOKUP(L47,Tabella_prezzi!$A$3:$K$303,6,FALSE)","v":"TS3L4-RAM64"}]
["512GB","Memory Capacity",null,{"$f":"VLOOKUP(L48,Tabella_prezzi!$A$3:$K$303,8,FALSE)","v":"64GB - 2RX4 DDR4 RDIMM 3200MHz"},null,"370-AEVP",7,{"$f":"VLOOKUP(L48,Tabella_prezzi!$A$3:$K$303,9,FALSE)","v":"L4N04-OpzRAM64GB"},{"$f":"VLOOKUP(L48,Tabella_prezzi!$A$3:$K$303,3,FALSE)","v":"OpzRAM64GB"},{"$f":"VLOOKUP(L48,Tabella_prezzi!$A$3:$K$303,4,FALSE)*G48","v":3108},null,"L4N04",{"$f":"VLOOKUP(L48,Tabella_prezzi!$A$3:$K$303,6,FALSE)","v":"TS3L4-RAM64"}]
["640GB","Memory Capacity",null,{"$f":"VLOOKUP(L49,Tabella_prezzi!$A$3:$K$303,8,FALSE)","v":"64GB - 2RX4 DDR4 RDIMM 3200MHz"},null,"370-AEVP",9,{"$f":"VLOOKUP(L49,Tabella_prezzi!$A$3:$K$303,9,FALSE)","v":"L4N04-OpzRAM64GB"},{"$f":"VLOOKUP(L49,Tabella_prezzi!$A$3:$K$303,3,FALSE)","v":"OpzRAM64GB"},{"$f":"VLOOKUP(L49,Tabella_prezzi!$A$3:$K$303,4,FALSE)*G49","v":3996},null,"L4N04",{"$f":"VLOOKUP(L49,Tabella_prezzi!$A$3:$K$303,6,FALSE)","v":"TS3L4-RAM64"}]
["768GB","Memory Capacity",null,{"$f":"VLOOKUP(L50,Tabella_prezzi!$A$3:$K$303,8,FALSE)","v":"64GB - 2RX4 DDR4 RDIMM 3200MHz"},null,"370-AEVP",11,{"$f":"VLOOKUP(L50,Tabella_prezzi!$A$3:$K$303,9,FALSE)","v":"L4N04-OpzRAM64GB"},{"$f":"VLOOKUP(L50,Tabella_prezzi!$A$3:$K$303,3,FALSE)","v":"OpzRAM64GB"},{"$f":"VLOOKUP(L50,Tabella_prezzi!$A$3:$K$303,4,FALSE)*G50","v":4884},null,"L4N04",{"$f":"VLOOKUP(L50,Tabella_prezzi!$A$3:$K$303,6,FALSE)","v":"TS3L4-RAM64"}]
["896GB","Memory Capacity",null,{"$f":"VLOOKUP(L51,Tabella_prezzi!$A$3:$K$303,8,FALSE)","v":"64GB - 2RX4 DDR4 RDIMM 3200MHz"},null,"370-AEVP",13,{"$f":"VLOOKUP(L51,Tabella_prezzi!$A$3:$K$303,9,FALSE)","v":"L4N04-OpzRAM64GB"},{"$f":"VLOOKUP(L51,Tabella_prezzi!$A$3:$K$303,3,FALSE)","v":"OpzRAM64GB"},{"$f":"VLOOKUP(L51,Tabella_prezzi!$A$3:$K$303,4,FALSE)*G51","v":5772},null,"L4N04",{"$f":"VLOOKUP(L51,Tabella_prezzi!$A$3:$K$303,6,FALSE)","v":"TS3L4-RAM64"}]
["1024GB","Memory Capacity",null,{"$f":"VLOOKUP(L52,Tabella_prezzi!$A$3:$K$303,8,FALSE)","v":"64GB - 2RX4 DDR4 RDIMM 3200MHz"},null,"370-AEVP",15,{"$f":"VLOOKUP(L52,Tabella_prezzi!$A$3:$K$303,9,FALSE)","v":"L4N04-OpzRAM64GB"},{"$f":"VLOOKUP(L52,Tabella_prezzi!$A$3:$K$303,3,FALSE)","v":"OpzRAM64GB"},{"$f":"VLOOKUP(L52,Tabella_prezzi!$A$3:$K$303,4,FALSE)*G52","v":6660},null,"L4N04",{"$f":"VLOOKUP(L52,Tabella_prezzi!$A$3:$K$303,6,FALSE)","v":"TS3L4-RAM64"}]
["1152GB","Memory Capacity",null,{"$f":"VLOOKUP(L53,Tabella_prezzi!$A$3:$K$303,8,FALSE)","v":"64GB - 2RX4 DDR4 RDIMM 3200MHz"},null,"370-AEVP",17,{"$f":"VLOOKUP(L53,Tabella_prezzi!$A$3:$K$303,9,FALSE)","v":"L4N04-OpzRAM64GB"},{"$f":"VLOOKUP(L53,Tabella_prezzi!$A$3:$K$303,3,FALSE)","v":"OpzRAM64GB"},{"$f":"VLOOKUP(L53,Tabella_prezzi!$A$3:$K$303,4,FALSE)*G53","v":7548},null,"L4N04",{"$f":"VLOOKUP(L53,Tabella_prezzi!$A$3:$K$303,6,FALSE)","v":"TS3L4-RAM64"}]
["1280GB","Memory Capacity",null,{"$f":"VLOOKUP(L54,Tabella_prezzi!$A$3:$K$303,8,FALSE)","v":"64GB - 2RX4 DDR4 RDIMM 3200MHz"},null,"370-AEVP",19,{"$f":"VLOOKUP(L54,Tabella_prezzi!$A$3:$K$303,9,FALSE)","v":"L4N04-OpzRAM64GB"},{"$f":"VLOOKUP(L54,Tabella_prezzi!$A$3:$K$303,3,FALSE)","v":"OpzRAM64GB"},{"$f":"VLOOKUP(L54,Tabella_prezzi!$A$3:$K$303,4,FALSE)*G54","v":8436},null,"L4N04",{"$f":"VLOOKUP(L54,Tabella_prezzi!$A$3:$K$303,6,FALSE)","v":"TS3L4-RAM64"}]
["1408GB","Memory Capacity",null,{"$f":"VLOOKUP(L55,Tabella_prezzi!$A$3:$K$303,8,FALSE)","v":"64GB - 2RX4 DDR4 RDIMM 3200MHz"},null,"370-AEVP",21,{"$f":"VLOOKUP(L55,Tabella_prezzi!$A$3:$K$303,9,FALSE)","v":"L4N04-OpzRAM64GB"},{"$f":"VLOOKUP(L55,Tabella_prezzi!$A$3:$K$303,3,FALSE)","v":"OpzRAM64GB"},{"$f":"VLOOKUP(L55,Tabella_prezzi!$A$3:$K$303,4,FALSE)*G55","v":9324},null,"L4N04",{"$f":"VLOOKUP(L55,Tabella_prezzi!$A$3:$K$303,6,FALSE)","v":"TS3L4-RAM64"}]
["1536GB","Memory Capacity",null,{"$f":"VLOOKUP(L56,Tabella_prezzi!$A$3:$K$303,8,FALSE)","v":"64GB - 2RX4 DDR4 RDIMM 3200MHz"},null,"370-AEVP",23,{"$f":"VLOOKUP(L56,Tabella_prezzi!$A$3:$K$303,9,FALSE)","v":"L4N04-OpzRAM64GB"},{"$f":"VLOOKUP(L56,Tabella_prezzi!$A$3:$K$303,3,FALSE)","v":"OpzRAM64GB"},{"$f":"VLOOKUP(L56,Tabella_prezzi!$A$3:$K$303,4,FALSE)*G56","v":10212},null,"L4N04",{"$f":"VLOOKUP(L56,Tabella_prezzi!$A$3:$K$303,6,FALSE)","v":"TS3L4-RAM64"}]
[1,2,3,4,5,6,7,8,9,10,11,12,13,14,15,16,17,18,19,20,21,22,23]
[]
["TS3L4_RAM (2CPU)vxfelx"]
["192GB","Memory Capacity",null,{"$f":"VLOOKUP(L60,Tabella_prezzi!$A$3:$K$303,8,FALSE)","v":"64GB - 2RX4 DDR4 RDIMM 3200MHz"},null,"370-AEVP",2,{"$f":"VLOOKUP(L60,Tabella_prezzi!$A$3:$K$303,9,FALSE)","v":"L4N04-OpzRAM64GB"},{"$f":"VLOOKUP(L60,Tabella_prezzi!$A$3:$K$303,3,FALSE)","v":"OpzRAM64GB"},{"$f":"VLOOKUP(L60,Tabella_prezzi!$A$3:$K$303,4,FALSE)*G60","v":888},null,"L4N04",{"$f":"VLOOKUP(L60,Tabella_prezzi!$A$3:$K$303,6,FALSE)","v":"TS3L4-RAM64"}]
["384GB","Memory Capacity",null,{"$f":"VLOOKUP(L61,Tabella_prezzi!$A$3:$K$303,8,FALSE)","v":"64GB - 2RX4 DDR4 RDIMM 3200MHz"},null,"370-AEVP",5,{"$f":"VLOOKUP(L61,Tabella_prezzi!$A$3:$K$303,9,FALSE)","v":"L4N04-OpzRAM64GB"},{"$f":"VLOOKUP(L61,Tabella_prezzi!$A$3:$K$303,3,FALSE)","v":"OpzRAM64GB"},{"$f":"VLOOKUP(L61,Tabella_prezzi!$A$3:$K$303,4,FALSE)*G61","v":2220},null,"L4N04",{"$f":"VLOOKUP(L61,Tabella_prezzi!$A$3:$K$303,6,FALSE)","v":"TS3L4-RAM64"}]
["768GB","Memory Capacity",null,{"$f":"VLOOKUP(L62,Tabella_prezzi!$A$3:$K$303,8,FALSE)","v":"64GB - 2RX4 DDR4 RDIMM 3200MHz"},null,"370-AEVP",11,{"$f":"VLOOKUP(L62,Tabella_prezzi!$A$3:$K$303,9,FALSE)","v":"L4N04-OpzRAM64GB"},{"$f":"VLOOKUP(L62,Tabella_prezzi!$A$3:$K$303,3,FALSE)","v":"OpzRAM64GB"},{"$f":"VLOOKUP(L62,Tabella_prezzi!$A$3:$K$303,4,FALSE)*G62","v":4884},null,"L4N04",{"$f":"VLOOKUP(L62,Tabella_prezzi!$A$3:$K$303,6,FALSE)","v":"TS3L4-RAM64"}]
["1536GB","Memory Capacity",null,{"$f":"VLOOKUP(L63,Tabella_prezzi!$A$3:$K$303,8,FALSE)","v":"64GB - 2RX4 DDR4 RDIMM 3200MHz"},null,"370-AEVP",23,{"$f":"VLOOKUP(L63,Tabella_prezzi!$A$3:$K$303,9,FALSE)","v":"L4N04-OpzRAM64GB"},{"$f":"VLOOKUP(L63,Tabella_prezzi!$A$3:$K$303,3,FALSE)","v":"OpzRAM64GB"},{"$f":"VLOOKUP(L63,Tabella_prezzi!$A$3:$K$303,4,FALSE)*G63","v":10212},null,"L4N04",{"$f":"VLOOKUP(L63,Tabella_prezzi!$A$3:$K$303,6,FALSE)","v":"TS3L4-RAM64"}]
[]
["TS3L4_OS"]
["No Operating System","Operating System",null,null,null,null,0,null,{"$f":"\"\"","v":""},null,null,{"$f":"\"\"","v":""},{"$f":"\"\"","v":""},0,null,{"$f":"\"\"","v":""},{"$f":"\"\"","v":""},null,0,0,null,null,{"$f":"\"\"","v":""}]
["[TS3L4-WINSRVSTD] Windows Server® 2019 Standard","Operating System",null,{"$f":"VLOOKUP(L67,Tabella_prezzi!$A$3:$K$303,8,FALSE)","v":"Windows Server 2019 Standard, ROK, 16CORE"},null,null,1,{"$f":"VLOOKUP(L67,Tabella_prezzi!$A$3:$K$303,9,FALSE)","v":"L4N22-OpzWinServSTD"},{"$f":"VLOOKUP(L67,Tabella_prezzi!$A$3:$K$303,3,FALSE)","v":"OpzWinServSTD"},{"$f":"VLOOKUP(L67,Tabella_prezzi!$A$3:$K$303,4,FALSE)","v":682},null,"L4N22",{"$f":"VLOOKUP(L67,Tabella_prezzi!$A$3:$K$303,6,FALSE)","v":"TS3L4-WINSRVSTD"},20,{"$f":"VLOOKUP(T67,Tabella_prezzi!$A$3:$K$303,9,FALSE)","v":"L4N25-OpzWinServSTD2core"},{"$f":"VLOOKUP(T67,Tabella_prezzi!$A$3:$K$303,3,FALSE)","v":"OpzWinServSTD2core"},{"$f":"VLOOKUP(T67,Tabella_prezzi!$A$3:$K$303,4,FALSE)*N67","v":1900},null,6,"L4N25",{"$f":"VLOOKUP(T67,Tabella_prezzi!$A$3:$K$303,4,FALSE)*S67","v":570},null,{"$f":"VLOOKUP(T67,Tabella_prezzi!$A$3:$K$303,6,FALSE)","v":"TS3L4-WINSRV2C"}]
["[TS3L4-WINDC] Windows Server® 2019 DataCenter","Operating System",null,{"$f":"VLOOKUP(L68,Tabella_prezzi!$A$3:$K$303,8,FALSE)","v":"Windows Server 2019 Data Center, ROK, 16CORE"},null,null,1,{"$f":"VLOOKUP(L68,Tabella_prezzi!$A$3:$K$303,9,FALSE)","v":"TS3-OpzA20WDC"},{"$f":"VLOOKUP(L68,Tabella_prezzi!$A$3:$K$303,3,FALSE)","v":"OpzWinServDC"},null,{"$f":"VLOOKUP(L68,Tabella_prezzi!$A$3:$K$303,4,FALSE)","v":4339},"L4N59",{"$f":"VLOOKUP(L68,Tabella_prezzi!$A$3:$K$303,6,FALSE)","v":"TS3L4-WINDC"},20,{"$f":"VLOOKUP(T68,Tabella_prezzi!$A$3:$K$303,9,FALSE)","v":"TS3-OpzA20WDC2C"},{"$f":"VLOOKUP(T68,Tabella_prezzi!$A$3:$K$303,3,FALSE)","v":"OpzWinServDC2core"},null,{"$f":"VLOOKUP(T68,Tabella_prezzi!$A$3:$K$303,4,FALSE)*N68","v":10900},6,"L4N60",null,{"$f":"VLOOKUP(T68,Tabella_prezzi!$A$3:$K$303,4,FALSE)*S68","v":3270},{"$f":"VLOOKUP(T68,Tabella_prezzi!$A$3:$K$303,6,FALSE)","v":"TS3L4-WINDC2C"}]
["[TS3L4-LINUX] Ubuntu 18.04 LTS 64 Bit","Operating System",null,{"$f":"VLOOKUP(L69,Tabella_prezzi!$A$3:$K$303,8,FALSE)","v":"Ubuntu 18.04 LTS 64 Bit"},null,null,1,{"$f":"VLOOKUP(L69,Tabella_prezzi!$A$3:$K$303,9,FALSE)","v":"L4N26-OpzOpenSource"},{"$f":"VLOOKUP(L69,Tabella_prezzi!$A$3:$K$303,3,FALSE)","v":"OpzOpenSource"},{"$f":"VLOOKUP(L69,Tabella_prezzi!$A$3:$K$303,4,FALSE)","v":49},null,"L4N26",{"$f":"VLOOKUP(L69,Tabella_prezzi!$A$3:$K$303,6,FALSE)","v":"TS3L4-LINUX"},0,null,{"$f":"\"\"","v":""},{"$f":"\"\"","v":""},null,0,0,null,null,{"$f":"\"\"","v":""}]
[]
["TS3L4_HDD"]
[{"$f":"\"\"","v":""},null,null,null,null,null,{"$f":"\"\"","v":""},null,{"$f":"\"\"","v":""},null,null,{"$f":"\"\"","v":""},{"$f":"\"\"","v":""}]
["300GB 15K RPM SAS 12Gbps 2.5in Hot-plug","Hard Drives",null,{"$f":"VLOOKUP(L73,Tabella_prezzi!$A$3:$K$303,8,FALSE)","v":"HDD 300GB 15K SAS 12Gbps 2.5in Hot-plug"},null,null,1,{"$f":"VLOOKUP(L73,Tabella_prezzi!$A$3:$K$303,9,FALSE)","v":"L4N12-OpzHDD300GB"},{"$f":"VLOOKUP(L73,Tabella_prezzi!$A$3:$K$303,3,FALSE)","v":"OpzHDD300GB"},{"$f":"VLOOKUP(L73,Tabella_prezzi!$A$3:$K$303,4,FALSE)","v":71},null,"L4N12",{"$f":"VLOOKUP(L73,Tabella_prezzi!$A$3:$K$303,6,FALSE)","v":"TS3L4-HDD300GB"}]
["1.2TB 10K RPM SAS 12Gbps 2.5in Hot-plug","Hard Drives",null,{"$f":"VLOOKUP(L74,Tabella_prezzi!$A$3:$K$303,8,FALSE)","v":"HDD 1200GB 10K SAS 12Gbps 2.5in Hot-plug"},null,null,1,{"$f":"VLOOKUP(L74,Tabella_prezzi!$A$3:$K$303,9,FALSE)","v":"L4N11-OpzHDD1TB"},{"$f":"VLOOKUP(L74,Tabella_prezzi!$A$3:$K$303,3,FALSE)","v":"OpzHDD1TB"},{"$f":"VLOOKUP(L74,Tabella_prezzi!$A$3:$K$303,4,FALSE)","v":77},null,"L4N11",{"$f":"VLOOKUP(L74,Tabella_prezzi!$A$3:$K$303,6,FALSE)","v":"TS3L4-HDD1TB"}]
["2.4TB 10K RPM SAS 12Gbps 2.5in Hot-plug","Hard Drives",null,{"$f":"VLOOKUP(L75,Tabella_prezzi!$A$3:$K$303,8,FALSE)","v":"HDD 2400GB 10K SAS 12Gbps 2.5in Hot-plug"},null,null,1,{"$f":"VLOOKUP(L75,Tabella_prezzi!$A$3:$K$303,9,FALSE)","v":"L4N10-OpzHDD2TB"},{"$f":"VLOOKUP(L75,Tabella_prezzi!$A$3:$K$303,3,FALSE)","v":"OpzHDD2TB"},{"$f":"VLOOKUP(L75,Tabella_prezzi!$A$3:$K$303,4,FALSE)","v":127},null,"L4N10",{"$f":"VLOOKUP(L75,Tabella_prezzi!$A$3:$K$303,6,FALSE)","v":"TS3L4-HDD2TB"}]
["960GB SSD SAS Read Intensive 12Gbps 2.5in Hot-plug","Hard Drives",null,{"$f":"VLOOKUP(L76,Tabella_prezzi!$A$3:$K$303,8,FALSE)","v":"SSD 960GB SAS RI 12Gbps 2.5in Hot-plug, 1 DWPD"},null,null,1,{"$f":"VLOOKUP(L76,Tabella_prezzi!$A$3:$K$303,9,FALSE)","v":"L4N15-OpzSSD-RI800GB"},{"$f":"VLOOKUP(L76,Tabella_prezzi!$A$3:$K$303,3,FALSE)","v":"OpzSSD-RI800GB"},{"$f":"VLOOKUP(L76,Tabella_prezzi!$A$3:$K$303,4,FALSE)","v":241},null,"L4N15",{"$f":"VLOOKUP(L76,Tabella_prezzi!$A$3:$K$303,6,FALSE)","v":"TS3L4-RI800GB"}]
["1.92TB SSD SAS Read Intensive 12Gbps 2.5in Hot-plug","Hard Drives",null,{"$f":"VLOOKUP(L77,Tabella_prezzi!$A$3:$K$303,8,FALSE)","v":"SSD 1,92TB SAS RI 12Gbps 2.5in Hot-plug, 1 DWPD"},null,null,1,{"$f":"VLOOKUP(L77,Tabella_prezzi!$A$3:$K$303,9,FALSE)","v":"L4N13-OpzSSD-RI1,6TB"},{"$f":"VLOOKUP(L77,Tabella_prezzi!$A$3:$K$303,3,FALSE)","v":"OpzSSD-RI1,6TB"},{"$f":"VLOOKUP(L77,Tabella_prezzi!$A$3:$K$303,4,FALSE)","v":412},null,"L4N13",{"$f":"VLOOKUP(L77,Tabella_prezzi!$A$3:$K$303,6,FALSE)","v":"TS3L4-RI1600GB"}]
["3.84TB SSD SAS Read Intensive 12Gbps 2.5in Hot-plug","Hard Drives",null,{"$f":"VLOOKUP(L78,Tabella_prezzi!$A$3:$K$303,8,FALSE)","v":"SSD 3,84TB SAS RI 12Gbps 2.5in Hot-plug, 1 DWPD"},null,null,1,{"$f":"VLOOKUP(L78,Tabella_prezzi!$A$3:$K$303,9,FALSE)","v":"TS3-OpzA20RI384"},{"$f":"VLOOKUP(L78,Tabella_prezzi!$A$3:$K$303,3,FALSE)","v":"OpzSSD-RI3,84TB"},null,{"$f":"VLOOKUP(L78,Tabella_prezzi!$A$3:$K$303,4,FALSE)","v":1380},"L4N51",{"$f":"VLOOKUP(L78,Tabella_prezzi!$A$3:$K$303,6,FALSE)","v":"TS3L4-RI3840GB"}]
["7.68TB SSD SAS Read Intensive 12Gbps 2.5in Hot-plug","Hard Drives",null,{"$f":"VLOOKUP(L79,Tabella_prezzi!$A$3:$K$303,8,FALSE)","v":"SSD 7,68TB VSAS RI 12Gbps 2.5in Hot-plug, 1 DWPD"},null,null,1,{"$f":"VLOOKUP(L79,Tabella_prezzi!$A$3:$K$303,9,FALSE)","v":"TS3-OpzA20RI768"},{"$f":"VLOOKUP(L79,Tabella_prezzi!$A$3:$K$303,3,FALSE)","v":"OpzSSD-RI7,68TB"},null,{"$f":"VLOOKUP(L79,Tabella_prezzi!$A$3:$K$303,4,FALSE)","v":2580},"L4N52",{"$f":"VLOOKUP(L79,Tabella_prezzi!$A$3:$K$303,6,FALSE)","v":"TS3L4-RI7680GB"}]
["960GB SSD SAS Mixed Use 12Gbps 512e 2.5in Hot-Plug","Hard Drives",null,{"$f":"VLOOKUP(L80,Tabella_prezzi!$A$3:$K$303,8,FALSE)","v":"SSD 960GB SAS MU 12Gbps 2.5in Hot-plug, 3 DWPD"},null,null,1,{"$f":"VLOOKUP(L80,Tabella_prezzi!$A$3:$K$303,9,FALSE)","v":"L4N16-OpzSSD-MU800GB"},{"$f":"VLOOKUP(L80,Tabella_prezzi!$A$3:$K$303,3,FALSE)","v":"OpzSSD-MU800GB"},{"$f":"VLOOKUP(L80,Tabella_prezzi!$A$3:$K$303,4,FALSE)","v":609},null,"L4N16",{"$f":"VLOOKUP(L80,Tabella_prezzi!$A$3:$K$303,6,FALSE)","v":"TS3L4-MU800GB"}]
["1.6TB SSD SAS Mix Use 12Gbps 2.5in Hot-plug","Hard Drives",null,{"$f":"VLOOKUP(L81,Tabella_prezzi!$A$3:$K$303,8,FALSE)","v":"SSD 1,6TB SAS MU 12Gbps 2.5in Hot-plug, 3 DWPD"},null,null,1,{"$f":"VLOOKUP(L81,Tabella_prezzi!$A$3:$K$303,9,FALSE)","v":"L4N14-OpzSSD-MU1,6TB"},{"$f":"VLOOKUP(L81,Tabella_prezzi!$A$3:$K$303,3,FALSE)","v":"OpzSSD-MU1,6TB"},{"$f":"VLOOKUP(L81,Tabella_prezzi!$A$3:$K$303,4,FALSE)","v":584},null,"L4N14",{"$f":"VLOOKUP(L81,Tabella_prezzi!$A$3:$K$303,6,FALSE)","v":"TS3L4-MU1600GB"}]
["800GB SSD SAS Write Intensive 12Gbps 2.5in Hot Plug ","Hard Drives",null,{"$f":"VLOOKUP(L82,Tabella_prezzi!$A$3:$K$303,8,FALSE)","v":"800GB SSD SAS Write Intensive 12Gbps 512e 2.5in Hot Plug Drive, PM5, 10 DWPD, 29200 TBW, CK"},null,null,1,{"$f":"VLOOKUP(L82,Tabella_prezzi!$A$3:$K$303,9,FALSE)","v":"TS3-OpzA20800WI"},{"$f":"VLOOKUP(L82,Tabella_prezzi!$A$3:$K$303,3,FALSE)","v":"OpzSSD-WI800GB"},null,{"$f":"VLOOKUP(L82,Tabella_prezzi!$A$3:$K$303,4,FALSE)","v":1106},"L4N53",{"$f":"VLOOKUP(L82,Tabella_prezzi!$A$3:$K$303,6,FALSE)","v":"TS3L4-WI800GB"}]
["1.6TB SSD SAS Write Intensive 12Gbps 2.5in Hot Plug","Hard Drives",null,{"$f":"VLOOKUP(L83,Tabella_prezzi!$A$3:$K$303,8,FALSE)","v":"1.6TB SSD SAS Write Intensive 12Gbps 512e 2.5in Hot Plug PM5-M Dr, 10 DWPD, 29200 TBW, CK"},null,null,1,{"$f":"VLOOKUP(L83,Tabella_prezzi!$A$3:$K$303,9,FALSE)","v":0},{"$f":"VLOOKUP(L83,Tabella_prezzi!$A$3:$K$303,3,FALSE)","v":"OpzSSD-WI1600GB"},null,{"$f":"VLOOKUP(L83,Tabella_prezzi!$A$3:$K$303,4,FALSE)","v":9999},"L4N54",{"$f":"VLOOKUP(L83,Tabella_prezzi!$A$3:$K$303,6,FALSE)","v":"TS3L4-WI1600GB"}]
[null,"Hard Drives",null,null,null,null,null,null,null,null,null,"L4N16",{"$f":"VLOOKUP(L84,Tabella_prezzi!$A$3:$K$303,6,FALSE)","v":"TS3L4-MU800GB"}]
[]
["TS3L4_PSU"]
["Dual, Hot-plug, Redundant Power Supply (1+1), 750W","Power Supply",null,"Dual, Hot-plug, Redundant Power Supply (1+1), 750W",null,null,{"$f":"\"\"","v":""},null,{"$f":"\"\"","v":""},null,null,{"$f":"\"\"","v":""},{"$f":"\"\"","v":""}]
["Dual, Hot-plug Power Supply (1+1), 1100W","Power Supply",null,{"$f":"VLOOKUP(L88,Tabella_prezzi!$A$3:$K$303,8,FALSE)","v":"Dual, Hot-plug Power Supply (1+1), 1100W in sostituzione di quelli in configurazione BASE"},null,null,1,{"$f":"VLOOKUP(L88,Tabella_prezzi!$A$3:$K$303,9,FALSE)","v":"TS3-OpzA201100W"},{"$f":"VLOOKUP(L88,Tabella_prezzi!$A$3:$K$303,3,FALSE)","v":"OpzPSU1100W"},null,{"$f":"VLOOKUP(L88,Tabella_prezzi!$A$3:$K$303,4,FALSE)","v":178},"L4N49",{"$f":"VLOOKUP(L88,Tabella_prezzi!$A$3:$K$303,6,FALSE)","v":"TS3L4-PSU1100W"}]
["Dual, Hot-plug Power Supply (1+1), 2000W","Power Supply",null,{"$f":"VLOOKUP(L89,Tabella_prezzi!$A$3:$K$303,8,FALSE)","v":"Dual, Hot-plug Power Supply (1+1), 2000W in sostituzione di quelli in configurazione BASE"},null,null,1,{"$f":"VLOOKUP(L89,Tabella_prezzi!$A$3:$K$303,9,FALSE)","v":"TS3-OpzA202000W"},{"$f":"VLOOKUP(L89,Tabella_prezzi!$A$3:$K$303,3,FALSE)","v":"OpzPSU2000W"},null,{"$f":"VLOOKUP(L89,Tabella_prezzi!$A$3:$K$303,4,FALSE)","v":306},"L4N50",{"$f":"VLOOKUP(L89,Tabella_prezzi!$A$3:$K$303,6,FALSE)","v":"TS3L4-PSU2000W"}]
[]
["TS3L4_AddCPU"]
[{"$f":"\"\"","v":""}]
["Aggiungere Secondo Processore"]
[]
[]
["Cavo “patch” di 3 mt RJ45 certificato per gigabit ethernet",null,null,{"$f":"VLOOKUP(L96,Tabella_prezzi!$A$3:$K$303,8,FALSE)","v":"Cavo “patch” di 3 mt RJ45 certificato per gigabit ethernet"},null,null,{"$f":"\"\"","v":""},{"$f":"VLOOKUP(L96,Tabella_prezzi!$A$3:$K$303,9,FALSE)","v":"TS3-OpzA20RJ45"},{"$f":"VLOOKUP(L96,Tabella_prezzi!$A$3:$K$303,3,FALSE)","v":"OpzRJ45 3m"},null,{"$f":"VLOOKUP(L96,Tabella_prezzi!$A$3:$K$303,4,FALSE)","v":3},"L4N62",{"$f":"VLOOKUP(L96,Tabella_prezzi!$A$3:$K$303,6,FALSE)","v":"TS3L4-RJ453M"}]
["Dell Networking, Cable, SFP+ to SFP+, 10GbE, Copper Twinax Direct Attach Cable, 3 Meter",null,null,"Dell Networking, Cable, SFP+ to SFP+, 10GbE, Copper Twinax Direct Attach Cable, 3 Meter",null,null,null,{"$f":"VLOOKUP(L97,Tabella_prezzi!$A$3:$K$303,9,FALSE)","v":"TS3-OpzA20DAC3S"},{"$f":"VLOOKUP(L97,Tabella_prezzi!$A$3:$K$303,3,FALSE)","v":0},null,{"$f":"VLOOKUP(L97,Tabella_prezzi!$A$3:$K$303,4,FALSE)","v":84},"L4N91",{"$f":"VLOOKUP(L97,Tabella_prezzi!$A$3:$K$303,6,FALSE)","v":"TS3L4-DAC3SFP"}]
["Mellanox LinkX 100Gb/s Passive Copper DAC 3m per scheda TS3L4-CONX6DP",null,null,"Mellanox LinkX 100Gb/s Passive Copper DAC 3m",null,null,null,{"$f":"VLOOKUP(L98,Tabella_prezzi!$A$3:$K$303,9,FALSE)","v":"TS3-OpzA20ML100"},{"$f":"VLOOKUP(L98,Tabella_prezzi!$A$3:$K$303,3,FALSE)","v":0},null,{"$f":"VLOOKUP(L98,Tabella_prezzi!$A$3:$K$303,4,FALSE)","v":258},"L4N92",{"$f":"VLOOKUP(L98,Tabella_prezzi!$A$3:$K$303,6,FALSE)","v":"TS3L4-MLX100M3"}]
["Dell Cable SFP28 to SFP28 25GbE Passive Copper Twinax Direct Attach Cable 3 Meter ",null,null,"Dell Cable SFP28 to SFP28 25GbE Passive Copper Twinax Direct Attach Cable 3 Meter ",null,null,null,{"$f":"VLOOKUP(L99,Tabella_prezzi!$A$3:$K$303,9,FALSE)","v":"TS3-OpzA20DAC28"},{"$f":"VLOOKUP(L99,Tabella_prezzi!$A$3:$K$303,3,FALSE)","v":0},null,{"$f":"VLOOKUP(L99,Tabella_prezzi!$A$3:$K$303,4,FALSE)","v":99},"L4N93",{"$f":"VLOOKUP(L99,Tabella_prezzi!$A$3:$K$303,6,FALSE)","v":"TS3L4-DAC3SFP28"}]
["Cable, SFP+ to SFP+, 10GbE, Copper Twinax Direct Attach Cable, 3 Meter",null,null,{"$f":"VLOOKUP(L100,Tabella_prezzi!$A$3:$K$303,8,FALSE)","v":"Cable, SFP+ to SFP+, 10GbE, Copper Twinax Direct Attach Cable, 3 Meter"},null,null,{"$f":"\"\"","v":""},{"$f":"VLOOKUP(L100,Tabella_prezzi!$A$3:$K$303,9,FALSE)","v":0},{"$f":"VLOOKUP(L100,Tabella_prezzi!$A$3:$K$303,3,FALSE)","v":"OpzDAC3M"},null,{"$f":"VLOOKUP(L100,Tabella_prezzi!$A$3:$K$303,4,FALSE)","v":9999},"L4N67",{"$f":"VLOOKUP(L100,Tabella_prezzi!$A$3:$K$303,6,FALSE)","v":"TS3L4-DAC3M"}]
["Transceiver, SFP+, 10GbE, SR, 850nm Wavelength, 300m ",null,null,{"$f":"VLOOKUP(L101,Tabella_prezzi!$A$3:$K$303,8,FALSE)","v":"Transceiver, SFP+, 10GbE, SR, 850nm Wavelength, 300m Reach"},null,null,null,{"$f":"VLOOKUP(L101,Tabella_prezzi!$A$3:$K$303,9,FALSE)","v":0},{"$f":"VLOOKUP(L101,Tabella_prezzi!$A$3:$K$303,3,FALSE)","v":"Opz10GBIC"},null,{"$f":"VLOOKUP(L101,Tabella_prezzi!$A$3:$K$303,4,FALSE)","v":90},"L4N66",{"$f":"VLOOKUP(L101,Tabella_prezzi!$A$3:$K$303,6,FALSE)","v":"TS3L4-10GBIC"}]
["Mellanox LinkX 100Gb/s Passive Copper Cables - attacco cavo diretto - 3 m - nero",null,null,{"$f":"VLOOKUP(L102,Tabella_prezzi!$A$3:$K$303,8,FALSE)","v":"Mellanox LinkX 100Gb/s Passive Copper Cables - attacco cavo diretto - 3 m - nero"},null,null,null,{"$f":"VLOOKUP(L102,Tabella_prezzi!$A$3:$K$303,9,FALSE)","v":0},{"$f":"VLOOKUP(L102,Tabella_prezzi!$A$3:$K$303,3,FALSE)","v":"OpzLINKX3m"},null,{"$f":"VLOOKUP(L102,Tabella_prezzi!$A$3:$K$303,4,FALSE)","v":9999},"L4N63",{"$f":"VLOOKUP(L102,Tabella_prezzi!$A$3:$K$303,6,FALSE)","v":"TS3L4-MEL100M3"}]
["Mellanox LinkX 100Gb/s VCSEL-Based Active Optical Cables - cavo InfiniBand - 10 m",null,null,{"$f":"VLOOKUP(L103,Tabella_prezzi!$A$3:$K$303,8,FALSE)","v":"Mellanox LinkX 100Gb/s VCSEL-Based Active Optical Cables - cavo InfiniBand - 10 m"},null,null,null,{"$f":"VLOOKUP(L103,Tabella_prezzi!$A$3:$K$303,9,FALSE)","v":0},{"$f":"VLOOKUP(L103,Tabella_prezzi!$A$3:$K$303,3,FALSE)","v":"OpzLINKX10m"},null,{"$f":"VLOOKUP(L103,Tabella_prezzi!$A$3:$K$303,4,FALSE)","v":9999},"L4N64",{"$f":"VLOOKUP(L103,Tabella_prezzi!$A$3:$K$303,6,FALSE)","v":"TS3L4-MEL100M10"}]
["Dell EMC PowerEdge QSFP28 SR4 100GbE 85C optic",null,null,{"$f":"VLOOKUP(L104,Tabella_prezzi!$A$3:$K$303,8,FALSE)","v":"Dell EMC PowerEdge QSFP28 SR4 100GbE 85C optic Customer Install"},null,null,null,{"$f":"VLOOKUP(L104,Tabella_prezzi!$A$3:$K$303,9,FALSE)","v":0},{"$f":"VLOOKUP(L104,Tabella_prezzi!$A$3:$K$303,3,FALSE)","v":"OpzQSFP28"},null,{"$f":"VLOOKUP(L104,Tabella_prezzi!$A$3:$K$303,4,FALSE)","v":9999},"L4N65",{"$f":"VLOOKUP(L104,Tabella_prezzi!$A$3:$K$303,6,FALSE)","v":"TS3L4-QSFP28"}]
["Dell Networking Cable, OM4 LC/LC Fiber Cable, 3 Meter",null,null,{"$f":"VLOOKUP(L105,Tabella_prezzi!$A$3:$K$303,8,FALSE)","v":"Dell Networking Cable, OM4 LC/LC Fiber Cable, 3 Meter"},null,null,{"$f":"\"\"","v":""},{"$f":"VLOOKUP(L105,Tabella_prezzi!$A$3:$K$303,9,FALSE)","v":"TS3L4-OM4M3"},{"$f":"VLOOKUP(L105,Tabella_prezzi!$A$3:$K$303,3,FALSE)","v":0},null,{"$f":"VLOOKUP(L105,Tabella_prezzi!$A$3:$K$303,4,FALSE)","v":69},"L4N130",{"$f":"VLOOKUP(L105,Tabella_prezzi!$A$3:$K$303,6,FALSE)","v":"TS3L4-OM4M3"}]
[]
["TS3L4_CTRL"]
[null,null,null,null,null,null,{"$f":"\"\"","v":""},null,{"$f":"\"\"","v":""},null,null,{"$f":"\"\"","v":""},{"$f":"\"\"","v":""}]
["PERC H740P RAID Controller, 8GB NV Cache","PERC H740P RAID Controller, 8GB NV Cache",null,null,null,null,{"$f":"\"\"","v":""},null,{"$f":"\"\"","v":""},null,null,{"$f":"\"\"","v":""},{"$f":"\"\"","v":""}]
["[TS3L4-HBA330-L] HBA330 12Gbps SAS HBA Controller (NON-RAID)","[TS3L4-HBA330-L] HBA330 12Gbps SAS HBA Controller (NON-RAID)",null,"HBA330 12Gbps SAS HBA Controller",null,null,1,{"$f":"VLOOKUP(L110,Tabella_prezzi!$A$3:$K$303,9,FALSE)","v":"TS3-OpzA20HBA3L"},{"$f":"VLOOKUP(L110,Tabella_prezzi!$A$3:$K$303,3,FALSE)","v":0},null,{"$f":"VLOOKUP(L110,Tabella_prezzi!$A$3:$K$303,4,FALSE)","v":180},"L4N34",{"$f":"VLOOKUP(L110,Tabella_prezzi!$A$3:$K$303,6,FALSE)","v":"TS3L4-HBA330-L"}]
[]
[{"$f":"Lotto4_R740XD_1!H4","v":""},{"$f":"IF(A112=\"\",A109,\"Pippo\")","v":"PERC H740P RAID Controller, 8GB NV Cache"},"Conf 1"]
[{"$f":"Lotto4_R740XD_2!H4","v":""},null,"Conf 2"]
[{"$f":"Lotto4_R740XD_3!H4","v":""},null,"Conf 3"]
["TS3L4_CMA"]
["No ",null,null,null,null,null,{"$f":"\"\"","v":""},null,{"$f":"\"\"","v":""},null,null,{"$f":"\"\"","v":""},{"$f":"\"\"","v":""}]
["2U Cable Management Arm","CMA","TS3L4-CMA2U","2U Cable Management Arm",null,null,1,{"$f":"VLOOKUP(L117,Tabella_prezzi!$A$3:$K$303,9,FALSE)","v":"TS3-OpzA20CMA2U"},{"$f":"VLOOKUP(L117,Tabella_prezzi!$A$3:$K$303,3,FALSE)","v":0},null,{"$f":"VLOOKUP(L117,Tabella_prezzi!$A$3:$K$303,4,FALSE)","v":50},"L4N135",{"$f":"VLOOKUP(L117,Tabella_prezzi!$A$3:$K$303,6,FALSE)","v":"TS3L4-CMA2U"}]
[]
[]
["TS3L4_BEZEL"]
["No Bezel","Bezel",null,"No Bezel",null,null,{"$f":"\"\"","v":""},null,{"$f":"\"\"","v":""},null,null,{"$f":"\"\"","v":""},{"$f":"\"\"","v":""}]
["-=-=-=-=-=-=-=-=-=-=-=-=-=-=-=-=-20%-=-=-=-=-=-=-=-=-=-=-=-=-=-=-=-=-",null,null,null,null,null,{"$f":"\"\"","v":""},null,{"$f":"\"\"","v":""},null,null,{"$f":"\"\"","v":""},{"$f":"\"\"","v":""}]
["[TS3L4-BZLLCD] LCD Security Bezel","Bezel","TS3L4-BZLLCD","LCD Security Bezel",null,null,1,{"$f":"VLOOKUP(L123,Tabella_prezzi!$A$3:$K$303,9,FALSE)","v":"TS3-OpzA20BZLCD"},{"$f":"VLOOKUP(L123,Tabella_prezzi!$A$3:$K$303,3,FALSE)","v":"OpzBezelLCD"},null,{"$f":"VLOOKUP(L123,Tabella_prezzi!$A$3:$K$303,4,FALSE)","v":63},"L4N68",{"$f":"VLOOKUP(L123,Tabella_prezzi!$A$3:$K$303,6,FALSE)","v":"TS3L4-BZLLCD"}]
["[TS3L4-BZLSTD] Standard Security Bezel","Bezel","TS3L4-BZLSTD","Standard Security Bezel",null,null,1,{"$f":"VLOOKUP(L124,Tabella_prezzi!$A$3:$K$303,9,FALSE)","v":"TS3-OpzA20BZSTD"},{"$f":"VLOOKUP(L124,Tabella_prezzi!$A$3:$K$303,3,FALSE)","v":"OpzBezelSTD"},null,{"$f":"VLOOKUP(L124,Tabella_prezzi!$A$3:$K$303,4,FALSE)","v":42},"L4N69",{"$f":"VLOOKUP(L124,Tabella_prezzi!$A$3:$K$303,6,FALSE)","v":"TS3L4-BZLSTD"}]
[]
["TS3L4_ISDM"]
["No ISDM",null,null,null,null,null,{"$f":"\"\"","v":""},null,{"$f":"\"\"","v":""},null,null,{"$f":"\"\"","v":""},{"$f":"\"\"","v":""}]
["-=-=-=-=-=-=-=-=-=-=-=-=-=-=-=-=-20%-=-=-=-=-=-=-=-=-=-=-=-=-=-=-=-=-",null,null,null,null,null,{"$f":"\"\"","v":""},null,{"$f":"\"\"","v":""},null,null,{"$f":"\"\"","v":""},{"$f":"\"\"","v":""}]
["[TS3L4-ISDM32GB] ISDM and Combo Card Reader with 2 x 32GB microSDHC/SDXC Card",null,null,{"$f":"VLOOKUP(L129,Tabella_prezzi!$A$3:$K$303,8,FALSE)","v":"ISDM and Combo Card Reader with 2 x 32GB microSDHC/SDXC Card"},null,null,1,{"$f":"VLOOKUP(L129,Tabella_prezzi!$A$3:$K$303,9,FALSE)","v":"TS3-OpzA20ISDM"},{"$f":"VLOOKUP(L129,Tabella_prezzi!$A$3:$K$303,3,FALSE)","v":"OpzISDM"},null,{"$f":"VLOOKUP(L129,Tabella_prezzi!$A$3:$K$303,4,FALSE)","v":134},"L4N70",{"$f":"VLOOKUP(L129,Tabella_prezzi!$A$3:$K$303,6,FALSE)","v":"TS3L4-ISDM32GB"}]
[]
["TS3L4_OME"]
["No OMEA",null,null,null,null,null,{"$f":"\"\"","v":""},null,{"$f":"\"\"","v":""},null,null,{"$f":"\"\"","v":""},{"$f":"\"\"","v":""}]
["[TS3L4-OMEA] OpenManage Enterprise Advanced","OpenManage Enterprise Advanced","TS3L4-OMEA","OpenManage Enterprise Advanced",null,null,1,{"$f":"VLOOKUP(L133,Tabella_prezzi!$A$3:$K$303,9,FALSE)","v":"TS3-OpzA20OMEA"},{"$f":"VLOOKUP(L133,Tabella_prezzi!$A$3:$K$303,3,FALSE)","v":0},null,{"$f":"VLOOKUP(L133,Tabella_prezzi!$A$3:$K$303,4,FALSE)","v":214},"L4N96",{"$f":"VLOOKUP(L133,Tabella_prezzi!$A$3:$K$303,6,FALSE)","v":"TS3L4-OMEA"}]
[]
["TS3L4_WARRANTY"]
["Manutenzione in garanzia (36 mesi)","Dell Services: Extended Service",null,"RESTRICTED:ProSupport One Data Center and Next Business Day Onsite Service Volume Low, 39 Month(s)",null,null,{"$f":"\"\"","v":""},null,{"$f":"\"\"","v":""},null,null,{"$f":"\"\"","v":""},{"$f":"\"\"","v":""}]
["[TS3L4-5Y] Manutenzione in garanzia (60 mesi)","Dell Services: Extended Service",null,{"$f":"VLOOKUP(L137,Tabella_prezzi!$A$3:$K$303,8,FALSE)","v":"Estensione della manutenzione in garanzia per ulteriori 24 mesi"},null,null,1,{"$f":"VLOOKUP(L137,Tabella_prezzi!$A$3:$K$498,9,FALSE)","v":"L4N28-OpzEstensione24"},{"$f":"VLOOKUP(L137,Tabella_prezzi!$A$3:$K$498,3,FALSE)","v":"OpzEstensione24"},{"$f":"VLOOKUP(L137,Tabella_prezzi!$A$3:$K$498,4,FALSE)","v":79},null,"L4N28",{"$f":"VLOOKUP(L137,Tabella_prezzi!$A$3:$K$303,6,FALSE)","v":"TS3L4-5Y"}]
[]
["TS34_KYHDD"]
[{"$f":"\"\"","v":""},"Keep Your Hard Drive",null,null,null,null,{"$f":"\"\"","v":""},null,{"$f":"\"\"","v":""},null,null,{"$f":"\"\"","v":""},{"$f":"\"\"","v":""}]
["Hard Disk Retention","Keep Your Hard Drive",null,{"$f":"VLOOKUP(L141,Tabella_prezzi!$A$3:$K$303,8,FALSE)","v":"Hard Disk Retention 36 mesi"},null,null,1,{"$f":"VLOOKUP(L141,Tabella_prezzi!$A$3:$K$498,9,FALSE)","v":"L4N27-OpzHDDRetention"},{"$f":"VLOOKUP(L141,Tabella_prezzi!$A$3:$K$498,3,FALSE)","v":"OpzHDDRetention"},{"$f":"VLOOKUP(L141,Tabella_prezzi!$A$3:$K$498,4,FALSE)","v":32},null,"L4N27",{"$f":"VLOOKUP(L141,Tabella_prezzi!$A$3:$K$303,6,FALSE)","v":"TS3L4-HDRTNTN"}]
["Hard Disk Retention (60 mesi)","Keep Your Hard Drive",null,{"$f":"VLOOKUP(L142,Tabella_prezzi!$A$3:$K$303,8,FALSE)","v":"Hard Disk Retention 60 mesi"},null,null,1,{"$f":"VLOOKUP(L142,Tabella_prezzi!$A$3:$K$498,9,FALSE)","v":"L4N30-OpzHDDRetention60"},{"$f":"VLOOKUP(L142,Tabella_prezzi!$A$3:$K$498,3,FALSE)","v":"OpzHDDRetention"},{"$f":"VLOOKUP(L142,Tabella_prezzi!$A$3:$K$498,4,FALSE)","v":53},null,"L4N30",{"$f":"VLOOKUP(L142,Tabella_prezzi!$A$3:$K$303,6,FALSE)","v":"TS3L4-HDRTNTN60"}]
[]
["TS3L2_UPS"]
[{"$f":"\"\"","v":""},null,null,null,null,null,{"$f":"\"\"","v":""},null,{"$f":"\"\"","v":""},null,null,{"$f":"\"\"","v":""},{"$f":"\"\"","v":""}]
["[TS3L2-UPS] UPS PowerMe RPMM/9K - 3000VA Tower",null,null,{"$f":"VLOOKUP(L146,Tabella_prezzi!$A$3:$K$303,8,FALSE)","v":0},null,null,1,{"$f":"VLOOKUP(L146,Tabella_prezzi!$A$3:$K$498,9,FALSE)","v":"TPMM/ 3K"},{"$f":"VLOOKUP(L146,Tabella_prezzi!$A$3:$K$498,3,FALSE)","v":"OpzUps (3000VA)"},{"$f":"VLOOKUP(L146,Tabella_prezzi!$A$3:$K$498,4,FALSE)","v":300},null,"L2N10",{"$f":"VLOOKUP(L146,Tabella_prezzi!$A$3:$K$303,6,FALSE)","v":"TS3L2-UPS"}]
[]
["TS3L2_GUI"]
[{"$f":"\"\"","v":""},null,null,null,null,null,{"$f":"\"\"","v":""},null,{"$f":"\"\"","v":""},null,null,{"$f":"\"\"","v":""},{"$f":"\"\"","v":""}]
["[TS3L2-GUI] Monitor DELL E1920H + Keyboard + Mouse",null,null,{"$f":"VLOOKUP(L150,Tabella_prezzi!$A$3:$K$303,8,FALSE)","v":"Monitor 19\" E1920H, Mouse MS116, Tastiera KB216"},null,null,1,{"$f":"VLOOKUP(L150,Tabella_prezzi!$A$3:$K$498,9,FALSE)","v":"580-ADHM"},{"$f":"VLOOKUP(L150,Tabella_prezzi!$A$3:$K$498,3,FALSE)","v":"OpzGUI per tower"},{"$f":"VLOOKUP(L150,Tabella_prezzi!$A$3:$K$498,4,FALSE)","v":104},null,"L2N11",{"$f":"VLOOKUP(L150,Tabella_prezzi!$A$3:$K$303,6,FALSE)","v":"TS3L2-GUI"}]
[]
["SFP+ Transceivers"]
["Transceiver, SFP+ SR Optic for SFP+ ports (Intel X710)",null,null,{"$f":"VLOOKUP(L153,Tabella_prezzi!$A$3:$K$303,8,FALSE)","v":"SFP+ SR Optic for SFP+ ports (Intel X710)"},null,null,1,{"$f":"VLOOKUP(L153,Tabella_prezzi!$A$3:$K$498,9,FALSE)","v":"TS3-OpzA20O10GB"},{"$f":"VLOOKUP(L153,Tabella_prezzi!$A$3:$K$498,3,FALSE)","v":0},null,{"$f":"VLOOKUP(L153,Tabella_prezzi!$A$3:$K$303,4,FALSE)","v":126},"L4N109",{"$f":"VLOOKUP(L153,Tabella_prezzi!$A$3:$K$303,6,FALSE)","v":"TS3L4-OT10GB"}]
[null,"=ConfigurationTS3L4!$A$172:$A$186"]
["PCI1","=SE($N$75=\"SW\";ConfigurationTS3L4!$A$283:$A$300;SE($N$75=\"DW\";ConfigurationTS3L4!$A$240:$A$259;ConfigurationTS3L4!$A$172:$A$186))",null,null,null,null,null,{"$f":"EXACT(B155,B156)","v":false}]
["PCI2","=SE($N$75=\"SW\";ConfigurationTS3L4!$A$172:$A$186;SE($N$75=\"DW\";ConfigurationTS3L4!$A$322:$A$322;ConfigurationTS3L4!$A$172:$A$186))",null,null,null,null,null,{"$f":"EXACT(B156,B157)","v":false}]
["PCI3","=SE($N$75=\"SW\";ConfigurationTS3L4!$A$172:$A$186;SE($N$75=\"DW\";ConfigurationTS3L4!$A$189:$A$204;ConfigurationTS3L4!$A$172:$A$186))"]
["PCI4","=SE($N$75=\"SW\";ConfigurationTS3L4!$A$303:$A$319;SE($N$75=\"DW\";ConfigurationTS3L4!$A$262:$A$280;SE($N$75=\"2CPU\";ConfigurationTS3L4!$A$189:$A$204;ConfigurationTS3L4!$A$103:$A$104)))"]
["PCI5","=SE($N$86=\"DW\";ConfigurationTS3L4!$A$322;SE($N$75=\"SW\";ConfigurationTS3L4!$A$172:$A$186;SE($N$75=\"DW\";ConfigurationTS3L4!$A$172:$A$186;SE($N$75=\"2CPU\";ConfigurationTS3L4!$A$172:$A$186;ConfigurationTS3L4!$A$103:$A$104))))"]
["PCI6","=SE($N$9=\"VxFlex\";ConfigurationTS3L4!$A$230;ConfigurationTS3L4!$A$207:$A$218)"]
["PCI7","=SE($N$9=\"VxFlex\";ConfigurationTS3L4!$A$235;SE($N$98=\"DW\";ConfigurationTS3L4!$A$322;SE($N$75=\"1CPU\";ConfigurationTS3L4!$A$103:$A$104;ConfigurationTS3L4!$A$172:$A$186)))"]
["PCI8","=SE($N$9=\"VxFlex\";ConfigurationTS3L4!$A$235;SE($N$75=\"SW\";ConfigurationTS3L4!$A$303:$A$319;SE($N$75=\"DW\";ConfigurationTS3L4!$A$240:$A$259;SE($N$75=\"2CPU\";ConfigurationTS3L4!$A$221:$A$237;ConfigurationTS3L4!$A$103:$A$104))))"]
[]
[]
["TS3L2_PCI_A"]
[{"$f":"\"\"","v":""},null,null,null,null,null,{"$f":"\"\"","v":""},null,{"$f":"\"\"","v":""},null,null,{"$f":"\"\"","v":""},{"$f":"\"\"","v":""}]
["[TS3L4-LAN1] Broadcom 5719 Quad Port 1Gb Network Interface Card,",null,null,{"$f":"VLOOKUP(L167,Tabella_prezzi!$A$3:$K$303,8,FALSE)","v":"Scheda LAN 5719 QP 1Gb FULL"},null,"540-BBCX",1,{"$f":"VLOOKUP(L167,Tabella_prezzi!$A$3:$K$303,9,FALSE)","v":"L4N05-OpzGigabit"},{"$f":"VLOOKUP(L167,Tabella_prezzi!$A$3:$K$303,3,FALSE)","v":"OpzGigabit"},{"$f":"VLOOKUP(L167,Tabella_prezzi!$A$3:$K$303,4,FALSE)","v":26},null,"L4N05",{"$f":"VLOOKUP(L167,Tabella_prezzi!$A$3:$K$303,6,FALSE)","v":"TS3L4-LAN1"}]
["[TS3L4-LAN10] Broadcom 57412 Dual Port 10Gb, SFP+, PCIe Adapter",null,null,{"$f":"VLOOKUP(L168,Tabella_prezzi!$A$3:$K$303,8,FALSE)","v":"Scheda 57412 DP 10Gb SFP+  FULL"},null,"540-BBCX",1,{"$f":"VLOOKUP(L168,Tabella_prezzi!$A$3:$K$303,9,FALSE)","v":"L4N06-OpzGigabit10Gbps"},{"$f":"VLOOKUP(L168,Tabella_prezzi!$A$3:$K$303,3,FALSE)","v":"OpzGigabit10Gbps"},{"$f":"VLOOKUP(L168,Tabella_prezzi!$A$3:$K$303,4,FALSE)","v":126},null,"L4N06",{"$f":"VLOOKUP(L168,Tabella_prezzi!$A$3:$K$303,6,FALSE)","v":"TS3L4-LAN10"}]
["[TS3L4-LAN25] QLogic 41262 Dual Port 25Gb SFP28 Adapter",null,null,{"$f":"VLOOKUP(L169,Tabella_prezzi!$A$3:$K$303,8,FALSE)","v":"Scheda 41262 DP 25Gb SFP28  FULL"},null,"540-BBCX",1,{"$f":"VLOOKUP(L169,Tabella_prezzi!$A$3:$K$303,9,FALSE)","v":"L4N07-OpzGigabit25Gbps"},{"$f":"VLOOKUP(L169,Tabella_prezzi!$A$3:$K$303,3,FALSE)","v":"OpzGigabit25Gbps"},{"$f":"VLOOKUP(L169,Tabella_prezzi!$A$3:$K$303,4,FALSE)","v":341},null,"L4N07",{"$f":"VLOOKUP(L169,Tabella_prezzi!$A$3:$K$303,6,FALSE)","v":"TS3L4-LAN25"}]
["[TS3L4CNA10] QLogic 41112 Dual Port 10Gb SFP+ Adapter",null,null,{"$f":"VLOOKUP(L170,Tabella_prezzi!$A$3:$K$303,8,FALSE)","v":"Scheda 41112 DP 10Gb SFP+  FULL"},null,"540-BBCX",1,{"$f":"VLOOKUP(L170,Tabella_prezzi!$A$3:$K$303,9,FALSE)","v":"L4N08-OpzCNA10Gbps"},{"$f":"VLOOKUP(L170,Tabella_prezzi!$A$3:$K$303,3,FALSE)","v":"OpzGigabit10Gbps CNA"},{"$f":"VLOOKUP(L170,Tabella_prezzi!$A$3:$K$303,4,FALSE)","v":149},null,"L4N08",{"$f":"VLOOKUP(L170,Tabella_prezzi!$A$3:$K$303,6,FALSE)","v":"TS3L4-CNA10"}]
["[TS3L4-FC16] Qlogic 2692 Dual Port 16Gb Fibre Channel HBA",null,null,{"$f":"VLOOKUP(L171,Tabella_prezzi!$A$3:$K$303,8,FALSE)","v":"Scheda FC 2692 DP 16Gb HBA FULL"},null,"540-BBCX",1,{"$f":"VLOOKUP(L171,Tabella_prezzi!$A$3:$K$303,9,FALSE)","v":"L4N09-OpzFibreChannel"},{"$f":"VLOOKUP(L171,Tabella_prezzi!$A$3:$K$303,3,FALSE)","v":"OpzFibreChannel"},{"$f":"VLOOKUP(L171,Tabella_prezzi!$A$3:$K$303,4,FALSE)","v":309},null,"L4N09",{"$f":"VLOOKUP(L171,Tabella_prezzi!$A$3:$K$303,6,FALSE)","v":"TS3L4-FC16"}]
["[TS3L4-NVME1600] Dell 1.6TB, NVMe, Mixed Use Express Flash, HHHL",null,null,{"$f":"VLOOKUP(L172,Tabella_prezzi!$A$3:$K$303,8,FALSE)","v":"NVME 1,6TB MU HHHL, 3 DWPD"},null,"540-BBCX",1,{"$f":"VLOOKUP(L172,Tabella_prezzi!$A$3:$K$303,9,FALSE)","v":"L4N17-OpzNVME1,6TB"},{"$f":"VLOOKUP(L172,Tabella_prezzi!$A$3:$K$303,3,FALSE)","v":"OpzNVME1,6TB"},{"$f":"VLOOKUP(L172,Tabella_prezzi!$A$3:$K$303,4,FALSE)","v":1050},null,"L4N17",{"$f":"VLOOKUP(L172,Tabella_prezzi!$A$3:$K$303,6,FALSE)","v":"TS3L4-NVME1600"}]
["[TS3L4-NVME800] Dell 1.6TB, NVMe, Mixed Use Express Flash, HHHL",null,null,{"$f":"VLOOKUP(L173,Tabella_prezzi!$A$3:$K$303,8,FALSE)","v":"NVME 1,6TB MU HHHL, 3 DWPD"},null,"540-BBCX",1,{"$f":"VLOOKUP(L173,Tabella_prezzi!$A$3:$K$303,9,FALSE)","v":"L4N18-OpzNVME800GB"},{"$f":"VLOOKUP(L173,Tabella_prezzi!$A$3:$K$303,3,FALSE)","v":"OpzNVME800GB"},{"$f":"VLOOKUP(L173,Tabella_prezzi!$A$3:$K$303,4,FALSE)","v":919},null,"L4N18",{"$f":"VLOOKUP(L173,Tabella_prezzi!$A$3:$K$303,6,FALSE)","v":"TS3L4-NVME800"}]
["-=-=-=-=-=-=-=-=-=-=-=-=-=-=-=-=-20%-=-=-=-=-=-=-=-=-=-=-=-=-=-=-=-=-",null,null,null,null,null,{"$f":"\"\"","v":""},null,{"$f":"\"\"","v":""},null,null,{"$f":"\"\"","v":""},{"$f":"\"\"","v":""}]
["[TS3L4-BOSS480] BOSS controller card, full height, with 2 480G M.2 Drives",null,null,{"$f":"VLOOKUP(L175,Tabella_prezzi!$A$3:$K$303,8,FALSE)","v":"BOSS controller card, full height, with 2 480G M.2 Drives"},null,null,1,null,{"$f":"VLOOKUP(L175,Tabella_prezzi!$A$3:$K$303,3,FALSE)","v":0},null,{"$f":"VLOOKUP(L175,Tabella_prezzi!$A$3:$K$303,4,FALSE)","v":748},"L4N33",{"$f":"VLOOKUP(L175,Tabella_prezzi!$A$3:$K$303,6,FALSE)","v":"TS3L4-BOSS480"}]
["[TS3L4-SAS12] SAS 12Gbps HBA External Controller, Full Height",null,null,{"$f":"VLOOKUP(L176,Tabella_prezzi!$A$3:$K$303,8,FALSE)","v":"SAS 12Gbps HBA External Controller, Full Height"},null,null,1,{"$f":"VLOOKUP(L176,Tabella_prezzi!$A$3:$K$303,9,FALSE)","v":"TS3-OpzA20SAS12"},{"$f":"VLOOKUP(L176,Tabella_prezzi!$A$3:$K$303,3,FALSE)","v":0},null,{"$f":"VLOOKUP(L176,Tabella_prezzi!$A$3:$K$303,4,FALSE)","v":92},"L4N101",{"$f":"VLOOKUP(L176,Tabella_prezzi!$A$3:$K$303,6,FALSE)","v":"TS3L4-SAS12"}]
["[TS3L4-H840] PERC H840 RAID Adapter for External MD14XX Only, 8GB NV Cache",null,null,{"$f":"VLOOKUP(L177,Tabella_prezzi!$A$3:$K$303,8,FALSE)","v":"PERC H840 RAID Adapter for External MD14XX Only, 8GB NV Cache, Full Height"},null,null,1,null,{"$f":"VLOOKUP(L177,Tabella_prezzi!$A$3:$K$303,3,FALSE)","v":"OpzH840"},null,{"$f":"VLOOKUP(L177,Tabella_prezzi!$A$3:$K$303,4,FALSE)","v":479},"L4N71",{"$f":"VLOOKUP(L177,Tabella_prezzi!$A$3:$K$303,6,FALSE)","v":"TS3L4-H840"}]
["[TS3L4-57416] Broadcom 57416 Dual Port 10Gb, Base-T, PCIe Adapter",null,null,{"$f":"VLOOKUP(L178,Tabella_prezzi!$A$3:$K$303,8,FALSE)","v":"Broadcom 57416 Dual Port 10Gb, Base-T, PCIe Adapter, Full Height"},null,null,1,null,{"$f":"VLOOKUP(L178,Tabella_prezzi!$A$3:$K$303,3,FALSE)","v":0},null,{"$f":"VLOOKUP(L178,Tabella_prezzi!$A$3:$K$303,4,FALSE)","v":334},"L4N46",{"$f":"VLOOKUP(L178,Tabella_prezzi!$A$3:$K$303,6,FALSE)","v":"TS3L4-57416"}]
["[TS3L4-X710DP] Intel X710 Dual Port 10Gb Direct Attach, SFP+,PCIe",null,null,{"$f":"VLOOKUP(L179,Tabella_prezzi!$A$3:$K$303,8,FALSE)","v":"Intel X710 Dual Port 10Gb SFP+ FULL"},null,null,1,null,{"$f":"VLOOKUP(L179,Tabella_prezzi!$A$3:$K$303,3,FALSE)","v":0},null,{"$f":"VLOOKUP(L179,Tabella_prezzi!$A$3:$K$303,4,FALSE)","v":342},"L4N42",{"$f":"VLOOKUP(L179,Tabella_prezzi!$A$3:$K$303,6,FALSE)","v":"TS3L4-X710DP"}]
["[TS3L4-X710QP] Intel X710 Quad Port 10Gb Direct Attach, SFP+, PCIe",null,null,{"$f":"VLOOKUP(L180,Tabella_prezzi!$A$3:$K$303,8,FALSE)","v":"Intel X710 Quad Port 10Gb SFP+ FULL"},null,null,1,null,{"$f":"VLOOKUP(L180,Tabella_prezzi!$A$3:$K$303,3,FALSE)","v":0},null,{"$f":"VLOOKUP(L180,Tabella_prezzi!$A$3:$K$303,4,FALSE)","v":518},"L4N43",{"$f":"VLOOKUP(L180,Tabella_prezzi!$A$3:$K$303,6,FALSE)","v":"TS3L4-X710QP"}]
["[TS3L4-MCX4DP] Mellanox ConnectX-4 Lx Dual Port 25GbE SFP28 FL 2 x SFP28 SR Optic, 25GbE",null,"TS3L4-MCX4DP","Mellanox ConnectX-4 Lx Dual Port 25GbE SFP28 Network Adapter, PCIe Full Height, 2 x SFP28 SR Optic, 25GbE",null,null,1,{"$f":"VLOOKUP(L181,Tabella_prezzi!$A$3:$K$303,9,FALSE)","v":"TS3-OpzA20MCX4F"},{"$f":"VLOOKUP(L181,Tabella_prezzi!$A$3:$K$303,3,FALSE)","v":0},null,{"$f":"VLOOKUP(L181,Tabella_prezzi!$A$3:$K$303,4,FALSE)","v":419},"L4N94",{"$f":"VLOOKUP(L181,Tabella_prezzi!$A$3:$K$303,6,FALSE)","v":"TS3L4-MCX4DP"}]
[]
["TS3L2_PCI_B"]
[{"$f":"\"\"","v":""},null,null,null,null,null,{"$f":"\"\"","v":""},null,{"$f":"\"\"","v":""},null,null,{"$f":"\"\"","v":""},{"$f":"\"\"","v":""}]
["[TS3L4-LAN1] Broadcom 5719 Quad Port 1Gb Network Interface Card,",null,null,{"$f":"VLOOKUP(L185,Tabella_prezzi!$A$3:$K$303,8,FALSE)","v":"Scheda LAN 5719 QP 1Gb FULL"},null,"540-BBCX",1,{"$f":"VLOOKUP(L185,Tabella_prezzi!$A$3:$K$303,9,FALSE)","v":"L4N05-OpzGigabit"},{"$f":"VLOOKUP(L185,Tabella_prezzi!$A$3:$K$303,3,FALSE)","v":"OpzGigabit"},{"$f":"VLOOKUP(L185,Tabella_prezzi!$A$3:$K$303,4,FALSE)","v":26},null,"L4N05",{"$f":"VLOOKUP(L185,Tabella_prezzi!$A$3:$K$303,6,FALSE)","v":"TS3L4-LAN1"}]
["[TS3L4-LAN10] Broadcom 57412 Dual Port 10Gb, SFP+, PCIe Adapter",null,null,{"$f":"VLOOKUP(L186,Tabella_prezzi!$A$3:$K$303,8,FALSE)","v":"Scheda 57412 DP 10Gb SFP+  FULL"},null,"540-BBCX",1,{"$f":"VLOOKUP(L186,Tabella_prezzi!$A$3:$K$303,9,FALSE)","v":"L4N06-OpzGigabit10Gbps"},{"$f":"VLOOKUP(L186,Tabella_prezzi!$A$3:$K$303,3,FALSE)","v":"OpzGigabit10Gbps"},{"$f":"VLOOKUP(L186,Tabella_prezzi!$A$3:$K$303,4,FALSE)","v":126},null,"L4N06",{"$f":"VLOOKUP(L186,Tabella_prezzi!$A$3:$K$303,6,FALSE)","v":"TS3L4-LAN10"}]
["[TS3L4-LAN25] QLogic 41262 Dual Port 25Gb SFP28 Adapter",null,null,{"$f":"VLOOKUP(L187,Tabella_prezzi!$A$3:$K$303,8,FALSE)","v":"Scheda 41262 DP 25Gb SFP28  FULL"},null,"540-BBCX",1,{"$f":"VLOOKUP(L187,Tabella_prezzi!$A$3:$K$303,9,FALSE)","v":"L4N07-OpzGigabit25Gbps"},{"$f":"VLOOKUP(L187,Tabella_prezzi!$A$3:$K$303,3,FALSE)","v":"OpzGigabit25Gbps"},{"$f":"VLOOKUP(L187,Tabella_prezzi!$A$3:$K$303,4,FALSE)","v":341},null,"L4N07",{"$f":"VLOOKUP(L187,Tabella_prezzi!$A$3:$K$303,6,FALSE)","v":"TS3L4-LAN25"}]
["[TS3L4CNA10] QLogic 41112 Dual Port 10Gb SFP+ Adapter",null,null,{"$f":"VLOOKUP(L188,Tabella_prezzi!$A$3:$K$303,8,FALSE)","v":"Scheda 41112 DP 10Gb SFP+  FULL"},null,"540-BBCX",1,{"$f":"VLOOKUP(L188,Tabella_prezzi!$A$3:$K$303,9,FALSE)","v":"L4N08-OpzCNA10Gbps"},{"$f":"VLOOKUP(L188,Tabella_prezzi!$A$3:$K$303,3,FALSE)","v":"OpzGigabit10Gbps CNA"},{"$f":"VLOOKUP(L188,Tabella_prezzi!$A$3:$K$303,4,FALSE)","v":149},null,"L4N08",{"$f":"VLOOKUP(L188,Tabella_prezzi!$A$3:$K$303,6,FALSE)","v":"TS3L4-CNA10"}]
["[TS3L4-FC16] Qlogic 2692 Dual Port 16Gb Fibre Channel HBA",null,null,{"$f":"VLOOKUP(L189,Tabella_prezzi!$A$3:$K$303,8,FALSE)","v":"Scheda FC 2692 DP 16Gb HBA FULL"},null,"540-BBCX",1,{"$f":"VLOOKUP(L189,Tabella_prezzi!$A$3:$K$303,9,FALSE)","v":"L4N09-OpzFibreChannel"},{"$f":"VLOOKUP(L189,Tabella_prezzi!$A$3:$K$303,3,FALSE)","v":"OpzFibreChannel"},{"$f":"VLOOKUP(L189,Tabella_prezzi!$A$3:$K$303,4,FALSE)","v":309},null,"L4N09",{"$f":"VLOOKUP(L189,Tabella_prezzi!$A$3:$K$303,6,FALSE)","v":"TS3L4-FC16"}]
["[TS3L4-NVME1600] Dell 1.6TB, NVMe, Mixed Use Express Flash, HHHL",null,null,{"$f":"VLOOKUP(L190,Tabella_prezzi!$A$3:$K$303,8,FALSE)","v":"NVME 1,6TB MU HHHL, 3 DWPD"},null,"540-BBCX",1,{"$f":"VLOOKUP(L190,Tabella_prezzi!$A$3:$K$303,9,FALSE)","v":"L4N17-OpzNVME1,6TB"},{"$f":"VLOOKUP(L190,Tabella_prezzi!$A$3:$K$303,3,FALSE)","v":"OpzNVME1,6TB"},{"$f":"VLOOKUP(L190,Tabella_prezzi!$A$3:$K$303,4,FALSE)","v":1050},null,"L4N17",{"$f":"VLOOKUP(L190,Tabella_prezzi!$A$3:$K$303,6,FALSE)","v":"TS3L4-NVME1600"}]
["[TS3L4-NVME800] Dell 1.6TB, NVMe, Mixed Use Express Flash, HHHL",null,null,{"$f":"VLOOKUP(L191,Tabella_prezzi!$A$3:$K$303,8,FALSE)","v":"NVME 1,6TB MU HHHL, 3 DWPD"},null,"540-BBCX",1,{"$f":"VLOOKUP(L191,Tabella_prezzi!$A$3:$K$303,9,FALSE)","v":"L4N18-OpzNVME800GB"},{"$f":"VLOOKUP(L191,Tabella_prezzi!$A$3:$K$303,3,FALSE)","v":"OpzNVME800GB"},{"$f":"VLOOKUP(L191,Tabella_prezzi!$A$3:$K$303,4,FALSE)","v":919},null,"L4N18",{"$f":"VLOOKUP(L191,Tabella_prezzi!$A$3:$K$303,6,FALSE)","v":"TS3L4-NVME800"}]
["-=-=-=-=-=-=-=-=-=-=-=-=-=-=-=-=-20%-=-=-=-=-=-=-=-=-=-=-=-=-=-=-=-=-",null,null,null,null,null,{"$f":"\"\"","v":""},null,{"$f":"\"\"","v":""},null,null,{"$f":"\"\"","v":""},{"$f":"\"\"","v":""}]
["[TS3L4-BOSS480] BOSS controller card, full height, with 2 480G M.2 Drives",null,null,{"$f":"VLOOKUP(L193,Tabella_prezzi!$A$3:$K$303,8,FALSE)","v":"BOSS controller card, full height, with 2 480G M.2 Drives"},null,null,1,null,{"$f":"VLOOKUP(L193,Tabella_prezzi!$A$3:$K$303,3,FALSE)","v":0},null,{"$f":"VLOOKUP(L193,Tabella_prezzi!$A$3:$K$303,4,FALSE)","v":748},"L4N33",{"$f":"VLOOKUP(L193,Tabella_prezzi!$A$3:$K$303,6,FALSE)","v":"TS3L4-BOSS480"}]
["[TS3L4-SAS12] SAS 12Gbps HBA External Controller, Full Height",null,null,{"$f":"VLOOKUP(L194,Tabella_prezzi!$A$3:$K$303,8,FALSE)","v":"SAS 12Gbps HBA External Controller, Full Height"},null,null,1,{"$f":"VLOOKUP(L194,Tabella_prezzi!$A$3:$K$303,9,FALSE)","v":"TS3-OpzA20SAS12"},{"$f":"VLOOKUP(L194,Tabella_prezzi!$A$3:$K$303,3,FALSE)","v":0},null,{"$f":"VLOOKUP(L194,Tabella_prezzi!$A$3:$K$303,4,FALSE)","v":92},"L4N101",{"$f":"VLOOKUP(L194,Tabella_prezzi!$A$3:$K$303,6,FALSE)","v":"TS3L4-SAS12"}]
["[TS3L4-H840] PERC H840 RAID Adapter for External MD14XX Only, 8GB NV Cache",null,null,{"$f":"VLOOKUP(L195,Tabella_prezzi!$A$3:$K$303,8,FALSE)","v":"PERC H840 RAID Adapter for External MD14XX Only, 8GB NV Cache, Full Height"},null,null,1,null,{"$f":"VLOOKUP(L195,Tabella_prezzi!$A$3:$K$303,3,FALSE)","v":"OpzH840"},null,{"$f":"VLOOKUP(L195,Tabella_prezzi!$A$3:$K$303,4,FALSE)","v":479},"L4N71",{"$f":"VLOOKUP(L195,Tabella_prezzi!$A$3:$K$303,6,FALSE)","v":"TS3L4-H840"}]
["[TS3L4-57416] Broadcom 57416 Dual Port 10Gb, Base-T, PCIe Adapter",null,null,{"$f":"VLOOKUP(L196,Tabella_prezzi!$A$3:$K$303,8,FALSE)","v":"Broadcom 57416 Dual Port 10Gb, Base-T, PCIe Adapter, Full Height"},null,null,1,null,{"$f":"VLOOKUP(L196,Tabella_prezzi!$A$3:$K$303,3,FALSE)","v":0},null,{"$f":"VLOOKUP(L196,Tabella_prezzi!$A$3:$K$303,4,FALSE)","v":334},"L4N46",{"$f":"VLOOKUP(L196,Tabella_prezzi!$A$3:$K$303,6,FALSE)","v":"TS3L4-57416"}]
["[TS3L4-X710DP] Intel X710 Dual Port 10Gb Direct Attach, SFP+,PCIe",null,null,{"$f":"VLOOKUP(L197,Tabella_prezzi!$A$3:$K$303,8,FALSE)","v":"Intel X710 Dual Port 10Gb SFP+ FULL"},null,null,1,null,{"$f":"VLOOKUP(L197,Tabella_prezzi!$A$3:$K$303,3,FALSE)","v":0},null,{"$f":"VLOOKUP(L197,Tabella_prezzi!$A$3:$K$303,4,FALSE)","v":342},"L4N42",{"$f":"VLOOKUP(L197,Tabella_prezzi!$A$3:$K$303,6,FALSE)","v":"TS3L4-X710DP"}]
["[TS3L4-X710QP] Intel X710 Quad Port 10Gb Direct Attach, SFP+, PCIe",null,null,{"$f":"VLOOKUP(L198,Tabella_prezzi!$A$3:$K$303,8,FALSE)","v":"Intel X710 Quad Port 10Gb SFP+ FULL"},null,null,1,null,{"$f":"VLOOKUP(L198,Tabella_prezzi!$A$3:$K$303,3,FALSE)","v":0},null,{"$f":"VLOOKUP(L198,Tabella_prezzi!$A$3:$K$303,4,FALSE)","v":518},"L4N43",{"$f":"VLOOKUP(L198,Tabella_prezzi!$A$3:$K$303,6,FALSE)","v":"TS3L4-X710QP"}]
["[TS3L4-CONX6DP] Mellanox ConnectX-6 DX Dual Port 100GbE QFSFP56 Network Adapter",null,null,{"$f":"VLOOKUP(L199,Tabella_prezzi!$A$3:$K$303,8,FALSE)","v":"Mellanox ConnectX-6 DX Dual Port 100GbE QFSFP56 FULL"},null,null,1,{"$f":"VLOOKUP(L199,Tabella_prezzi!$A$3:$K$303,9,FALSE)","v":"TS3-OpzA20CX6DP"},{"$f":"VLOOKUP(L199,Tabella_prezzi!$A$3:$K$303,3,FALSE)","v":0},null,{"$f":"VLOOKUP(L199,Tabella_prezzi!$A$3:$K$303,4,FALSE)","v":812},"L4N40",{"$f":"VLOOKUP(L199,Tabella_prezzi!$A$3:$K$303,6,FALSE)","v":"TS3L4-CONX6DP"}]
["[TS3L4-MCX4DP] Mellanox ConnectX-4 Lx Dual Port 25GbE SFP28 FL 2 x SFP28 SR Optic, 25GbE",null,"TS3L4-MCX4DP","Mellanox ConnectX-4 Lx Dual Port 25GbE SFP28 Network Adapter, PCIe Full Height, 2 x SFP28 SR Optic, 25GbE",null,null,1,{"$f":"VLOOKUP(L200,Tabella_prezzi!$A$3:$K$303,9,FALSE)","v":"TS3-OpzA20MCX4F"},{"$f":"VLOOKUP(L200,Tabella_prezzi!$A$3:$K$303,3,FALSE)","v":0},null,{"$f":"VLOOKUP(L200,Tabella_prezzi!$A$3:$K$303,4,FALSE)","v":419},"L4N94",{"$f":"VLOOKUP(L200,Tabella_prezzi!$A$3:$K$303,6,FALSE)","v":"TS3L4-MCX4DP"}]
[]
["TS3L2_PCI_C"]
[{"$f":"\"\"","v":""},null,null,null,null,null,{"$f":"\"\"","v":""},null,{"$f":"\"\"","v":""},null,null,{"$f":"\"\"","v":""},{"$f":"\"\"","v":""}]
["[TS3L4-LAN1-L] Broadcom 5719 Quad Port 1Gb Network Interface Card,",null,null,{"$f":"VLOOKUP(L204,Tabella_prezzi!$A$3:$K$303,8,FALSE)","v":"Scheda LAN 5719 QP 1Gb LOW"},null,null,1,{"$f":"VLOOKUP(L204,Tabella_prezzi!$A$3:$K$303,9,FALSE)","v":"L4N75-OpzGigabitLP"},{"$f":"VLOOKUP(L204,Tabella_prezzi!$A$3:$K$303,3,FALSE)","v":"OpzGigabit"},{"$f":"VLOOKUP(L204,Tabella_prezzi!$A$3:$K$303,4,FALSE)","v":26},null,"L4N75",{"$f":"VLOOKUP(L204,Tabella_prezzi!$A$3:$K$303,6,FALSE)","v":"TS3L4-LAN1-L"}]
["[TS3L4-LAN10-L] Broadcom 57412 Dual Port 10Gb, SFP+, PCIe Adapter",null,null,{"$f":"VLOOKUP(L205,Tabella_prezzi!$A$3:$K$303,8,FALSE)","v":"Scheda 57412 DP 10Gb SFP+ LOW"},null,null,1,{"$f":"VLOOKUP(L205,Tabella_prezzi!$A$3:$K$303,9,FALSE)","v":"L4N76-OpzGigabit10GbpsLP"},{"$f":"VLOOKUP(L205,Tabella_prezzi!$A$3:$K$303,3,FALSE)","v":"OpzGigabit10Gbps"},{"$f":"VLOOKUP(L205,Tabella_prezzi!$A$3:$K$303,4,FALSE)","v":126},null,"L4N76",{"$f":"VLOOKUP(L205,Tabella_prezzi!$A$3:$K$303,6,FALSE)","v":"TS3L4-LAN10-L"}]
["[TS3L4-LAN25-L] QLogic 41262 Dual Port 25Gb SFP28 Adapter",null,null,{"$f":"VLOOKUP(L206,Tabella_prezzi!$A$3:$K$303,8,FALSE)","v":"Scheda 41262 DP 25Gb SFP28 LOW"},null,null,1,{"$f":"VLOOKUP(L206,Tabella_prezzi!$A$3:$K$303,9,FALSE)","v":"L4N77-OpzGigabit25GbpsLP"},{"$f":"VLOOKUP(L206,Tabella_prezzi!$A$3:$K$303,3,FALSE)","v":"OpzGigabit25Gbps"},{"$f":"VLOOKUP(L206,Tabella_prezzi!$A$3:$K$303,4,FALSE)","v":341},null,"L4N77",{"$f":"VLOOKUP(L206,Tabella_prezzi!$A$3:$K$303,6,FALSE)","v":"TS3L4-LAN25-L"}]
["[TS3L4CNA10-L] QLogic 41112 Dual Port 10Gb SFP+ Adapter",null,null,{"$f":"VLOOKUP(L207,Tabella_prezzi!$A$3:$K$303,8,FALSE)","v":"Scheda 41112 DP 10Gb SFP+ LOW"},null,null,1,{"$f":"VLOOKUP(L207,Tabella_prezzi!$A$3:$K$303,9,FALSE)","v":"L4N78-OpzCNA10GbpsLP"},{"$f":"VLOOKUP(L207,Tabella_prezzi!$A$3:$K$303,3,FALSE)","v":"OpzGigabit10Gbps CNA"},{"$f":"VLOOKUP(L207,Tabella_prezzi!$A$3:$K$303,4,FALSE)","v":149},null,"L4N78",{"$f":"VLOOKUP(L207,Tabella_prezzi!$A$3:$K$303,6,FALSE)","v":"TS3L4-CNA10-L"}]
["[TS3L4-FC16-L] Qlogic 2692 Dual Port 16Gb Fibre Channel HBA",null,null,{"$f":"VLOOKUP(L208,Tabella_prezzi!$A$3:$K$303,8,FALSE)","v":"Scheda FC 2692 DP 16Gb HBA LOW"},null,null,1,{"$f":"VLOOKUP(L208,Tabella_prezzi!$A$3:$K$303,9,FALSE)","v":"L4N79-OpzFibreChannelLP"},{"$f":"VLOOKUP(L208,Tabella_prezzi!$A$3:$K$303,3,FALSE)","v":"OpzFibreChannel"},{"$f":"VLOOKUP(L208,Tabella_prezzi!$A$3:$K$303,4,FALSE)","v":309},null,"L4N79",{"$f":"VLOOKUP(L208,Tabella_prezzi!$A$3:$K$303,6,FALSE)","v":"TS3L4-FC16-L"}]
["[TS3L4-NVME1600] Dell 1.6TB, NVMe, Mixed Use Express Flash, HHHL",null,null,{"$f":"VLOOKUP(L209,Tabella_prezzi!$A$3:$K$303,8,FALSE)","v":"NVME 1,6TB MU HHHL, 3 DWPD"},null,null,1,{"$f":"VLOOKUP(L209,Tabella_prezzi!$A$3:$K$303,9,FALSE)","v":"L4N17-OpzNVME1,6TB"},{"$f":"VLOOKUP(L209,Tabella_prezzi!$A$3:$K$303,3,FALSE)","v":"OpzNVME1,6TB"},{"$f":"VLOOKUP(L209,Tabella_prezzi!$A$3:$K$303,4,FALSE)","v":1050},null,"L4N17",{"$f":"VLOOKUP(L209,Tabella_prezzi!$A$3:$K$303,6,FALSE)","v":"TS3L4-NVME1600"}]
["[TS3L4-NVME800] Dell 1.6TB, NVMe, Mixed Use Express Flash, HHHL",null,null,{"$f":"VLOOKUP(L210,Tabella_prezzi!$A$3:$K$303,8,FALSE)","v":"NVME 1,6TB MU HHHL, 3 DWPD"},null,null,1,{"$f":"VLOOKUP(L210,Tabella_prezzi!$A$3:$K$303,9,FALSE)","v":"L4N18-OpzNVME800GB"},{"$f":"VLOOKUP(L210,Tabella_prezzi!$A$3:$K$303,3,FALSE)","v":"OpzNVME800GB"},{"$f":"VLOOKUP(L210,Tabella_prezzi!$A$3:$K$303,4,FALSE)","v":919},null,"L4N18",{"$f":"VLOOKUP(L210,Tabella_prezzi!$A$3:$K$303,6,FALSE)","v":"TS3L4-NVME800"}]
["-=-=-=-=-=-=-=-=-=-=-=-=-=-=-=-=-20%-=-=-=-=-=-=-=-=-=-=-=-=-=-=-=-=-",null,null,null,null,null,{"$f":"\"\"","v":""},null,{"$f":"\"\"","v":""},null,null,{"$f":"\"\"","v":""},{"$f":"\"\"","v":""}]
["[TS3L4-57416-L] Broadcom 57416 Dual Port 10Gb, Base-T, PCIe Adapter","Broadcom 57416 Dual Port 10Gb, Base-T, PCIe Adapter, Low Profile","TS3L4-57416-L",{"$f":"VLOOKUP(L212,Tabella_prezzi!$A$3:$K$303,8,FALSE)","v":"Broadcom 57416 Dual Port 10Gb, Base-T, PCIe Adapter, Low Profile"},null,null,1,{"$f":"VLOOKUP(L212,Tabella_prezzi!$A$3:$K$303,9,FALSE)","v":"TS3-OpzA205741L"},{"$f":"VLOOKUP(L212,Tabella_prezzi!$A$3:$K$303,3,FALSE)","v":0},null,{"$f":"VLOOKUP(L212,Tabella_prezzi!$A$3:$K$303,4,FALSE)","v":334},"L4N31",{"$f":"VLOOKUP(L212,Tabella_prezzi!$A$3:$K$303,6,FALSE)","v":"TS3L4-57416-L"}]
["[TS3L4-MCX4DP-L] Mellanox ConnectX-4 Lx Dual Port 25GbE SFP28 LP 2 x SFP28 SR Optic, 25GbE","Mellanox ConnectX-4 Lx Dual Port 25GbE SFP28 Network Adapter, Low Profile, 2 x SFP28 SR Optic, 25GbE","TS3L4-MCX4DP-L","Mellanox ConnectX-4 Lx Dual Port 25GbE SFP28 Network Adapter, Low Profile, 2 x SFP28 SR Optic, 25GbE",null,null,1,{"$f":"VLOOKUP(L213,Tabella_prezzi!$A$3:$K$303,9,FALSE)","v":"TS3-OpzA20MCX4L"},{"$f":"VLOOKUP(L213,Tabella_prezzi!$A$3:$K$303,3,FALSE)","v":0},null,{"$f":"VLOOKUP(L213,Tabella_prezzi!$A$3:$K$303,4,FALSE)","v":419},"L4N95",{"$f":"VLOOKUP(L213,Tabella_prezzi!$A$3:$K$303,6,FALSE)","v":"TS3L4-MCX4DP-L"}]
["[TS3L4-H840-L] PERC H840 RAID Adapter, Low Profile for External Enclosure ",null,"TS3L4-57416-L",{"$f":"VLOOKUP(L214,Tabella_prezzi!$A$3:$K$303,8,FALSE)","v":"PERC H840 RAID Adapter, Low Profile for External Enclosure "},null,null,1,{"$f":"VLOOKUP(L214,Tabella_prezzi!$A$3:$K$303,9,FALSE)","v":"TS3-OpzA20H840L"},{"$f":"VLOOKUP(L214,Tabella_prezzi!$A$3:$K$303,3,FALSE)","v":0},null,{"$f":"VLOOKUP(L214,Tabella_prezzi!$A$3:$K$303,4,FALSE)","v":479},"L4N102",{"$f":"VLOOKUP(L214,Tabella_prezzi!$A$3:$K$303,6,FALSE)","v":"TS3L4-H840-L"}]
["[TS3L4-SAS12-L] SAS 12Gbps HBA External Controller, Low Profile","SAS 12Gbps HBA External Controller, Low Profile","TS3L4-57416-L",{"$f":"VLOOKUP(L215,Tabella_prezzi!$A$3:$K$303,8,FALSE)","v":"SAS 12Gbps HBA External Controller, Low Profile"},null,null,1,{"$f":"VLOOKUP(L215,Tabella_prezzi!$A$3:$K$303,9,FALSE)","v":"TS3-OpzA20SAS12L"},{"$f":"VLOOKUP(L215,Tabella_prezzi!$A$3:$K$303,3,FALSE)","v":0},null,{"$f":"VLOOKUP(L215,Tabella_prezzi!$A$3:$K$303,4,FALSE)","v":92},"L4N100",{"$f":"VLOOKUP(L215,Tabella_prezzi!$A$3:$K$303,6,FALSE)","v":"TS3L4-SAS12-L"}]
["[TS3L4-X710DP-L] Intel X710 Dual Port 10Gb Direct Attach, SFP+,PCIe","Intel X710 2-port 10GbE Adapter, Low Profile Low Profile, Cuskit","TS3L4-X710DP-L",{"$f":"VLOOKUP(L216,Tabella_prezzi!$A$3:$K$303,8,FALSE)","v":"Intel X710 Dual Port 10Gb SFP+ LOW"},null,null,1,{"$f":"VLOOKUP(L216,Tabella_prezzi!$A$3:$K$303,9,FALSE)","v":"TS3-OpzA20710DL"},{"$f":"VLOOKUP(L216,Tabella_prezzi!$A$3:$K$303,3,FALSE)","v":0},null,{"$f":"VLOOKUP(L216,Tabella_prezzi!$A$3:$K$303,4,FALSE)","v":342},"L4N41",{"$f":"VLOOKUP(L216,Tabella_prezzi!$A$3:$K$303,6,FALSE)","v":"TS3L4-X710DP-L"}]
[]
["TS3L2_PCI_D"]
[{"$f":"\"\"","v":""},null,null,null,null,null,{"$f":"\"\"","v":""},null,{"$f":"\"\"","v":""},null,null,{"$f":"\"\"","v":""},{"$f":"\"\"","v":""}]
["[TS3L4-LAN1] Broadcom 5719 Quad Port 1Gb Network Interface Card,",null,null,{"$f":"VLOOKUP(L220,Tabella_prezzi!$A$3:$K$303,8,FALSE)","v":"Scheda LAN 5719 QP 1Gb FULL"},null,"540-BBCX",1,{"$f":"VLOOKUP(L220,Tabella_prezzi!$A$3:$K$303,9,FALSE)","v":"L4N05-OpzGigabit"},{"$f":"VLOOKUP(L220,Tabella_prezzi!$A$3:$K$303,3,FALSE)","v":"OpzGigabit"},{"$f":"VLOOKUP(L220,Tabella_prezzi!$A$3:$K$303,4,FALSE)","v":26},null,"L4N05",{"$f":"VLOOKUP(L220,Tabella_prezzi!$A$3:$K$303,6,FALSE)","v":"TS3L4-LAN1"}]
["[TS3L4-LAN10] Broadcom 57412 Dual Port 10Gb, SFP+, PCIe Adapter",null,null,{"$f":"VLOOKUP(L221,Tabella_prezzi!$A$3:$K$303,8,FALSE)","v":"Scheda 57412 DP 10Gb SFP+  FULL"},null,"540-BBCX",1,{"$f":"VLOOKUP(L221,Tabella_prezzi!$A$3:$K$303,9,FALSE)","v":"L4N06-OpzGigabit10Gbps"},{"$f":"VLOOKUP(L221,Tabella_prezzi!$A$3:$K$303,3,FALSE)","v":"OpzGigabit10Gbps"},{"$f":"VLOOKUP(L221,Tabella_prezzi!$A$3:$K$303,4,FALSE)","v":126},null,"L4N06",{"$f":"VLOOKUP(L221,Tabella_prezzi!$A$3:$K$303,6,FALSE)","v":"TS3L4-LAN10"}]
["[TS3L4-LAN25] QLogic 41262 Dual Port 25Gb SFP28 Adapter",null,null,{"$f":"VLOOKUP(L222,Tabella_prezzi!$A$3:$K$303,8,FALSE)","v":"Scheda 41262 DP 25Gb SFP28  FULL"},null,"540-BBCX",1,{"$f":"VLOOKUP(L222,Tabella_prezzi!$A$3:$K$303,9,FALSE)","v":"L4N07-OpzGigabit25Gbps"},{"$f":"VLOOKUP(L222,Tabella_prezzi!$A$3:$K$303,3,FALSE)","v":"OpzGigabit25Gbps"},{"$f":"VLOOKUP(L222,Tabella_prezzi!$A$3:$K$303,4,FALSE)","v":341},null,"L4N07",{"$f":"VLOOKUP(L222,Tabella_prezzi!$A$3:$K$303,6,FALSE)","v":"TS3L4-LAN25"}]
["[TS3L4CNA10] QLogic 41112 Dual Port 10Gb SFP+ Adapter",null,null,{"$f":"VLOOKUP(L223,Tabella_prezzi!$A$3:$K$303,8,FALSE)","v":"Scheda 41112 DP 10Gb SFP+  FULL"},null,"540-BBCX",1,{"$f":"VLOOKUP(L223,Tabella_prezzi!$A$3:$K$303,9,FALSE)","v":"L4N08-OpzCNA10Gbps"},{"$f":"VLOOKUP(L223,Tabella_prezzi!$A$3:$K$303,3,FALSE)","v":"OpzGigabit10Gbps CNA"},{"$f":"VLOOKUP(L223,Tabella_prezzi!$A$3:$K$303,4,FALSE)","v":149},null,"L4N08",{"$f":"VLOOKUP(L223,Tabella_prezzi!$A$3:$K$303,6,FALSE)","v":"TS3L4-CNA10"}]
["[TS3L4-FC16] Qlogic 2692 Dual Port 16Gb Fibre Channel HBA",null,null,{"$f":"VLOOKUP(L224,Tabella_prezzi!$A$3:$K$303,8,FALSE)","v":"Scheda FC 2692 DP 16Gb HBA FULL"},null,"540-BBCX",1,{"$f":"VLOOKUP(L224,Tabella_prezzi!$A$3:$K$303,9,FALSE)","v":"L4N09-OpzFibreChannel"},{"$f":"VLOOKUP(L224,Tabella_prezzi!$A$3:$K$303,3,FALSE)","v":"OpzFibreChannel"},{"$f":"VLOOKUP(L224,Tabella_prezzi!$A$3:$K$303,4,FALSE)","v":309},null,"L4N09",{"$f":"VLOOKUP(L224,Tabella_prezzi!$A$3:$K$303,6,FALSE)","v":"TS3L4-FC16"}]
["[TS3L4-NVME1600] Dell 1.6TB, NVMe, Mixed Use Express Flash, HHHL",null,null,{"$f":"VLOOKUP(L225,Tabella_prezzi!$A$3:$K$303,8,FALSE)","v":"NVME 1,6TB MU HHHL, 3 DWPD"},null,"540-BBCX",1,{"$f":"VLOOKUP(L225,Tabella_prezzi!$A$3:$K$303,9,FALSE)","v":"L4N17-OpzNVME1,6TB"},{"$f":"VLOOKUP(L225,Tabella_prezzi!$A$3:$K$303,3,FALSE)","v":"OpzNVME1,6TB"},{"$f":"VLOOKUP(L225,Tabella_prezzi!$A$3:$K$303,4,FALSE)","v":1050},null,"L4N17",{"$f":"VLOOKUP(L225,Tabella_prezzi!$A$3:$K$303,6,FALSE)","v":"TS3L4-NVME1600"}]
["[TS3L4-NVME800] Dell 1.6TB, NVMe, Mixed Use Express Flash, HHHL",null,null,{"$f":"VLOOKUP(L226,Tabella_prezzi!$A$3:$K$303,8,FALSE)","v":"NVME 1,6TB MU HHHL, 3 DWPD"},null,"540-BBCX",1,{"$f":"VLOOKUP(L226,Tabella_prezzi!$A$3:$K$303,9,FALSE)","v":"L4N18-OpzNVME800GB"},{"$f":"VLOOKUP(L226,Tabella_prezzi!$A$3:$K$303,3,FALSE)","v":"OpzNVME800GB"},{"$f":"VLOOKUP(L226,Tabella_prezzi!$A$3:$K$303,4,FALSE)","v":919},null,"L4N18",{"$f":"VLOOKUP(L226,Tabella_prezzi!$A$3:$K$303,6,FALSE)","v":"TS3L4-NVME800"}]
["-=-=-=-=-=-=-=-=-=-=-=-=-=-=-=-=-20%-=-=-=-=-=-=-=-=-=-=-=-=-=-=-=-=-",null,null,null,null,null,{"$f":"\"\"","v":""},null,{"$f":"\"\"","v":""},null,null,{"$f":"\"\"","v":""},{"$f":"\"\"","v":""}]
["[TS3L4-BOSS480] BOSS controller card, full height, with 2 480G M.2 Drives",null,null,{"$f":"VLOOKUP(L228,Tabella_prezzi!$A$3:$K$303,8,FALSE)","v":"BOSS controller card, full height, with 2 480G M.2 Drives"},null,null,1,null,{"$f":"VLOOKUP(L228,Tabella_prezzi!$A$3:$K$303,3,FALSE)","v":0},null,{"$f":"VLOOKUP(L228,Tabella_prezzi!$A$3:$K$303,4,FALSE)","v":748},"L4N33",{"$f":"VLOOKUP(L228,Tabella_prezzi!$A$3:$K$303,6,FALSE)","v":"TS3L4-BOSS480"}]
["[TS3L4-SAS12] SAS 12Gbps HBA External Controller, Full Height",null,null,{"$f":"VLOOKUP(L229,Tabella_prezzi!$A$3:$K$303,8,FALSE)","v":"SAS 12Gbps HBA External Controller, Full Height"},null,null,1,{"$f":"VLOOKUP(L229,Tabella_prezzi!$A$3:$K$303,9,FALSE)","v":"TS3-OpzA20SAS12"},{"$f":"VLOOKUP(L229,Tabella_prezzi!$A$3:$K$303,3,FALSE)","v":0},null,{"$f":"VLOOKUP(L229,Tabella_prezzi!$A$3:$K$303,4,FALSE)","v":92},"L4N101",{"$f":"VLOOKUP(L229,Tabella_prezzi!$A$3:$K$303,6,FALSE)","v":"TS3L4-SAS12"}]
["[TS3L4-H840] PERC H840 RAID Adapter for External MD14XX Only, 8GB NV Cache",null,null,{"$f":"VLOOKUP(L230,Tabella_prezzi!$A$3:$K$303,8,FALSE)","v":"PERC H840 RAID Adapter for External MD14XX Only, 8GB NV Cache, Full Height"},null,null,1,null,{"$f":"VLOOKUP(L230,Tabella_prezzi!$A$3:$K$303,3,FALSE)","v":"OpzH840"},null,{"$f":"VLOOKUP(L230,Tabella_prezzi!$A$3:$K$303,4,FALSE)","v":479},"L4N71",{"$f":"VLOOKUP(L230,Tabella_prezzi!$A$3:$K$303,6,FALSE)","v":"TS3L4-H840"}]
["[TS3L4-57416] Broadcom 57416 Dual Port 10Gb, Base-T, PCIe Adapter",null,null,{"$f":"VLOOKUP(L231,Tabella_prezzi!$A$3:$K$303,8,FALSE)","v":"Broadcom 57416 Dual Port 10Gb, Base-T, PCIe Adapter, Full Height"},null,null,1,null,{"$f":"VLOOKUP(L231,Tabella_prezzi!$A$3:$K$303,3,FALSE)","v":0},null,{"$f":"VLOOKUP(L231,Tabella_prezzi!$A$3:$K$303,4,FALSE)","v":334},"L4N46",{"$f":"VLOOKUP(L231,Tabella_prezzi!$A$3:$K$303,6,FALSE)","v":"TS3L4-57416"}]
["[TS3L4-X710DP] Intel X710 Dual Port 10Gb Direct Attach, SFP+,PCIe",null,null,{"$f":"VLOOKUP(L232,Tabella_prezzi!$A$3:$K$303,8,FALSE)","v":"Intel X710 Dual Port 10Gb SFP+ FULL"},null,null,1,null,{"$f":"VLOOKUP(L232,Tabella_prezzi!$A$3:$K$303,3,FALSE)","v":0},null,{"$f":"VLOOKUP(L232,Tabella_prezzi!$A$3:$K$303,4,FALSE)","v":342},"L4N42",{"$f":"VLOOKUP(L232,Tabella_prezzi!$A$3:$K$303,6,FALSE)","v":"TS3L4-X710DP"}]
["[TS3L4-X710QP] Intel X710 Quad Port 10Gb Direct Attach, SFP+, PCIe",null,null,{"$f":"VLOOKUP(L233,Tabella_prezzi!$A$3:$K$303,8,FALSE)","v":"Intel X710 Quad Port 10Gb SFP+ FULL"},null,null,1,null,{"$f":"VLOOKUP(L233,Tabella_prezzi!$A$3:$K$303,3,FALSE)","v":0},null,{"$f":"VLOOKUP(L233,Tabella_prezzi!$A$3:$K$303,4,FALSE)","v":518},"L4N43",{"$f":"VLOOKUP(L233,Tabella_prezzi!$A$3:$K$303,6,FALSE)","v":"TS3L4-X710QP"}]
["[TS3L4-CONX6DP] Mellanox ConnectX-6 DX Dual Port 100GbE QFSFP56 Network Adapter",null,null,{"$f":"VLOOKUP(L234,Tabella_prezzi!$A$3:$K$303,8,FALSE)","v":"Mellanox ConnectX-6 DX Dual Port 100GbE QFSFP56 FULL"},null,null,1,{"$f":"VLOOKUP(L234,Tabella_prezzi!$A$3:$K$303,9,FALSE)","v":"TS3-OpzA20CX6DP"},{"$f":"VLOOKUP(L234,Tabella_prezzi!$A$3:$K$303,3,FALSE)","v":0},null,{"$f":"VLOOKUP(L234,Tabella_prezzi!$A$3:$K$303,4,FALSE)","v":812},"L4N40",{"$f":"VLOOKUP(L234,Tabella_prezzi!$A$3:$K$303,6,FALSE)","v":"TS3L4-CONX6DP"}]
["[TS3L4-CONX6SP] Mellanox ConnectX-6 Single Port HDR100 QSFP56 Infiniband Adapter",null,null,{"$f":"VLOOKUP(L235,Tabella_prezzi!$A$3:$K$303,8,FALSE)","v":"Mellanox ConnectX-6 Single Port HDR100 QSFP56 Infiniband FULL"},null,null,1,{"$f":"VLOOKUP(L235,Tabella_prezzi!$A$3:$K$303,9,FALSE)","v":"TS3-OpzA20CX6SP"},{"$f":"VLOOKUP(L235,Tabella_prezzi!$A$3:$K$303,3,FALSE)","v":0},null,{"$f":"VLOOKUP(L235,Tabella_prezzi!$A$3:$K$303,4,FALSE)","v":720},"L4N39",{"$f":"VLOOKUP(L235,Tabella_prezzi!$A$3:$K$303,6,FALSE)","v":"TS3L4-CONX6SP"}]
["[TS3L4-MCX4DP] Mellanox ConnectX-4 Lx Dual Port 25GbE SFP28 FL 2 x SFP28 SR Optic, 25GbE",null,"TS3L4-MCX4DP","Mellanox ConnectX-4 Lx Dual Port 25GbE SFP28 Network Adapter, PCIe Full Height, 2 x SFP28 SR Optic, 25GbE",null,null,1,{"$f":"VLOOKUP(L236,Tabella_prezzi!$A$3:$K$303,9,FALSE)","v":"TS3-OpzA20MCX4F"},{"$f":"VLOOKUP(L236,Tabella_prezzi!$A$3:$K$303,3,FALSE)","v":0},null,{"$f":"VLOOKUP(L236,Tabella_prezzi!$A$3:$K$303,4,FALSE)","v":419},"L4N94",{"$f":"VLOOKUP(L236,Tabella_prezzi!$A$3:$K$303,6,FALSE)","v":"TS3L4-MCX4DP"}]
[]
["TS3L2_PCI_E"]
[{"$f":"\"\"","v":""},null,null,null,null,null,{"$f":"\"\"","v":""},null,{"$f":"\"\"","v":""},null,null,{"$f":"\"\"","v":""},{"$f":"\"\"","v":""}]
["[TS3L4-LAN1] Broadcom 5719 Quad Port 1Gb Network Interface Card,",null,null,{"$f":"VLOOKUP(L240,Tabella_prezzi!$A$3:$K$303,8,FALSE)","v":"Scheda LAN 5719 QP 1Gb FULL"},null,"540-BBCX",1,{"$f":"VLOOKUP(L240,Tabella_prezzi!$A$3:$K$303,9,FALSE)","v":"L4N05-OpzGigabit"},{"$f":"VLOOKUP(L240,Tabella_prezzi!$A$3:$K$303,3,FALSE)","v":"OpzGigabit"},{"$f":"VLOOKUP(L240,Tabella_prezzi!$A$3:$K$303,4,FALSE)","v":26},null,"L4N05",{"$f":"VLOOKUP(L240,Tabella_prezzi!$A$3:$K$303,6,FALSE)","v":"TS3L4-LAN1"}]
["[TS3L4-LAN10] Broadcom 57412 Dual Port 10Gb, SFP+, PCIe Adapter",null,null,{"$f":"VLOOKUP(L241,Tabella_prezzi!$A$3:$K$303,8,FALSE)","v":"Scheda 57412 DP 10Gb SFP+  FULL"},null,"540-BBCX",1,{"$f":"VLOOKUP(L241,Tabella_prezzi!$A$3:$K$303,9,FALSE)","v":"L4N06-OpzGigabit10Gbps"},{"$f":"VLOOKUP(L241,Tabella_prezzi!$A$3:$K$303,3,FALSE)","v":"OpzGigabit10Gbps"},{"$f":"VLOOKUP(L241,Tabella_prezzi!$A$3:$K$303,4,FALSE)","v":126},null,"L4N06",{"$f":"VLOOKUP(L241,Tabella_prezzi!$A$3:$K$303,6,FALSE)","v":"TS3L4-LAN10"}]
["[TS3L4-LAN25] QLogic 41262 Dual Port 25Gb SFP28 Adapter",null,null,{"$f":"VLOOKUP(L242,Tabella_prezzi!$A$3:$K$303,8,FALSE)","v":"Scheda 41262 DP 25Gb SFP28  FULL"},null,"540-BBCX",1,{"$f":"VLOOKUP(L242,Tabella_prezzi!$A$3:$K$303,9,FALSE)","v":"L4N07-OpzGigabit25Gbps"},{"$f":"VLOOKUP(L242,Tabella_prezzi!$A$3:$K$303,3,FALSE)","v":"OpzGigabit25Gbps"},{"$f":"VLOOKUP(L242,Tabella_prezzi!$A$3:$K$303,4,FALSE)","v":341},null,"L4N07",{"$f":"VLOOKUP(L242,Tabella_prezzi!$A$3:$K$303,6,FALSE)","v":"TS3L4-LAN25"}]
["[TS3L4CNA10] QLogic 41112 Dual Port 10Gb SFP+ Adapter",null,null,{"$f":"VLOOKUP(L243,Tabella_prezzi!$A$3:$K$303,8,FALSE)","v":"Scheda 41112 DP 10Gb SFP+  FULL"},null,"540-BBCX",1,{"$f":"VLOOKUP(L243,Tabella_prezzi!$A$3:$K$303,9,FALSE)","v":"L4N08-OpzCNA10Gbps"},{"$f":"VLOOKUP(L243,Tabella_prezzi!$A$3:$K$303,3,FALSE)","v":"OpzGigabit10Gbps CNA"},{"$f":"VLOOKUP(L243,Tabella_prezzi!$A$3:$K$303,4,FALSE)","v":149},null,"L4N08",{"$f":"VLOOKUP(L243,Tabella_prezzi!$A$3:$K$303,6,FALSE)","v":"TS3L4-CNA10"}]
["[TS3L4-FC16] Qlogic 2692 Dual Port 16Gb Fibre Channel HBA",null,null,{"$f":"VLOOKUP(L244,Tabella_prezzi!$A$3:$K$303,8,FALSE)","v":"Scheda FC 2692 DP 16Gb HBA FULL"},null,"540-BBCX",1,{"$f":"VLOOKUP(L244,Tabella_prezzi!$A$3:$K$303,9,FALSE)","v":"L4N09-OpzFibreChannel"},{"$f":"VLOOKUP(L244,Tabella_prezzi!$A$3:$K$303,3,FALSE)","v":"OpzFibreChannel"},{"$f":"VLOOKUP(L244,Tabella_prezzi!$A$3:$K$303,4,FALSE)","v":309},null,"L4N09",{"$f":"VLOOKUP(L244,Tabella_prezzi!$A$3:$K$303,6,FALSE)","v":"TS3L4-FC16"}]
["[TS3L4-NVME1600] Dell 1.6TB, NVMe, Mixed Use Express Flash, HHHL",null,null,{"$f":"VLOOKUP(L245,Tabella_prezzi!$A$3:$K$303,8,FALSE)","v":"NVME 1,6TB MU HHHL, 3 DWPD"},null,"540-BBCX",1,{"$f":"VLOOKUP(L245,Tabella_prezzi!$A$3:$K$303,9,FALSE)","v":"L4N17-OpzNVME1,6TB"},{"$f":"VLOOKUP(L245,Tabella_prezzi!$A$3:$K$303,3,FALSE)","v":"OpzNVME1,6TB"},{"$f":"VLOOKUP(L245,Tabella_prezzi!$A$3:$K$303,4,FALSE)","v":1050},null,"L4N17",{"$f":"VLOOKUP(L245,Tabella_prezzi!$A$3:$K$303,6,FALSE)","v":"TS3L4-NVME1600"}]
["[TS3L4-NVME800] Dell 1.6TB, NVMe, Mixed Use Express Flash, HHHL",null,null,{"$f":"VLOOKUP(L246,Tabella_prezzi!$A$3:$K$303,8,FALSE)","v":"NVME 1,6TB MU HHHL, 3 DWPD"},null,"540-BBCX",1,{"$f":"VLOOKUP(L246,Tabella_prezzi!$A$3:$K$303,9,FALSE)","v":"L4N18-OpzNVME800GB"},{"$f":"VLOOKUP(L246,Tabella_prezzi!$A$3:$K$303,3,FALSE)","v":"OpzNVME800GB"},{"$f":"VLOOKUP(L246,Tabella_prezzi!$A$3:$K$303,4,FALSE)","v":919},null,"L4N18",{"$f":"VLOOKUP(L246,Tabella_prezzi!$A$3:$K$303,6,FALSE)","v":"TS3L4-NVME800"}]
["-=-=-=-=-=-=-=-=-=-=-=-=-=-=-=-=-20%-=-=-=-=-=-=-=-=-=-=-=-=-=-=-=-=-",null,null,null,null,null,{"$f":"\"\"","v":""},null,{"$f":"\"\"","v":""},null,null,{"$f":"\"\"","v":""},{"$f":"\"\"","v":""}]
["[TS3L4-BOSS480] BOSS controller card, full height, with 2 480G M.2 Drives",null,null,{"$f":"VLOOKUP(L248,Tabella_prezzi!$A$3:$K$303,8,FALSE)","v":"BOSS controller card, full height, with 2 480G M.2 Drives"},null,null,1,null,{"$f":"VLOOKUP(L248,Tabella_prezzi!$A$3:$K$303,3,FALSE)","v":0},null,{"$f":"VLOOKUP(L248,Tabella_prezzi!$A$3:$K$303,4,FALSE)","v":748},"L4N33",{"$f":"VLOOKUP(L248,Tabella_prezzi!$A$3:$K$303,6,FALSE)","v":"TS3L4-BOSS480"}]
["[TS3L4-SAS12] SAS 12Gbps HBA External Controller, Full Height",null,null,{"$f":"VLOOKUP(L249,Tabella_prezzi!$A$3:$K$303,8,FALSE)","v":"SAS 12Gbps HBA External Controller, Full Height"},null,null,1,{"$f":"VLOOKUP(L249,Tabella_prezzi!$A$3:$K$303,9,FALSE)","v":"TS3-OpzA20SAS12"},{"$f":"VLOOKUP(L249,Tabella_prezzi!$A$3:$K$303,3,FALSE)","v":0},null,{"$f":"VLOOKUP(L249,Tabella_prezzi!$A$3:$K$303,4,FALSE)","v":92},"L4N101",{"$f":"VLOOKUP(L249,Tabella_prezzi!$A$3:$K$303,6,FALSE)","v":"TS3L4-SAS12"}]
["[TS3L4-H840] PERC H840 RAID Adapter for External MD14XX Only, 8GB NV Cache",null,null,{"$f":"VLOOKUP(L250,Tabella_prezzi!$A$3:$K$303,8,FALSE)","v":"PERC H840 RAID Adapter for External MD14XX Only, 8GB NV Cache, Full Height"},null,null,1,null,{"$f":"VLOOKUP(L250,Tabella_prezzi!$A$3:$K$303,3,FALSE)","v":"OpzH840"},null,{"$f":"VLOOKUP(L250,Tabella_prezzi!$A$3:$K$303,4,FALSE)","v":479},"L4N71",{"$f":"VLOOKUP(L250,Tabella_prezzi!$A$3:$K$303,6,FALSE)","v":"TS3L4-H840"}]
["[TS3L4-57416] Broadcom 57416 Dual Port 10Gb, Base-T, PCIe Adapter",null,null,{"$f":"VLOOKUP(L251,Tabella_prezzi!$A$3:$K$303,8,FALSE)","v":"Broadcom 57416 Dual Port 10Gb, Base-T, PCIe Adapter, Full Height"},null,null,1,null,{"$f":"VLOOKUP(L251,Tabella_prezzi!$A$3:$K$303,3,FALSE)","v":0},null,{"$f":"VLOOKUP(L251,Tabella_prezzi!$A$3:$K$303,4,FALSE)","v":334},"L4N46",{"$f":"VLOOKUP(L251,Tabella_prezzi!$A$3:$K$303,6,FALSE)","v":"TS3L4-57416"}]
["[TS3L4-A10080GB] NVIDIA Ampere A100, PCIe, 300W, 80GB Passive, Double Wide, Full Height GPU",null,null,{"$f":"VLOOKUP(L252,Tabella_prezzi!$A$3:$K$303,8,FALSE)","v":"NVIDIA Ampere A100, PCIe, 300W, 80GB Passive, Double Wide, Full Height GPU"},null,null,1,null,{"$f":"VLOOKUP(L252,Tabella_prezzi!$A$3:$K$303,3,FALSE)","v":0},null,{"$f":"VLOOKUP(L252,Tabella_prezzi!$A$3:$K$303,4,FALSE)","v":12460},"L4N131",{"$f":"VLOOKUP(L252,Tabella_prezzi!$A$3:$K$303,6,FALSE)","v":"TS3L4-A10080GB"}]
["[TS3L4-GPUA30] NVIDIA Ampere A30, PCIe, 165W, 24GB Passive, Double Wide, Full Height GPU",null,null,{"$f":"VLOOKUP(L253,Tabella_prezzi!$A$3:$K$303,8,FALSE)","v":"NVIDIA Ampere A30, PCIe, 165W, 24GB Passive, Double Wide, Full Height GPU"},null,null,1,null,{"$f":"VLOOKUP(L253,Tabella_prezzi!$A$3:$K$303,3,FALSE)","v":0},null,{"$f":"VLOOKUP(L253,Tabella_prezzi!$A$3:$K$303,4,FALSE)","v":4657},"L4N133",{"$f":"VLOOKUP(L253,Tabella_prezzi!$A$3:$K$303,6,FALSE)","v":"TS3L4-GPUA30"}]
["[TS3L4-GPUA16] NVIDIA Ampere A16, PCIe, 250W, 64GB Passive, Double Wide, Full Height GPU",null,null,{"$f":"VLOOKUP(L254,Tabella_prezzi!$A$3:$K$303,8,FALSE)","v":"NVIDIA Ampere A16, PCIe, 250W, 64GB Passive, Double Wide, Full Height GPU"},null,null,1,null,{"$f":"VLOOKUP(L254,Tabella_prezzi!$A$3:$K$303,3,FALSE)","v":0},null,{"$f":"VLOOKUP(L254,Tabella_prezzi!$A$3:$K$303,4,FALSE)","v":3394},"L4N134",{"$f":"VLOOKUP(L254,Tabella_prezzi!$A$3:$K$303,6,FALSE)","v":"TS3L4-GPUA16"}]
["[TS3L4-X710DP] Intel X710 Dual Port 10Gb Direct Attach, SFP+,PCIe",null,null,{"$f":"VLOOKUP(L255,Tabella_prezzi!$A$3:$K$303,8,FALSE)","v":"Intel X710 Dual Port 10Gb SFP+ FULL"},null,null,1,null,{"$f":"VLOOKUP(L255,Tabella_prezzi!$A$3:$K$303,3,FALSE)","v":0},null,{"$f":"VLOOKUP(L255,Tabella_prezzi!$A$3:$K$303,4,FALSE)","v":342},"L4N42",{"$f":"VLOOKUP(L255,Tabella_prezzi!$A$3:$K$303,6,FALSE)","v":"TS3L4-X710DP"}]
["[TS3L4-X710QP] Intel X710 Quad Port 10Gb Direct Attach, SFP+, PCIe",null,null,{"$f":"VLOOKUP(L256,Tabella_prezzi!$A$3:$K$303,8,FALSE)","v":"Intel X710 Quad Port 10Gb SFP+ FULL"},null,null,1,null,{"$f":"VLOOKUP(L256,Tabella_prezzi!$A$3:$K$303,3,FALSE)","v":0},null,{"$f":"VLOOKUP(L256,Tabella_prezzi!$A$3:$K$303,4,FALSE)","v":518},"L4N43",{"$f":"VLOOKUP(L256,Tabella_prezzi!$A$3:$K$303,6,FALSE)","v":"TS3L4-X710QP"}]
["[TS3L4-CONX6DP] Mellanox ConnectX-6 DX Dual Port 100GbE QFSFP56 Network Adapter",null,null,{"$f":"VLOOKUP(L257,Tabella_prezzi!$A$3:$K$303,8,FALSE)","v":"Mellanox ConnectX-6 DX Dual Port 100GbE QFSFP56 FULL"},null,null,1,{"$f":"VLOOKUP(L257,Tabella_prezzi!$A$3:$K$303,9,FALSE)","v":"TS3-OpzA20CX6DP"},{"$f":"VLOOKUP(L257,Tabella_prezzi!$A$3:$K$303,3,FALSE)","v":0},null,{"$f":"VLOOKUP(L257,Tabella_prezzi!$A$3:$K$303,4,FALSE)","v":812},"L4N40",{"$f":"VLOOKUP(L257,Tabella_prezzi!$A$3:$K$303,6,FALSE)","v":"TS3L4-CONX6DP"}]
["[TS3L4-CONX6SP] Mellanox ConnectX-6 Single Port HDR100 QSFP56 Infiniband Adapter",null,null,{"$f":"VLOOKUP(L258,Tabella_prezzi!$A$3:$K$303,8,FALSE)","v":"Mellanox ConnectX-6 Single Port HDR100 QSFP56 Infiniband FULL"},null,null,1,{"$f":"VLOOKUP(L258,Tabella_prezzi!$A$3:$K$303,9,FALSE)","v":"TS3-OpzA20CX6SP"},{"$f":"VLOOKUP(L258,Tabella_prezzi!$A$3:$K$303,3,FALSE)","v":0},null,{"$f":"VLOOKUP(L258,Tabella_prezzi!$A$3:$K$303,4,FALSE)","v":720},"L4N39",{"$f":"VLOOKUP(L258,Tabella_prezzi!$A$3:$K$303,6,FALSE)","v":"TS3L4-CONX6SP"}]
["[TS3L4-MCX4DP] Mellanox ConnectX-4 Lx Dual Port 25GbE SFP28 FL 2 x SFP28 SR Optic, 25GbE",null,"TS3L4-MCX4DP","Mellanox ConnectX-4 Lx Dual Port 25GbE SFP28 Network Adapter, PCIe Full Height, 2 x SFP28 SR Optic, 25GbE",null,null,1,{"$f":"VLOOKUP(L259,Tabella_prezzi!$A$3:$K$303,9,FALSE)","v":"TS3-OpzA20MCX4F"},{"$f":"VLOOKUP(L259,Tabella_prezzi!$A$3:$K$303,3,FALSE)","v":0},null,{"$f":"VLOOKUP(L259,Tabella_prezzi!$A$3:$K$303,4,FALSE)","v":419},"L4N94",{"$f":"VLOOKUP(L259,Tabella_prezzi!$A$3:$K$303,6,FALSE)","v":"TS3L4-MCX4DP"}]
["[TS3L4-RTX6000] NVIDIA Quadro RTX 6000 24 GB, 250W, Dual Slot, PCIe x16 Passive Cooled",null,null,{"$f":"VLOOKUP(L260,Tabella_prezzi!$A$3:$K$303,8,FALSE)","v":"NVIDIA Quadro RTX 6000 24 GB, 250W, Dual Slot, GPU"},null,null,1,null,{"$f":"VLOOKUP(L260,Tabella_prezzi!$A$3:$K$303,3,FALSE)","v":"OpzGPURTX6000"},null,{"$f":"VLOOKUP(L260,Tabella_prezzi!$A$3:$K$303,4,FALSE)","v":4800},"L4N56",{"$f":"VLOOKUP(L260,Tabella_prezzi!$A$3:$K$303,6,FALSE)","v":"TS3L4-RTX6000"}]
["[TS3L4-TESLAM10] NVIDIA Tesla M10 GPU",null,null,{"$f":"VLOOKUP(L261,Tabella_prezzi!$A$3:$K$303,8,FALSE)","v":"NVIDIA Tesla M10 GPU"},null,null,1,null,{"$f":"VLOOKUP(L261,Tabella_prezzi!$A$3:$K$303,3,FALSE)","v":"OpzGPUM10"},null,{"$f":"VLOOKUP(L261,Tabella_prezzi!$A$3:$K$303,4,FALSE)","v":2700},"L4N57",{"$f":"VLOOKUP(L261,Tabella_prezzi!$A$3:$K$303,6,FALSE)","v":"TS3L4-TESLAM10"}]
["[TS3L4-A100] NVIDIA Ampere A100, PCIe, 250W , 40GB Passive, Double Wide, Full Height GPU",null,null,{"$f":"VLOOKUP(L262,Tabella_prezzi!$A$3:$K$303,8,FALSE)","v":"NVIDIA Ampere A100, PCIe, 250W , 40GB Passive, Double Wide, Full Height GPU"},null,null,1,null,{"$f":"VLOOKUP(L262,Tabella_prezzi!$A$3:$K$303,3,FALSE)","v":0},null,{"$f":"VLOOKUP(L262,Tabella_prezzi!$A$3:$K$303,4,FALSE)","v":10130},"L4N108",{"$f":"VLOOKUP(L262,Tabella_prezzi!$A$3:$K$303,6,FALSE)","v":"TS3L4-A100"}]
[]
["TS3L2_PCI_F"]
[{"$f":"\"\"","v":""},null,null,null,null,null,{"$f":"\"\"","v":""},null,{"$f":"\"\"","v":""},null,null,{"$f":"\"\"","v":""},{"$f":"\"\"","v":""}]
["[TS3L4-LAN1] Broadcom 5719 Quad Port 1Gb Network Interface Card,",null,null,{"$f":"VLOOKUP(L266,Tabella_prezzi!$A$3:$K$303,8,FALSE)","v":"Scheda LAN 5719 QP 1Gb FULL"},null,"540-BBCX",1,{"$f":"VLOOKUP(L266,Tabella_prezzi!$A$3:$K$303,9,FALSE)","v":"L4N05-OpzGigabit"},{"$f":"VLOOKUP(L266,Tabella_prezzi!$A$3:$K$303,3,FALSE)","v":"OpzGigabit"},{"$f":"VLOOKUP(L266,Tabella_prezzi!$A$3:$K$303,4,FALSE)","v":26},null,"L4N05",{"$f":"VLOOKUP(L266,Tabella_prezzi!$A$3:$K$303,6,FALSE)","v":"TS3L4-LAN1"}]
["[TS3L4-LAN10] Broadcom 57412 Dual Port 10Gb, SFP+, PCIe Adapter",null,null,{"$f":"VLOOKUP(L267,Tabella_prezzi!$A$3:$K$303,8,FALSE)","v":"Scheda 57412 DP 10Gb SFP+  FULL"},null,"540-BBCX",1,{"$f":"VLOOKUP(L267,Tabella_prezzi!$A$3:$K$303,9,FALSE)","v":"L4N06-OpzGigabit10Gbps"},{"$f":"VLOOKUP(L267,Tabella_prezzi!$A$3:$K$303,3,FALSE)","v":"OpzGigabit10Gbps"},{"$f":"VLOOKUP(L267,Tabella_prezzi!$A$3:$K$303,4,FALSE)","v":126},null,"L4N06",{"$f":"VLOOKUP(L267,Tabella_prezzi!$A$3:$K$303,6,FALSE)","v":"TS3L4-LAN10"}]
["[TS3L4-LAN25] QLogic 41262 Dual Port 25Gb SFP28 Adapter",null,null,{"$f":"VLOOKUP(L268,Tabella_prezzi!$A$3:$K$303,8,FALSE)","v":"Scheda 41262 DP 25Gb SFP28  FULL"},null,"540-BBCX",1,{"$f":"VLOOKUP(L268,Tabella_prezzi!$A$3:$K$303,9,FALSE)","v":"L4N07-OpzGigabit25Gbps"},{"$f":"VLOOKUP(L268,Tabella_prezzi!$A$3:$K$303,3,FALSE)","v":"OpzGigabit25Gbps"},{"$f":"VLOOKUP(L268,Tabella_prezzi!$A$3:$K$303,4,FALSE)","v":341},null,"L4N07",{"$f":"VLOOKUP(L268,Tabella_prezzi!$A$3:$K$303,6,FALSE)","v":"TS3L4-LAN25"}]
["[TS3L4CNA10] QLogic 41112 Dual Port 10Gb SFP+ Adapter",null,null,{"$f":"VLOOKUP(L269,Tabella_prezzi!$A$3:$K$303,8,FALSE)","v":"Scheda 41112 DP 10Gb SFP+  FULL"},null,"540-BBCX",1,{"$f":"VLOOKUP(L269,Tabella_prezzi!$A$3:$K$303,9,FALSE)","v":"L4N08-OpzCNA10Gbps"},{"$f":"VLOOKUP(L269,Tabella_prezzi!$A$3:$K$303,3,FALSE)","v":"OpzGigabit10Gbps CNA"},{"$f":"VLOOKUP(L269,Tabella_prezzi!$A$3:$K$303,4,FALSE)","v":149},null,"L4N08",{"$f":"VLOOKUP(L269,Tabella_prezzi!$A$3:$K$303,6,FALSE)","v":"TS3L4-CNA10"}]
["[TS3L4-FC16] Qlogic 2692 Dual Port 16Gb Fibre Channel HBA",null,null,{"$f":"VLOOKUP(L270,Tabella_prezzi!$A$3:$K$303,8,FALSE)","v":"Scheda FC 2692 DP 16Gb HBA FULL"},null,"540-BBCX",1,{"$f":"VLOOKUP(L270,Tabella_prezzi!$A$3:$K$303,9,FALSE)","v":"L4N09-OpzFibreChannel"},{"$f":"VLOOKUP(L270,Tabella_prezzi!$A$3:$K$303,3,FALSE)","v":"OpzFibreChannel"},{"$f":"VLOOKUP(L270,Tabella_prezzi!$A$3:$K$303,4,FALSE)","v":309},null,"L4N09",{"$f":"VLOOKUP(L270,Tabella_prezzi!$A$3:$K$303,6,FALSE)","v":"TS3L4-FC16"}]
["[TS3L4-NVME1600] Dell 1.6TB, NVMe, Mixed Use Express Flash, HHHL",null,null,{"$f":"VLOOKUP(L271,Tabella_prezzi!$A$3:$K$303,8,FALSE)","v":"NVME 1,6TB MU HHHL, 3 DWPD"},null,"540-BBCX",1,{"$f":"VLOOKUP(L271,Tabella_prezzi!$A$3:$K$303,9,FALSE)","v":"L4N17-OpzNVME1,6TB"},{"$f":"VLOOKUP(L271,Tabella_prezzi!$A$3:$K$303,3,FALSE)","v":"OpzNVME1,6TB"},{"$f":"VLOOKUP(L271,Tabella_prezzi!$A$3:$K$303,4,FALSE)","v":1050},null,"L4N17",{"$f":"VLOOKUP(L271,Tabella_prezzi!$A$3:$K$303,6,FALSE)","v":"TS3L4-NVME1600"}]
["[TS3L4-NVME800] Dell 1.6TB, NVMe, Mixed Use Express Flash, HHHL",null,null,{"$f":"VLOOKUP(L272,Tabella_prezzi!$A$3:$K$303,8,FALSE)","v":"NVME 1,6TB MU HHHL, 3 DWPD"},null,"540-BBCX",1,{"$f":"VLOOKUP(L272,Tabella_prezzi!$A$3:$K$303,9,FALSE)","v":"L4N18-OpzNVME800GB"},{"$f":"VLOOKUP(L272,Tabella_prezzi!$A$3:$K$303,3,FALSE)","v":"OpzNVME800GB"},{"$f":"VLOOKUP(L272,Tabella_prezzi!$A$3:$K$303,4,FALSE)","v":919},null,"L4N18",{"$f":"VLOOKUP(L272,Tabella_prezzi!$A$3:$K$303,6,FALSE)","v":"TS3L4-NVME800"}]
["-=-=-=-=-=-=-=-=-=-=-=-=-=-=-=-=-20%-=-=-=-=-=-=-=-=-=-=-=-=-=-=-=-=-",null,null,null,null,null,{"$f":"\"\"","v":""},null,{"$f":"\"\"","v":""},null,null,{"$f":"\"\"","v":""},{"$f":"\"\"","v":""}]
["[TS3L4-BOSS480] BOSS controller card, full height, with 2 480G M.2 Drives",null,null,{"$f":"VLOOKUP(L274,Tabella_prezzi!$A$3:$K$303,8,FALSE)","v":"BOSS controller card, full height, with 2 480G M.2 Drives"},null,null,1,null,{"$f":"VLOOKUP(L274,Tabella_prezzi!$A$3:$K$303,3,FALSE)","v":0},null,{"$f":"VLOOKUP(L274,Tabella_prezzi!$A$3:$K$303,4,FALSE)","v":748},"L4N33",{"$f":"VLOOKUP(L274,Tabella_prezzi!$A$3:$K$303,6,FALSE)","v":"TS3L4-BOSS480"}]
["[TS3L4-SAS12] SAS 12Gbps HBA External Controller, Full Height",null,null,{"$f":"VLOOKUP(L275,Tabella_prezzi!$A$3:$K$303,8,FALSE)","v":"SAS 12Gbps HBA External Controller, Full Height"},null,null,1,{"$f":"VLOOKUP(L275,Tabella_prezzi!$A$3:$K$303,9,FALSE)","v":"TS3-OpzA20SAS12"},{"$f":"VLOOKUP(L275,Tabella_prezzi!$A$3:$K$303,3,FALSE)","v":0},null,{"$f":"VLOOKUP(L275,Tabella_prezzi!$A$3:$K$303,4,FALSE)","v":92},"L4N101",{"$f":"VLOOKUP(L275,Tabella_prezzi!$A$3:$K$303,6,FALSE)","v":"TS3L4-SAS12"}]
["[TS3L4-H840] PERC H840 RAID Adapter for External MD14XX Only, 8GB NV Cache",null,null,{"$f":"VLOOKUP(L276,Tabella_prezzi!$A$3:$K$303,8,FALSE)","v":"PERC H840 RAID Adapter for External MD14XX Only, 8GB NV Cache, Full Height"},null,null,1,null,{"$f":"VLOOKUP(L276,Tabella_prezzi!$A$3:$K$303,3,FALSE)","v":"OpzH840"},null,{"$f":"VLOOKUP(L276,Tabella_prezzi!$A$3:$K$303,4,FALSE)","v":479},"L4N71",{"$f":"VLOOKUP(L276,Tabella_prezzi!$A$3:$K$303,6,FALSE)","v":"TS3L4-H840"}]
["[TS3L4-57416] Broadcom 57416 Dual Port 10Gb, Base-T, PCIe Adapter",null,null,{"$f":"VLOOKUP(L277,Tabella_prezzi!$A$3:$K$303,8,FALSE)","v":"Broadcom 57416 Dual Port 10Gb, Base-T, PCIe Adapter, Full Height"},null,null,1,null,{"$f":"VLOOKUP(L277,Tabella_prezzi!$A$3:$K$303,3,FALSE)","v":0},null,{"$f":"VLOOKUP(L277,Tabella_prezzi!$A$3:$K$303,4,FALSE)","v":334},"L4N46",{"$f":"VLOOKUP(L277,Tabella_prezzi!$A$3:$K$303,6,FALSE)","v":"TS3L4-57416"}]
["[TS3L4-A10080GB] NVIDIA Ampere A100, PCIe, 300W, 80GB Passive, Double Wide, Full Height GPU",null,null,{"$f":"VLOOKUP(L278,Tabella_prezzi!$A$3:$K$303,8,FALSE)","v":"NVIDIA Ampere A100, PCIe, 300W, 80GB Passive, Double Wide, Full Height GPU"},null,null,1,null,{"$f":"VLOOKUP(L278,Tabella_prezzi!$A$3:$K$303,3,FALSE)","v":0},null,{"$f":"VLOOKUP(L278,Tabella_prezzi!$A$3:$K$303,4,FALSE)","v":12460},"L4N131",{"$f":"VLOOKUP(L278,Tabella_prezzi!$A$3:$K$303,6,FALSE)","v":"TS3L4-A10080GB"}]
["[TS3L4-GPUA30] NVIDIA Ampere A30, PCIe, 165W, 24GB Passive, Double Wide, Full Height GPU",null,null,{"$f":"VLOOKUP(L279,Tabella_prezzi!$A$3:$K$303,8,FALSE)","v":"NVIDIA Ampere A30, PCIe, 165W, 24GB Passive, Double Wide, Full Height GPU"},null,null,1,null,{"$f":"VLOOKUP(L279,Tabella_prezzi!$A$3:$K$303,3,FALSE)","v":0},null,{"$f":"VLOOKUP(L279,Tabella_prezzi!$A$3:$K$303,4,FALSE)","v":4657},"L4N133",{"$f":"VLOOKUP(L279,Tabella_prezzi!$A$3:$K$303,6,FALSE)","v":"TS3L4-GPUA30"}]
["[TS3L4-GPUA16] NVIDIA Ampere A16, PCIe, 250W, 64GB Passive, Double Wide, Full Height GPU",null,null,{"$f":"VLOOKUP(L280,Tabella_prezzi!$A$3:$K$303,8,FALSE)","v":"NVIDIA Ampere A16, PCIe, 250W, 64GB Passive, Double Wide, Full Height GPU"},null,null,1,null,{"$f":"VLOOKUP(L280,Tabella_prezzi!$A$3:$K$303,3,FALSE)","v":0},null,{"$f":"VLOOKUP(L280,Tabella_prezzi!$A$3:$K$303,4,FALSE)","v":3394},"L4N134",{"$f":"VLOOKUP(L280,Tabella_prezzi!$A$3:$K$303,6,FALSE)","v":"TS3L4-GPUA16"}]
["[TS3L4-X710DP] Intel X710 Dual Port 10Gb Direct Attach, SFP+,PCIe",null,null,{"$f":"VLOOKUP(L281,Tabella_prezzi!$A$3:$K$303,8,FALSE)","v":"Intel X710 Dual Port 10Gb SFP+ FULL"},null,null,1,null,{"$f":"VLOOKUP(L281,Tabella_prezzi!$A$3:$K$303,3,FALSE)","v":0},null,{"$f":"VLOOKUP(L281,Tabella_prezzi!$A$3:$K$303,4,FALSE)","v":342},"L4N42",{"$f":"VLOOKUP(L281,Tabella_prezzi!$A$3:$K$303,6,FALSE)","v":"TS3L4-X710DP"}]
["[TS3L4-X710QP] Intel X710 Quad Port 10Gb Direct Attach, SFP+, PCIe",null,null,{"$f":"VLOOKUP(L282,Tabella_prezzi!$A$3:$K$303,8,FALSE)","v":"Intel X710 Quad Port 10Gb SFP+ FULL"},null,null,1,null,{"$f":"VLOOKUP(L282,Tabella_prezzi!$A$3:$K$303,3,FALSE)","v":0},null,{"$f":"VLOOKUP(L282,Tabella_prezzi!$A$3:$K$303,4,FALSE)","v":518},"L4N43",{"$f":"VLOOKUP(L282,Tabella_prezzi!$A$3:$K$303,6,FALSE)","v":"TS3L4-X710QP"}]
["[TS3L4-CONX6DP] Mellanox ConnectX-6 DX Dual Port 100GbE QFSFP56 Network Adapter",null,null,{"$f":"VLOOKUP(L283,Tabella_prezzi!$A$3:$K$303,8,FALSE)","v":"Mellanox ConnectX-6 DX Dual Port 100GbE QFSFP56 FULL"},null,null,1,{"$f":"VLOOKUP(L283,Tabella_prezzi!$A$3:$K$303,9,FALSE)","v":"TS3-OpzA20CX6DP"},{"$f":"VLOOKUP(L283,Tabella_prezzi!$A$3:$K$303,3,FALSE)","v":0},null,{"$f":"VLOOKUP(L283,Tabella_prezzi!$A$3:$K$303,4,FALSE)","v":812},"L4N40",{"$f":"VLOOKUP(L283,Tabella_prezzi!$A$3:$K$303,6,FALSE)","v":"TS3L4-CONX6DP"}]
["[TS3L4-MCX4DP] Mellanox ConnectX-4 Lx Dual Port 25GbE SFP28 FL 2 x SFP28 SR Optic, 25GbE",null,"TS3L4-MCX4DP","Mellanox ConnectX-4 Lx Dual Port 25GbE SFP28 Network Adapter, PCIe Full Height, 2 x SFP28 SR Optic, 25GbE",null,null,1,{"$f":"VLOOKUP(L284,Tabella_prezzi!$A$3:$K$303,9,FALSE)","v":"TS3-OpzA20MCX4F"},{"$f":"VLOOKUP(L284,Tabella_prezzi!$A$3:$K$303,3,FALSE)","v":0},null,{"$f":"VLOOKUP(L284,Tabella_prezzi!$A$3:$K$303,4,FALSE)","v":419},"L4N94",{"$f":"VLOOKUP(L284,Tabella_prezzi!$A$3:$K$303,6,FALSE)","v":"TS3L4-MCX4DP"}]
["[TS3L4-RTX6000] NVIDIA Quadro RTX 6000 24 GB, 250W, Dual Slot, PCIe x16 Passive Cooled",null,null,{"$f":"VLOOKUP(L285,Tabella_prezzi!$A$3:$K$303,8,FALSE)","v":"NVIDIA Quadro RTX 6000 24 GB, 250W, Dual Slot, GPU"},null,null,1,null,{"$f":"VLOOKUP(L285,Tabella_prezzi!$A$3:$K$303,3,FALSE)","v":"OpzGPURTX6000"},null,{"$f":"VLOOKUP(L285,Tabella_prezzi!$A$3:$K$303,4,FALSE)","v":4800},"L4N56",{"$f":"VLOOKUP(L285,Tabella_prezzi!$A$3:$K$303,6,FALSE)","v":"TS3L4-RTX6000"}]
["[TS3L4-TESLAM10] NVIDIA Tesla M10 GPU",null,null,{"$f":"VLOOKUP(L286,Tabella_prezzi!$A$3:$K$303,8,FALSE)","v":"NVIDIA Tesla M10 GPU"},null,null,1,null,{"$f":"VLOOKUP(L286,Tabella_prezzi!$A$3:$K$303,3,FALSE)","v":"OpzGPUM10"},null,{"$f":"VLOOKUP(L286,Tabella_prezzi!$A$3:$K$303,4,FALSE)","v":2700},"L4N57",{"$f":"VLOOKUP(L286,Tabella_prezzi!$A$3:$K$303,6,FALSE)","v":"TS3L4-TESLAM10"}]
["[TS3L4-A100] NVIDIA Ampere A100, PCIe, 250W , 40GB Passive, Double Wide, Full Height GPU",null,null,{"$f":"VLOOKUP(L287,Tabella_prezzi!$A$3:$K$303,8,FALSE)","v":"NVIDIA Ampere A100, PCIe, 250W , 40GB Passive, Double Wide, Full Height GPU"},null,null,1,null,{"$f":"VLOOKUP(L287,Tabella_prezzi!$A$3:$K$303,3,FALSE)","v":0},null,{"$f":"VLOOKUP(L287,Tabella_prezzi!$A$3:$K$303,4,FALSE)","v":10130},"L4N108",{"$f":"VLOOKUP(L287,Tabella_prezzi!$A$3:$K$303,6,FALSE)","v":"TS3L4-A100"}]
[]
["TS3L2_PCI_G"]
[{"$f":"\"\"","v":""},null,null,null,null,null,{"$f":"\"\"","v":""},null,{"$f":"\"\"","v":""},null,null,{"$f":"\"\"","v":""},{"$f":"\"\"","v":""}]
["[TS3L4-LAN1] Broadcom 5719 Quad Port 1Gb Network Interface Card,",null,null,{"$f":"VLOOKUP(L291,Tabella_prezzi!$A$3:$K$303,8,FALSE)","v":"Scheda LAN 5719 QP 1Gb FULL"},null,"540-BBCX",1,{"$f":"VLOOKUP(L291,Tabella_prezzi!$A$3:$K$303,9,FALSE)","v":"L4N05-OpzGigabit"},{"$f":"VLOOKUP(L291,Tabella_prezzi!$A$3:$K$303,3,FALSE)","v":"OpzGigabit"},{"$f":"VLOOKUP(L291,Tabella_prezzi!$A$3:$K$303,4,FALSE)","v":26},null,"L4N05",{"$f":"VLOOKUP(L291,Tabella_prezzi!$A$3:$K$303,6,FALSE)","v":"TS3L4-LAN1"}]
["[TS3L4-LAN10] Broadcom 57412 Dual Port 10Gb, SFP+, PCIe Adapter",null,null,{"$f":"VLOOKUP(L292,Tabella_prezzi!$A$3:$K$303,8,FALSE)","v":"Scheda 57412 DP 10Gb SFP+  FULL"},null,"540-BBCX",1,{"$f":"VLOOKUP(L292,Tabella_prezzi!$A$3:$K$303,9,FALSE)","v":"L4N06-OpzGigabit10Gbps"},{"$f":"VLOOKUP(L292,Tabella_prezzi!$A$3:$K$303,3,FALSE)","v":"OpzGigabit10Gbps"},{"$f":"VLOOKUP(L292,Tabella_prezzi!$A$3:$K$303,4,FALSE)","v":126},null,"L4N06",{"$f":"VLOOKUP(L292,Tabella_prezzi!$A$3:$K$303,6,FALSE)","v":"TS3L4-LAN10"}]
["[TS3L4-LAN25] QLogic 41262 Dual Port 25Gb SFP28 Adapter",null,null,{"$f":"VLOOKUP(L293,Tabella_prezzi!$A$3:$K$303,8,FALSE)","v":"Scheda 41262 DP 25Gb SFP28  FULL"},null,"540-BBCX",1,{"$f":"VLOOKUP(L293,Tabella_prezzi!$A$3:$K$303,9,FALSE)","v":"L4N07-OpzGigabit25Gbps"},{"$f":"VLOOKUP(L293,Tabella_prezzi!$A$3:$K$303,3,FALSE)","v":"OpzGigabit25Gbps"},{"$f":"VLOOKUP(L293,Tabella_prezzi!$A$3:$K$303,4,FALSE)","v":341},null,"L4N07",{"$f":"VLOOKUP(L293,Tabella_prezzi!$A$3:$K$303,6,FALSE)","v":"TS3L4-LAN25"}]
["[TS3L4CNA10] QLogic 41112 Dual Port 10Gb SFP+ Adapter",null,null,{"$f":"VLOOKUP(L294,Tabella_prezzi!$A$3:$K$303,8,FALSE)","v":"Scheda 41112 DP 10Gb SFP+  FULL"},null,"540-BBCX",1,{"$f":"VLOOKUP(L294,Tabella_prezzi!$A$3:$K$303,9,FALSE)","v":"L4N08-OpzCNA10Gbps"},{"$f":"VLOOKUP(L294,Tabella_prezzi!$A$3:$K$303,3,FALSE)","v":"OpzGigabit10Gbps CNA"},{"$f":"VLOOKUP(L294,Tabella_prezzi!$A$3:$K$303,4,FALSE)","v":149},null,"L4N08",{"$f":"VLOOKUP(L294,Tabella_prezzi!$A$3:$K$303,6,FALSE)","v":"TS3L4-CNA10"}]
["[TS3L4-FC16] Qlogic 2692 Dual Port 16Gb Fibre Channel HBA",null,null,{"$f":"VLOOKUP(L295,Tabella_prezzi!$A$3:$K$303,8,FALSE)","v":"Scheda FC 2692 DP 16Gb HBA FULL"},null,"540-BBCX",1,{"$f":"VLOOKUP(L295,Tabella_prezzi!$A$3:$K$303,9,FALSE)","v":"L4N09-OpzFibreChannel"},{"$f":"VLOOKUP(L295,Tabella_prezzi!$A$3:$K$303,3,FALSE)","v":"OpzFibreChannel"},{"$f":"VLOOKUP(L295,Tabella_prezzi!$A$3:$K$303,4,FALSE)","v":309},null,"L4N09",{"$f":"VLOOKUP(L295,Tabella_prezzi!$A$3:$K$303,6,FALSE)","v":"TS3L4-FC16"}]
["[TS3L4-NVME1600] Dell 1.6TB, NVMe, Mixed Use Express Flash, HHHL",null,null,{"$f":"VLOOKUP(L296,Tabella_prezzi!$A$3:$K$303,8,FALSE)","v":"NVME 1,6TB MU HHHL, 3 DWPD"},null,"540-BBCX",1,{"$f":"VLOOKUP(L296,Tabella_prezzi!$A$3:$K$303,9,FALSE)","v":"L4N17-OpzNVME1,6TB"},{"$f":"VLOOKUP(L296,Tabella_prezzi!$A$3:$K$303,3,FALSE)","v":"OpzNVME1,6TB"},{"$f":"VLOOKUP(L296,Tabella_prezzi!$A$3:$K$303,4,FALSE)","v":1050},null,"L4N17",{"$f":"VLOOKUP(L296,Tabella_prezzi!$A$3:$K$303,6,FALSE)","v":"TS3L4-NVME1600"}]
["[TS3L4-NVME800] Dell 1.6TB, NVMe, Mixed Use Express Flash, HHHL",null,null,{"$f":"VLOOKUP(L297,Tabella_prezzi!$A$3:$K$303,8,FALSE)","v":"NVME 1,6TB MU HHHL, 3 DWPD"},null,"540-BBCX",1,{"$f":"VLOOKUP(L297,Tabella_prezzi!$A$3:$K$303,9,FALSE)","v":"L4N18-OpzNVME800GB"},{"$f":"VLOOKUP(L297,Tabella_prezzi!$A$3:$K$303,3,FALSE)","v":"OpzNVME800GB"},{"$f":"VLOOKUP(L297,Tabella_prezzi!$A$3:$K$303,4,FALSE)","v":919},null,"L4N18",{"$f":"VLOOKUP(L297,Tabella_prezzi!$A$3:$K$303,6,FALSE)","v":"TS3L4-NVME800"}]
["-=-=-=-=-=-=-=-=-=-=-=-=-=-=-=-=-20%-=-=-=-=-=-=-=-=-=-=-=-=-=-=-=-=-",null,null,null,null,null,{"$f":"\"\"","v":""},null,{"$f":"\"\"","v":""},null,null,{"$f":"\"\"","v":""},{"$f":"\"\"","v":""}]
["[TS3L4-BOSS480] BOSS controller card, full height, with 2 480G M.2 Drives",null,null,{"$f":"VLOOKUP(L299,Tabella_prezzi!$A$3:$K$303,8,FALSE)","v":"BOSS controller card, full height, with 2 480G M.2 Drives"},null,null,1,null,{"$f":"VLOOKUP(L299,Tabella_prezzi!$A$3:$K$303,3,FALSE)","v":0},null,{"$f":"VLOOKUP(L299,Tabella_prezzi!$A$3:$K$303,4,FALSE)","v":748},"L4N33",{"$f":"VLOOKUP(L299,Tabella_prezzi!$A$3:$K$303,6,FALSE)","v":"TS3L4-BOSS480"}]
["[TS3L4-SAS12] SAS 12Gbps HBA External Controller, Full Height",null,null,{"$f":"VLOOKUP(L300,Tabella_prezzi!$A$3:$K$303,8,FALSE)","v":"SAS 12Gbps HBA External Controller, Full Height"},null,null,1,{"$f":"VLOOKUP(L300,Tabella_prezzi!$A$3:$K$303,9,FALSE)","v":"TS3-OpzA20SAS12"},{"$f":"VLOOKUP(L300,Tabella_prezzi!$A$3:$K$303,3,FALSE)","v":0},null,{"$f":"VLOOKUP(L300,Tabella_prezzi!$A$3:$K$303,4,FALSE)","v":92},"L4N101",{"$f":"VLOOKUP(L300,Tabella_prezzi!$A$3:$K$303,6,FALSE)","v":"TS3L4-SAS12"}]
["[TS3L4-H840] PERC H840 RAID Adapter for External MD14XX Only, 8GB NV Cache",null,null,{"$f":"VLOOKUP(L301,Tabella_prezzi!$A$3:$K$303,8,FALSE)","v":"PERC H840 RAID Adapter for External MD14XX Only, 8GB NV Cache, Full Height"},null,null,1,null,{"$f":"VLOOKUP(L301,Tabella_prezzi!$A$3:$K$303,3,FALSE)","v":"OpzH840"},null,{"$f":"VLOOKUP(L301,Tabella_prezzi!$A$3:$K$303,4,FALSE)","v":479},"L4N71",{"$f":"VLOOKUP(L301,Tabella_prezzi!$A$3:$K$303,6,FALSE)","v":"TS3L4-H840"}]
["[TS3L4-57416] Broadcom 57416 Dual Port 10Gb, Base-T, PCIe Adapter",null,null,{"$f":"VLOOKUP(L302,Tabella_prezzi!$A$3:$K$303,8,FALSE)","v":"Broadcom 57416 Dual Port 10Gb, Base-T, PCIe Adapter, Full Height"},null,null,1,null,{"$f":"VLOOKUP(L302,Tabella_prezzi!$A$3:$K$303,3,FALSE)","v":0},null,{"$f":"VLOOKUP(L302,Tabella_prezzi!$A$3:$K$303,4,FALSE)","v":334},"L4N46",{"$f":"VLOOKUP(L302,Tabella_prezzi!$A$3:$K$303,6,FALSE)","v":"TS3L4-57416"}]
["[TS3L4-GPUA2] NVIDIA Ampere A2, PCIe, 60W, 16GB Passive, Single Wide, Full Height GPU",null,null,{"$f":"VLOOKUP(L303,Tabella_prezzi!$A$3:$K$303,8,FALSE)","v":"NVIDIA Ampere A2, PCIe, 60W, 16GB Passive, Single Wide, Full Height GPU"},null,null,1,null,{"$f":"VLOOKUP(L303,Tabella_prezzi!$A$3:$K$303,3,FALSE)","v":0},null,{"$f":"VLOOKUP(L303,Tabella_prezzi!$A$3:$K$303,4,FALSE)","v":1269},"L4N132",{"$f":"VLOOKUP(L303,Tabella_prezzi!$A$3:$K$303,6,FALSE)","v":"TS3L4-GPUA2"}]
["[TS3L4-X710DP] Intel X710 Dual Port 10Gb Direct Attach, SFP+,PCIe",null,null,{"$f":"VLOOKUP(L304,Tabella_prezzi!$A$3:$K$303,8,FALSE)","v":"Intel X710 Dual Port 10Gb SFP+ FULL"},null,null,1,null,{"$f":"VLOOKUP(L304,Tabella_prezzi!$A$3:$K$303,3,FALSE)","v":0},null,{"$f":"VLOOKUP(L304,Tabella_prezzi!$A$3:$K$303,4,FALSE)","v":342},"L4N42",{"$f":"VLOOKUP(L304,Tabella_prezzi!$A$3:$K$303,6,FALSE)","v":"TS3L4-X710DP"}]
["[TS3L4-X710QP] Intel X710 Quad Port 10Gb Direct Attach, SFP+, PCIe",null,null,{"$f":"VLOOKUP(L305,Tabella_prezzi!$A$3:$K$303,8,FALSE)","v":"Intel X710 Quad Port 10Gb SFP+ FULL"},null,null,1,null,{"$f":"VLOOKUP(L305,Tabella_prezzi!$A$3:$K$303,3,FALSE)","v":0},null,{"$f":"VLOOKUP(L305,Tabella_prezzi!$A$3:$K$303,4,FALSE)","v":518},"L4N43",{"$f":"VLOOKUP(L305,Tabella_prezzi!$A$3:$K$303,6,FALSE)","v":"TS3L4-X710QP"}]
["[TS3L4-MCX4DP] Mellanox ConnectX-4 Lx Dual Port 25GbE SFP28 FL 2 x SFP28 SR Optic, 25GbE",null,"TS3L4-MCX4DP","Mellanox ConnectX-4 Lx Dual Port 25GbE SFP28 Network Adapter, PCIe Full Height, 2 x SFP28 SR Optic, 25GbE",null,null,1,{"$f":"VLOOKUP(L306,Tabella_prezzi!$A$3:$K$303,9,FALSE)","v":"TS3-OpzA20MCX4F"},{"$f":"VLOOKUP(L306,Tabella_prezzi!$A$3:$K$303,3,FALSE)","v":0},null,{"$f":"VLOOKUP(L306,Tabella_prezzi!$A$3:$K$303,4,FALSE)","v":419},"L4N94",{"$f":"VLOOKUP(L306,Tabella_prezzi!$A$3:$K$303,6,FALSE)","v":"TS3L4-MCX4DP"}]
["[TS3L4-CONX6DP] Mellanox ConnectX-6 DX Dual Port 100GbE QFSFP56 Network Adapter",null,null,{"$f":"VLOOKUP(L307,Tabella_prezzi!$A$3:$K$303,8,FALSE)","v":"Mellanox ConnectX-6 DX Dual Port 100GbE QFSFP56 FULL"},null,null,1,{"$f":"VLOOKUP(L307,Tabella_prezzi!$A$3:$K$303,9,FALSE)","v":"TS3-OpzA20CX6DP"},{"$f":"VLOOKUP(L307,Tabella_prezzi!$A$3:$K$303,3,FALSE)","v":0},null,{"$f":"VLOOKUP(L307,Tabella_prezzi!$A$3:$K$303,4,FALSE)","v":812},"L4N40",{"$f":"VLOOKUP(L307,Tabella_prezzi!$A$3:$K$303,6,FALSE)","v":"TS3L4-CONX6DP"}]
["[TS3L4-CONX6SP] Mellanox ConnectX-6 Single Port HDR100 QSFP56 Infiniband Adapter",null,null,{"$f":"VLOOKUP(L308,Tabella_prezzi!$A$3:$K$303,8,FALSE)","v":"Mellanox ConnectX-6 Single Port HDR100 QSFP56 Infiniband FULL"},null,null,1,{"$f":"VLOOKUP(L308,Tabella_prezzi!$A$3:$K$303,9,FALSE)","v":"TS3-OpzA20CX6SP"},{"$f":"VLOOKUP(L308,Tabella_prezzi!$A$3:$K$303,3,FALSE)","v":0},null,{"$f":"VLOOKUP(L308,Tabella_prezzi!$A$3:$K$303,4,FALSE)","v":720},"L4N39",{"$f":"VLOOKUP(L308,Tabella_prezzi!$A$3:$K$303,6,FALSE)","v":"TS3L4-CONX6SP"}]
["[TS3L4-TESLAT4] NVIDIA TeslaT4 16GB GPU",null,null,{"$f":"VLOOKUP(L309,Tabella_prezzi!$A$3:$K$303,8,FALSE)","v":"NVIDIA TeslaT4 16GB GPU"},null,null,1,{"$f":"VLOOKUP(L309,Tabella_prezzi!$A$3:$K$303,9,FALSE)","v":"TS3-OpzA20GPUT4"},{"$f":"VLOOKUP(L309,Tabella_prezzi!$A$3:$K$303,3,FALSE)","v":"OpzGPUT4"},null,{"$f":"VLOOKUP(L309,Tabella_prezzi!$A$3:$K$303,4,FALSE)","v":2450},"L4N55",{"$f":"VLOOKUP(L309,Tabella_prezzi!$A$3:$K$303,6,FALSE)","v":"TS3L4-TESLAT4"}]
[]
["TS3L2_PCI_H"]
[{"$f":"\"\"","v":""},null,null,null,null,null,{"$f":"\"\"","v":""},null,{"$f":"\"\"","v":""},null,null,{"$f":"\"\"","v":""},{"$f":"\"\"","v":""}]
["[TS3L4-LAN1] Broadcom 5719 Quad Port 1Gb Network Interface Card,",null,null,{"$f":"VLOOKUP(L313,Tabella_prezzi!$A$3:$K$303,8,FALSE)","v":"Scheda LAN 5719 QP 1Gb FULL"},null,"540-BBCX",1,{"$f":"VLOOKUP(L313,Tabella_prezzi!$A$3:$K$303,9,FALSE)","v":"L4N05-OpzGigabit"},{"$f":"VLOOKUP(L313,Tabella_prezzi!$A$3:$K$303,3,FALSE)","v":"OpzGigabit"},{"$f":"VLOOKUP(L313,Tabella_prezzi!$A$3:$K$303,4,FALSE)","v":26},null,"L4N05",{"$f":"VLOOKUP(L313,Tabella_prezzi!$A$3:$K$303,6,FALSE)","v":"TS3L4-LAN1"}]
["[TS3L4-LAN10] Broadcom 57412 Dual Port 10Gb, SFP+, PCIe Adapter",null,null,{"$f":"VLOOKUP(L314,Tabella_prezzi!$A$3:$K$303,8,FALSE)","v":"Scheda 57412 DP 10Gb SFP+  FULL"},null,"540-BBCX",1,{"$f":"VLOOKUP(L314,Tabella_prezzi!$A$3:$K$303,9,FALSE)","v":"L4N06-OpzGigabit10Gbps"},{"$f":"VLOOKUP(L314,Tabella_prezzi!$A$3:$K$303,3,FALSE)","v":"OpzGigabit10Gbps"},{"$f":"VLOOKUP(L314,Tabella_prezzi!$A$3:$K$303,4,FALSE)","v":126},null,"L4N06",{"$f":"VLOOKUP(L314,Tabella_prezzi!$A$3:$K$303,6,FALSE)","v":"TS3L4-LAN10"}]
["[TS3L4-LAN25] QLogic 41262 Dual Port 25Gb SFP28 Adapter",null,null,{"$f":"VLOOKUP(L315,Tabella_prezzi!$A$3:$K$303,8,FALSE)","v":"Scheda 41262 DP 25Gb SFP28  FULL"},null,"540-BBCX",1,{"$f":"VLOOKUP(L315,Tabella_prezzi!$A$3:$K$303,9,FALSE)","v":"L4N07-OpzGigabit25Gbps"},{"$f":"VLOOKUP(L315,Tabella_prezzi!$A$3:$K$303,3,FALSE)","v":"OpzGigabit25Gbps"},{"$f":"VLOOKUP(L315,Tabella_prezzi!$A$3:$K$303,4,FALSE)","v":341},null,"L4N07",{"$f":"VLOOKUP(L315,Tabella_prezzi!$A$3:$K$303,6,FALSE)","v":"TS3L4-LAN25"}]
["[TS3L4CNA10] QLogic 41112 Dual Port 10Gb SFP+ Adapter",null,null,{"$f":"VLOOKUP(L316,Tabella_prezzi!$A$3:$K$303,8,FALSE)","v":"Scheda 41112 DP 10Gb SFP+  FULL"},null,"540-BBCX",1,{"$f":"VLOOKUP(L316,Tabella_prezzi!$A$3:$K$303,9,FALSE)","v":"L4N08-OpzCNA10Gbps"},{"$f":"VLOOKUP(L316,Tabella_prezzi!$A$3:$K$303,3,FALSE)","v":"OpzGigabit10Gbps CNA"},{"$f":"VLOOKUP(L316,Tabella_prezzi!$A$3:$K$303,4,FALSE)","v":149},null,"L4N08",{"$f":"VLOOKUP(L316,Tabella_prezzi!$A$3:$K$303,6,FALSE)","v":"TS3L4-CNA10"}]
["[TS3L4-FC16] Qlogic 2692 Dual Port 16Gb Fibre Channel HBA",null,null,{"$f":"VLOOKUP(L317,Tabella_prezzi!$A$3:$K$303,8,FALSE)","v":"Scheda FC 2692 DP 16Gb HBA FULL"},null,"540-BBCX",1,{"$f":"VLOOKUP(L317,Tabella_prezzi!$A$3:$K$303,9,FALSE)","v":"L4N09-OpzFibreChannel"},{"$f":"VLOOKUP(L317,Tabella_prezzi!$A$3:$K$303,3,FALSE)","v":"OpzFibreChannel"},{"$f":"VLOOKUP(L317,Tabella_prezzi!$A$3:$K$303,4,FALSE)","v":309},null,"L4N09",{"$f":"VLOOKUP(L317,Tabella_prezzi!$A$3:$K$303,6,FALSE)","v":"TS3L4-FC16"}]
["[TS3L4-NVME1600] Dell 1.6TB, NVMe, Mixed Use Express Flash, HHHL",null,null,{"$f":"VLOOKUP(L318,Tabella_prezzi!$A$3:$K$303,8,FALSE)","v":"NVME 1,6TB MU HHHL, 3 DWPD"},null,"540-BBCX",1,{"$f":"VLOOKUP(L318,Tabella_prezzi!$A$3:$K$303,9,FALSE)","v":"L4N17-OpzNVME1,6TB"},{"$f":"VLOOKUP(L318,Tabella_prezzi!$A$3:$K$303,3,FALSE)","v":"OpzNVME1,6TB"},{"$f":"VLOOKUP(L318,Tabella_prezzi!$A$3:$K$303,4,FALSE)","v":1050},null,"L4N17",{"$f":"VLOOKUP(L318,Tabella_prezzi!$A$3:$K$303,6,FALSE)","v":"TS3L4-NVME1600"}]
["[TS3L4-NVME800] Dell 1.6TB, NVMe, Mixed Use Express Flash, HHHL",null,null,{"$f":"VLOOKUP(L319,Tabella_prezzi!$A$3:$K$303,8,FALSE)","v":"NVME 1,6TB MU HHHL, 3 DWPD"},null,"540-BBCX",1,{"$f":"VLOOKUP(L319,Tabella_prezzi!$A$3:$K$303,9,FALSE)","v":"L4N18-OpzNVME800GB"},{"$f":"VLOOKUP(L319,Tabella_prezzi!$A$3:$K$303,3,FALSE)","v":"OpzNVME800GB"},{"$f":"VLOOKUP(L319,Tabella_prezzi!$A$3:$K$303,4,FALSE)","v":919},null,"L4N18",{"$f":"VLOOKUP(L319,Tabella_prezzi!$A$3:$K$303,6,FALSE)","v":"TS3L4-NVME800"}]
["-=-=-=-=-=-=-=-=-=-=-=-=-=-=-=-=-20%-=-=-=-=-=-=-=-=-=-=-=-=-=-=-=-=-",null,null,null,null,null,{"$f":"\"\"","v":""},null,{"$f":"\"\"","v":""},null,null,{"$f":"\"\"","v":""},{"$f":"\"\"","v":""}]
["[TS3L4-BOSS480] BOSS controller card, full height, with 2 480G M.2 Drives",null,null,{"$f":"VLOOKUP(L321,Tabella_prezzi!$A$3:$K$303,8,FALSE)","v":"BOSS controller card, full height, with 2 480G M.2 Drives"},null,null,1,null,{"$f":"VLOOKUP(L321,Tabella_prezzi!$A$3:$K$303,3,FALSE)","v":0},null,{"$f":"VLOOKUP(L321,Tabella_prezzi!$A$3:$K$303,4,FALSE)","v":748},"L4N33",{"$f":"VLOOKUP(L321,Tabella_prezzi!$A$3:$K$303,6,FALSE)","v":"TS3L4-BOSS480"}]
["[TS3L4-SAS12] SAS 12Gbps HBA External Controller, Full Height",null,null,{"$f":"VLOOKUP(L322,Tabella_prezzi!$A$3:$K$303,8,FALSE)","v":"SAS 12Gbps HBA External Controller, Full Height"},null,null,1,{"$f":"VLOOKUP(L322,Tabella_prezzi!$A$3:$K$303,9,FALSE)","v":"TS3-OpzA20SAS12"},{"$f":"VLOOKUP(L322,Tabella_prezzi!$A$3:$K$303,3,FALSE)","v":0},null,{"$f":"VLOOKUP(L322,Tabella_prezzi!$A$3:$K$303,4,FALSE)","v":92},"L4N101",{"$f":"VLOOKUP(L322,Tabella_prezzi!$A$3:$K$303,6,FALSE)","v":"TS3L4-SAS12"}]
["[TS3L4-H840] PERC H840 RAID Adapter for External MD14XX Only, 8GB NV Cache",null,null,{"$f":"VLOOKUP(L323,Tabella_prezzi!$A$3:$K$303,8,FALSE)","v":"PERC H840 RAID Adapter for External MD14XX Only, 8GB NV Cache, Full Height"},null,null,1,null,{"$f":"VLOOKUP(L323,Tabella_prezzi!$A$3:$K$303,3,FALSE)","v":"OpzH840"},null,{"$f":"VLOOKUP(L323,Tabella_prezzi!$A$3:$K$303,4,FALSE)","v":479},"L4N71",{"$f":"VLOOKUP(L323,Tabella_prezzi!$A$3:$K$303,6,FALSE)","v":"TS3L4-H840"}]
["[TS3L4-57416] Broadcom 57416 Dual Port 10Gb, Base-T, PCIe Adapter",null,null,{"$f":"VLOOKUP(L324,Tabella_prezzi!$A$3:$K$303,8,FALSE)","v":"Broadcom 57416 Dual Port 10Gb, Base-T, PCIe Adapter, Full Height"},null,null,1,null,{"$f":"VLOOKUP(L324,Tabella_prezzi!$A$3:$K$303,3,FALSE)","v":0},null,{"$f":"VLOOKUP(L324,Tabella_prezzi!$A$3:$K$303,4,FALSE)","v":334},"L4N46",{"$f":"VLOOKUP(L324,Tabella_prezzi!$A$3:$K$303,6,FALSE)","v":"TS3L4-57416"}]
["[TS3L4-GPUA2] NVIDIA Ampere A2, PCIe, 60W, 16GB Passive, Single Wide, Full Height GPU",null,null,{"$f":"VLOOKUP(L325,Tabella_prezzi!$A$3:$K$303,8,FALSE)","v":"NVIDIA Ampere A2, PCIe, 60W, 16GB Passive, Single Wide, Full Height GPU"},null,null,1,null,{"$f":"VLOOKUP(L325,Tabella_prezzi!$A$3:$K$303,3,FALSE)","v":0},null,{"$f":"VLOOKUP(L325,Tabella_prezzi!$A$3:$K$303,4,FALSE)","v":1269},"L4N132",{"$f":"VLOOKUP(L325,Tabella_prezzi!$A$3:$K$303,6,FALSE)","v":"TS3L4-GPUA2"}]
["[TS3L4-X710DP] Intel X710 Dual Port 10Gb Direct Attach, SFP+,PCIe",null,null,{"$f":"VLOOKUP(L326,Tabella_prezzi!$A$3:$K$303,8,FALSE)","v":"Intel X710 Dual Port 10Gb SFP+ FULL"},null,null,1,null,{"$f":"VLOOKUP(L326,Tabella_prezzi!$A$3:$K$303,3,FALSE)","v":0},null,{"$f":"VLOOKUP(L326,Tabella_prezzi!$A$3:$K$303,4,FALSE)","v":342},"L4N42",{"$f":"VLOOKUP(L326,Tabella_prezzi!$A$3:$K$303,6,FALSE)","v":"TS3L4-X710DP"}]
["[TS3L4-X710QP] Intel X710 Quad Port 10Gb Direct Attach, SFP+, PCIe",null,null,{"$f":"VLOOKUP(L327,Tabella_prezzi!$A$3:$K$303,8,FALSE)","v":"Intel X710 Quad Port 10Gb SFP+ FULL"},null,null,1,null,{"$f":"VLOOKUP(L327,Tabella_prezzi!$A$3:$K$303,3,FALSE)","v":0},null,{"$f":"VLOOKUP(L327,Tabella_prezzi!$A$3:$K$303,4,FALSE)","v":518},"L4N43",{"$f":"VLOOKUP(L327,Tabella_prezzi!$A$3:$K$303,6,FALSE)","v":"TS3L4-X710QP"}]
["[TS3L4-CONX6DP] Mellanox ConnectX-6 DX Dual Port 100GbE QFSFP56 Network Adapter",null,null,{"$f":"VLOOKUP(L328,Tabella_prezzi!$A$3:$K$303,8,FALSE)","v":"Mellanox ConnectX-6 DX Dual Port 100GbE QFSFP56 FULL"},null,null,1,{"$f":"VLOOKUP(L328,Tabella_prezzi!$A$3:$K$303,9,FALSE)","v":"TS3-OpzA20CX6DP"},{"$f":"VLOOKUP(L328,Tabella_prezzi!$A$3:$K$303,3,FALSE)","v":0},null,{"$f":"VLOOKUP(L328,Tabella_prezzi!$A$3:$K$303,4,FALSE)","v":812},"L4N40",{"$f":"VLOOKUP(L328,Tabella_prezzi!$A$3:$K$303,6,FALSE)","v":"TS3L4-CONX6DP"}]
["[TS3L4-MCX4DP] Mellanox ConnectX-4 Lx Dual Port 25GbE SFP28 FL 2 x SFP28 SR Optic, 25GbE",null,"TS3L4-MCX4DP","Mellanox ConnectX-4 Lx Dual Port 25GbE SFP28 Network Adapter, PCIe Full Height, 2 x SFP28 SR Optic, 25GbE",null,null,1,{"$f":"VLOOKUP(L329,Tabella_prezzi!$A$3:$K$303,9,FALSE)","v":"TS3-OpzA20MCX4F"},{"$f":"VLOOKUP(L329,Tabella_prezzi!$A$3:$K$303,3,FALSE)","v":0},null,{"$f":"VLOOKUP(L329,Tabella_prezzi!$A$3:$K$303,4,FALSE)","v":419},"L4N94",{"$f":"VLOOKUP(L329,Tabella_prezzi!$A$3:$K$303,6,FALSE)","v":"TS3L4-MCX4DP"}]
["[TS3L4-TESLAT4] NVIDIA TeslaT4 16GB GPU",null,null,{"$f":"VLOOKUP(L330,Tabella_prezzi!$A$3:$K$303,8,FALSE)","v":"NVIDIA TeslaT4 16GB GPU"},null,null,1,{"$f":"VLOOKUP(L330,Tabella_prezzi!$A$3:$K$303,9,FALSE)","v":"TS3-OpzA20GPUT4"},{"$f":"VLOOKUP(L330,Tabella_prezzi!$A$3:$K$303,3,FALSE)","v":"OpzGPUT4"},null,{"$f":"VLOOKUP(L330,Tabella_prezzi!$A$3:$K$303,4,FALSE)","v":2450},"L4N55",{"$f":"VLOOKUP(L330,Tabella_prezzi!$A$3:$K$303,6,FALSE)","v":"TS3L4-TESLAT4"}]
[]
["TS3L2_PCI_I"]
[{"$f":"\"\"","v":""},null,null,null,null,null,{"$f":"\"\"","v":""},null,{"$f":"\"\"","v":""},null,null,{"$f":"\"\"","v":""},{"$f":"\"\"","v":""}]
[]
["TS3L2_PCI_L"]
[{"$f":"\"\"","v":""},null,null,null,null,null,{"$f":"\"\"","v":""},null,{"$f":"\"\"","v":""},null,null,{"$f":"\"\"","v":""},{"$f":"\"\"","v":""}]
["[TS3L4-LAN1] Broadcom 5719 Quad Port 1Gb Network Interface Card,",null,null,{"$f":"VLOOKUP(L337,Tabella_prezzi!$A$3:$K$303,8,FALSE)","v":"Scheda LAN 5719 QP 1Gb FULL"},null,"540-BBCX",1,{"$f":"VLOOKUP(L337,Tabella_prezzi!$A$3:$K$303,9,FALSE)","v":"L4N05-OpzGigabit"},{"$f":"VLOOKUP(L337,Tabella_prezzi!$A$3:$K$303,3,FALSE)","v":"OpzGigabit"},{"$f":"VLOOKUP(L337,Tabella_prezzi!$A$3:$K$303,4,FALSE)","v":26},null,"L4N05",{"$f":"VLOOKUP(L337,Tabella_prezzi!$A$3:$K$303,6,FALSE)","v":"TS3L4-LAN1"}]
["[TS3L4-LAN10] Broadcom 57412 Dual Port 10Gb, SFP+, PCIe Adapter",null,null,{"$f":"VLOOKUP(L338,Tabella_prezzi!$A$3:$K$303,8,FALSE)","v":"Scheda 57412 DP 10Gb SFP+  FULL"},null,"540-BBCX",1,{"$f":"VLOOKUP(L338,Tabella_prezzi!$A$3:$K$303,9,FALSE)","v":"L4N06-OpzGigabit10Gbps"},{"$f":"VLOOKUP(L338,Tabella_prezzi!$A$3:$K$303,3,FALSE)","v":"OpzGigabit10Gbps"},{"$f":"VLOOKUP(L338,Tabella_prezzi!$A$3:$K$303,4,FALSE)","v":126},null,"L4N06",{"$f":"VLOOKUP(L338,Tabella_prezzi!$A$3:$K$303,6,FALSE)","v":"TS3L4-LAN10"}]
["[TS3L4-LAN25] QLogic 41262 Dual Port 25Gb SFP28 Adapter",null,null,{"$f":"VLOOKUP(L339,Tabella_prezzi!$A$3:$K$303,8,FALSE)","v":"Scheda 41262 DP 25Gb SFP28  FULL"},null,"540-BBCX",1,{"$f":"VLOOKUP(L339,Tabella_prezzi!$A$3:$K$303,9,FALSE)","v":"L4N07-OpzGigabit25Gbps"},{"$f":"VLOOKUP(L339,Tabella_prezzi!$A$3:$K$303,3,FALSE)","v":"OpzGigabit25Gbps"},{"$f":"VLOOKUP(L339,Tabella_prezzi!$A$3:$K$303,4,FALSE)","v":341},null,"L4N07",{"$f":"VLOOKUP(L339,Tabella_prezzi!$A$3:$K$303,6,FALSE)","v":"TS3L4-LAN25"}]
["[TS3L4CNA10] QLogic 41112 Dual Port 10Gb SFP+ Adapter",null,null,{"$f":"VLOOKUP(L340,Tabella_prezzi!$A$3:$K$303,8,FALSE)","v":"Scheda 41112 DP 10Gb SFP+  FULL"},null,"540-BBCX",1,{"$f":"VLOOKUP(L340,Tabella_prezzi!$A$3:$K$303,9,FALSE)","v":"L4N08-OpzCNA10Gbps"},{"$f":"VLOOKUP(L340,Tabella_prezzi!$A$3:$K$303,3,FALSE)","v":"OpzGigabit10Gbps CNA"},{"$f":"VLOOKUP(L340,Tabella_prezzi!$A$3:$K$303,4,FALSE)","v":149},null,"L4N08",{"$f":"VLOOKUP(L340,Tabella_prezzi!$A$3:$K$303,6,FALSE)","v":"TS3L4-CNA10"}]
["[TS3L4-FC16] Qlogic 2692 Dual Port 16Gb Fibre Channel HBA",null,null,{"$f":"VLOOKUP(L341,Tabella_prezzi!$A$3:$K$303,8,FALSE)","v":"Scheda FC 2692 DP 16Gb HBA FULL"},null,"540-BBCX",1,{"$f":"VLOOKUP(L341,Tabella_prezzi!$A$3:$K$303,9,FALSE)","v":"L4N09-OpzFibreChannel"},{"$f":"VLOOKUP(L341,Tabella_prezzi!$A$3:$K$303,3,FALSE)","v":"OpzFibreChannel"},{"$f":"VLOOKUP(L341,Tabella_prezzi!$A$3:$K$303,4,FALSE)","v":309},null,"L4N09",{"$f":"VLOOKUP(L341,Tabella_prezzi!$A$3:$K$303,6,FALSE)","v":"TS3L4-FC16"}]
["[TS3L4-NVME1600] Dell 1.6TB, NVMe, Mixed Use Express Flash, HHHL",null,null,{"$f":"VLOOKUP(L342,Tabella_prezzi!$A$3:$K$303,8,FALSE)","v":"NVME 1,6TB MU HHHL, 3 DWPD"},null,"540-BBCX",1,{"$f":"VLOOKUP(L342,Tabella_prezzi!$A$3:$K$303,9,FALSE)","v":"L4N17-OpzNVME1,6TB"},{"$f":"VLOOKUP(L342,Tabella_prezzi!$A$3:$K$303,3,FALSE)","v":"OpzNVME1,6TB"},{"$f":"VLOOKUP(L342,Tabella_prezzi!$A$3:$K$303,4,FALSE)","v":1050},null,"L4N17",{"$f":"VLOOKUP(L342,Tabella_prezzi!$A$3:$K$303,6,FALSE)","v":"TS3L4-NVME1600"}]
["[TS3L4-NVME800] Dell 1.6TB, NVMe, Mixed Use Express Flash, HHHL",null,null,{"$f":"VLOOKUP(L343,Tabella_prezzi!$A$3:$K$303,8,FALSE)","v":"NVME 1,6TB MU HHHL, 3 DWPD"},null,"540-BBCX",1,{"$f":"VLOOKUP(L343,Tabella_prezzi!$A$3:$K$303,9,FALSE)","v":"L4N18-OpzNVME800GB"},{"$f":"VLOOKUP(L343,Tabella_prezzi!$A$3:$K$303,3,FALSE)","v":"OpzNVME800GB"},{"$f":"VLOOKUP(L343,Tabella_prezzi!$A$3:$K$303,4,FALSE)","v":919},null,"L4N18",{"$f":"VLOOKUP(L343,Tabella_prezzi!$A$3:$K$303,6,FALSE)","v":"TS3L4-NVME800"}]
["-=-=-=-=-=-=-=-=-=-=-=-=-=-=-=-=-20%-=-=-=-=-=-=-=-=-=-=-=-=-=-=-=-=-",null,null,null,null,null,{"$f":"\"\"","v":""},null,{"$f":"\"\"","v":""},null,null,{"$f":"\"\"","v":""},{"$f":"\"\"","v":""}]
["[TS3L4-BOSS480] BOSS controller card, full height, with 2 480G M.2 Drives",null,null,{"$f":"VLOOKUP(L345,Tabella_prezzi!$A$3:$K$303,8,FALSE)","v":"BOSS controller card, full height, with 2 480G M.2 Drives"},null,null,1,null,{"$f":"VLOOKUP(L345,Tabella_prezzi!$A$3:$K$303,3,FALSE)","v":0},null,{"$f":"VLOOKUP(L345,Tabella_prezzi!$A$3:$K$303,4,FALSE)","v":748},"L4N33",{"$f":"VLOOKUP(L345,Tabella_prezzi!$A$3:$K$303,6,FALSE)","v":"TS3L4-BOSS480"}]
["[TS3L4-SAS12] SAS 12Gbps HBA External Controller, Full Height",null,null,{"$f":"VLOOKUP(L346,Tabella_prezzi!$A$3:$K$303,8,FALSE)","v":"SAS 12Gbps HBA External Controller, Full Height"},null,null,1,{"$f":"VLOOKUP(L346,Tabella_prezzi!$A$3:$K$303,9,FALSE)","v":"TS3-OpzA20SAS12"},{"$f":"VLOOKUP(L346,Tabella_prezzi!$A$3:$K$303,3,FALSE)","v":0},null,{"$f":"VLOOKUP(L346,Tabella_prezzi!$A$3:$K$303,4,FALSE)","v":92},"L4N101",{"$f":"VLOOKUP(L346,Tabella_prezzi!$A$3:$K$303,6,FALSE)","v":"TS3L4-SAS12"}]
["[TS3L4-H840] PERC H840 RAID Adapter for External MD14XX Only, 8GB NV Cache",null,null,{"$f":"VLOOKUP(L347,Tabella_prezzi!$A$3:$K$303,8,FALSE)","v":"PERC H840 RAID Adapter for External MD14XX Only, 8GB NV Cache, Full Height"},null,null,1,null,{"$f":"VLOOKUP(L347,Tabella_prezzi!$A$3:$K$303,3,FALSE)","v":"OpzH840"},null,{"$f":"VLOOKUP(L347,Tabella_prezzi!$A$3:$K$303,4,FALSE)","v":479},"L4N71",{"$f":"VLOOKUP(L347,Tabella_prezzi!$A$3:$K$303,6,FALSE)","v":"TS3L4-H840"}]
["[TS3L4-57416] Broadcom 57416 Dual Port 10Gb, Base-T, PCIe Adapter",null,null,{"$f":"VLOOKUP(L348,Tabella_prezzi!$A$3:$K$303,8,FALSE)","v":"Broadcom 57416 Dual Port 10Gb, Base-T, PCIe Adapter, Full Height"},null,null,1,null,{"$f":"VLOOKUP(L348,Tabella_prezzi!$A$3:$K$303,3,FALSE)","v":0},null,{"$f":"VLOOKUP(L348,Tabella_prezzi!$A$3:$K$303,4,FALSE)","v":334},"L4N46",{"$f":"VLOOKUP(L348,Tabella_prezzi!$A$3:$K$303,6,FALSE)","v":"TS3L4-57416"}]
["[TS3L4-GPUA2] NVIDIA Ampere A2, PCIe, 60W, 16GB Passive, Single Wide, Full Height GPU",null,null,{"$f":"VLOOKUP(L349,Tabella_prezzi!$A$3:$K$303,8,FALSE)","v":"NVIDIA Ampere A2, PCIe, 60W, 16GB Passive, Single Wide, Full Height GPU"},null,null,1,null,{"$f":"VLOOKUP(L349,Tabella_prezzi!$A$3:$K$303,3,FALSE)","v":0},null,{"$f":"VLOOKUP(L349,Tabella_prezzi!$A$3:$K$303,4,FALSE)","v":1269},"L4N132",{"$f":"VLOOKUP(L349,Tabella_prezzi!$A$3:$K$303,6,FALSE)","v":"TS3L4-GPUA2"}]
["[TS3L4-X710DP] Intel X710 Dual Port 10Gb Direct Attach, SFP+,PCIe",null,null,{"$f":"VLOOKUP(L350,Tabella_prezzi!$A$3:$K$303,8,FALSE)","v":"Intel X710 Dual Port 10Gb SFP+ FULL"},null,null,1,null,{"$f":"VLOOKUP(L350,Tabella_prezzi!$A$3:$K$303,3,FALSE)","v":0},null,{"$f":"VLOOKUP(L350,Tabella_prezzi!$A$3:$K$303,4,FALSE)","v":342},"L4N42",{"$f":"VLOOKUP(L350,Tabella_prezzi!$A$3:$K$303,6,FALSE)","v":"TS3L4-X710DP"}]
["[TS3L4-X710QP] Intel X710 Quad Port 10Gb Direct Attach, SFP+, PCIe",null,null,{"$f":"VLOOKUP(L351,Tabella_prezzi!$A$3:$K$303,8,FALSE)","v":"Intel X710 Quad Port 10Gb SFP+ FULL"},null,null,1,null,{"$f":"VLOOKUP(L351,Tabella_prezzi!$A$3:$K$303,3,FALSE)","v":0},null,{"$f":"VLOOKUP(L351,Tabella_prezzi!$A$3:$K$303,4,FALSE)","v":518},"L4N43",{"$f":"VLOOKUP(L351,Tabella_prezzi!$A$3:$K$303,6,FALSE)","v":"TS3L4-X710QP"}]
["[TS3L4-MCX4DP] Mellanox ConnectX-4 Lx Dual Port 25GbE SFP28 FL 2 x SFP28 SR Optic, 25GbE",null,"TS3L4-MCX4DP","Mellanox ConnectX-4 Lx Dual Port 25GbE SFP28 Network Adapter, PCIe Full Height, 2 x SFP28 SR Optic, 25GbE",null,null,1,{"$f":"VLOOKUP(L352,Tabella_prezzi!$A$3:$K$303,9,FALSE)","v":"TS3-OpzA20MCX4F"},{"$f":"VLOOKUP(L352,Tabella_prezzi!$A$3:$K$303,3,FALSE)","v":0},null,{"$f":"VLOOKUP(L352,Tabella_prezzi!$A$3:$K$303,4,FALSE)","v":419},"L4N94",{"$f":"VLOOKUP(L352,Tabella_prezzi!$A$3:$K$303,6,FALSE)","v":"TS3L4-MCX4DP"}]
["[TS3L4-TESLAT4] NVIDIA TeslaT4 16GB GPU",null,null,{"$f":"VLOOKUP(L353,Tabella_prezzi!$A$3:$K$303,8,FALSE)","v":"NVIDIA TeslaT4 16GB GPU"},null,null,1,{"$f":"VLOOKUP(L353,Tabella_prezzi!$A$3:$K$303,9,FALSE)","v":"TS3-OpzA20GPUT4"},{"$f":"VLOOKUP(L353,Tabella_prezzi!$A$3:$K$303,3,FALSE)","v":"OpzGPUT4"},null,{"$f":"VLOOKUP(L353,Tabella_prezzi!$A$3:$K$303,4,FALSE)","v":2450},"L4N55",{"$f":"VLOOKUP(L353,Tabella_prezzi!$A$3:$K$303,6,FALSE)","v":"TS3L4-TESLAT4"}]
[]
[]
["BUNDLE PMEUPS3RTSER Comprensivo di UPS e scheda SNMP + Kit Rack incluso",null,null,{"$f":"VLOOKUP(L356,Tabella_prezzi!$A$3:$K$303,8,FALSE)","v":"Powerme Online UPS RPMM/9 3K, Rack, SNMP card"},null,null,1,{"$f":"VLOOKUP(L356,Tabella_prezzi!$A$3:$K$303,9,FALSE)","v":"L4N19-OpzUps"},{"$f":"VLOOKUP(L356,Tabella_prezzi!$A$3:$K$303,3,FALSE)","v":"OpzUps (3000VA)"},{"$f":"VLOOKUP(L356,Tabella_prezzi!$A$3:$K$303,4,FALSE)","v":308},null,"L4N19",{"$f":"VLOOKUP(L356,Tabella_prezzi!$A$3:$K$303,6,FALSE)","v":"TS3L4-UPS"}]
["Unità KVM - monitor 17\", cavo combi PS2 e USB da 1,8mt, tastiera ita, touch pad",null,null,{"$f":"VLOOKUP(L357,Tabella_prezzi!$A$3:$K$303,8,FALSE)","v":"Unità KVM - monitor 17\", cavo combi PS/2&USB da 1,8mt, tastiera italiana, touch pad"},null,null,1,{"$f":"VLOOKUP(L357,Tabella_prezzi!$A$3:$K$303,9,FALSE)","v":"L4N20-OpzGUI"},{"$f":"VLOOKUP(L357,Tabella_prezzi!$A$3:$K$303,3,FALSE)","v":"OpzGUI"},{"$f":"VLOOKUP(L357,Tabella_prezzi!$A$3:$K$303,4,FALSE)","v":439},null,"L4N20",{"$f":"VLOOKUP(L357,Tabella_prezzi!$A$3:$K$303,6,FALSE)","v":"TS3L4-GUI"}]
["Switch 16 porte IP con relativi cavi combi PS/2 e USB inclusi",null,null,{"$f":"VLOOKUP(L358,Tabella_prezzi!$A$3:$K$303,8,FALSE)","v":"KVM Switch IP per GUI 16P"},null,null,1,{"$f":"VLOOKUP(L358,Tabella_prezzi!$A$3:$K$303,9,FALSE)","v":"L4N21-OpzKVM"},{"$f":"VLOOKUP(L358,Tabella_prezzi!$A$3:$K$303,3,FALSE)","v":"OpzKVM"},{"$f":"VLOOKUP(L358,Tabella_prezzi!$A$3:$K$303,4,FALSE)","v":506},null,"L4N21",{"$f":"VLOOKUP(L358,Tabella_prezzi!$A$3:$K$303,6,FALSE)","v":"TS3L4-SWKVM"}]
["1-pack of Windows Server 2019/2016 Device CALs (STD or DC)",null,null,{"$f":"VLOOKUP(L359,Tabella_prezzi!$A$3:$K$303,8,FALSE)","v":"Windows Server 2019 Device CAL (STD or DC)"},null,null,1,{"$f":"VLOOKUP(L359,Tabella_prezzi!$A$3:$K$303,9,FALSE)","v":"L4N23-OpzDeviceCal"},{"$f":"VLOOKUP(L359,Tabella_prezzi!$A$3:$K$303,3,FALSE)","v":"OpzDeviceCal"},{"$f":"VLOOKUP(L359,Tabella_prezzi!$A$3:$K$303,4,FALSE)","v":23},null,"L4N23",{"$f":"VLOOKUP(L359,Tabella_prezzi!$A$3:$K$303,6,FALSE)","v":"TS3L4-WINDEVCAL"}]
["1-pack of Windows Server 2019/2016 User CALs (STD or DC)",null,null,{"$f":"VLOOKUP(L360,Tabella_prezzi!$A$3:$K$303,8,FALSE)","v":"Windows Server 2019 User CAL (STD or DC)"},null,null,1,{"$f":"VLOOKUP(L360,Tabella_prezzi!$A$3:$K$303,9,FALSE)","v":"L4N24-OpzUserCal"},{"$f":"VLOOKUP(L360,Tabella_prezzi!$A$3:$K$303,3,FALSE)","v":"OpzUserCal"},{"$f":"VLOOKUP(L360,Tabella_prezzi!$A$3:$K$303,4,FALSE)","v":29},null,"L4N24",{"$f":"VLOOKUP(L360,Tabella_prezzi!$A$3:$K$303,6,FALSE)","v":"TS3L4-WINUSRCAL"}]
["Rack 42U con portata 1000 KG e 4 ruote + coppia PDU 12 prese Shuko bipasso ITA",null,null,{"$f":"VLOOKUP(L361,Tabella_prezzi!$A$3:$K$303,8,FALSE)","v":"Armadio Rack 42U"},null,null,1,{"$f":"VLOOKUP(L361,Tabella_prezzi!$A$3:$K$303,9,FALSE)","v":"L4N29-OpzRack"},{"$f":"VLOOKUP(L361,Tabella_prezzi!$A$3:$K$303,3,FALSE)","v":"OpzRack"},{"$f":"VLOOKUP(L361,Tabella_prezzi!$A$3:$K$303,4,FALSE)","v":511},null,"L4N29",{"$f":"VLOOKUP(L361,Tabella_prezzi!$A$3:$K$303,6,FALSE)","v":"TS3L4-RACK"}]
["VMware vSphere 7 Standard Acceleration Kit OEM for 6 CPU, 3YR License and Maintenance",null,null,{"$f":"VLOOKUP(L362,Tabella_prezzi!$A$3:$K$303,8,FALSE)","v":"VMware vSphere 7 Standard Acceleration Kit OEM for 6 CPU, 3YR License and Maintenance"},null,null,2,{"$f":"VLOOKUP(L362,Tabella_prezzi!$A$3:$K$303,9,FALSE)","v":"TS3-OpzA20VMW01"},{"$f":"VLOOKUP(L362,Tabella_prezzi!$A$3:$K$303,3,FALSE)","v":0},null,{"$f":"VLOOKUP(L362,Tabella_prezzi!$A$3:$K$303,4,FALSE)","v":16549},"L4N72",{"$f":"VLOOKUP(L362,Tabella_prezzi!$A$3:$K$303,6,FALSE)","v":"TS3L4-VS7STD6AK"}]
["VMware vSphere 7 Standard OEM, 1 CPU (max 32 cores/CPU socket), 3YR License and Maintenance",null,null,{"$f":"VLOOKUP(L363,Tabella_prezzi!$A$3:$K$303,8,FALSE)","v":"VMware vSphere 7 Standard OEM, 1 CPU (max 32 cores/CPU socket), 3YR License and Maintenance"},null,null,3,{"$f":"VLOOKUP(L363,Tabella_prezzi!$A$3:$K$303,9,FALSE)","v":"TS3-OpzA20VMW02"},{"$f":"VLOOKUP(L363,Tabella_prezzi!$A$3:$K$303,3,FALSE)","v":0},null,{"$f":"VLOOKUP(L363,Tabella_prezzi!$A$3:$K$303,4,FALSE)","v":1557},"L4N73",{"$f":"VLOOKUP(L363,Tabella_prezzi!$A$3:$K$303,6,FALSE)","v":"TS3L4-VS7STD"}]
["VMware vSphere 7 Enterprise Plus Acceleration Kit OEM for 6 CPU, 3YR License and Maintenance",null,null,{"$f":"VLOOKUP(L364,Tabella_prezzi!$A$3:$K$303,8,FALSE)","v":"VMware vSphere 7 Enterprise Plus Acceleration Kit OEM for 6 CPU, 3YR License and Maintenance"},null,null,4,{"$f":"VLOOKUP(L364,Tabella_prezzi!$A$3:$K$303,9,FALSE)","v":"TS3-OpzA20VMW03"},{"$f":"VLOOKUP(L364,Tabella_prezzi!$A$3:$K$303,3,FALSE)","v":0},null,{"$f":"VLOOKUP(L364,Tabella_prezzi!$A$3:$K$303,4,FALSE)","v":34860},"L4N74",{"$f":"VLOOKUP(L364,Tabella_prezzi!$A$3:$K$303,6,FALSE)","v":"TS3L4-VS7EPL6AK"}]
["VMware vSphere 7 Enterprise Plus OEM, 1 CPU (max 32 cores/CPU socket), 3YR License and Maintenance",null,null,{"$f":"VLOOKUP(L365,Tabella_prezzi!$A$3:$K$303,8,FALSE)","v":"VMware vSphere 7 Enterprise Plus OEM, 1 CPU (max 32 cores/CPU socket), 3YR License and Maintenance"},null,null,5,{"$f":"VLOOKUP(L365,Tabella_prezzi!$A$3:$K$303,9,FALSE)","v":"TS3-OpzA20VMW04"},{"$f":"VLOOKUP(L365,Tabella_prezzi!$A$3:$K$303,3,FALSE)","v":0},null,{"$f":"VLOOKUP(L365,Tabella_prezzi!$A$3:$K$303,4,FALSE)","v":4576},"L4N80",{"$f":"VLOOKUP(L365,Tabella_prezzi!$A$3:$K$303,6,FALSE)","v":"TS3L4-VS7EPL"}]
["VMware vCenter 7 Standard OEM ,Per Instance,3YR License and Maintenance",null,null,{"$f":"VLOOKUP(L366,Tabella_prezzi!$A$3:$K$303,8,FALSE)","v":"VMware vCenter 7 Standard OEM ,Per Instance,3YR License and Maintenance"},null,null,6,{"$f":"VLOOKUP(L366,Tabella_prezzi!$A$3:$K$303,9,FALSE)","v":"TS3-OpzA20VMW05"},{"$f":"VLOOKUP(L366,Tabella_prezzi!$A$3:$K$303,3,FALSE)","v":0},null,{"$f":"VLOOKUP(L366,Tabella_prezzi!$A$3:$K$303,4,FALSE)","v":7860},"L4N81",{"$f":"VLOOKUP(L366,Tabella_prezzi!$A$3:$K$303,6,FALSE)","v":"TS3L4-VCS7STD"}]
["VMware vSAN 7 Enterprise OEM, 1 CPU (max 32 cores/CPU socket), 3YR License and Maintenance",null,null,{"$f":"VLOOKUP(L367,Tabella_prezzi!$A$3:$K$303,8,FALSE)","v":"VMware vSAN 7 Enterprise OEM, 1 CPU (max 32 cores/CPU socket), 3YR License and Maintenance"},null,null,7,{"$f":"VLOOKUP(L367,Tabella_prezzi!$A$3:$K$303,9,FALSE)","v":"TS3-OpzA20VMW06"},{"$f":"VLOOKUP(L367,Tabella_prezzi!$A$3:$K$303,3,FALSE)","v":0},null,{"$f":"VLOOKUP(L367,Tabella_prezzi!$A$3:$K$303,4,FALSE)","v":7196},"L4N82",{"$f":"VLOOKUP(L367,Tabella_prezzi!$A$3:$K$303,6,FALSE)","v":"TS3L4-ST7ENT"}]
["VMware Horizon 8 Advanced OEM,10 Pack,CCU, 3YR License and Maintenance",null,null,{"$f":"VLOOKUP(L368,Tabella_prezzi!$A$3:$K$303,8,FALSE)","v":"VMware Horizon 8 Advanced OEM,10 Pack,CCU, 3YR License and Maintenance"},null,null,8,{"$f":"VLOOKUP(L368,Tabella_prezzi!$A$3:$K$303,9,FALSE)","v":"TS3-OpzA20VMW07"},{"$f":"VLOOKUP(L368,Tabella_prezzi!$A$3:$K$303,3,FALSE)","v":0},null,{"$f":"VLOOKUP(L368,Tabella_prezzi!$A$3:$K$303,4,FALSE)","v":5028},"L4N83",{"$f":"VLOOKUP(L368,Tabella_prezzi!$A$3:$K$303,6,FALSE)","v":"TS3L4-HZ8ADC10"}]
["VMware Horizon 8 Enterprise OEM,10 Pack,CCU, 3YR License and Maintenance",null,null,{"$f":"VLOOKUP(L369,Tabella_prezzi!$A$3:$K$303,8,FALSE)","v":"VMware Horizon 8 Enterprise OEM,10 Pack,CCU, 3YR License and Maintenance"},null,null,9,{"$f":"VLOOKUP(L369,Tabella_prezzi!$A$3:$K$303,9,FALSE)","v":"TS3-OpzA20VMW08"},{"$f":"VLOOKUP(L369,Tabella_prezzi!$A$3:$K$303,3,FALSE)","v":0},null,{"$f":"VLOOKUP(L369,Tabella_prezzi!$A$3:$K$303,4,FALSE)","v":7116},"L4N84",{"$f":"VLOOKUP(L369,Tabella_prezzi!$A$3:$K$303,6,FALSE)","v":"TS3L4-HZ8ENC10"}]
["VMware Horizon Advanced OEM, 10 Pack, Named User, 3YR License and Maintenance",null,null,{"$f":"VLOOKUP(L370,Tabella_prezzi!$A$3:$K$303,8,FALSE)","v":"VMware Horizon Advanced OEM, 10 Pack, Named User, 3YR License and Maintenance"},null,null,10,{"$f":"VLOOKUP(L370,Tabella_prezzi!$A$3:$K$303,9,FALSE)","v":"TS3-OpzA20VMW09"},{"$f":"VLOOKUP(L370,Tabella_prezzi!$A$3:$K$303,3,FALSE)","v":0},null,{"$f":"VLOOKUP(L370,Tabella_prezzi!$A$3:$K$303,4,FALSE)","v":3089},"L4N85",{"$f":"VLOOKUP(L370,Tabella_prezzi!$A$3:$K$303,6,FALSE)","v":"TS3L4-HZ8ADN10"}]
["VMware Horizon 8 Enterprise OEM,10 Pack, Named User, 3YR License and Maintenance",null,null,{"$f":"VLOOKUP(L371,Tabella_prezzi!$A$3:$K$303,8,FALSE)","v":"VMware Horizon 8 Enterprise OEM,10 Pack, Named User, 3YR License and Maintenance"},null,null,11,{"$f":"VLOOKUP(L371,Tabella_prezzi!$A$3:$K$303,9,FALSE)","v":"TS3-OpzA20VMW10"},{"$f":"VLOOKUP(L371,Tabella_prezzi!$A$3:$K$303,3,FALSE)","v":0},null,{"$f":"VLOOKUP(L371,Tabella_prezzi!$A$3:$K$303,4,FALSE)","v":4398},"L4N86",{"$f":"VLOOKUP(L371,Tabella_prezzi!$A$3:$K$303,6,FALSE)","v":"TS3L4-HZ8ENN10"}]
["Enclosure SAS 12 Slot 3.5\", 3YR ProSupport and 4hr Mission Critical",null,null,{"$f":"VLOOKUP(L372,Tabella_prezzi!$A$3:$K$303,8,FALSE)","v":"Enclosure SAS 12 Slot 3.5\", 3YR ProSupport and 4hr Mission Critical"},null,null,12,{"$f":"VLOOKUP(L372,Tabella_prezzi!$A$3:$K$303,9,FALSE)","v":"TS3-OpzA20E13Y4"},{"$f":"VLOOKUP(L372,Tabella_prezzi!$A$3:$K$303,3,FALSE)","v":0},null,{"$f":"VLOOKUP(L372,Tabella_prezzi!$A$3:$K$303,4,FALSE)","v":2727},"L4N87",{"$f":"VLOOKUP(L372,Tabella_prezzi!$A$3:$K$303,6,FALSE)","v":"TS3L4-Encl13Y4H"}]
["Enclosure SAS 12 Slot 3.5\", 5YR ProSupport and 4hr Mission Critical",null,null,{"$f":"VLOOKUP(L373,Tabella_prezzi!$A$3:$K$303,8,FALSE)","v":"Enclosure SAS 12 Slot 3.5\", 5YR ProSupport and 4hr Mission Critical"},null,null,13,{"$f":"VLOOKUP(L373,Tabella_prezzi!$A$3:$K$303,9,FALSE)","v":"TS3-OpzA20E25Y4"},{"$f":"VLOOKUP(L373,Tabella_prezzi!$A$3:$K$303,3,FALSE)","v":0},null,{"$f":"VLOOKUP(L373,Tabella_prezzi!$A$3:$K$303,4,FALSE)","v":2827},"L4N88",{"$f":"VLOOKUP(L373,Tabella_prezzi!$A$3:$K$303,6,FALSE)","v":"TS3L4-Encl25Y4H"}]
["Enclosure SAS 12 Slot 2.5\", 3YR ProSupport and 4hr Mission Critical",null,null,{"$f":"VLOOKUP(L374,Tabella_prezzi!$A$3:$K$303,8,FALSE)","v":"Enclosure SAS 24 Slot 2.5\", 3YR ProSupport and 4hr Mission Critical"},null,null,12,{"$f":"VLOOKUP(L374,Tabella_prezzi!$A$3:$K$303,9,FALSE)","v":"TS3-OpzA20E33Y4"},{"$f":"VLOOKUP(L374,Tabella_prezzi!$A$3:$K$303,3,FALSE)","v":0},null,{"$f":"VLOOKUP(L374,Tabella_prezzi!$A$3:$K$303,4,FALSE)","v":3027},"L4N98",{"$f":"VLOOKUP(L374,Tabella_prezzi!$A$3:$K$303,6,FALSE)","v":"TS3L4-Encl33Y4H"}]
["Enclosure SAS 12 Slot 2.5\", 5YR ProSupport and 4hr Mission Critical",null,null,{"$f":"VLOOKUP(L375,Tabella_prezzi!$A$3:$K$303,8,FALSE)","v":"Enclosure SAS 24 Slot 2.5\", 5YR ProSupport and 4hr Mission Critical"},null,null,13,{"$f":"VLOOKUP(L375,Tabella_prezzi!$A$3:$K$303,9,FALSE)","v":"TS3-OpzA20E45Y4"},{"$f":"VLOOKUP(L375,Tabella_prezzi!$A$3:$K$303,3,FALSE)","v":0},null,{"$f":"VLOOKUP(L375,Tabella_prezzi!$A$3:$K$303,4,FALSE)","v":3327},"L4N99",{"$f":"VLOOKUP(L375,Tabella_prezzi!$A$3:$K$303,6,FALSE)","v":"TS3L4-Encl45Y4H"}]
["HDD 16TB SAS 12Gbps 7k 3.5in Hot-Plug per Enclosure 3.5\"",null,null,{"$f":"VLOOKUP(L376,Tabella_prezzi!$A$3:$K$303,8,FALSE)","v":"HDD 16TB SAS 12Gbps 7k 3.5in Hot-Plug per Enclosure 3.5\""},null,null,13,{"$f":"VLOOKUP(L376,Tabella_prezzi!$A$3:$K$303,9,FALSE)","v":"TS3-OpzA20ED16TB"},{"$f":"VLOOKUP(L376,Tabella_prezzi!$A$3:$K$303,3,FALSE)","v":0},null,{"$f":"VLOOKUP(L376,Tabella_prezzi!$A$3:$K$303,4,FALSE)","v":494},"L4N103",{"$f":"VLOOKUP(L376,Tabella_prezzi!$A$3:$K$303,6,FALSE)","v":"TS3L4-ED16TB"}]
["HDD 12TB SAS 12Gbps 7k 3.5in Hot-Plug per Enclosure 3.5\"",null,null,{"$f":"VLOOKUP(L377,Tabella_prezzi!$A$3:$K$303,8,FALSE)","v":"HDD 12TB SAS 12Gbps 7k 3.5in Hot-Plug per Enclosure 3.5\""},null,null,13,{"$f":"VLOOKUP(L377,Tabella_prezzi!$A$3:$K$303,9,FALSE)","v":"TS3-OpzA20ED12TB"},{"$f":"VLOOKUP(L377,Tabella_prezzi!$A$3:$K$303,3,FALSE)","v":0},null,{"$f":"VLOOKUP(L377,Tabella_prezzi!$A$3:$K$303,4,FALSE)","v":443},"L4N104",{"$f":"VLOOKUP(L377,Tabella_prezzi!$A$3:$K$303,6,FALSE)","v":"TS3L4-ED12TB"}]
["HDD 8TB SAS 12Gbps 7k 3.5in Hot-Plug per Enclosure 3.5\"",null,null,{"$f":"VLOOKUP(L378,Tabella_prezzi!$A$3:$K$303,8,FALSE)","v":"HDD 8TB SAS 12Gbps 7k 3.5in Hot-Plug per Enclosure 3.5\""},null,null,13,{"$f":"VLOOKUP(L378,Tabella_prezzi!$A$3:$K$303,9,FALSE)","v":"TS3-OpzA20ED8TB"},{"$f":"VLOOKUP(L378,Tabella_prezzi!$A$3:$K$303,3,FALSE)","v":0},null,{"$f":"VLOOKUP(L378,Tabella_prezzi!$A$3:$K$303,4,FALSE)","v":281},"L4N105",{"$f":"VLOOKUP(L378,Tabella_prezzi!$A$3:$K$303,6,FALSE)","v":"TS3L4-ED08TB"}]
["HDD 2400GB 10K SAS 12Gbps 2.5in Hot-plug per Enclosure 2.5\"",null,null,{"$f":"VLOOKUP(L379,Tabella_prezzi!$A$3:$K$303,8,FALSE)","v":"HDD 2400GB 10K SAS 12Gbps 2.5in Hot-plug per Enclosure 2.5\""},null,null,13,{"$f":"VLOOKUP(L379,Tabella_prezzi!$A$3:$K$303,9,FALSE)","v":"L2N05-OpzHDD2TB"},{"$f":"VLOOKUP(L379,Tabella_prezzi!$A$3:$K$303,3,FALSE)","v":0},null,{"$f":"VLOOKUP(L379,Tabella_prezzi!$A$3:$K$303,4,FALSE)","v":226},"L4N106",{"$f":"VLOOKUP(L379,Tabella_prezzi!$A$3:$K$303,6,FALSE)","v":"TS3L4-ED2TB"}]
["SSD 960GB SAS RI 12Gbps 2.5in Hot-plug, 1 DWPD per Enclosure 2.5\"",null,null,{"$f":"VLOOKUP(L380,Tabella_prezzi!$A$3:$K$303,8,FALSE)","v":"SSD 960GB SAS RI 12Gbps 2.5in Hot-plug, 1 DWPD per Enclosure 2.5\""},null,null,13,{"$f":"VLOOKUP(L380,Tabella_prezzi!$A$3:$K$303,9,FALSE)","v":"L2N08-OpzSSD-RI800GB"},{"$f":"VLOOKUP(L380,Tabella_prezzi!$A$3:$K$303,3,FALSE)","v":0},null,{"$f":"VLOOKUP(L380,Tabella_prezzi!$A$3:$K$303,4,FALSE)","v":727},"L4N107",{"$f":"VLOOKUP(L380,Tabella_prezzi!$A$3:$K$303,6,FALSE)","v":"TS3L2-EDRI800"}]
["NVIDIA"]
["NVIDIA vApps Subscription License 1 Year, 1 CCU",null,null,{"$f":"VLOOKUP(L382,Tabella_prezzi!$A$3:$K$303,8,FALSE)","v":"NVIDIA vApps Subscription License 1 Year, 1 CCU"},null,null,13,{"$f":"VLOOKUP(L382,Tabella_prezzi!$A$3:$K$303,9,FALSE)","v":"TS3-OpzA20NVIDIA1"},{"$f":"VLOOKUP(L382,Tabella_prezzi!$A$3:$K$303,3,FALSE)","v":0},null,{"$f":"VLOOKUP(L382,Tabella_prezzi!$A$3:$K$303,4,FALSE)","v":8.66},"L4N110",{"$f":"VLOOKUP(L382,Tabella_prezzi!$A$3:$K$303,6,FALSE)","v":"TS3L4-VAPPS1Y"}]
["NVIDIA vApps Subscription License 3 Years, 1 CCU",null,null,{"$f":"VLOOKUP(L383,Tabella_prezzi!$A$3:$K$303,8,FALSE)","v":"NVIDIA vApps Subscription License 3 Years, 1 CCU"},null,null,13,{"$f":"VLOOKUP(L383,Tabella_prezzi!$A$3:$K$303,9,FALSE)","v":"TS3-OpzA20NVIDIA2"},{"$f":"VLOOKUP(L383,Tabella_prezzi!$A$3:$K$303,3,FALSE)","v":0},null,{"$f":"VLOOKUP(L383,Tabella_prezzi!$A$3:$K$303,4,FALSE)","v":25.98},"L4N111",{"$f":"VLOOKUP(L383,Tabella_prezzi!$A$3:$K$303,6,FALSE)","v":"TS3L4-VAPPS3Y"}]
["NVIDIA vApps Subscription License 5 Years, 1 CCU",null,null,{"$f":"VLOOKUP(L384,Tabella_prezzi!$A$3:$K$303,8,FALSE)","v":"NVIDIA vApps Subscription License 5 Years, 1 CCU"},null,null,13,{"$f":"VLOOKUP(L384,Tabella_prezzi!$A$3:$K$303,9,FALSE)","v":"TS3-OpzA20NVIDIA3"},{"$f":"VLOOKUP(L384,Tabella_prezzi!$A$3:$K$303,3,FALSE)","v":0},null,{"$f":"VLOOKUP(L384,Tabella_prezzi!$A$3:$K$303,4,FALSE)","v":43.3},"L4N112",{"$f":"VLOOKUP(L384,Tabella_prezzi!$A$3:$K$303,6,FALSE)","v":"TS3L4-VAPPS5Y"}]
["NVIDIA vPC Subscription License 1 Year, 1 CCU",null,null,{"$f":"VLOOKUP(L385,Tabella_prezzi!$A$3:$K$303,8,FALSE)","v":"NVIDIA vPC Subscription License 1 Year, 1 CCU"},null,null,13,{"$f":"VLOOKUP(L385,Tabella_prezzi!$A$3:$K$303,9,FALSE)","v":"TS3-OpzA20NVIDIA4"},{"$f":"VLOOKUP(L385,Tabella_prezzi!$A$3:$K$303,3,FALSE)","v":0},null,{"$f":"VLOOKUP(L385,Tabella_prezzi!$A$3:$K$303,4,FALSE)","v":43.3},"L4N113",{"$f":"VLOOKUP(L385,Tabella_prezzi!$A$3:$K$303,6,FALSE)","v":"TS3L4-VPC1Y"}]
["NVIDIA vPC Subscription License 3 Years, 1 CCU",null,null,{"$f":"VLOOKUP(L386,Tabella_prezzi!$A$3:$K$303,8,FALSE)","v":"NVIDIA vPC Subscription License 3 Years, 1 CCU"},null,null,13,{"$f":"VLOOKUP(L386,Tabella_prezzi!$A$3:$K$303,9,FALSE)","v":"TS3-OpzA20NVIDIA5"},{"$f":"VLOOKUP(L386,Tabella_prezzi!$A$3:$K$303,3,FALSE)","v":0},null,{"$f":"VLOOKUP(L386,Tabella_prezzi!$A$3:$K$303,4,FALSE)","v":129.91},"L4N114",{"$f":"VLOOKUP(L386,Tabella_prezzi!$A$3:$K$303,6,FALSE)","v":"TS3L4-VPC3Y"}]
["NVIDIA vPC Subscription License 5 Years, 1 CCU",null,null,{"$f":"VLOOKUP(L387,Tabella_prezzi!$A$3:$K$303,8,FALSE)","v":"NVIDIA vPC Subscription License 5 Years, 1 CCU"},null,null,13,{"$f":"VLOOKUP(L387,Tabella_prezzi!$A$3:$K$303,9,FALSE)","v":"TS3-OpzA20NVIDIA6"},{"$f":"VLOOKUP(L387,Tabella_prezzi!$A$3:$K$303,3,FALSE)","v":0},null,{"$f":"VLOOKUP(L387,Tabella_prezzi!$A$3:$K$303,4,FALSE)","v":173.2},"L4N115",{"$f":"VLOOKUP(L387,Tabella_prezzi!$A$3:$K$303,6,FALSE)","v":"TS3L4-VPC5Y"}]
["NVIDIA RTX vWS Subscription License 1 Year, 1 CCU",null,null,{"$f":"VLOOKUP(L388,Tabella_prezzi!$A$3:$K$303,8,FALSE)","v":"NVIDIA RTX vWS Subscription License 1 Year, 1 CCU"},null,null,13,{"$f":"VLOOKUP(L388,Tabella_prezzi!$A$3:$K$303,9,FALSE)","v":"TS3-OpzA20NVIDIA7"},{"$f":"VLOOKUP(L388,Tabella_prezzi!$A$3:$K$303,3,FALSE)","v":0},null,{"$f":"VLOOKUP(L388,Tabella_prezzi!$A$3:$K$303,4,FALSE)","v":210.13},"L4N116",{"$f":"VLOOKUP(L388,Tabella_prezzi!$A$3:$K$303,6,FALSE)","v":"TS3L4-VWS1Y"}]
["NVIDIA RTX vWS Subscription License 3 Years, 1 CCU",null,null,{"$f":"VLOOKUP(L389,Tabella_prezzi!$A$3:$K$303,8,FALSE)","v":"NVIDIA RTX vWS Subscription License 3 Years, 1 CCU"},null,null,13,{"$f":"VLOOKUP(L389,Tabella_prezzi!$A$3:$K$303,9,FALSE)","v":"TS3-OpzA20NVIDIA8"},{"$f":"VLOOKUP(L389,Tabella_prezzi!$A$3:$K$303,3,FALSE)","v":0},null,{"$f":"VLOOKUP(L389,Tabella_prezzi!$A$3:$K$303,4,FALSE)","v":649.5},"L4N117",{"$f":"VLOOKUP(L389,Tabella_prezzi!$A$3:$K$303,6,FALSE)","v":"TS3L4-VWS3Y"}]
["NVIDIA RTX vWS Subscription License 5 Years, 1 CCU",null,null,{"$f":"VLOOKUP(L390,Tabella_prezzi!$A$3:$K$303,8,FALSE)","v":"NVIDIA RTX vWS Subscription License 5 Years, 1 CCU"},null,null,13,{"$f":"VLOOKUP(L390,Tabella_prezzi!$A$3:$K$303,9,FALSE)","v":"TS3-OpzA20NVIDIA9"},{"$f":"VLOOKUP(L390,Tabella_prezzi!$A$3:$K$303,3,FALSE)","v":0},null,{"$f":"VLOOKUP(L390,Tabella_prezzi!$A$3:$K$303,4,FALSE)","v":1082.51},"L4N118",{"$f":"VLOOKUP(L390,Tabella_prezzi!$A$3:$K$303,6,FALSE)","v":"TS3L4-VWS5Y"}]
["NVIDIA Virtual Compute Server Subscription, 1 GPU (Max 8 CC VMs), 1 Year",null,null,{"$f":"VLOOKUP(L391,Tabella_prezzi!$A$3:$K$303,8,FALSE)","v":"NVIDIA Virtual Compute Server Subscription, 1 GPU (Max 8 CC VMs), 1 Year"},null,null,13,{"$f":"VLOOKUP(L391,Tabella_prezzi!$A$3:$K$303,9,FALSE)","v":"TS3-OpzA20NVIDIA10"},{"$f":"VLOOKUP(L391,Tabella_prezzi!$A$3:$K$303,3,FALSE)","v":0},null,{"$f":"VLOOKUP(L391,Tabella_prezzi!$A$3:$K$303,4,FALSE)","v":129.91},"L4N119",{"$f":"VLOOKUP(L391,Tabella_prezzi!$A$3:$K$303,6,FALSE)","v":"TS3L4-VCS1Y"}]
["NVIDIA Virtual Compute Server Subscription, 1 GPU (Max 8 CC VMs), 3 Years",null,null,{"$f":"VLOOKUP(L392,Tabella_prezzi!$A$3:$K$303,8,FALSE)","v":"NVIDIA Virtual Compute Server Subscription, 1 GPU (Max 8 CC VMs), 3 Years"},null,null,13,{"$f":"VLOOKUP(L392,Tabella_prezzi!$A$3:$K$303,9,FALSE)","v":"TS3-OpzA20NVIDIA11"},{"$f":"VLOOKUP(L392,Tabella_prezzi!$A$3:$K$303,3,FALSE)","v":0},null,{"$f":"VLOOKUP(L392,Tabella_prezzi!$A$3:$K$303,4,FALSE)","v":378.25},"L4N120",{"$f":"VLOOKUP(L392,Tabella_prezzi!$A$3:$K$303,6,FALSE)","v":"TS3L4-VCS3Y"}]
["NVIDIA Virtual Compute Server Subscription, 1 GPU (Max 8 CC VMs), 5 Years",null,null,{"$f":"VLOOKUP(L393,Tabella_prezzi!$A$3:$K$303,8,FALSE)","v":"NVIDIA Virtual Compute Server Subscription, 1 GPU (Max 8 CC VMs), 5 Years"},null,null,13,{"$f":"VLOOKUP(L393,Tabella_prezzi!$A$3:$K$303,9,FALSE)","v":"TS3-OpzA20NVIDIA12"},{"$f":"VLOOKUP(L393,Tabella_prezzi!$A$3:$K$303,3,FALSE)","v":0},null,{"$f":"VLOOKUP(L393,Tabella_prezzi!$A$3:$K$303,4,FALSE)","v":630.41},"L4N121",{"$f":"VLOOKUP(L393,Tabella_prezzi!$A$3:$K$303,6,FALSE)","v":"TS3L4-VCS5Y"}]
["NVIDIA vApps Bundle Perpetual License Plus 4yr vApps SUMS, 1CCU",null,null,{"$f":"VLOOKUP(L394,Tabella_prezzi!$A$3:$K$303,8,FALSE)","v":"NVIDIA vApps Bundle Perpetual License Plus 4yr vApps SUMS, 1CCU"},null,null,13,{"$f":"VLOOKUP(L394,Tabella_prezzi!$A$3:$K$303,9,FALSE)","v":"TS3-OpzA20NVIDIA13"},{"$f":"VLOOKUP(L394,Tabella_prezzi!$A$3:$K$303,3,FALSE)","v":0},null,{"$f":"VLOOKUP(L394,Tabella_prezzi!$A$3:$K$303,4,FALSE)","v":36.56},"L4N122",{"$f":"VLOOKUP(L394,Tabella_prezzi!$A$3:$K$303,6,FALSE)","v":"TS3L4-VAPPS-P4Y"}]
["NVIDIA vApps Bundle Perpetual License Plus 5yr vApps SUMS, 1CCU",null,null,{"$f":"VLOOKUP(L395,Tabella_prezzi!$A$3:$K$303,8,FALSE)","v":"NVIDIA vApps Bundle Perpetual License Plus 5yr vApps SUMS, 1CCU"},null,null,13,{"$f":"VLOOKUP(L395,Tabella_prezzi!$A$3:$K$303,9,FALSE)","v":"TS3-OpzA20NVIDIA14"},{"$f":"VLOOKUP(L395,Tabella_prezzi!$A$3:$K$303,3,FALSE)","v":0},null,{"$f":"VLOOKUP(L395,Tabella_prezzi!$A$3:$K$303,4,FALSE)","v":41.37},"L4N123",{"$f":"VLOOKUP(L395,Tabella_prezzi!$A$3:$K$303,6,FALSE)","v":"TS3L4-VAPPS-P5Y"}]
["NVIDIA vPC Bundle Perpetual License Plus 4yr vPC SUMS, 1CCU",null,null,{"$f":"VLOOKUP(L396,Tabella_prezzi!$A$3:$K$303,8,FALSE)","v":"NVIDIA vPC Bundle Perpetual License Plus 4yr vPC SUMS, 1CCU"},null,null,13,{"$f":"VLOOKUP(L396,Tabella_prezzi!$A$3:$K$303,9,FALSE)","v":"TS3-OpzA20NVIDIA15"},{"$f":"VLOOKUP(L396,Tabella_prezzi!$A$3:$K$303,3,FALSE)","v":0},null,{"$f":"VLOOKUP(L396,Tabella_prezzi!$A$3:$K$303,4,FALSE)","v":182.82},"L4N124",{"$f":"VLOOKUP(L396,Tabella_prezzi!$A$3:$K$303,6,FALSE)","v":"TS3L4-VPC-P4Y"}]
["NVIDIA vPC Bundle Perpetual License Plus 5yr vPC SUMS, 1CCU",null,null,{"$f":"VLOOKUP(L397,Tabella_prezzi!$A$3:$K$303,8,FALSE)","v":"NVIDIA vPC Bundle Perpetual License Plus 5yr vPC SUMS, 1CCU"},null,null,13,{"$f":"VLOOKUP(L397,Tabella_prezzi!$A$3:$K$303,9,FALSE)","v":"TS3-OpzA20NVIDIA16"},{"$f":"VLOOKUP(L397,Tabella_prezzi!$A$3:$K$303,3,FALSE)","v":0},null,{"$f":"VLOOKUP(L397,Tabella_prezzi!$A$3:$K$303,4,FALSE)","v":206.87},"L4N125",{"$f":"VLOOKUP(L397,Tabella_prezzi!$A$3:$K$303,6,FALSE)","v":"TS3L4-VPC-P5Y"}]
["NVIDIA RTX vWS Bundle Perpetual License Plus 4yr RTX vWS SUMS, 1CCU",null,null,{"$f":"VLOOKUP(L398,Tabella_prezzi!$A$3:$K$303,8,FALSE)","v":"NVIDIA RTX vWS Bundle Perpetual License Plus 4yr RTX vWS SUMS, 1CCU"},null,null,13,{"$f":"VLOOKUP(L398,Tabella_prezzi!$A$3:$K$303,9,FALSE)","v":"TS3-OpzA20NVIDIA17"},{"$f":"VLOOKUP(L398,Tabella_prezzi!$A$3:$K$303,3,FALSE)","v":0},null,{"$f":"VLOOKUP(L398,Tabella_prezzi!$A$3:$K$303,4,FALSE)","v":774.6},"L4N126",{"$f":"VLOOKUP(L398,Tabella_prezzi!$A$3:$K$303,6,FALSE)","v":"TS3L4-VWS-P4Y"}]
["NVIDIA RTX vWS Bundle Perpetual License Plus 5yr RTX vWS SUMS, 1CCU",null,null,{"$f":"VLOOKUP(L399,Tabella_prezzi!$A$3:$K$303,8,FALSE)","v":"NVIDIA RTX vWS Bundle Perpetual License Plus 5yr RTX vWS SUMS, 1CCU"},null,null,13,{"$f":"VLOOKUP(L399,Tabella_prezzi!$A$3:$K$303,9,FALSE)","v":"TS3-OpzA20NVIDIA18"},{"$f":"VLOOKUP(L399,Tabella_prezzi!$A$3:$K$303,3,FALSE)","v":0},null,{"$f":"VLOOKUP(L399,Tabella_prezzi!$A$3:$K$303,4,FALSE)","v":870.81},"L4N127",{"$f":"VLOOKUP(L399,Tabella_prezzi!$A$3:$K$303,6,FALSE)","v":"TS3L4-VWS-P5Y"}]
["NVIDIA vPC to NVIDIA RTX vWS Upgrade 4 year SUMS Bundle",null,null,{"$f":"VLOOKUP(L400,Tabella_prezzi!$A$3:$K$303,8,FALSE)","v":"NVIDIA vPC to NVIDIA RTX vWS Upgrade 4 year SUMS Bundle"},null,null,13,{"$f":"VLOOKUP(L400,Tabella_prezzi!$A$3:$K$303,9,FALSE)","v":"TS3-OpzA20NVIDIA19"},{"$f":"VLOOKUP(L400,Tabella_prezzi!$A$3:$K$303,3,FALSE)","v":0},null,{"$f":"VLOOKUP(L400,Tabella_prezzi!$A$3:$K$303,4,FALSE)","v":1},"L4N128",{"$f":"VLOOKUP(L400,Tabella_prezzi!$A$3:$K$303,6,FALSE)","v":"TS3L4-VWSUPG4Y"}]
["NVIDIA vPC to NVIDIA RTX vWS Upgrade 5 year SUMS Bundle",null,null,{"$f":"VLOOKUP(L401,Tabella_prezzi!$A$3:$K$303,8,FALSE)","v":"NVIDIA vPC to NVIDIA RTX vWS Upgrade 5 year SUMS Bundle"},null,null,13,{"$f":"VLOOKUP(L401,Tabella_prezzi!$A$3:$K$303,9,FALSE)","v":"TS3-OpzA20NVIDIA20"},{"$f":"VLOOKUP(L401,Tabella_prezzi!$A$3:$K$303,3,FALSE)","v":0},null,{"$f":"VLOOKUP(L401,Tabella_prezzi!$A$3:$K$303,4,FALSE)","v":1},"L4N129",{"$f":"VLOOKUP(L401,Tabella_prezzi!$A$3:$K$303,6,FALSE)","v":"TS3L4-VWSUPG5Y"}]
[]
[]
[]
[]
[]
[]
[]
["Armadio Rack 42U 600x1200, 2 x PDU Monofase 2G, ZeroU, 32A, 230V, (36) C13 & (6) C19",null,null,{"$f":"VLOOKUP(L409,Tabella_prezzi!$A$3:$K$303,8,FALSE)","v":"Armadio Rack 42U 600x1200, 2 x PDU Monofase 2G, ZeroU, 32A, 230V, (36) C13 & (6) C19"},null,null,14,{"$f":"VLOOKUP(L409,Tabella_prezzi!$A$3:$K$303,9,FALSE)","v":"TS3-OpzA20RAPCM"},{"$f":"VLOOKUP(L409,Tabella_prezzi!$A$3:$K$303,3,FALSE)","v":0},null,{"$f":"VLOOKUP(L409,Tabella_prezzi!$A$3:$K$303,4,FALSE)","v":2653},"L4N89",{"$f":"VLOOKUP(L409,Tabella_prezzi!$A$3:$K$303,6,FALSE)","v":"TS3L4-RACKM32A"}]
["Armadio Rack 42U 600x1200, 2 x PDU Trifase 2G, ZeroU, 22.0kW(32A) 17.3kW(24A), 230V, (30) C13 & (12) C19",null,null,{"$f":"VLOOKUP(L410,Tabella_prezzi!$A$3:$K$303,8,FALSE)","v":"Armadio Rack 42U 600x1200, 2 x PDU Trifase 2G, ZeroU, 22.0kW(32A) 17.3kW(24A), 230V, (30) C13 & (12) C19"},null,null,15,{"$f":"VLOOKUP(L410,Tabella_prezzi!$A$3:$K$303,9,FALSE)","v":"TS3-OpzA20RAPCT"},{"$f":"VLOOKUP(L410,Tabella_prezzi!$A$3:$K$303,3,FALSE)","v":0},null,{"$f":"VLOOKUP(L410,Tabella_prezzi!$A$3:$K$303,4,FALSE)","v":4311},"L4N90",{"$f":"VLOOKUP(L410,Tabella_prezzi!$A$3:$K$303,6,FALSE)","v":"TS3L4-RACKT32A"}]
[]
["[TS3L4-HBA330-L] PERC HBA330 Adapter, 12Gbps Adapter","PERC HBA330 Adapter, 12Gbps Adapter, Low Profile,CK","TS3L4-HBA330-L",{"$f":"VLOOKUP(L412,Tabella_prezzi!$A$3:$K$303,8,FALSE)","v":"HBA330 Controller Card in sostituzione del Controller in configurazione BASE"},null,null,1,null,{"$f":"VLOOKUP(L412,Tabella_prezzi!$A$3:$K$303,3,FALSE)","v":0},null,{"$f":"VLOOKUP(L412,Tabella_prezzi!$A$3:$K$303,4,FALSE)","v":180},"L4N34",{"$f":"VLOOKUP(L412,Tabella_prezzi!$A$3:$K$303,6,FALSE)","v":"TS3L4-HBA330-L"}]
[]
[]
["Slot PCI",1,2,3,4,5,6,7,8,null,"Slot PCI",1,2,3,4,5,6,7,8,null,"Slot PCI",1,2,3,4,5,6,7,8]
["Conf.1",{"$f":"Lotto4_R740XD_1!$E$77","v":""},{"$f":"Lotto4_R740XD_1!$E$80","v":""},{"$f":"Lotto4_R740XD_1!$E$83","v":""},{"$f":"Lotto4_R740XD_1!$E$86","v":""},{"$f":"Lotto4_R740XD_1!$E$89","v":""},{"$f":"Lotto4_R740XD_1!$E$92","v":""},{"$f":"Lotto4_R740XD_1!$E$95","v":""},{"$f":"Lotto4_R740XD_1!$E$98","v":""},null,"Conf.2",{"$f":"Lotto4_R740XD_2!$E$77","v":""},{"$f":"Lotto4_R740XD_2!$E$80","v":""},{"$f":"Lotto4_R740XD_2!$E$83","v":""},{"$f":"Lotto4_R740XD_2!$E$86","v":""},{"$f":"Lotto4_R740XD_2!$E$89","v":""},{"$f":"Lotto4_R740XD_2!$E$92","v":""},{"$f":"Lotto4_R740XD_2!$E$95","v":""},{"$f":"Lotto4_R740XD_2!$E$98","v":""},null,"Conf.3",{"$f":"Lotto4_R740XD_3!$E$77","v":""},{"$f":"Lotto4_R740XD_3!$E$80","v":""},{"$f":"Lotto4_R740XD_3!$E$83","v":""},{"$f":"Lotto4_R740XD_3!$E$86","v":""},{"$f":"Lotto4_R740XD_3!$E$89","v":""},{"$f":"Lotto4_R740XD_3!$E$92","v":""},{"$f":"Lotto4_R740XD_3!$E$95","v":""},{"$f":"Lotto4_R740XD_3!$E$98","v":""}]
[]
[]
[]
["TS3L4-SRV",{"$f":"IF(A420=B416,1,\"\")","v":""},{"$f":"IF(A420=C416,2,\"\")","v":""},{"$f":"IF(A420=D416,3,\"\")","v":""},{"$f":"IF(A420=E416,4,\"\")","v":""},{"$f":"IF(A420=F416,5,\"\")","v":""},{"$f":"IF(A420=G416,6,\"\")","v":""},{"$f":"IF(A420=H416,7,\"\")","v":""},{"$f":"IF(A420=I416,8,\"\")","v":""},{"$f":"IF(SUM(B420:I420)=0,\"\",CONCATENATE(\" (Slot PCI \",B420,\".\",C420,\".\",D420,\".\",E420,\".\",F420,\".\",G420,\".\",H420,\".\",I420,\")\"))","v":""},"TS3L4-SRV",{"$f":"IF(K420=$L$416,1,\"\")","v":""},{"$f":"IF(K420=$M$416,2,\"\")","v":""},{"$f":"IF(K420=$N$416,3,\"\")","v":""},{"$f":"IF(K420=$O$416,4,\"\")","v":""},{"$f":"IF(K420=$P$416,5,\"\")","v":""},{"$f":"IF(K420=$Q$416,6,\"\")","v":""},{"$f":"IF(K420=$R$416,7,\"\")","v":""},{"$f":"IF(K420=$S$416,8,\"\")","v":""},{"$f":"IF(SUM(L420:S420)=0,\"\",CONCATENATE(\" (Slot PCI \",L420,\".\",M420,\".\",N420,\".\",O420,\".\",P420,\".\",Q420,\".\",R420,\".\",S420,\")\"))","v":""},"TS3L4-SRV",{"$f":"IF(U420=$V$416,1,\"\")","v":""},{"$f":"IF(U420=$W$416,2,\"\")","v":""},{"$f":"IF(U420=$X$416,3,\"\")","v":""},{"$f":"IF(U420=$Y$416,4,\"\")","v":""},{"$f":"IF(U420=$Z$416,5,\"\")","v":""},{"$f":"IF(U420=$AA$416,6,\"\")","v":""},{"$f":"IF(U420=$AB$416,7,\"\")","v":""},{"$f":"IF(U420=$AC$416,8,\"\")","v":""},{"$f":"IF(SUM(V420:AC420)=0,\"\",CONCATENATE(\" (Slot PCI \",V420,\".\",W420,\".\",X420,\".\",Y420,\".\",Z420,\".\",AA420,\".\",AB420,\".\",AC420,\")\"))","v":""}]
["TS3L4-CPU",{"$f":"IF(A421=B416,1,\"\")","v":""},{"$f":"IF(A421=C416,2,\"\")","v":""},{"$f":"IF(A421=D416,3,\"\")","v":""},{"$f":"IF(A421=E416,4,\"\")","v":""},{"$f":"IF(A421=F416,5,\"\")","v":""},{"$f":"IF(A421=G416,6,\"\")","v":""},{"$f":"IF(A421=H416,7,\"\")","v":""},{"$f":"IF(A421=I416,8,\"\")","v":""},{"$f":"IF(SUM(B421:I421)=0,\"\",CONCATENATE(\" (Slot PCI \",B421,\".\",C421,\".\",D421,\".\",E421,\".\",F421,\".\",G421,\".\",H421,\".\",I421,\")\"))","v":""},"TS3L4-CPU",{"$f":"IF(K421=$L$416,1,\"\")","v":""},{"$f":"IF(K421=$M$416,2,\"\")","v":""},{"$f":"IF(K421=$N$416,3,\"\")","v":""},{"$f":"IF(K421=$O$416,4,\"\")","v":""},{"$f":"IF(K421=$P$416,5,\"\")","v":""},{"$f":"IF(K421=$Q$416,6,\"\")","v":""},{"$f":"IF(K421=$R$416,7,\"\")","v":""},{"$f":"IF(K421=$S$416,8,\"\")","v":""},{"$f":"IF(SUM(L421:S421)=0,\"\",CONCATENATE(\" (Slot PCI \",L421,\".\",M421,\".\",N421,\".\",O421,\".\",P421,\".\",Q421,\".\",R421,\".\",S421,\")\"))","v":""},"TS3L4-CPU",{"$f":"IF(U421=$V$416,1,\"\")","v":""},{"$f":"IF(U421=$W$416,2,\"\")","v":""},{"$f":"IF(U421=$X$416,3,\"\")","v":""},{"$f":"IF(U421=$Y$416,4,\"\")","v":""},{"$f":"IF(U421=$Z$416,5,\"\")","v":""},{"$f":"IF(U421=$AA$416,6,\"\")","v":""},{"$f":"IF(U421=$AB$416,7,\"\")","v":""},{"$f":"IF(U421=$AC$416,8,\"\")","v":""},{"$f":"IF(SUM(V421:AC421)=0,\"\",CONCATENATE(\" (Slot PCI \",V421,\".\",W421,\".\",X421,\".\",Y421,\".\",Z421,\".\",AA421,\".\",AB421,\".\",AC421,\")\"))","v":""}]
["TS3L4-RAM32",{"$f":"IF(A422=B416,1,\"\")","v":""},{"$f":"IF(A422=C416,2,\"\")","v":""},{"$f":"IF(A422=D416,3,\"\")","v":""},{"$f":"IF(A422=E416,4,\"\")","v":""},{"$f":"IF(A422=F416,5,\"\")","v":""},{"$f":"IF(A422=G416,6,\"\")","v":""},{"$f":"IF(A422=H416,7,\"\")","v":""},{"$f":"IF(A422=I416,8,\"\")","v":""},"","TS3L4-RAM32","","","","","","","","","","TS3L4-RAM32","","","","","","","","",""]
["TS3L4-RAM64",{"$f":"IF(A423=B416,1,\"\")","v":""},{"$f":"IF(A423=C416,2,\"\")","v":""},{"$f":"IF(A423=D416,3,\"\")","v":""},{"$f":"IF(A423=E416,4,\"\")","v":""},{"$f":"IF(A423=F416,5,\"\")","v":""},{"$f":"IF(A423=G416,6,\"\")","v":""},{"$f":"IF(A423=H416,7,\"\")","v":""},{"$f":"IF(A423=I416,8,\"\")","v":""},"","TS3L4-RAM64","","","","","","","","","","TS3L4-RAM64","","","","","","","","",""]
["TS3L4-LAN1",{"$f":"IF(A424=B416,1,\"\")","v":""},{"$f":"IF(A424=C416,2,\"\")","v":""},{"$f":"IF(A424=D416,3,\"\")","v":""},{"$f":"IF(A424=E416,4,\"\")","v":""},{"$f":"IF(A424=F416,5,\"\")","v":""},{"$f":"IF(A424=G416,6,\"\")","v":""},{"$f":"IF(A424=H416,7,\"\")","v":""},{"$f":"IF(A424=I416,8,\"\")","v":""},"","TS3L4-LAN1","","","","","","","","","","TS3L4-LAN1","","","","","","","","",""]
["TS3L4-LAN1-L",{"$f":"IF(A425=B416,1,\"\")","v":""},{"$f":"IF(A425=C416,2,\"\")","v":""},{"$f":"IF(A425=D416,3,\"\")","v":""},{"$f":"IF(A425=E416,4,\"\")","v":""},{"$f":"IF(A425=F416,5,\"\")","v":""},{"$f":"IF(A425=G416,6,\"\")","v":""},{"$f":"IF(A425=H416,7,\"\")","v":""},{"$f":"IF(A425=I416,8,\"\")","v":""},"","TS3L4-LAN1-L","","","","","","","","","","TS3L4-LAN1-L","","","","","","","","",""]
["TS3L4-LAN10",{"$f":"IF(A426=B416,1,\"\")","v":""},{"$f":"IF(A426=C416,2,\"\")","v":""},{"$f":"IF(A426=D416,3,\"\")","v":""},{"$f":"IF(A426=E416,4,\"\")","v":""},{"$f":"IF(A426=F416,5,\"\")","v":""},{"$f":"IF(A426=G416,6,\"\")","v":""},{"$f":"IF(A426=H416,7,\"\")","v":""},{"$f":"IF(A426=I416,8,\"\")","v":""},"","TS3L4-LAN10","","","","","","","","","","TS3L4-LAN10","","","","","","","","",""]
["TS3L4-LAN10-L",{"$f":"IF(A427=B416,1,\"\")","v":""},{"$f":"IF(A427=C416,2,\"\")","v":""},{"$f":"IF(A427=D416,3,\"\")","v":""},{"$f":"IF(A427=E416,4,\"\")","v":""},{"$f":"IF(A427=F416,5,\"\")","v":""},{"$f":"IF(A427=G416,6,\"\")","v":""},{"$f":"IF(A427=H416,7,\"\")","v":""},{"$f":"IF(A427=I416,8,\"\")","v":""},"","TS3L4-LAN10-L","","","","","","","","","","TS3L4-LAN10-L","","","","","","","","",""]
["TS3L4-LAN25",{"$f":"IF(A428=B416,1,\"\")","v":""},{"$f":"IF(A428=C416,2,\"\")","v":""},{"$f":"IF(A428=D416,3,\"\")","v":""},{"$f":"IF(A428=E416,4,\"\")","v":""},{"$f":"IF(A428=F416,5,\"\")","v":""},{"$f":"IF(A428=G416,6,\"\")","v":""},{"$f":"IF(A428=H416,7,\"\")","v":""},{"$f":"IF(A428=I416,8,\"\")","v":""},"","TS3L4-LAN25","","","","","","","","","","TS3L4-LAN25","","","","","","","","",""]
["TS3L4-LAN25-L",{"$f":"IF(A429=B416,1,\"\")","v":""},{"$f":"IF(A429=C416,2,\"\")","v":""},{"$f":"IF(A429=D416,3,\"\")","v":""},{"$f":"IF(A429=E416,4,\"\")","v":""},{"$f":"IF(A429=F416,5,\"\")","v":""},{"$f":"IF(A429=G416,6,\"\")","v":""},{"$f":"IF(A429=H416,7,\"\")","v":""},{"$f":"IF(A429=I416,8,\"\")","v":""},"","TS3L4-LAN25-L","","","","","","","","","","TS3L4-LAN25-L","","","","","","","","",""]
["TS3L4-CNA10",{"$f":"IF(A430=B416,1,\"\")","v":""},{"$f":"IF(A430=C416,2,\"\")","v":""},{"$f":"IF(A430=D416,3,\"\")","v":""},{"$f":"IF(A430=E416,4,\"\")","v":""},{"$f":"IF(A430=F416,5,\"\")","v":""},{"$f":"IF(A430=G416,6,\"\")","v":""},{"$f":"IF(A430=H416,7,\"\")","v":""},{"$f":"IF(A430=I416,8,\"\")","v":""},"","TS3L4-CNA10","","","","","","","","","","TS3L4-CNA10","","","","","","","","",""]
["TS3L4-CNA10-L",{"$f":"IF(A431=B416,1,\"\")","v":""},{"$f":"IF(A431=C416,2,\"\")","v":""},{"$f":"IF(A431=D416,3,\"\")","v":""},{"$f":"IF(A431=E416,4,\"\")","v":""},{"$f":"IF(A431=F416,5,\"\")","v":""},{"$f":"IF(A431=G416,6,\"\")","v":""},{"$f":"IF(A431=H416,7,\"\")","v":""},{"$f":"IF(A431=I416,8,\"\")","v":""},"","TS3L4-CNA10-L","","","","","","","","","","TS3L4-CNA10-L","","","","","","","","",""]
["TS3L4-FC16",{"$f":"IF(A432=B416,1,\"\")","v":""},{"$f":"IF(A432=C416,2,\"\")","v":""},{"$f":"IF(A432=D416,3,\"\")","v":""},{"$f":"IF(A432=E416,4,\"\")","v":""},{"$f":"IF(A432=F416,5,\"\")","v":""},{"$f":"IF(A432=G416,6,\"\")","v":""},{"$f":"IF(A432=H416,7,\"\")","v":""},{"$f":"IF(A432=I416,8,\"\")","v":""},"","TS3L4-FC16","","","","","","","","","","TS3L4-FC16","","","","","","","","",""]
["TS3L4-FC16-L",{"$f":"IF(A433=B416,1,\"\")","v":""},{"$f":"IF(A433=C416,2,\"\")","v":""},{"$f":"IF(A433=D416,3,\"\")","v":""},{"$f":"IF(A433=E416,4,\"\")","v":""},{"$f":"IF(A433=F416,5,\"\")","v":""},{"$f":"IF(A433=G416,6,\"\")","v":""},{"$f":"IF(A433=H416,7,\"\")","v":""},{"$f":"IF(A433=I416,8,\"\")","v":""},"","TS3L4-FC16-L","","","","","","","","","","TS3L4-FC16-L","","","","","","","","",""]
["TS3L4-HDD2TB",{"$f":"IF(A434=B416,1,\"\")","v":""},{"$f":"IF(A434=C416,2,\"\")","v":""},{"$f":"IF(A434=D416,3,\"\")","v":""},{"$f":"IF(A434=E416,4,\"\")","v":""},{"$f":"IF(A434=F416,5,\"\")","v":""},{"$f":"IF(A434=G416,6,\"\")","v":""},{"$f":"IF(A434=H416,7,\"\")","v":""},{"$f":"IF(A434=I416,8,\"\")","v":""},"","TS3L4-HDD2TB","","","","","","","","","","TS3L4-HDD2TB","","","","","","","","",""]
["TS3L4-HDD1TB",{"$f":"IF(A435=B416,1,\"\")","v":""},{"$f":"IF(A435=C416,2,\"\")","v":""},{"$f":"IF(A435=D416,3,\"\")","v":""},{"$f":"IF(A435=E416,4,\"\")","v":""},{"$f":"IF(A435=F416,5,\"\")","v":""},{"$f":"IF(A435=G416,6,\"\")","v":""},{"$f":"IF(A435=H416,7,\"\")","v":""},{"$f":"IF(A435=I416,8,\"\")","v":""},"","TS3L4-HDD1TB","","","","","","","","","","TS3L4-HDD1TB","","","","","","","","",""]
["TS3L4-HDD300GB",{"$f":"IF(A436=B416,1,\"\")","v":""},{"$f":"IF(A436=C416,2,\"\")","v":""},{"$f":"IF(A436=D416,3,\"\")","v":""},{"$f":"IF(A436=E416,4,\"\")","v":""},{"$f":"IF(A436=F416,5,\"\")","v":""},{"$f":"IF(A436=G416,6,\"\")","v":""},{"$f":"IF(A436=H416,7,\"\")","v":""},{"$f":"IF(A436=I416,8,\"\")","v":""},"","TS3L4-HDD300GB","","","","","","","","","","TS3L4-HDD300GB","","","","","","","","",""]
["TS3L4-RI1600GB",{"$f":"IF(A437=B416,1,\"\")","v":""},{"$f":"IF(A437=C416,2,\"\")","v":""},{"$f":"IF(A437=D416,3,\"\")","v":""},{"$f":"IF(A437=E416,4,\"\")","v":""},{"$f":"IF(A437=F416,5,\"\")","v":""},{"$f":"IF(A437=G416,6,\"\")","v":""},{"$f":"IF(A437=H416,7,\"\")","v":""},{"$f":"IF(A437=I416,8,\"\")","v":""},"","TS3L4-RI1600GB","","","","","","","","","","TS3L4-RI1600GB","","","","","","","","",""]
["TS3L4-MU1600GB",{"$f":"IF(A438=B416,1,\"\")","v":""},{"$f":"IF(A438=C416,2,\"\")","v":""},{"$f":"IF(A438=D416,3,\"\")","v":""},{"$f":"IF(A438=E416,4,\"\")","v":""},{"$f":"IF(A438=F416,5,\"\")","v":""},{"$f":"IF(A438=G416,6,\"\")","v":""},{"$f":"IF(A438=H416,7,\"\")","v":""},{"$f":"IF(A438=I416,8,\"\")","v":""},"","TS3L4-MU1600GB","","","","","","","","","","TS3L4-MU1600GB","","","","","","","","",""]
["TS3L4-RI800GB",{"$f":"IF(A439=B416,1,\"\")","v":""},{"$f":"IF(A439=C416,2,\"\")","v":""},{"$f":"IF(A439=D416,3,\"\")","v":""},{"$f":"IF(A439=E416,4,\"\")","v":""},{"$f":"IF(A439=F416,5,\"\")","v":""},{"$f":"IF(A439=G416,6,\"\")","v":""},{"$f":"IF(A439=H416,7,\"\")","v":""},{"$f":"IF(A439=I416,8,\"\")","v":""},"","TS3L4-RI800GB","","","","","","","","","","TS3L4-RI800GB","","","","","","","","",""]
["TS3L4-MU800GB",{"$f":"IF(A440=B416,1,\"\")","v":""},{"$f":"IF(A440=C416,2,\"\")","v":""},{"$f":"IF(A440=D416,3,\"\")","v":""},{"$f":"IF(A440=E416,4,\"\")","v":""},{"$f":"IF(A440=F416,5,\"\")","v":""},{"$f":"IF(A440=G416,6,\"\")","v":""},{"$f":"IF(A440=H416,7,\"\")","v":""},{"$f":"IF(A440=I416,8,\"\")","v":""},"","TS3L4-MU800GB","","","","","","","","","","TS3L4-MU800GB","","","","","","","","",""]
["TS3L4-NVME1600",{"$f":"IF(A441=B416,1,\"\")","v":""},{"$f":"IF(A441=C416,2,\"\")","v":""},{"$f":"IF(A441=D416,3,\"\")","v":""},{"$f":"IF(A441=E416,4,\"\")","v":""},{"$f":"IF(A441=F416,5,\"\")","v":""},{"$f":"IF(A441=G416,6,\"\")","v":""},{"$f":"IF(A441=H416,7,\"\")","v":""},{"$f":"IF(A441=I416,8,\"\")","v":""},"","TS3L4-NVME1600","","","","","","","","","","TS3L4-NVME1600","","","","","","","","",""]
["TS3L4-NVME800",{"$f":"IF(A442=B416,1,\"\")","v":""},{"$f":"IF(A442=C416,2,\"\")","v":""},{"$f":"IF(A442=D416,3,\"\")","v":""},{"$f":"IF(A442=E416,4,\"\")","v":""},{"$f":"IF(A442=F416,5,\"\")","v":""},{"$f":"IF(A442=G416,6,\"\")","v":""},{"$f":"IF(A442=H416,7,\"\")","v":""},{"$f":"IF(A442=I416,8,\"\")","v":""},"","TS3L4-NVME800","","","","","","","","","","TS3L4-NVME800","","","","","","","","",""]
["TS3L4-UPS",{"$f":"IF(A443=B416,1,\"\")","v":""},{"$f":"IF(A443=C416,2,\"\")","v":""},{"$f":"IF(A443=D416,3,\"\")","v":""},{"$f":"IF(A443=E416,4,\"\")","v":""},{"$f":"IF(A443=F416,5,\"\")","v":""},{"$f":"IF(A443=G416,6,\"\")","v":""},{"$f":"IF(A443=H416,7,\"\")","v":""},{"$f":"IF(A443=I416,8,\"\")","v":""},"","TS3L4-UPS","","","","","","","","","","TS3L4-UPS","","","","","","","","",""]
["TS3L4-GUI",{"$f":"IF(A444=B416,1,\"\")","v":""},{"$f":"IF(A444=C416,2,\"\")","v":""},{"$f":"IF(A444=D416,3,\"\")","v":""},{"$f":"IF(A444=E416,4,\"\")","v":""},{"$f":"IF(A444=F416,5,\"\")","v":""},{"$f":"IF(A444=G416,6,\"\")","v":""},{"$f":"IF(A444=H416,7,\"\")","v":""},{"$f":"IF(A444=I416,8,\"\")","v":""},"","TS3L4-GUI","","","","","","","","","","TS3L4-GUI","","","","","","","","",""]
["TS3L4-SWKVM",{"$f":"IF(A445=B416,1,\"\")","v":""},{"$f":"IF(A445=C416,2,\"\")","v":""},{"$f":"IF(A445=D416,3,\"\")","v":""},{"$f":"IF(A445=E416,4,\"\")","v":""},{"$f":"IF(A445=F416,5,\"\")","v":""},{"$f":"IF(A445=G416,6,\"\")","v":""},{"$f":"IF(A445=H416,7,\"\")","v":""},{"$f":"IF(A445=I416,8,\"\")","v":""},"","TS3L4-SWKVM","","","","","","","","","","TS3L4-SWKVM","","","","","","","","",""]
["TS3L4-WINSRVSTD",{"$f":"IF(A446=B416,1,\"\")","v":""},{"$f":"IF(A446=C416,2,\"\")","v":""},{"$f":"IF(A446=D416,3,\"\")","v":""},{"$f":"IF(A446=E416,4,\"\")","v":""},{"$f":"IF(A446=F416,5,\"\")","v":""},{"$f":"IF(A446=G416,6,\"\")","v":""},{"$f":"IF(A446=H416,7,\"\")","v":""},{"$f":"IF(A446=I416,8,\"\")","v":""},"","TS3L4-WINSRVSTD","","","","","","","","","","TS3L4-WINSRVSTD","","","","","","","","",""]
["TS3L4-WINDEVCAL",{"$f":"IF(A447=B416,1,\"\")","v":""},{"$f":"IF(A447=C416,2,\"\")","v":""},{"$f":"IF(A447=D416,3,\"\")","v":""},{"$f":"IF(A447=E416,4,\"\")","v":""},{"$f":"IF(A447=F416,5,\"\")","v":""},{"$f":"IF(A447=G416,6,\"\")","v":""},{"$f":"IF(A447=H416,7,\"\")","v":""},{"$f":"IF(A447=I416,8,\"\")","v":""},"","TS3L4-WINDEVCAL","","","","","","","","","","TS3L4-WINDEVCAL","","","","","","","","",""]
["TS3L4-WINUSRCAL",{"$f":"IF(A448=B416,1,\"\")","v":""},{"$f":"IF(A448=C416,2,\"\")","v":""},{"$f":"IF(A448=D416,3,\"\")","v":""},{"$f":"IF(A448=E416,4,\"\")","v":""},{"$f":"IF(A448=F416,5,\"\")","v":""},{"$f":"IF(A448=G416,6,\"\")","v":""},{"$f":"IF(A448=H416,7,\"\")","v":""},{"$f":"IF(A448=I416,8,\"\")","v":""},"","TS3L4-WINUSRCAL","","","","","","","","","","TS3L4-WINUSRCAL","","","","","","","","",""]
["TS3L4-WINSRV2C",{"$f":"IF(A449=B416,1,\"\")","v":""},{"$f":"IF(A449=C416,2,\"\")","v":""},{"$f":"IF(A449=D416,3,\"\")","v":""},{"$f":"IF(A449=E416,4,\"\")","v":""},{"$f":"IF(A449=F416,5,\"\")","v":""},{"$f":"IF(A449=G416,6,\"\")","v":""},{"$f":"IF(A449=H416,7,\"\")","v":""},{"$f":"IF(A449=I416,8,\"\")","v":""},"","TS3L4-WINSRV2C","","","","","","","","","","TS3L4-WINSRV2C","","","","","","","","",""]
["TS3L4-LINUX",{"$f":"IF(A450=B416,1,\"\")","v":""},{"$f":"IF(A450=C416,2,\"\")","v":""},{"$f":"IF(A450=D416,3,\"\")","v":""},{"$f":"IF(A450=E416,4,\"\")","v":""},{"$f":"IF(A450=F416,5,\"\")","v":""},{"$f":"IF(A450=G416,6,\"\")","v":""},{"$f":"IF(A450=H416,7,\"\")","v":""},{"$f":"IF(A450=I416,8,\"\")","v":""},"","TS3L4-LINUX","","","","","","","","","","TS3L4-LINUX","","","","","","","","",""]
["TS3L4-HDRTNTN",{"$f":"IF(A451=B416,1,\"\")","v":""},{"$f":"IF(A451=C416,2,\"\")","v":""},{"$f":"IF(A451=D416,3,\"\")","v":""},{"$f":"IF(A451=E416,4,\"\")","v":""},{"$f":"IF(A451=F416,5,\"\")","v":""},{"$f":"IF(A451=G416,6,\"\")","v":""},{"$f":"IF(A451=H416,7,\"\")","v":""},{"$f":"IF(A451=I416,8,\"\")","v":""},"","TS3L4-HDRTNTN","","","","","","","","","","TS3L4-HDRTNTN","","","","","","","","",""]
["TS3L4-5Y",{"$f":"IF(A452=B416,1,\"\")","v":""},{"$f":"IF(A452=C416,2,\"\")","v":""},{"$f":"IF(A452=D416,3,\"\")","v":""},{"$f":"IF(A452=E416,4,\"\")","v":""},{"$f":"IF(A452=F416,5,\"\")","v":""},{"$f":"IF(A452=G416,6,\"\")","v":""},{"$f":"IF(A452=H416,7,\"\")","v":""},{"$f":"IF(A452=I416,8,\"\")","v":""},"","TS3L4-5Y","","","","","","","","","","TS3L4-5Y","","","","","","","","",""]
["TS3L4-RACK",{"$f":"IF(A453=B416,1,\"\")","v":""},{"$f":"IF(A453=C416,2,\"\")","v":""},{"$f":"IF(A453=D416,3,\"\")","v":""},{"$f":"IF(A453=E416,4,\"\")","v":""},{"$f":"IF(A453=F416,5,\"\")","v":""},{"$f":"IF(A453=G416,6,\"\")","v":""},{"$f":"IF(A453=H416,7,\"\")","v":""},{"$f":"IF(A453=I416,8,\"\")","v":""},"","TS3L4-RACK","","","","","","","","","","TS3L4-RACK","","","","","","","","",""]
["TS3L4-HDRTNTN60",{"$f":"IF(A454=B416,1,\"\")","v":""},{"$f":"IF(A454=C416,2,\"\")","v":""},{"$f":"IF(A454=D416,3,\"\")","v":""},{"$f":"IF(A454=E416,4,\"\")","v":""},{"$f":"IF(A454=F416,5,\"\")","v":""},{"$f":"IF(A454=G416,6,\"\")","v":""},{"$f":"IF(A454=H416,7,\"\")","v":""},{"$f":"IF(A454=I416,8,\"\")","v":""},"","TS3L4-HDRTNTN60","","","","","","","","","","TS3L4-HDRTNTN60","","","","","","","","",""]
[0,{"$f":"IF(A455=B416,1,\"\")","v":""},{"$f":"IF(A455=C416,2,\"\")","v":""},{"$f":"IF(A455=D416,3,\"\")","v":""},{"$f":"IF(A455=E416,4,\"\")","v":""},{"$f":"IF(A455=F416,5,\"\")","v":""},{"$f":"IF(A455=G416,6,\"\")","v":""},{"$f":"IF(A455=H416,7,\"\")","v":""},{"$f":"IF(A455=I416,8,\"\")","v":""},"",0,"","","","","","","","","",0,"","","","","","","","",""]
[0,{"$f":"IF(A456=B416,1,\"\")","v":""},{"$f":"IF(A456=C416,2,\"\")","v":""},{"$f":"IF(A456=D416,3,\"\")","v":""},{"$f":"IF(A456=E416,4,\"\")","v":""},{"$f":"IF(A456=F416,5,\"\")","v":""},{"$f":"IF(A456=G416,6,\"\")","v":""},{"$f":"IF(A456=H416,7,\"\")","v":""},{"$f":"IF(A456=I416,8,\"\")","v":""},"",0,"","","","","","","","","",0,"","","","","","","","",""]
[0,{"$f":"IF(A457=B416,1,\"\")","v":""},{"$f":"IF(A457=C416,2,\"\")","v":""},{"$f":"IF(A457=D416,3,\"\")","v":""},{"$f":"IF(A457=E416,4,\"\")","v":""},{"$f":"IF(A457=F416,5,\"\")","v":""},{"$f":"IF(A457=G416,6,\"\")","v":""},{"$f":"IF(A457=H416,7,\"\")","v":""},{"$f":"IF(A457=I416,8,\"\")","v":""},"",0,"","","","","","","","","",0,"","","","","","","","",""]
["TS3L4-57416-L",{"$f":"IF(A458=B416,1,\"\")","v":""},{"$f":"IF(A458=C416,2,\"\")","v":""},{"$f":"IF(A458=D416,3,\"\")","v":""},{"$f":"IF(A458=E416,4,\"\")","v":""},{"$f":"IF(A458=F416,5,\"\")","v":""},{"$f":"IF(A458=G416,6,\"\")","v":""},{"$f":"IF(A458=H416,7,\"\")","v":""},{"$f":"IF(A458=I416,8,\"\")","v":""},"","TS3L4-57416-L","","","","","","","","","","TS3L4-57416-L","","","","","","","","",""]
["TS3L4-BOSS240",{"$f":"IF(A459=B416,1,\"\")","v":""},{"$f":"IF(A459=C416,2,\"\")","v":""},{"$f":"IF(A459=D416,3,\"\")","v":""},{"$f":"IF(A459=E416,4,\"\")","v":""},{"$f":"IF(A459=F416,5,\"\")","v":""},{"$f":"IF(A459=G416,6,\"\")","v":""},{"$f":"IF(A459=H416,7,\"\")","v":""},{"$f":"IF(A459=I416,8,\"\")","v":""},"","TS3L4-BOSS240","","","","","","","","","","TS3L4-BOSS240","","","","","","","","",""]
["TS3L4-BOSS480",{"$f":"IF(A460=B416,1,\"\")","v":""},{"$f":"IF(A460=C416,2,\"\")","v":""},{"$f":"IF(A460=D416,3,\"\")","v":""},{"$f":"IF(A460=E416,4,\"\")","v":""},{"$f":"IF(A460=F416,5,\"\")","v":""},{"$f":"IF(A460=G416,6,\"\")","v":""},{"$f":"IF(A460=H416,7,\"\")","v":""},{"$f":"IF(A460=I416,8,\"\")","v":""},"","TS3L4-BOSS480","","","","","","","","","","TS3L4-BOSS480","","","","","","","","",""]
["TS3L4-HBA330-L",{"$f":"IF(A461=B416,1,\"\")","v":""},{"$f":"IF(A461=C416,2,\"\")","v":""},{"$f":"IF(A461=D416,3,\"\")","v":""},{"$f":"IF(A461=E416,4,\"\")","v":""},{"$f":"IF(A461=F416,5,\"\")","v":""},{"$f":"IF(A461=G416,6,\"\")","v":""},{"$f":"IF(A461=H416,7,\"\")","v":""},{"$f":"IF(A461=I416,8,\"\")","v":""},"","TS3L4-HBA330-L","","","","","","","","","","TS3L4-HBA330-L","","","","","","","","",""]
["TS3L4-HBA330M",{"$f":"IF(A462=B416,1,\"\")","v":""},{"$f":"IF(A462=C416,2,\"\")","v":""},{"$f":"IF(A462=D416,3,\"\")","v":""},{"$f":"IF(A462=E416,4,\"\")","v":""},{"$f":"IF(A462=F416,5,\"\")","v":""},{"$f":"IF(A462=G416,6,\"\")","v":""},{"$f":"IF(A462=H416,7,\"\")","v":""},{"$f":"IF(A462=I416,8,\"\")","v":""},"","TS3L4-HBA330M","","","","","","","","","","TS3L4-HBA330M","","","","","","","","",""]
["TS3L4-GPUSW",{"$f":"IF(A463=B416,1,\"\")","v":""},{"$f":"IF(A463=C416,2,\"\")","v":""},{"$f":"IF(A463=D416,3,\"\")","v":""},{"$f":"IF(A463=E416,4,\"\")","v":""},{"$f":"IF(A463=F416,5,\"\")","v":""},{"$f":"IF(A463=G416,6,\"\")","v":""},{"$f":"IF(A463=H416,7,\"\")","v":""},{"$f":"IF(A463=I416,8,\"\")","v":""},"","TS3L4-GPUSW","","","","","","","","","","TS3L4-GPUSW","","","","","","","","",""]
["TS3L4-GPUDW",{"$f":"IF(A464=B416,1,\"\")","v":""},{"$f":"IF(A464=C416,2,\"\")","v":""},{"$f":"IF(A464=D416,3,\"\")","v":""},{"$f":"IF(A464=E416,4,\"\")","v":""},{"$f":"IF(A464=F416,5,\"\")","v":""},{"$f":"IF(A464=G416,6,\"\")","v":""},{"$f":"IF(A464=H416,7,\"\")","v":""},{"$f":"IF(A464=I416,8,\"\")","v":""},"","TS3L4-GPUDW","","","","","","","","","","TS3L4-GPUDW","","","","","","","","",""]
["TS3L4-VSAN",{"$f":"IF(A465=B416,1,\"\")","v":""},{"$f":"IF(A465=C416,2,\"\")","v":""},{"$f":"IF(A465=D416,3,\"\")","v":""},{"$f":"IF(A465=E416,4,\"\")","v":""},{"$f":"IF(A465=F416,5,\"\")","v":""},{"$f":"IF(A465=G416,6,\"\")","v":""},{"$f":"IF(A465=H416,7,\"\")","v":""},{"$f":"IF(A465=I416,8,\"\")","v":""},"","TS3L4-VSAN","","","","","","","","","","TS3L4-VSAN","","","","","","","","",""]
["TS3L4-CONX6SP",{"$f":"IF(A466=B416,1,\"\")","v":""},{"$f":"IF(A466=C416,2,\"\")","v":""},{"$f":"IF(A466=D416,3,\"\")","v":""},{"$f":"IF(A466=E416,4,\"\")","v":""},{"$f":"IF(A466=F416,5,\"\")","v":""},{"$f":"IF(A466=G416,6,\"\")","v":""},{"$f":"IF(A466=H416,7,\"\")","v":""},{"$f":"IF(A466=I416,8,\"\")","v":""},"","TS3L4-CONX6SP","","","","","","","","","","TS3L4-CONX6SP","","","","","","","","",""]
["TS3L4-CONX6DP",{"$f":"IF(A467=B416,1,\"\")","v":""},{"$f":"IF(A467=C416,2,\"\")","v":""},{"$f":"IF(A467=D416,3,\"\")","v":""},{"$f":"IF(A467=E416,4,\"\")","v":""},{"$f":"IF(A467=F416,5,\"\")","v":""},{"$f":"IF(A467=G416,6,\"\")","v":""},{"$f":"IF(A467=H416,7,\"\")","v":""},{"$f":"IF(A467=I416,8,\"\")","v":""},"","TS3L4-CONX6DP","","","","","","","","","","TS3L4-CONX6DP","","","","","","","","",""]
["TS3L4-X710DP-L",{"$f":"IF(A468=B416,1,\"\")","v":""},{"$f":"IF(A468=C416,2,\"\")","v":""},{"$f":"IF(A468=D416,3,\"\")","v":""},{"$f":"IF(A468=E416,4,\"\")","v":""},{"$f":"IF(A468=F416,5,\"\")","v":""},{"$f":"IF(A468=G416,6,\"\")","v":""},{"$f":"IF(A468=H416,7,\"\")","v":""},{"$f":"IF(A468=I416,8,\"\")","v":""},"","TS3L4-X710DP-L","","","","","","","","","","TS3L4-X710DP-L","","","","","","","","",""]
["TS3L4-X710DP",{"$f":"IF(A469=B416,1,\"\")","v":""},{"$f":"IF(A469=C416,2,\"\")","v":""},{"$f":"IF(A469=D416,3,\"\")","v":""},{"$f":"IF(A469=E416,4,\"\")","v":""},{"$f":"IF(A469=F416,5,\"\")","v":""},{"$f":"IF(A469=G416,6,\"\")","v":""},{"$f":"IF(A469=H416,7,\"\")","v":""},{"$f":"IF(A469=I416,8,\"\")","v":""},"","TS3L4-X710DP","","","","","","","","","","TS3L4-X710DP","","","","","","","","",""]
["TS3L4-X710QP",{"$f":"IF(A470=B416,1,\"\")","v":""},{"$f":"IF(A470=C416,2,\"\")","v":""},{"$f":"IF(A470=D416,3,\"\")","v":""},{"$f":"IF(A470=E416,4,\"\")","v":""},{"$f":"IF(A470=F416,5,\"\")","v":""},{"$f":"IF(A470=G416,6,\"\")","v":""},{"$f":"IF(A470=H416,7,\"\")","v":""},{"$f":"IF(A470=I416,8,\"\")","v":""},"","TS3L4-X710QP","","","","","","","","","","TS3L4-X710QP","","","","","","","","",""]
[0,{"$f":"IF(A471=B416,1,\"\")","v":""},{"$f":"IF(A471=C416,2,\"\")","v":""},{"$f":"IF(A471=D416,3,\"\")","v":""},{"$f":"IF(A471=E416,4,\"\")","v":""},{"$f":"IF(A471=F416,5,\"\")","v":""},{"$f":"IF(A471=G416,6,\"\")","v":""},{"$f":"IF(A471=H416,7,\"\")","v":""},{"$f":"IF(A471=I416,8,\"\")","v":""},"",0,"","","","","","","","","",0,"","","","","","","","",""]
[0,{"$f":"IF(A472=B416,1,\"\")","v":""},{"$f":"IF(A472=C416,2,\"\")","v":""},{"$f":"IF(A472=D416,3,\"\")","v":""},{"$f":"IF(A472=E416,4,\"\")","v":""},{"$f":"IF(A472=F416,5,\"\")","v":""},{"$f":"IF(A472=G416,6,\"\")","v":""},{"$f":"IF(A472=H416,7,\"\")","v":""},{"$f":"IF(A472=I416,8,\"\")","v":""},"",0,"","","","","","","","","",0,"","","","","","","","",""]
["TS3L4-57416",{"$f":"IF(A473=B416,1,\"\")","v":""},{"$f":"IF(A473=C416,2,\"\")","v":""},{"$f":"IF(A473=D416,3,\"\")","v":""},{"$f":"IF(A473=E416,4,\"\")","v":""},{"$f":"IF(A473=F416,5,\"\")","v":""},{"$f":"IF(A473=G416,6,\"\")","v":""},{"$f":"IF(A473=H416,7,\"\")","v":""},{"$f":"IF(A473=I416,8,\"\")","v":""},"","TS3L4-57416","","","","","","","","","","TS3L4-57416","","","","","","","","",""]
["TS3L4-SRV8CORE",{"$f":"IF(A474=B416,1,\"\")","v":""},{"$f":"IF(A474=C416,2,\"\")","v":""},{"$f":"IF(A474=D416,3,\"\")","v":""},{"$f":"IF(A474=E416,4,\"\")","v":""},{"$f":"IF(A474=F416,5,\"\")","v":""},{"$f":"IF(A474=G416,6,\"\")","v":""},{"$f":"IF(A474=H416,7,\"\")","v":""},{"$f":"IF(A474=I416,8,\"\")","v":""},"","TS3L4-SRV8CORE","","","","","","","","","","TS3L4-SRV8CORE","","","","","","","","",""]
["TS3L4-CPU8CORE",{"$f":"IF(A475=B416,1,\"\")","v":""},{"$f":"IF(A475=C416,2,\"\")","v":""},{"$f":"IF(A475=D416,3,\"\")","v":""},{"$f":"IF(A475=E416,4,\"\")","v":""},{"$f":"IF(A475=F416,5,\"\")","v":""},{"$f":"IF(A475=G416,6,\"\")","v":""},{"$f":"IF(A475=H416,7,\"\")","v":""},{"$f":"IF(A475=I416,8,\"\")","v":""},"","TS3L4-CPU8CORE","","","","","","","","","","TS3L4-CPU8CORE","","","","","","","","",""]
["TS3L4-PSU1100W",{"$f":"IF(A476=B416,1,\"\")","v":""},{"$f":"IF(A476=C416,2,\"\")","v":""},{"$f":"IF(A476=D416,3,\"\")","v":""},{"$f":"IF(A476=E416,4,\"\")","v":""},{"$f":"IF(A476=F416,5,\"\")","v":""},{"$f":"IF(A476=G416,6,\"\")","v":""},{"$f":"IF(A476=H416,7,\"\")","v":""},{"$f":"IF(A476=I416,8,\"\")","v":""},"","TS3L4-PSU1100W","","","","","","","","","","TS3L4-PSU1100W","","","","","","","","",""]
["TS3L4-PSU2000W",{"$f":"IF(A477=B416,1,\"\")","v":""},{"$f":"IF(A477=C416,2,\"\")","v":""},{"$f":"IF(A477=D416,3,\"\")","v":""},{"$f":"IF(A477=E416,4,\"\")","v":""},{"$f":"IF(A477=F416,5,\"\")","v":""},{"$f":"IF(A477=G416,6,\"\")","v":""},{"$f":"IF(A477=H416,7,\"\")","v":""},{"$f":"IF(A477=I416,8,\"\")","v":""},"","TS3L4-PSU2000W","","","","","","","","","","TS3L4-PSU2000W","","","","","","","","",""]
["TS3L4-RI3840GB",{"$f":"IF(A478=B416,1,\"\")","v":""},{"$f":"IF(A478=C416,2,\"\")","v":""},{"$f":"IF(A478=D416,3,\"\")","v":""},{"$f":"IF(A478=E416,4,\"\")","v":""},{"$f":"IF(A478=F416,5,\"\")","v":""},{"$f":"IF(A478=G416,6,\"\")","v":""},{"$f":"IF(A478=H416,7,\"\")","v":""},{"$f":"IF(A478=I416,8,\"\")","v":""},"","TS3L4-RI3840GB","","","","","","","","","","TS3L4-RI3840GB","","","","","","","","",""]
["TS3L4-RI7680GB",{"$f":"IF(A479=B416,1,\"\")","v":""},{"$f":"IF(A479=C416,2,\"\")","v":""},{"$f":"IF(A479=D416,3,\"\")","v":""},{"$f":"IF(A479=E416,4,\"\")","v":""},{"$f":"IF(A479=F416,5,\"\")","v":""},{"$f":"IF(A479=G416,6,\"\")","v":""},{"$f":"IF(A479=H416,7,\"\")","v":""},{"$f":"IF(A479=I416,8,\"\")","v":""},"","TS3L4-RI7680GB","","","","","","","","","","TS3L4-RI7680GB","","","","","","","","",""]
["TS3L4-WI800GB",{"$f":"IF(A480=B416,1,\"\")","v":""},{"$f":"IF(A480=C416,2,\"\")","v":""},{"$f":"IF(A480=D416,3,\"\")","v":""},{"$f":"IF(A480=E416,4,\"\")","v":""},{"$f":"IF(A480=F416,5,\"\")","v":""},{"$f":"IF(A480=G416,6,\"\")","v":""},{"$f":"IF(A480=H416,7,\"\")","v":""},{"$f":"IF(A480=I416,8,\"\")","v":""},"","TS3L4-WI800GB","","","","","","","","","","TS3L4-WI800GB","","","","","","","","",""]
["TS3L4-WI1600GB",{"$f":"IF(A481=B416,1,\"\")","v":""},{"$f":"IF(A481=C416,2,\"\")","v":""},{"$f":"IF(A481=D416,3,\"\")","v":""},{"$f":"IF(A481=E416,4,\"\")","v":""},{"$f":"IF(A481=F416,5,\"\")","v":""},{"$f":"IF(A481=G416,6,\"\")","v":""},{"$f":"IF(A481=H416,7,\"\")","v":""},{"$f":"IF(A481=I416,8,\"\")","v":""},"","TS3L4-WI1600GB","","","","","","","","","","TS3L4-WI1600GB","","","","","","","","",""]
["TS3L4-TESLAT4",{"$f":"IF(A482=B416,1,\"\")","v":""},{"$f":"IF(A482=C416,2,\"\")","v":""},{"$f":"IF(A482=D416,3,\"\")","v":""},{"$f":"IF(A482=E416,4,\"\")","v":""},{"$f":"IF(A482=F416,5,\"\")","v":""},{"$f":"IF(A482=G416,6,\"\")","v":""},{"$f":"IF(A482=H416,7,\"\")","v":""},{"$f":"IF(A482=I416,8,\"\")","v":""},"","TS3L4-TESLAT4","","","","","","","","","","TS3L4-TESLAT4","","","","","","","","",""]
["TS3L4-RTX6000",{"$f":"IF(A483=B416,1,\"\")","v":""},{"$f":"IF(A483=C416,2,\"\")","v":""},{"$f":"IF(A483=D416,3,\"\")","v":""},{"$f":"IF(A483=E416,4,\"\")","v":""},{"$f":"IF(A483=F416,5,\"\")","v":""},{"$f":"IF(A483=G416,6,\"\")","v":""},{"$f":"IF(A483=H416,7,\"\")","v":""},{"$f":"IF(A483=I416,8,\"\")","v":""},"","TS3L4-RTX6000","","","","","","","","","","TS3L4-RTX6000","","","","","","","","",""]
["TS3L4-TESLAM10",{"$f":"IF(A484=B416,1,\"\")","v":""},{"$f":"IF(A484=C416,2,\"\")","v":""},{"$f":"IF(A484=D416,3,\"\")","v":""},{"$f":"IF(A484=E416,4,\"\")","v":""},{"$f":"IF(A484=F416,5,\"\")","v":""},{"$f":"IF(A484=G416,6,\"\")","v":""},{"$f":"IF(A484=H416,7,\"\")","v":""},{"$f":"IF(A484=I416,8,\"\")","v":""},"","TS3L4-TESLAM10","","","","","","","","","","TS3L4-TESLAM10","","","","","","","","",""]
["TS3L4-V100S32G",{"$f":"IF(A485=B416,1,\"\")","v":""},{"$f":"IF(A485=C416,2,\"\")","v":""},{"$f":"IF(A485=D416,3,\"\")","v":""},{"$f":"IF(A485=E416,4,\"\")","v":""},{"$f":"IF(A485=F416,5,\"\")","v":""},{"$f":"IF(A485=G416,6,\"\")","v":""},{"$f":"IF(A485=H416,7,\"\")","v":""},{"$f":"IF(A485=I416,8,\"\")","v":""},{"$f":"IF(SUM(B485:I485)=0,\"\",CONCATENATE(\" (Slot PCI \",B485,\".\",C485,\".\",D485,\".\",E485,\".\",F485,\".\",G485,\".\",H485,\".\",I485,\")\"))","v":""},"TS3L4-V100S32G",{"$f":"IF(K485=$L$416,1,\"\")","v":""},{"$f":"IF(K485=$M$416,2,\"\")","v":""},{"$f":"IF(K485=$N$416,3,\"\")","v":""},{"$f":"IF(K485=$O$416,4,\"\")","v":""},{"$f":"IF(K485=$P$416,5,\"\")","v":""},{"$f":"IF(K485=$Q$416,6,\"\")","v":""},{"$f":"IF(K485=$R$416,7,\"\")","v":""},{"$f":"IF(K485=$S$416,8,\"\")","v":""},{"$f":"IF(SUM(L485:S485)=0,\"\",CONCATENATE(\" (Slot PCI \",L485,\".\",M485,\".\",N485,\".\",O485,\".\",P485,\".\",Q485,\".\",R485,\".\",S485,\")\"))","v":""},"TS3L4-V100S32G",{"$f":"IF(U485=$V$416,1,\"\")","v":""},{"$f":"IF(U485=$W$416,2,\"\")","v":""},{"$f":"IF(U485=$X$416,3,\"\")","v":""},{"$f":"IF(U485=$Y$416,4,\"\")","v":""},{"$f":"IF(U485=$Z$416,5,\"\")","v":""},{"$f":"IF(U485=$AA$416,6,\"\")","v":""},{"$f":"IF(U485=$AB$416,7,\"\")","v":""},{"$f":"IF(U485=$AC$416,8,\"\")","v":""},{"$f":"IF(SUM(V485:AC485)=0,\"\",CONCATENATE(\" (Slot PCI \",V485,\".\",W485,\".\",X485,\".\",Y485,\".\",Z485,\".\",AA485,\".\",AB485,\".\",AC485,\")\"))","v":""}]
["TS3L4-WINDC",{"$f":"IF(A486=B416,1,\"\")","v":""},{"$f":"IF(A486=C416,2,\"\")","v":""},{"$f":"IF(A486=D416,3,\"\")","v":""},{"$f":"IF(A486=E416,4,\"\")","v":""},{"$f":"IF(A486=F416,5,\"\")","v":""},{"$f":"IF(A486=G416,6,\"\")","v":""},{"$f":"IF(A486=H416,7,\"\")","v":""},{"$f":"IF(A486=I416,8,\"\")","v":""},"","TS3L4-WINDC","","","","","","","","","","TS3L4-WINDC","","","","","","","","",""]
["TS3L4-WINDC2C",{"$f":"IF(A487=B416,1,\"\")","v":""},{"$f":"IF(A487=C416,2,\"\")","v":""},{"$f":"IF(A487=D416,3,\"\")","v":""},{"$f":"IF(A487=E416,4,\"\")","v":""},{"$f":"IF(A487=F416,5,\"\")","v":""},{"$f":"IF(A487=G416,6,\"\")","v":""},{"$f":"IF(A487=H416,7,\"\")","v":""},{"$f":"IF(A487=I416,8,\"\")","v":""},"","TS3L4-WINDC2C","","","","","","","","","","TS3L4-WINDC2C","","","","","","","","",""]
["TS3L4-WINDC16C",{"$f":"IF(A488=B416,1,\"\")","v":""},{"$f":"IF(A488=C416,2,\"\")","v":""},{"$f":"IF(A488=D416,3,\"\")","v":""},{"$f":"IF(A488=E416,4,\"\")","v":""},{"$f":"IF(A488=F416,5,\"\")","v":""},{"$f":"IF(A488=G416,6,\"\")","v":""},{"$f":"IF(A488=H416,7,\"\")","v":""},{"$f":"IF(A488=I416,8,\"\")","v":""},"","TS3L4-WINDC16C","","","","","","","","","","TS3L4-WINDC16C","","","","","","","","",""]
["TS3L4-RJ453M",{"$f":"IF(A489=B416,1,\"\")","v":""},{"$f":"IF(A489=C416,2,\"\")","v":""},{"$f":"IF(A489=D416,3,\"\")","v":""},{"$f":"IF(A489=E416,4,\"\")","v":""},{"$f":"IF(A489=F416,5,\"\")","v":""},{"$f":"IF(A489=G416,6,\"\")","v":""},{"$f":"IF(A489=H416,7,\"\")","v":""},{"$f":"IF(A489=I416,8,\"\")","v":""},"","TS3L4-RJ453M","","","","","","","","","","TS3L4-RJ453M","","","","","","","","",""]
["TS3L4-MEL100M3",{"$f":"IF(A490=B416,1,\"\")","v":""},{"$f":"IF(A490=C416,2,\"\")","v":""},{"$f":"IF(A490=D416,3,\"\")","v":""},{"$f":"IF(A490=E416,4,\"\")","v":""},{"$f":"IF(A490=F416,5,\"\")","v":""},{"$f":"IF(A490=G416,6,\"\")","v":""},{"$f":"IF(A490=H416,7,\"\")","v":""},{"$f":"IF(A490=I416,8,\"\")","v":""},"","TS3L4-MEL100M3","","","","","","","","","","TS3L4-MEL100M3","","","","","","","","",""]
["TS3L4-MEL100M10",{"$f":"IF(A491=B416,1,\"\")","v":""},{"$f":"IF(A491=C416,2,\"\")","v":""},{"$f":"IF(A491=D416,3,\"\")","v":""},{"$f":"IF(A491=E416,4,\"\")","v":""},{"$f":"IF(A491=F416,5,\"\")","v":""},{"$f":"IF(A491=G416,6,\"\")","v":""},{"$f":"IF(A491=H416,7,\"\")","v":""},{"$f":"IF(A491=I416,8,\"\")","v":""},"","TS3L4-MEL100M10","","","","","","","","","","TS3L4-MEL100M10","","","","","","","","",""]
["TS3L4-QSFP28",{"$f":"IF(A492=B416,1,\"\")","v":""},{"$f":"IF(A492=C416,2,\"\")","v":""},{"$f":"IF(A492=D416,3,\"\")","v":""},{"$f":"IF(A492=E416,4,\"\")","v":""},{"$f":"IF(A492=F416,5,\"\")","v":""},{"$f":"IF(A492=G416,6,\"\")","v":""},{"$f":"IF(A492=H416,7,\"\")","v":""},{"$f":"IF(A492=I416,8,\"\")","v":""},"","TS3L4-QSFP28","","","","","","","","","","TS3L4-QSFP28","","","","","","","","",""]
["TS3L4-10GBIC",{"$f":"IF(A493=B416,1,\"\")","v":""},{"$f":"IF(A493=C416,2,\"\")","v":""},{"$f":"IF(A493=D416,3,\"\")","v":""},{"$f":"IF(A493=E416,4,\"\")","v":""},{"$f":"IF(A493=F416,5,\"\")","v":""},{"$f":"IF(A493=G416,6,\"\")","v":""},{"$f":"IF(A493=H416,7,\"\")","v":""},{"$f":"IF(A493=I416,8,\"\")","v":""},"","TS3L4-10GBIC","","","","","","","","","","TS3L4-10GBIC","","","","","","","","",""]
["TS3L4-DAC3M",{"$f":"IF(A494=B416,1,\"\")","v":""},{"$f":"IF(A494=C416,2,\"\")","v":""},{"$f":"IF(A494=D416,3,\"\")","v":""},{"$f":"IF(A494=E416,4,\"\")","v":""},{"$f":"IF(A494=F416,5,\"\")","v":""},{"$f":"IF(A494=G416,6,\"\")","v":""},{"$f":"IF(A494=H416,7,\"\")","v":""},{"$f":"IF(A494=I416,8,\"\")","v":""},"","TS3L4-DAC3M","","","","","","","","","","TS3L4-DAC3M","","","","","","","","",""]
["TS3L4-BZLLCD",{"$f":"IF(A495=B416,1,\"\")","v":""},{"$f":"IF(A495=C416,2,\"\")","v":""},{"$f":"IF(A495=D416,3,\"\")","v":""},{"$f":"IF(A495=E416,4,\"\")","v":""},{"$f":"IF(A495=F416,5,\"\")","v":""},{"$f":"IF(A495=G416,6,\"\")","v":""},{"$f":"IF(A495=H416,7,\"\")","v":""},{"$f":"IF(A495=I416,8,\"\")","v":""},"","TS3L4-BZLLCD","","","","","","","","","","TS3L4-BZLLCD","","","","","","","","",""]
["TS3L4-BZLSTD",{"$f":"IF(A496=B416,1,\"\")","v":""},{"$f":"IF(A496=C416,2,\"\")","v":""},{"$f":"IF(A496=D416,3,\"\")","v":""},{"$f":"IF(A496=E416,4,\"\")","v":""},{"$f":"IF(A496=F416,5,\"\")","v":""},{"$f":"IF(A496=G416,6,\"\")","v":""},{"$f":"IF(A496=H416,7,\"\")","v":""},{"$f":"IF(A496=I416,8,\"\")","v":""},"","TS3L4-BZLSTD","","","","","","","","","","TS3L4-BZLSTD","","","","","","","","",""]
["TS3L4-ISDM32GB",{"$f":"IF(A497=B416,1,\"\")","v":""},{"$f":"IF(A497=C416,2,\"\")","v":""},{"$f":"IF(A497=D416,3,\"\")","v":""},{"$f":"IF(A497=E416,4,\"\")","v":""},{"$f":"IF(A497=F416,5,\"\")","v":""},{"$f":"IF(A497=G416,6,\"\")","v":""},{"$f":"IF(A497=H416,7,\"\")","v":""},{"$f":"IF(A497=I416,8,\"\")","v":""},"","TS3L4-ISDM32GB","","","","","","","","","","TS3L4-ISDM32GB","","","","","","","","",""]
["TS3L4-H840",{"$f":"IF(A498=B416,1,\"\")","v":""},{"$f":"IF(A498=C416,2,\"\")","v":""},{"$f":"IF(A498=D416,3,\"\")","v":""},{"$f":"IF(A498=E416,4,\"\")","v":""},{"$f":"IF(A498=F416,5,\"\")","v":""},{"$f":"IF(A498=G416,6,\"\")","v":""},{"$f":"IF(A498=H416,7,\"\")","v":""},{"$f":"IF(A498=I416,8,\"\")","v":""},"","TS3L4-H840","","","","","","","","","","TS3L4-H840","","","","","","","","",""]
["TS3L4-VS7STD6AK",{"$f":"IF(A499=B416,1,\"\")","v":""},{"$f":"IF(A499=C416,2,\"\")","v":""},{"$f":"IF(A499=D416,3,\"\")","v":""},{"$f":"IF(A499=E416,4,\"\")","v":""},{"$f":"IF(A499=F416,5,\"\")","v":""},{"$f":"IF(A499=G416,6,\"\")","v":""},{"$f":"IF(A499=H416,7,\"\")","v":""},{"$f":"IF(A499=I416,8,\"\")","v":""},"","TS3L4-VS7STD6AK","","","","","","","","","","TS3L4-VS7STD6AK","","","","","","","","",""]
["TS3L4-VS7STD",{"$f":"IF(A500=B416,1,\"\")","v":""},{"$f":"IF(A500=C416,2,\"\")","v":""},{"$f":"IF(A500=D416,3,\"\")","v":""},{"$f":"IF(A500=E416,4,\"\")","v":""},{"$f":"IF(A500=F416,5,\"\")","v":""},{"$f":"IF(A500=G416,6,\"\")","v":""},{"$f":"IF(A500=H416,7,\"\")","v":""},{"$f":"IF(A500=I416,8,\"\")","v":""},"","TS3L4-VS7STD","","","","","","","","","","TS3L4-VS7STD","","","","","","","","",""]
["TS3L4-VS7EPL6AK",{"$f":"IF(A501=B416,1,\"\")","v":""},{"$f":"IF(A501=C416,2,\"\")","v":""},{"$f":"IF(A501=D416,3,\"\")","v":""},{"$f":"IF(A501=E416,4,\"\")","v":""},{"$f":"IF(A501=F416,5,\"\")","v":""},{"$f":"IF(A501=G416,6,\"\")","v":""},{"$f":"IF(A501=H416,7,\"\")","v":""},{"$f":"IF(A501=I416,8,\"\")","v":""},"","TS3L4-VS7EPL6AK","","","","","","","","","","TS3L4-VS7EPL6AK","","","","","","","","",""]
["TS3L4-VS7EPL",{"$f":"IF(A502=B416,1,\"\")","v":""},{"$f":"IF(A502=C416,2,\"\")","v":""},{"$f":"IF(A502=D416,3,\"\")","v":""},{"$f":"IF(A502=E416,4,\"\")","v":""},{"$f":"IF(A502=F416,5,\"\")","v":""},{"$f":"IF(A502=G416,6,\"\")","v":""},{"$f":"IF(A502=H416,7,\"\")","v":""},{"$f":"IF(A502=I416,8,\"\")","v":""},"","TS3L4-VS7EPL","","","","","","","","","","TS3L4-VS7EPL","","","","","","","","",""]
["TS3L4-VCS7STD",{"$f":"IF(A503=B416,1,\"\")","v":""},{"$f":"IF(A503=C416,2,\"\")","v":""},{"$f":"IF(A503=D416,3,\"\")","v":""},{"$f":"IF(A503=E416,4,\"\")","v":""},{"$f":"IF(A503=F416,5,\"\")","v":""},{"$f":"IF(A503=G416,6,\"\")","v":""},{"$f":"IF(A503=H416,7,\"\")","v":""},{"$f":"IF(A503=I416,8,\"\")","v":""},"","TS3L4-VCS7STD","","","","","","","","","","TS3L4-VCS7STD","","","","","","","","",""]
["TS3L4-ST7ENT",{"$f":"IF(A504=B416,1,\"\")","v":""},{"$f":"IF(A504=C416,2,\"\")","v":""},{"$f":"IF(A504=D416,3,\"\")","v":""},{"$f":"IF(A504=E416,4,\"\")","v":""},{"$f":"IF(A504=F416,5,\"\")","v":""},{"$f":"IF(A504=G416,6,\"\")","v":""},{"$f":"IF(A504=H416,7,\"\")","v":""},{"$f":"IF(A504=I416,8,\"\")","v":""},"","TS3L4-ST7ENT","","","","","","","","","","TS3L4-ST7ENT","","","","","","","","",""]
["TS3L4-HZ8ADC10",{"$f":"IF(A505=B416,1,\"\")","v":""},{"$f":"IF(A505=C416,2,\"\")","v":""},{"$f":"IF(A505=D416,3,\"\")","v":""},{"$f":"IF(A505=E416,4,\"\")","v":""},{"$f":"IF(A505=F416,5,\"\")","v":""},{"$f":"IF(A505=G416,6,\"\")","v":""},{"$f":"IF(A505=H416,7,\"\")","v":""},{"$f":"IF(A505=I416,8,\"\")","v":""},"","TS3L4-HZ8ADC10","","","","","","","","","","TS3L4-HZ8ADC10","","","","","","","","",""]
["TS3L4-HZ8ENC10",{"$f":"IF(A506=B416,1,\"\")","v":""},{"$f":"IF(A506=C416,2,\"\")","v":""},{"$f":"IF(A506=D416,3,\"\")","v":""},{"$f":"IF(A506=E416,4,\"\")","v":""},{"$f":"IF(A506=F416,5,\"\")","v":""},{"$f":"IF(A506=G416,6,\"\")","v":""},{"$f":"IF(A506=H416,7,\"\")","v":""},{"$f":"IF(A506=I416,8,\"\")","v":""},"","TS3L4-HZ8ENC10","","","","","","","","","","TS3L4-HZ8ENC10","","","","","","","","",""]
["TS3L4-HZ8ADN10",{"$f":"IF(A507=B416,1,\"\")","v":""},{"$f":"IF(A507=C416,2,\"\")","v":""},{"$f":"IF(A507=D416,3,\"\")","v":""},{"$f":"IF(A507=E416,4,\"\")","v":""},{"$f":"IF(A507=F416,5,\"\")","v":""},{"$f":"IF(A507=G416,6,\"\")","v":""},{"$f":"IF(A507=H416,7,\"\")","v":""},{"$f":"IF(A507=I416,8,\"\")","v":""},"","TS3L4-HZ8ADN10","","","","","","","","","","TS3L4-HZ8ADN10","","","","","","","","",""]
["TS3L4-HZ8ENN10",{"$f":"IF(A508=B416,1,\"\")","v":""},{"$f":"IF(A508=C416,2,\"\")","v":""},{"$f":"IF(A508=D416,3,\"\")","v":""},{"$f":"IF(A508=E416,4,\"\")","v":""},{"$f":"IF(A508=F416,5,\"\")","v":""},{"$f":"IF(A508=G416,6,\"\")","v":""},{"$f":"IF(A508=H416,7,\"\")","v":""},{"$f":"IF(A508=I416,8,\"\")","v":""},"","TS3L4-HZ8ENN10","","","","","","","","","","TS3L4-HZ8ENN10","","","","","","","","",""]
["TS3L4-Encl13Y4H",{"$f":"IF(A509=B416,1,\"\")","v":""},{"$f":"IF(A509=C416,2,\"\")","v":""},{"$f":"IF(A509=D416,3,\"\")","v":""},{"$f":"IF(A509=E416,4,\"\")","v":""},{"$f":"IF(A509=F416,5,\"\")","v":""},{"$f":"IF(A509=G416,6,\"\")","v":""},{"$f":"IF(A509=H416,7,\"\")","v":""},{"$f":"IF(A509=I416,8,\"\")","v":""},"","TS3L4-Encl13Y4H","","","","","","","","","","TS3L4-Encl13Y4H","","","","","","","","",""]
["TS3L4-Encl25Y4H",{"$f":"IF(A510=B416,1,\"\")","v":""},{"$f":"IF(A510=C416,2,\"\")","v":""},{"$f":"IF(A510=D416,3,\"\")","v":""},{"$f":"IF(A510=E416,4,\"\")","v":""},{"$f":"IF(A510=F416,5,\"\")","v":""},{"$f":"IF(A510=G416,6,\"\")","v":""},{"$f":"IF(A510=H416,7,\"\")","v":""},{"$f":"IF(A510=I416,8,\"\")","v":""},"","TS3L4-Encl25Y4H","","","","","","","","","","TS3L4-Encl25Y4H","","","","","","","","",""]
["TS3L4-RACKM32A",{"$f":"IF(A511=B416,1,\"\")","v":""},{"$f":"IF(A511=C416,2,\"\")","v":""},{"$f":"IF(A511=D416,3,\"\")","v":""},{"$f":"IF(A511=E416,4,\"\")","v":""},{"$f":"IF(A511=F416,5,\"\")","v":""},{"$f":"IF(A511=G416,6,\"\")","v":""},{"$f":"IF(A511=H416,7,\"\")","v":""},{"$f":"IF(A511=I416,8,\"\")","v":""},"","TS3L4-RACKM32A","","","","","","","","","","TS3L4-RACKM32A","","","","","","","","",""]
["TS3L4-RACKT32A",{"$f":"IF(A512=B416,1,\"\")","v":""},{"$f":"IF(A512=C416,2,\"\")","v":""},{"$f":"IF(A512=D416,3,\"\")","v":""},{"$f":"IF(A512=E416,4,\"\")","v":""},{"$f":"IF(A512=F416,5,\"\")","v":""},{"$f":"IF(A512=G416,6,\"\")","v":""},{"$f":"IF(A512=H416,7,\"\")","v":""},{"$f":"IF(A512=I416,8,\"\")","v":""},"","TS3L4-RACKT32A","","","","","","","","","","TS3L4-RACKT32A","","","","","","","","",""]
["TS3L4-DAC3SFP",{"$f":"IF(A513=B416,1,\"\")","v":""},{"$f":"IF(A513=C416,2,\"\")","v":""},{"$f":"IF(A513=D416,3,\"\")","v":""},{"$f":"IF(A513=E416,4,\"\")","v":""},{"$f":"IF(A513=F416,5,\"\")","v":""},{"$f":"IF(A513=G416,6,\"\")","v":""},{"$f":"IF(A513=H416,7,\"\")","v":""},{"$f":"IF(A513=I416,8,\"\")","v":""},"","TS3L4-DAC3SFP","","","","","","","","","","TS3L4-DAC3SFP","","","","","","","","",""]
["TS3L4-MLX100M3",{"$f":"IF(A514=B416,1,\"\")","v":""},{"$f":"IF(A514=C416,2,\"\")","v":""},{"$f":"IF(A514=D416,3,\"\")","v":""},{"$f":"IF(A514=E416,4,\"\")","v":""},{"$f":"IF(A514=F416,5,\"\")","v":""},{"$f":"IF(A514=G416,6,\"\")","v":""},{"$f":"IF(A514=H416,7,\"\")","v":""},{"$f":"IF(A514=I416,8,\"\")","v":""},"","TS3L4-MLX100M3","","","","","","","","","","TS3L4-MLX100M3","","","","","","","","",""]
["TS3L4-DAC3SFP28",{"$f":"IF(A515=B416,1,\"\")","v":""},{"$f":"IF(A515=C416,2,\"\")","v":""},{"$f":"IF(A515=D416,3,\"\")","v":""},{"$f":"IF(A515=E416,4,\"\")","v":""},{"$f":"IF(A515=F416,5,\"\")","v":""},{"$f":"IF(A515=G416,6,\"\")","v":""},{"$f":"IF(A515=H416,7,\"\")","v":""},{"$f":"IF(A515=I416,8,\"\")","v":""},"","TS3L4-DAC3SFP28","","","","","","","","","","TS3L4-DAC3SFP28","","","","","","","","",""]
["TS3L4-DAC3SFP",{"$f":"IF(A516=B416,1,\"\")","v":""},{"$f":"IF(A516=C416,2,\"\")","v":""},{"$f":"IF(A516=D416,3,\"\")","v":""},{"$f":"IF(A516=E416,4,\"\")","v":""},{"$f":"IF(A516=F416,5,\"\")","v":""},{"$f":"IF(A516=G416,6,\"\")","v":""},{"$f":"IF(A516=H416,7,\"\")","v":""},{"$f":"IF(A516=I416,8,\"\")","v":""},"","TS3L4-DAC3SFP","","","","","","","","","","TS3L4-DAC3SFP","","","","","","","","",""]
["TS3L4-MLX100M3",{"$f":"IF(A517=B416,1,\"\")","v":""},{"$f":"IF(A517=C416,2,\"\")","v":""},{"$f":"IF(A517=D416,3,\"\")","v":""},{"$f":"IF(A517=E416,4,\"\")","v":""},{"$f":"IF(A517=F416,5,\"\")","v":""},{"$f":"IF(A517=G416,6,\"\")","v":""},{"$f":"IF(A517=H416,7,\"\")","v":""},{"$f":"IF(A517=I416,8,\"\")","v":""},"","TS3L4-MLX100M3","","","","","","","","","","TS3L4-MLX100M3","","","","","","","","",""]
["TS3L4-MCX4DP",{"$f":"IF(A518=B416,1,\"\")","v":""},{"$f":"IF(A518=C416,2,\"\")","v":""},{"$f":"IF(A518=D416,3,\"\")","v":""},{"$f":"IF(A518=E416,4,\"\")","v":""},{"$f":"IF(A518=F416,5,\"\")","v":""},{"$f":"IF(A518=G416,6,\"\")","v":""},{"$f":"IF(A518=H416,7,\"\")","v":""},{"$f":"IF(A518=I416,8,\"\")","v":""},"","TS3L4-MCX4DP","","","","","","","","","","TS3L4-MCX4DP","","","","","","","","",""]
["TS3L4-MCX4DP-L",{"$f":"IF(A519=B416,1,\"\")","v":""},{"$f":"IF(A519=C416,2,\"\")","v":""},{"$f":"IF(A519=D416,3,\"\")","v":""},{"$f":"IF(A519=E416,4,\"\")","v":""},{"$f":"IF(A519=F416,5,\"\")","v":""},{"$f":"IF(A519=G416,6,\"\")","v":""},{"$f":"IF(A519=H416,7,\"\")","v":""},{"$f":"IF(A519=I416,8,\"\")","v":""},"","TS3L4-MCX4DP-L","","","","","","","","","","TS3L4-MCX4DP-L","","","","","","","","",""]
["TS3L4-OMEA",null,null,null,null,null,null,null,null,"","TS3L4-OMEA","",{"$f":"IF(K520=$M$416,2,\"\")","v":""},{"$f":"IF(K520=$N$416,3,\"\")","v":""},{"$f":"IF(K520=$O$416,4,\"\")","v":""},{"$f":"IF(K520=$P$416,5,\"\")","v":""},{"$f":"IF(K520=$Q$416,6,\"\")","v":""},{"$f":"IF(K520=$R$416,7,\"\")","v":""},{"$f":"IF(K520=$S$416,8,\"\")","v":""},{"$f":"IF(SUM(L520:S520)=0,\"\",CONCATENATE(\" (Slot PCI \",L520,\".\",M520,\".\",N520,\".\",O520,\".\",P520,\".\",Q520,\".\",R520,\".\",S520,\")\"))","v":""},"TS3L4-OMEA",{"$f":"IF(U520=$V$416,1,\"\")","v":""},{"$f":"IF(U520=$W$416,2,\"\")","v":""},{"$f":"IF(U520=$X$416,3,\"\")","v":""},{"$f":"IF(U520=$Y$416,4,\"\")","v":""},{"$f":"IF(U520=$Z$416,5,\"\")","v":""},{"$f":"IF(U520=$AA$416,6,\"\")","v":""},{"$f":"IF(U520=$AB$416,7,\"\")","v":""},{"$f":"IF(U520=$AC$416,8,\"\")","v":""},""]
["TS3L4-A100",{"$f":"IF(A521=B416,1,\"\")","v":""},{"$f":"IF(A521=C416,2,\"\")","v":""},{"$f":"IF(A521=D416,3,\"\")","v":""},{"$f":"IF(A521=E416,4,\"\")","v":""},{"$f":"IF(A521=F416,5,\"\")","v":""},{"$f":"IF(A521=G416,6,\"\")","v":""},{"$f":"IF(A521=H416,7,\"\")","v":""},{"$f":"IF(A521=I416,8,\"\")","v":""},"","TS3L4-A100",{"$f":"IF(K521=$L$416,1,\"\")","v":""},"","","","","","","",{"$f":"IF(SUM(L521:S521)=0,\"\",CONCATENATE(\" (Slot PCI \",L521,\".\",M521,\".\",N521,\".\",O521,\".\",P521,\".\",Q521,\".\",R521,\".\",S521,\")\"))","v":""},"TS3L4-A100","","","","","","","","",""]
["TS3L4-SAS12-L",{"$f":"IF(A522=B416,1,\"\")","v":""},{"$f":"IF(A522=C416,2,\"\")","v":""},{"$f":"IF(A522=D416,3,\"\")","v":""},{"$f":"IF(A522=E416,4,\"\")","v":""},{"$f":"IF(A522=F416,5,\"\")","v":""},{"$f":"IF(A522=G416,6,\"\")","v":""},{"$f":"IF(A522=H416,7,\"\")","v":""},{"$f":"IF(A522=I416,8,\"\")","v":""},"","TS3L4-SAS12-L","","","","","","","","","","TS3L4-SAS12-L","","","","","","","","",""]
["TS3L4-SAS12",{"$f":"IF(A523=B416,1,\"\")","v":""},{"$f":"IF(A523=C416,2,\"\")","v":""},{"$f":"IF(A523=D416,3,\"\")","v":""},{"$f":"IF(A523=E416,4,\"\")","v":""},{"$f":"IF(A523=F416,5,\"\")","v":""},{"$f":"IF(A523=G416,6,\"\")","v":""},{"$f":"IF(A523=H416,7,\"\")","v":""},{"$f":"IF(A523=I416,8,\"\")","v":""},"","TS3L4-SAS12","","","","","","","","","","TS3L4-SAS12","","","","","","","","",""]
["TS3L4-H840-L",{"$f":"IF(A524=B416,1,\"\")","v":""},{"$f":"IF(A524=C416,2,\"\")","v":""},{"$f":"IF(A524=D416,3,\"\")","v":""},{"$f":"IF(A524=E416,4,\"\")","v":""},{"$f":"IF(A524=F416,5,\"\")","v":""},{"$f":"IF(A524=G416,6,\"\")","v":""},{"$f":"IF(A524=H416,7,\"\")","v":""},{"$f":"IF(A524=I416,8,\"\")","v":""},"","TS3L4-H840-L","","","","","","","","","","TS3L4-H840-L","","","","","","","","",""]
[]
["_C14C13"]
["_C20C19"]

{"sheet":"Tabella_prezzi","index":5,"n_rows":271,"n_cols":16,"rows_kept":271,"cut":false,"hidden":true,"merged":[[209,8,210,8],[155,8,156,8],[209,0,210,0],[209,1,210,1],[209,2,210,2],[209,3,210,3],[209,4,210,4],[209,5,210,5],[12,7,18,7],[89,5,93,5],[89,0,93,0],[89,1,93,1],[89,2,93,2],[89,3,93,3],[89,4,93,4],[85,5,86,5],[85,7,86,7],[87,7,88,7],[87,0,88,0],[87,1,88,1],[87,2,88,2],[87,3,88,3],[87,4,88,4],[87,5,88,5],[12,10,18,10],[12,0,18,0],[12,1,18,1],[12,2,18,2],[12,3,18,3],[12,4,18,4],[12,5,18,5],[12,6,18,6],[70,4,76,4],[70,5,76,5],[70,7,76,7],[60,0,61,0],[60,1,61,1],[60,2,61,2],[60,3,61,3],[60,4,61,4],[60,5,61,5],[60,7,61,7],[70,0,76,0],[70,1,76,1],[70,2,76,2],[70,3,76,3],[85,0,86,0],[85,1,86,1],[85,2,86,2],[155,5,156,5],[155,2,156,2],[155,3,156,3],[134,5,135,5],[136,2,137,2],[136,3,137,3],[136,4,137,4],[140,2,141,2],[140,3,141,3],[140,4,141,4],[140,5,141,5],[138,4,139,4],[85,3,86,3],[85,4,86,4],[123,5,127,5],[132,5,133,5],[136,5,137,5],[138,5,139,5],[132,4,133,4],[123,0,127,0],[123,1,127,1],[123,4,127,4],[123,3,127,3],[123,2,127,2],[134,1,135,1],[134,2,135,2],[134,3,135,3],[134,4,135,4],[169,2,170,2],[169,3,170,3],[171,2,172,2],[171,3,172,3],[169,0,170,0],[140,0,141,0],[140,1,141,1],[132,0,133,0],[132,1,133,1],[132,2,133,2],[132,3,133,3],[138,0,139,0],[138,1,139,1],[138,2,139,2],[138,3,139,3],[136,0,137,0],[136,1,137,1],[134,0,135,0],[171,0,172,0],[169,8,170,8],[171,8,172,8],[142,0,143,0],[142,1,143,1],[142,2,143,2],[142,3,143,3],[142,4,143,4],[142,5,143,5],[123,8,127,8],[132,8,133,8],[134,8,135,8],[136,8,137,8],[138,8,139,8],[140,8,141,8],[142,8,143,8],[155,0,156,0],[155,1,156,1],[155,4,156,4],[169,4,170,4],[171,4,172,4],[169,1,170,1],[171,1,172,1],[169,5,170,5],[171,5,172,5]]}
[]
["N°",null,"Attributo","Valore inserito","N°","Codice Convenzione","Qty:","Description:","Manufacturer Part","Sku Number:","Brand"]
["L1N01",1,"Server Tower mono-processore",1399,"L1N01","TS3L1-SRV",1,"PowerEdge T340 Server","-","-","DELL"]
["L1N02",2,"OpzRAM16GB",98,"L1N02","TS3L1-RAM16",1,"16GB 2Rx8 DDR4 UDIMM 2666MHz","AA335286","AA335286","DELL"]
["L1N03",3,"OpzGigabit",25,"L1N03","TS3L1-LAN1",1,"Broadcom 5720 DP 1Gb NIC,Full Height","540-BBGY","540-BBGY","DELL"]
["L1N04",4,"OpzHDD8TB",285,"L1N04","TS3L1-HDD8TB",1,"8TB 7.2K RPM SATA 6Gbps 3.5in Hot-plug","400-AHID","400-AHID","DELL"]
["L1N05",5,"OpzHDD4TB",194,"L1N05","TS3L1-HDD4TB",1,"4TB 7.2K RPM SATA 6Gbps 3.5in Hot-plug","400-AUWY","400-AUWY","DELL"]
["L1N06",6,"OpzHDD2TB",148,"L1N06","TS3L1-HDD2TB",1,"2TB 7.2K RPM SATA 6Gbps 3.5in Hot-plug","400-AUWX","400-AUWX","DELL"]
["L1N07",7,"OpzHDD1TB",80,"L1N07","TS3L1-HDD1TB",1,"1TB 7.2K RPM SATA 6Gbps 3.5in Hot-plug","400-AURS","400-AURS","DELL"]
["L1N08",8,"OpzSSD-RI800GB",216,"L1N08","TS3L1-RI960GB",1,"960GB SSD SATA Read Intensive 6Gbps 2.5in Drive in 3.5in Hybrid Carrier, 1 DWPD","400-BDPC","400-BDPC","DELL"]
["L1N09",9,"OpzSSD-RI400GB",160,"L1N09","TS3L1-RI480GB",1,"480GB SSD SATA Read Intensive 6Gbps 2.5in Drive in 3.5in Hybrid Carrier, 1 DWPD","400-BDQT","400-BDQT","DELL"]
["L1N10",10,"OpzUps (3000VA)",302,"L1N10","TS3L1-UPS",1,"Powerme Online UPS RPMM/9 3K, Tower, SNMP card","TPMM/ 3K","TPMM/ 3K","PowerME"]
["L1N11",11,"OpzGUI per tower",69,"L1N11","TS3L1-GUI",1,"Monitor 19\" E1920H, Mouse MS116, Tastiera KB216","580-ADHM","580-ADHM","DELL"]
[null,null,null,null,null,null,1,"Mouse ottico Dell MS116 - nero","570-AAIS","570-AAIS"]
[null,null,null,null,null,null,1,"BASE,DIS,MON,E1920H,EMEA","210-AURI","210-AURI"]
[null,null,null,null,null,null,1,"Italian 220V Power Cord","450-ABCK","450-ABCK"]
[null,null,null,null,null,null,1,"SnP order - EMEA.","800-10243","800-10243"]
[null,null,null,null,null,null,1,"39M Basic with Advanced Exchange Channel","709-17931","709-17931"]
[null,null,null,null,null,null,1,"No Warranty Upgrade","710-10844","710-10844"]
["L1N12",12,"OpzWinServESS",256,"L1N12","TS3L1-WINSRVESS",1,"Windows Server 2019,Essentials, ROK","634-BSFZ","634-BSFZ","DELL"]
["L1N13",13,null,null,"L1N13"]
["L1N14",14,null,null,"L1N14"]
["L1N15",15,"OpzOpenSource",49,"L1N15","TS3L1-LINUX",1,"Ubuntu 18.04 LTS 64 Bit"]
["L1N16",16,"OpzHDDRetention",38,"L1N16","TS3L1-HDRTNTN",1,"Hard Disk Retention","785-10921","785-10921","DELL"]
["L1N17",17,"OpzEstensione24",79,"L1N17","TS3L1-5Y",1,"Estensione della manutenzione in garanzia per ulteriori 24 mesi","742-10105","742-10105","DELL"]
["L1N18",18,"OpzPowerSupply",82,"L1N18","TS3L1-PSU",1,"Single, Hot-plug Power Supply (1+0), 495W,CusKit","450-AEBM","450-AEBM","DELL"]
["L1N19",19,"OpzGigabit 4p",50,"L1N19","TS3L1-LAN1QP",1,"Broadcom 5719 QP 1Gb Network Interface Card,Full Height,CusKit","540-BBGX","540-BBGX","DELL"]
["L1N20",20,"OpzGigabit I350 2p",99.99,"L1N20","TS3L1-I3502P",1,"Intel Ethernet I350 Dual Port 1GbE BASE-T Adapter, PCIe Full Height","540-BBGZ","540-BBGZ","DELL"]
["L1N21",21,"OpzGigabit I350 4p",99.99,"L1N21","TS3L1-I3504P",1,"Intel Ethernet I350 Quad Port 1GbE BASE-T Adapter, PCIe Full Height","540-BBDS","540-BBDS","DELL"]
["L1N22",22,"OpzGigabit10Gbps X550 2p T",99.99,"L1N22","TS3L1-X550",1,"Intel X550 Dual Port 10GbE BASE-T Adapter, PCIe Full Height","540-BBRK","540-BBRK","DELL"]
["L1N23",23,"OpzGigabit10Gbps X710 2p SFP+",99.99,"L1N23","TS3L1-X710",1,"Intel X710 Dual Port 10GbE SFP+ Adapter, PCIe Full Height","540-BBIV","540-BBIV","DELL"]
["L1N24",24,"OpzFibreChannel Emulex LPE12002",99.99,"L1N24","TS3L1-E12002",1,"Emulex LPE 12002 Dual Port 8Gb Fibre Channel HBA, PCIe Full Height","406-BBGR","406-BBGR","DELL"]
["L1N25",25,"OpzControllerSAS ",99,"L1N25","TS3L1-CtrlSAS",1,"SAS 12Gbps HBA External Controller","405-AADZ","405-AADZ","DELL"]
["L1N26",26,"OpzRJ45 3m",2,"L1N26","TS3L1-RJ453M",1,"cavo “patch” di 3 mt RJ45 certificato per gigabit ethernet"]
["L1N27",27,"OpzBezel",99.99,"L1N27","TS3L1-BEZEL",1,"Tower Bezel, PowerEdge, T340","470-ACNV","470-ACNV","DELL"]
["L1N28",28,"OpzDVD",99.99,"L1N28","TS3L1-DVD",1,"DVD+/-RW, SATA, Internal","429-ABIE","429-ABIE","DELL"]
["L1N29",29,"OpzHDMiniSAS2M",80,"L1N29","TS3L1-SAS2M",1,"12Gb HD-Mini to HD-Mini SAS Cable, 2M, Customer Kit","470-AATP","470-AATP","DELL"]
["L1N30",30,"OpzHDMiniSAS6M",120,"L1N30","TS3L1-SAS6M",1,"12Gb HD-Mini to HD-Mini SAS Cable, 6M, Customer Kit","470-AATR","470-AATR","DELL"]
["L1N31",31,"OpzHDMiniSAS05M",50,"L1N31","TS3L1-SAS05M",1,"12Gb HD-Mini SAS cable, 0.5m, Customer Kit","470-ABDQ","470-ABDQ","DELL"]
["L1N32",32,"OpzHDMiniSAS2MB",80,"L1N32","TS3L1-SAS2MB",1,"12Gb HD-Mini SAS cable, 2m, Customer Kit","470-ABDR","470-ABDR","DELL"]
["L1N33",33,"OpzHDMiniSAS4M",100,"L1N33","TS3L1-SAS4M",1,"12Gb Mini-SAS HD to Mini-SAS HD Cable, 4m, Customer Kit","470-ACIS","470-ACIS","DELL"]
["L1N34",34,"OpzSFPALL",40,"L1N34","TS3L1-SFPALL",1,"SFP+ SR Optic for all SFP+ ","407-BCBN","407-BCBN","DELL"]
["L1N35",35,"OpzDAC1M",120,"L1N35","TS3L1-DAC1M",1,"Cable, SFP+ to SFP+, 10GbE, Copper Twinax Direct Attach Cable, 1 Meter","470-AAVG","470-AAVG","DELL"]
["L1N36",36,"OpzDAC3M",150,"L1N36","TS3L1-DAC3M",1,"Cable, SFP+ to SFP+, 10GbE, Copper Twinax Direct Attach Cable, 3 Meter","470-AAVH","470-AAVH","DELL"]
["L1N37",37,"OpzDAC5M",170,"L1N37","TS3L1-DAC5M",1,"Cable, SFP+ to SFP+, 10GbE, Copper Twinax Direct Attach Cable, 5 Meter","470-AAVJ","470-AAVJ","DELL"]
["L1N38",38,null,null,"L1N38"]
["L1N39",39,null,null,"L1N39"]
["L1N40",40,null,null,"L1N40"]
["L1N41",41,null,null,"L1N41"]
["L1N42",42,null,null,"L1N42"]
["L1N43",43,null,null,"L1N43"]
["L1N44",44,null,null,"L1N44"]
["L1N45",45,null,null,"L1N45"]
["L1N46",46,null,null,"L1N46"]
["L1N47",47,null,null,"L1N47"]
["L1N48",48,null,null,"L1N48"]
["L1N49",49,null,null,"L1N49"]
["L1N50",50,null,null,"L1N50"]
["N°",null,"Attributo","Valore inserito","N°","Codice Convenzione","Qty:","Description:","Sku Number:","Sku Number:"]
["L2N01",1,"Server Tower bi-processore",2088,"L2N01","TS3L2-SRV",1,"PowerEdge T640 Server","-","-"]
["L2N02",2,"Kit n. 1 Processore aggiuntivo",590,"L2N02","TS3L2-CPU",1,"Intel® Xeon® Silver 4112 Processor 2.20 GHz, 12C/24T","338-BSDR","338-BSDR"]
[null,null,null,null,null,null,1,null,"412-AAMS","412-AAMS"]
["L2N03",3,"OpzRAM16GB",99,"L2N03","TS3L2-RAM16",1,"16GB 2Rx8 DDR4 RDIMM 3200MHz","AA799064","AA799064"]
["L2N04",4,"OpzGigabit",26,"L2N04","TS3L2-LAN1",1,"Broadcom 5720 DP 1Gb NIC,Full Height","540-BBGY","540-BBGY"]
["L2N05",5,"OpzHDD2TB",226,"L2N05","TS3L2-HDD2TB",1,"1.8TB 10K RPM SAS 12Gbps 2.5in Hot-plug","400-AURF","400-AURF"]
["L2N06",6,"OpzHDD1TB",141,"L2N06","TS3L2-HDD1TB",1,"1.2TB 10K RPM SAS 12Gbps 2.5in Hot-plug","400-AJPD","400-AJPD"]
["L2N07",7,"OpzHDD300GB",92,"L2N07","TS3L2-HDD300GB",1,"300GB 15K RPM SAS 12Gbps 2.5in Hot-plug","400-AUXN","400-AUXN"]
["L2N08",8,"OpzSSD-RI800GB",727,"L2N08","TS3L2-RI960GB",1,"960GB SSD SAS Read Intensive 12Gbps 2.5in Hot-plug","400-BBOU","400-BBOU"]
["L2N09",9,"OpzSSD-RI400GB",394,"L2N09","TS3L2-RI480GB",1,"480GB SSD SAS Read Intensive 12Gbps 2.5in Hot-plug","400-BKSC","400-BKSC"]
["L2N10",10,"OpzUps (3000VA)",300,"L2N10","TS3L2-UPS",1,null,"TPMM/ 3K","TPMM/ 3K"]
["L2N11",11,"OpzGUI per tower",104,"L2N11","TS3L2-GUI",1,"Monitor 19\" E1920H, Mouse MS116, Tastiera KB216","580-ADHM","580-ADHM"]
[null,null,null,null,null,null,1,null,"570-AAIS","570-AAIS"]
[null,null,null,null,null,null,1,null,"210-AURI","210-AURI"]
[null,null,null,null,null,null,1,null,"450-ABCK","450-ABCK"]
[null,null,null,null,null,null,1,null,"800-10243","800-10243"]
[null,null,null,null,null,null,1,null,"709-17931","709-17931"]
[null,null,null,null,null,null,1,null,"710-10844","710-10844"]
["L2N12",12,"OpzWinServSTD",732,"L2N12","TS3L2-WINSRVSTD",1,"Windows Server 2019 Standard, ROK, 16CORE","634-BSFX","634-BSFX"]
["L2N13",13,"OpzWinServSTD2core",94,"L2N13","TS3L2-WINSRV2C",1,"Windows Server 2019 Standard, Additional License, 2CORE","634-BSGS","634-BSGS"]
["L2N14",14,"OpzDeviceCal",23,"L2N14","TS3L2-WINDEVCAL",1,"Windows Server 2019 Device CAL (STD or DC)","623-BBCV","623-BBCV"]
["L2N15",15,"OpzUserCal",29,"L2N15","TS3L2-WINUSRCAL",1,"Windows Server 2019 User CAL (STD or DC)","623-BBCT","623-BBCT"]
["L2N16",16,"OpzOpenSource",49,"L2N16","TS3L2-LINUX",1,"Ubuntu 18.04 LTS 64 Bit"]
["L2N17",17,"OpzHDDRetention",207,"L2N17","TS3L2-HDRTNTN",1,"Hard Disk Retention","785-10921","785-10921"]
["L2N18",18,"OpzEstensione24",79,"L2N18","TS3L2-5Y",1,"Estensione della manutenzione in garanzia per ulteriori 24 mesi","742-10105","742-10105"]
["L2N19",19,"OpzBezel",99.99,"L2N19","TS3L2-BEZEL",1,"Tower Standard Bezel for T640","325-BCMV","325-BCMV","DELL"]
["L2N20",20,"OpzBOSS240",199,"L2N20","TS3L2-BOSS240",1,"BOSS controller card, full height, with 2 240G M.2 Drives","403-BBVQ","403-BBVQ","DELL"]
[null,null,null,null,null,null,2,null,"400-ASDQ","400-ASDQ","DELL"]
["L2N21",21,"OpzBOSS480",299,"L2N21","TS3L2-BOSS480",1,"BOSS controller card, full height, with 2 480G M.2 Drives","403-BBVQ","403-BBVQ","DELL"]
[null,null,null,null,null,null,2,null,"400-AVSS","400-AVSS","DELL"]
["L2N22",22,"OpzRackKit",99.99,"L2N22","TS3L2-RACKKIT",1,"Kit composto da: Tower to Rack Conversion Kit; Rack Standard Bezel; 3U Cable Management Arm; Ready Rails 3U Sliding Rails","325-BCOZ","325-BCOZ","DELL"]
[null,null,null,null,null,null,1,"Rack Standard Bezel for T640","325-BCOZ","325-BCOZ","DELL"]
[null,null,null,null,null,null,1,"Tower to Rack,Conversion Kit T640","770-BCJK","770-BCJK","DELL"]
[null,null,null,null,null,null,1,"3U Cable Management Arm","770-BBKV","770-BBKV","DELL"]
[null,null,null,null,null,null,1,"Ready Rails 3U Sliding Rails","770-BBJJ","770-BBJJ","DELL"]
["L2N23",23,"OpzCNA10Gb",249,"L2N23","TS3L2-CNA10GB",1,"QLogic 41112 Dual Port 10Gb SFP+ Adapter, Full Height","540-BBYH","540-BBYH","DELL"]
["L2N24",24,"Opz10GBIC",90,"L2N24","TS3L2-10GBIC",1,"Transceiver, SFP+, 10GbE, SR, 850nm Wavelength, 300m Reach","407-BBOU","407-BBOU","DELL"]
["L2N25",25,"OpzDAC3M",9999,"L2N25","TS3L2-DAC3M",1,"Cable, SFP+ to SFP+, 10GbE, Copper Twinax Direct Attach Cable, 3 Meter","470-AAVJ","470-AAVJ","DELL"]
["L2N26",26,"OpzRJ45 3m",2,"L2N26","TS3L2-RJ453M",1,"Cavo “patch” di 3 mt RJ45 certificato per gigabit ethernet"]
["L2N27",27,"OpzH840",100,"L2N27","TS3L2-H840",1,"PERC H840 RAID Adapter for External MD14XX Only, 8GB NV Cache, Full Height","405-AAMZ","405-AAMZ","DELL"]
["L2N28",28,"OpzSAS2M",null,"L2N28","TS3L2-SAS2M",1,"12Gb HD-Mini SAS cable, 2m, Customer Kit","470-ABDR","470-ABDR","DELL"]
["L2N29",29,null,null,"L2N29",null,null,null,null,null,"DELL"]
["L2N30",30,null,null,"L2N30",null,null,null,null,null,"DELL"]
["L2N31",31,null,null,"L2N31",null,null,null,null,null,"DELL"]
["L2N32",32,null,null,"L2N32",null,null,null,null,null,"DELL"]
["L2N33",33,null,null,"L2N33",null,null,null,null,null,"DELL"]
["L2N34",34,null,null,"L2N34"]
["L2N35",35,null,null,"L2N35"]
["L2N36",36,"OpzLCLC1M",null,"L2N36","TS3L2-LCLC1M",2,"Networking Cable, OM4 LC/LC Fiber Cable, (Optics required), 1 Meter","470-ACLV","470-ACLV","DELL"]
["L2N37",37,"OpzLCLC2M",null,"L2N37","TS3L2-LCLC2M",2,"Networking Cable, OM4 LC/LC Fiber Cable, (Optics required), 2 Meter","470-ACLT","470-ACLT","DELL"]
["L2N38",38,"OpzLCLC3M",null,"L2N38","TS3L2-LCLC3M",2,"Networking Cable, OM4 LC/LC Fiber Cable, (Optics required), 3 Meter","470-ACMO","470-ACMO","DELL"]
["L2N39",39,"OpzLCLC5M",null,"L2N39","TS3L2-LCLC5M",2,"Networking Cable, OM4 LC/LC Fiber Cable, (Optics required), 5 Meter","470-ACLY","470-ACLY","DELL"]
["L2N40",40,"OpzLCLC10M",null,"L2N40","TS3L2-LCLC10M",2,"Networking Cable, OM4 LC/LC Fiber Cable, (Optics required), 10 Meter","470-ACMN","470-ACMN","DELL"]
["L2N41",41,"OpzLCLC30M",null,"L2N41","TS3L2-LCLC30M",2,"Networking Cable, OM4 LC/LC Fiber Cable, (Optics required), 30 Meter","470-ACLM","470-ACLM","DELL"]
["L2N42",42,null,null,"L2N42"]
["L2N43",43,null,null,"L2N43"]
["L2N44",44,null,null,"L2N44"]
["L2N45",45,null,null,"L2N45"]
["L2N46",46,null,null,"L2N46",null,null,null,null,null,null,null,null,null,null,"24HD2P"]
["L2N47",47,null,null,"L2N47",null,null,null,null,null,null,null,null,null,null,"24HD1P"]
["L2N48",48,null,null,"L2N48",null,null,null,null,null,null,null,null,null,null,"24HD2PSW"]
["L2N49",49,null,null,"L2N49",null,null,null,null,null,null,null,null,null,null,"24HD2PDW"]
["L2N50",50,null,null,"L2N50"]
["L4N01",1,"Server rackable bi-processore prest.",2530,"L4N01","TS3L4-SRV-U",1,"PowerEdge R740xd Server","L4N01-ServerR740XD","210-AMTE","DELL",null,null,null,"210-321-BCPX","-"]
["L4N02",2,"Kit n. 1 Processore aggiuntivo",730,"L4N02","TS3L4-CPU",1,"Processore INTEL XEON GOLD 6238R 28C","L4N02-OpzCPU","338-BVKX","DELL",null,null,null,"338-WX6G7","WX6G7"]
[null,null,null,null,null,null,1,"Heat Sink for R740/R740XD,125W or greater CPU (no MB or GPU),CK",null,"412-AAME","DELL",null,null,null,"412-4RCGC","4RCGC"]
[null,null,null,null,null,null,1,"2pc Fan Module (Kit)",null,"384-BBSD","DELL",null,null,null,"384-HVVRP","HVVRP"]
[null,null,null,null,null,null,1,"Riser 2A, Customer Install",null,"330-BBLT","DELL",null,null,null,"330-234T7","234T7"]
[null,null,null,null,null,null,1,"Riser 3A, Customer Install",null,"330-BBLS","DELL",null,null,null,"330-R80PP","R80PP"]
["L4N03",3,"OpzRAM32GB",155,"L4N03","TS3L4-RAM32",1,"32GB - 2Rx4 DDR4 RDIMM 3200MHz","L4N03-OpzRAM32GB","AA799087","DELL",null,null,null,"AA79SNP75X1VC/32G","SNP75X1VC/32G"]
["L4N04",4,"OpzRAM64GB",444,"L4N04","TS3L4-RAM64",1,"64GB - 2RX4 DDR4 RDIMM 3200MHz","L4N04-OpzRAM64GB","AA799110","DELL",null,null,null,"AA79SNPP2MYXC/64G","SNPP2MYXC/64G"]
["L4N05",5,"OpzGigabit",26,"L4N05","TS3L4-LAN1",1,"Scheda LAN 5719 QP 1Gb FULL","L4N05-OpzGigabit","540-BBGX","DELL",1,2,3,"540-XF9VF","XF9VF"]
["L4N75",5,"OpzGigabit",26,"L4N05b","TS3L4-LAN1-L",1,"Scheda LAN 5719 QP 1Gb LOW","L4N75-OpzGigabitLP","540-BBHB","DELL",4,null,null,"540-W0N4T","W0N4T"]
["L4N06",6,"OpzGigabit10Gbps",126,"L4N06","TS3L4-LAN10",1,"Scheda 57412 DP 10Gb SFP+  FULL","L4N06-OpzGigabit10Gbps","540-BBUN","DELL",1,2,3,"540-H6N50","H6N50"]
[null,null,null,null,null,null,2,"SFP+ SR Optic for all SFP+ ports except high temp validation warning cards customer install",null,"407-BCBN","DELL",null,null,null,"407-4Y8DN","4Y8DN"]
["L4N76",6,"OpzGigabit10Gbps",126,"L4N06b","TS3L4-LAN10-L",1,"Scheda 57412 DP 10Gb SFP+ LOW","L4N76-OpzGigabit10GbpsLP","540-BBVL","DELL",4,null,null,"540-N7R67","N7R67"]
[null,null,null,null,null,null,2,"SFP+ SR Optic for all SFP+ ports except high temp validation warning cards customer install",null,"407-BCBN","DELL",null,null,null,"407-4Y8DN","4Y8DN"]
["L4N07",7,"OpzGigabit25Gbps",341,"L4N07","TS3L4-LAN25",1,"Scheda 41262 DP 25Gb SFP28  FULL","L4N07-OpzGigabit25Gbps","540-BBYI","DELL",1,2,3,"540-86P4V","86P4V"]
[null,null,null,null,null,null,2,"Dell EMC PowerEdge 10/25GbE Dual Rate SFP28 SR 85C Optic for all SFP28 ports, Customer Install",null,"407-BCHI","DELL",null,null,null,"407-PY7V9","PY7V9"]
["L4N77",7,"OpzGigabit25Gbps",341,"L4N07b","TS3L4-LAN25-L",1,"Scheda 41262 DP 25Gb SFP28 LOW","L4N77-OpzGigabit25GbpsLP","540-BBZO","DELL",4,null,null,"540-9RVF0","9RVF0"]
[null,null,null,null,null,null,2,"Dell EMC PowerEdge 10/25GbE Dual Rate SFP28 SR 85C Optic for all SFP28 ports, Customer Install",null,"407-BCHI","DELL",null,null,null,"407-PY7V9","PY7V9"]
["L4N08",8,"OpzGigabit10Gbps CNA",149,"L4N08","TS3L4-CNA10",1,"Scheda 41112 DP 10Gb SFP+  FULL","L4N08-OpzCNA10Gbps","540-BBYH","DELL",1,2,3,"540-42H35","42H35"]
[null,null,null,null,null,null,2,"SFP+ SR Optic for all SFP+ ports except high temp validation warning cards customer install",null,"407-BCBN","DELL",null,null,null,"407-4Y8DN","4Y8DN"]
["L4N78",8,"OpzGigabit10Gbps CNA",149,"L4N08b","TS3L4-CNA10-L",1,"Scheda 41112 DP 10Gb SFP+ LOW","L4N78-OpzCNA10GbpsLP","540-BBZM","DELL",4,null,null,"540-01CN1","01CN1"]
[null,null,null,null,null,null,2,"SFP+ SR Optic for all SFP+ ports except high temp validation warning cards customer install",null,"407-BCBN","DELL",null,null,null,"407-4Y8DN","4Y8DN"]
["L4N09",9,"OpzFibreChannel",309,"L4N09","TS3L4-FC16",1,"Scheda FC 2692 DP 16Gb HBA FULL","L4N09-OpzFibreChannel","403-BBMU","DELL",1,2,3,"403-YH1DK","YH1DK"]
["L4N79",9,"OpzFibreChannel",309,"L4N09b","TS3L4-FC16-L",1,"Scheda FC 2692 DP 16Gb HBA LOW","L4N79-OpzFibreChannelLP","403-BBMT","DELL",4,null,null,"403-P0TRP","P0TRP"]
["L4N10",10,"OpzHDD2TB",127,"L4N10","TS3L4-HDD2TB",1,"HDD 2400GB 10K SAS 12Gbps 2.5in Hot-plug","L4N10-OpzHDD2TB","401-ABHQ","DELL",null,null,null,"400-HTMGW","HTMGW"]
["L4N11",11,"OpzHDD1TB",77,"L4N11","TS3L4-HDD1TB",1,"HDD 1200GB 10K SAS 12Gbps 2.5in Hot-plug","L4N11-OpzHDD1TB","400-ATJL","DELL",null,null,null,"400-400-ATJL","400-ATJL"]
["L4N12",12,"OpzHDD300GB",71,"L4N12","TS3L4-HDD300GB",1,"HDD 300GB 15K SAS 12Gbps 2.5in Hot-plug","L4N12-OpzHDD300GB","400-ATII","DELL",null,null,null,"400-PDNT1","PDNT1"]
["L4N13",13,"OpzSSD-RI1,6TB",412,"L4N13","TS3L4-RI1600GB",1,"SSD 1,92TB SAS RI 12Gbps 2.5in Hot-plug, 1 DWPD","L4N13-OpzSSD-RI1,6TB","400-BFZC","DELL",null,null,null,"400-2H59H","2H59H"]
["L4N14",14,"OpzSSD-MU1,6TB",584,"L4N14","TS3L4-MU1600GB",1,"SSD 1,6TB SAS MU 12Gbps 2.5in Hot-plug, 3 DWPD","L4N14-OpzSSD-MU1,6TB","400-AZIH","DELL",null,null,null,"400-CDPWY","CDPWY"]
["L4N15",15,"OpzSSD-RI800GB",241,"L4N15","TS3L4-RI800GB",1,"SSD 960GB SAS RI 12Gbps 2.5in Hot-plug, 1 DWPD","L4N15-OpzSSD-RI800GB","400-BBPN","DELL",null,null,null,"400-VPV60","VPV60"]
["L4N16",16,"OpzSSD-MU800GB",609,"L4N16","TS3L4-MU800GB",1,"SSD 960GB SAS MU 12Gbps 2.5in Hot-plug, 3 DWPD","L4N16-OpzSSD-MU800GB","400-BCNN","DELL",null,null,null,"400-MW0DK","MW0DK"]
["L4N17",17,"OpzNVME1,6TB",1050,"L4N17","TS3L4-NVME1600",1,"NVME 1,6TB MU HHHL, 3 DWPD","L4N17-OpzNVME1,6TB","403-BCCE","DELL",null,null,null,"403-C359R","C359R"]
["L4N18",18,"OpzNVME800GB",919,"L4N18","TS3L4-NVME800",1,"NVME 1,6TB MU HHHL, 3 DWPD","L4N18-OpzNVME800GB","403-BCCE","DELL",null,null,null,"403-C359R","C359R"]
["L4N19",19,"OpzUps (3000VA)",308,"L4N19","TS3L4-UPS",1,"Powerme Online UPS RPMM/9 3K, Rack, SNMP card","L4N19-OpzUps","RPMM9/3K",null,null,null,null,"RPMMRPMM9/3K","RPMM9/3K"]
[null,null,null,null,null,null,1,"KIT RACK incluso nella fornitura",null,null,null,null,null,null,""]
["L4N20",20,"OpzGUI",439,"L4N20","TS3L4-GUI",1,"Unità KVM - monitor 17\", cavo combi PS/2&USB da 1,8mt, tastiera italiana, touch pad","L4N20-OpzGUI","F9857N",null,null,null,null,"F985F9857N","F9857N"]
["L4N21",21,"OpzKVM",506,"L4N21","TS3L4-SWKVM",1,"KVM Switch IP per GUI 16P","L4N21-OpzKVM","T9816NIP",null,null,null,null,"T981T9816NIP","T9816NIP"]
["L4N22",22,"OpzWinServSTD",682,"L4N22","TS3L4-WINSRVSTD",1,"Windows Server 2019 Standard, ROK, 16CORE","L4N22-OpzWinServSTD","634-BSFX","DELL",null,null,null,"634-634-BSFX","634-BSFX"]
["L4N23",23,"OpzDeviceCal",23,"L4N23","TS3L4-WINDEVCAL",1,"Windows Server 2019 Device CAL (STD or DC)","L4N23-OpzDeviceCal","623-BBCV","DELL",null,null,null,"623-623-BBCV","623-BBCV"]
["L4N24",24,"OpzUserCal",29,"L4N24","TS3L4-WINUSRCAL",1,"Windows Server 2019 User CAL (STD or DC)","L4N24-OpzUserCal","623-BBCT","DELL",null,null,null,"623-623-BBCT","623-BBCT"]
["L4N25",25,"OpzWinServSTD2core",95,"L4N25","TS3L4-WINSRV2C",1,"Windows Server 2019 Standard, Additional License, 2CORE","L4N25-OpzWinServSTD2core","634-BSGS","DELL",null,null,null,"634-634-BSGS","634-BSGS"]
["L4N26",26,"OpzOpenSource",49,"L4N26","TS3L4-LINUX",1,"Ubuntu 18.04 LTS 64 Bit","L4N26-OpzOpenSource",null,null,null,null,null,""]
["L4N27",27,"OpzHDDRetention",32,"L4N27","TS3L4-HDRTNTN",1,"Hard Disk Retention 36 mesi","L4N27-OpzHDDRetention","785-10921","DELL",null,null,null,"785-785-10921","785-10921"]
["L4N28",28,"OpzEstensione24",79,"L4N28","TS3L4-5Y",1,"Estensione della manutenzione in garanzia per ulteriori 24 mesi","L4N28-OpzEstensione24","742-10105","DELL",null,null,null,"742-742-10105","742-10105"]
["L4N29",29,"OpzRack",511,"L4N29","TS3L4-RACK",1,"Armadio Rack 42U","L4N29-OpzRack","P6142NCONSIP",null,null,null,null,"P614P6142NCONSIP","P6142NCONSIP"]
["L4N30",30,"OpzHDDRetention",53,"L4N30","TS3L4-HDRTNTN60",1,"Hard Disk Retention 60 mesi","L4N30-OpzHDDRetention60","785-10921","DELL",1,2,3,"405-V5FKR","V5FKR"]
["L4N31",31,null,334,"L4N31","TS3L4-57416-L",1,"Broadcom 57416 Dual Port 10Gb, Base-T, PCIe Adapter, Low Profile","TS3-OpzA205741L","540-BBVM","DELL",4,null,null,"540-MT69G","MT69G"]
["L4N32",32,null,null,"L4N32","TS3L4-BOSS240",1,"BOSS controller card, full height, with 2 240G M.2 Drives",null,"403-BBVQ","DELL",1,2,3,"403-4FXXT","4FXXT"]
[null,null,null,null,null,null,2,"Dell 240GB SSD M.2 SATA 6Gbps Drive",null,"400-ASDQ","DELL",null,null,null,"400-4GWX0","4GWX0"]
["L4N33",33,null,748,"L4N33","TS3L4-BOSS480",1,"BOSS controller card, full height, with 2 480G M.2 Drives","TS3-OpzA20B480G","403-BBVQ","DELL",1,2,3,"403-4FXXT","4FXXT"]
[null,null,null,null,null,null,2,"Dell 480GB M.2 SSD SATA 512n 6Gbps S3520",null,"400-AVSS","DELL",null,null,null,"400-9NF27","9NF27"]
["L4N34",34,null,180,"L4N34","TS3L4-HBA330-L",1,"HBA330 Controller Card in sostituzione del Controller in configurazione BASE","TS3-OpzA20HBA3L","405-AANM","DELL",4,null,null,"405-Y29HF","Y29HF"]
["L4N35",35,null,9999,"L4N35","TS3L4-HBA330M",1,"Customer Kit,Card,Controller,HBA330,Minicard",null,"405-AAJW","DELL","int",null,null,"405-THN56","THN56"]
["L4N36",36,null,299,"L4N36","TS3L4-GPUSW",1,"Kit upgrade chassies for Server GPU Single-Wide Ready","TS3-OpzA20GPUSW","490-BEIX","DELL",null,null,null,"490-JKFGX","JKFGX"]
["L4N37",37,null,299,"L4N37","TS3L4-GPUDW",1,"Kit upgrade chassies for Server GPU Double-Wide Ready","TS3-OpzA20GPUDW","490-BEIX","DELL",null,null,null,"490-JKFGX","JKFGX"]
["L4N38",38,null,80,"L4N38","TS3L4-VSAN",1,"Kit upgrade chassies for Server vSAN Ready","TS3-OpzA20VSAN",null,"DELL",null,null,null,""]
["L4N39",39,null,720,"L4N39","TS3L4-CONX6SP",1,"Mellanox ConnectX-6 Single Port HDR100 QSFP56 Infiniband FULL","TS3-OpzA20CX6SP","540-BCMU","DELL","NO",null,null,"540-DXMD8","DXMD8"]
["L4N40",40,null,812,"L4N40","TS3L4-CONX6DP",1,"Mellanox ConnectX-6 DX Dual Port 100GbE QFSFP56 FULL","TS3-OpzA20CX6DP","540-BCXP",null,"NO",null,null,"540-2RMCP","2RMCP"]
["L4N41",41,null,342,"L4N41","TS3L4-X710DP-L",1,"Intel X710 Dual Port 10Gb SFP+ LOW","TS3-OpzA20710DL","540-BBML","Intel X710 adapters require firmware 19.0 or later to work with the SFP + SR Optic (Factory Installed SKU # 407-BCBE and Kit SKU 407-BCBN).",4,null,null,"540-VHNMC","VHNMC"]
["L4N42",42,null,342,"L4N42","TS3L4-X710DP",1,"Intel X710 Dual Port 10Gb SFP+ FULL","TS3-OpzA20710D","540-BBIV",null,1,2,3,"540-6W1YC","6W1YC"]
["L4N43",43,null,518,"L4N43","TS3L4-X710QP",1,"Intel X710 Quad Port 10Gb SFP+ FULL","TS3-OpzA20710Q","540-BBIW","Intel X710 adapters require firmware 19.0 or later to work with the SFP + SR Optic (Factory Installed SKU # 407-BCBE and Kit SKU 407-BCBN).",null,null,null,"540-60WX8","60WX8"]
["L4N44",44,null,null,"L4N44",null,1,"PERC H740P RAID Controller Adapter, Low Profile,CK",null,"405-AAMX","DELL",4,null,null,"405-39M19","39M19"]
["L4N45",45,null,null,"L4N45",null,1,"Customer Kit,Card,Controller,H740P,Minicard",null,"405-AANL","DELL","int",null,null,"405-4R84R","4R84R"]
["L4N46",46,null,334,"L4N46","TS3L4-57416",1,"Broadcom 57416 Dual Port 10Gb, Base-T, PCIe Adapter, Full Height","TS3-OpzA2057416","540-BBUO","DELL",null,null,null,"540-GRT2K","GRT2K"]
["L4N47",47,"Kit n. 1 Processore 8 Core base",99999,"L4N47","TS3L4-SRV8CORE",1,"Upgrade da Processore base a Processore 8 core","TS3-OpzA20SRV8C","338-BTSX","DELL",null,null,null,"338-WP22J","WP22J"]
["L4N48",48,"Kit n. 1 Processore 8 Core aggiuntivo",99999,"L4N48","TS3L4-CPU8CORE",1,"Upgrade da Processore aggiuntivo a Processore 8 core","TS3-OpzA20CPU8C","338-BTSX","DELL",null,null,null,"338-WP22J","WP22J"]
["L4N49",49,"OpzPSU1100W",178,"L4N49","TS3L4-PSU1100W",1,"Dual, Hot-plug Power Supply (1+1), 1100W in sostituzione di quelli in configurazione BASE","TS3-OpzA201100W","450-AEBL","DELL",null,null,null,"450-T4RTF","T4RTF"]
["L4N50",50,"OpzPSU2000W",306,"L4N50","TS3L4-PSU2000W",1,"Dual, Hot-plug Power Supply (1+1), 2000W in sostituzione di quelli in configurazione BASE","TS3-OpzA202000W","450-AENT","DELL",null,null,null,"450-54WHW","54WHW"]
["L4N51",51,"OpzSSD-RI3,84TB",1380,"L4N51","TS3L4-RI3840GB",1,"SSD 3,84TB SAS RI 12Gbps 2.5in Hot-plug, 1 DWPD","TS3-OpzA20RI384","400-BBQZ","DELL",null,null,null,"400-64G77","64G77"]
["L4N52",52,"OpzSSD-RI7,68TB",2580,"L4N52","TS3L4-RI7680GB",1,"SSD 7,68TB VSAS RI 12Gbps 2.5in Hot-plug, 1 DWPD","TS3-OpzA20RI768","400-BFPF","DELL",null,null,null,"400-7HH3W","7HH3W"]
["L4N53",53,"OpzSSD-WI800GB",1106,"L4N53","TS3L4-WI800GB",1,"800GB SSD SAS Write Intensive 12Gbps 512e 2.5in Hot Plug Drive, PM5, 10 DWPD, 29200 TBW, CK","TS3-OpzA20800WI","400-BDIL","DELL",null,null,null,"400-6P43P","6P43P"]
["L4N54",54,"OpzSSD-WI1600GB",9999,"L4N54","TS3L4-WI1600GB",1,"1.6TB SSD SAS Write Intensive 12Gbps 512e 2.5in Hot Plug PM5-M Dr, 10 DWPD, 29200 TBW, CK",null,"400-BDGY","DELL",null,null,null,"400-NHGRN","NHGRN"]
["L4N55",55,"OpzGPUT4",2450,"L4N55","TS3L4-TESLAT4",1,"NVIDIA TeslaT4 16GB GPU","TS3-OpzA20GPUT4","490-BEYM","DELL",null,null,null,"490-F9PH5","F9PH5"]
["L4N56",56,"OpzGPURTX6000",4800,"L4N56","TS3L4-RTX6000",1,"NVIDIA Quadro RTX 6000 24 GB, 250W, Dual Slot, GPU","TS3-OpzA20GPU60","490-BFRS","DELL",null,null,null,"490-VN574","VN574"]
["L4N57",57,"OpzGPUM10",2700,"L4N57","TS3L4-TESLAM10",1,"NVIDIA Tesla M10 GPU","TS3-OpzA20GPU10","489-BBCJ","DELL",null,null,null,"489-409GF ","409GF "]
["L4N58",58,"OpzGPUV100S",10130,"L4N58","TS3L4-V100S32G",1,"NVIDIA Tesla V100S 32GB, 250W, Passive, Double Wide, GPU","TS3-OpzA20V100S","490-BFRT","DELL",null,null,null,"490-GH9J0","GH9J0"]
["L4N59",59,"OpzWinServDC",4339,"L4N59","TS3L4-WINDC",1,"Windows Server 2019 Data Center, ROK, 16CORE","TS3-OpzA20WDC","634-BSGB","DELL",null,null,null,"634-634-BSGB","634-BSGB"]
["L4N60",60,"OpzWinServDC2core",545,"L4N60","TS3L4-WINDC2C",1,"Windows Server 2019 Data Center, Additional License, 2CORE","TS3-OpzA20WDC2C","634-BSGR","DELL",null,null,null,"634-634-BSGR","634-BSGR"]
["L4N61",61,"OpzWinServDC16core",4336,"L4N61","TS3L4-WINDC16C",1,"MS2019 Datacenter Ed, Additional License, 16 CORE,NO MEDIA/KEY, Customer Kit",null,"634-BSGT","DELL",null,null,null,"634-634-BSGT","634-BSGT"]
["L4N62",62,"OpzRJ45 3m",3,"L4N62","TS3L4-RJ453M",1,"Cavo “patch” di 3 mt RJ45 certificato per gigabit ethernet","TS3-OpzA20RJ45",null,null,null,null,null,""]
["L4N63",63,"OpzLINKX3m",9999,"L4N63","TS3L4-MEL100M3",1,"Mellanox LinkX 100Gb/s Passive Copper Cables - attacco cavo diretto - 3 m - nero",null,"AA407867","DELL",null,null,null,"AA40AA407867","AA407867"]
["L4N64",64,"OpzLINKX10m",9999,"L4N64","TS3L4-MEL100M10",1,"Mellanox LinkX 100Gb/s VCSEL-Based Active Optical Cables - cavo InfiniBand - 10 m",null,"A8431034","DELL",null,null,null,"A843MFA1A00-E010","MFA1A00-E010"]
["L4N65",65,"OpzQSFP28",9999,"L4N65","TS3L4-QSFP28",1,"Dell EMC PowerEdge QSFP28 SR4 100GbE 85C optic Customer Install",null,"407-BCEX","DELL",null,null,null,"407-5M3CP","5M3CP"]
["L4N66",66,"Opz10GBIC",90,"L4N66","TS3L4-10GBIC",1,"Transceiver, SFP+, 10GbE, SR, 850nm Wavelength, 300m Reach",null,"407-BBOU","DELL",null,null,null,"407-RK0CX","RK0CX"]
["L4N67",67,"OpzDAC3M",9999,"L4N67","TS3L4-DAC3M",1,"Cable, SFP+ to SFP+, 10GbE, Copper Twinax Direct Attach Cable, 3 Meter",null,"470-AAVJ","DELL",null,null,null,"470-4WM8D","4WM8D"]
["L4N68",68,"OpzBezelLCD",63,"L4N68","TS3L4-BZLLCD",1,"PowerEdge 2U LCD Bezel","TS3-OpzA20BZLCD","325-BCHW","DELL",null,null,null,"325-MPW3H","MPW3H"]
["L4N69",69,"OpzBezelSTD",42,"L4N69","TS3L4-BZLSTD",1,"PowerEdge 2U Standard Bezel","TS3-OpzA20BZSTD","350-BBJW","DELL",null,null,null,"350-0V5VK","0V5VK"]
["L4N70",70,"OpzISDM",134,"L4N70","TS3L4-ISDM32GB",1,"ISDM and Combo Card Reader with 2 x 32GB microSDHC/SDXC Card","TS3-OpzA20ISDM","385-BBLF","DELL",null,null,null,"385-NYT1H","NYT1H"]
[null,null,null,null,null,null,2,"32GB microSDHC/SDXC Card, CusKit",null,"385-BBKK","DELL",null,null,null,"385-YYC3N","YYC3N"]
["L4N71",71,"OpzH840",479,"L4N71","TS3L4-H840",1,"PERC H840 RAID Adapter for External MD14XX Only, 8GB NV Cache, Full Height","TS3-OpzA20H840","405-AAMZ","DELL",null,null,null,""]
["L4N72",72,null,16549,"L4N72","TS3L4-VS7STD6AK",1,"VMware vSphere 7 Standard Acceleration Kit OEM for 6 CPU, 3YR License and Maintenance","TS3-OpzA20VMW01",null,"DELL",null,null,null,""]
["L4N73",73,null,1557,"L4N73","TS3L4-VS7STD",1,"VMware vSphere 7 Standard OEM, 1 CPU (max 32 cores/CPU socket), 3YR License and Maintenance","TS3-OpzA20VMW02",null,"DELL",null,null,null,""]
["L4N74",74,null,34860,"L4N74","TS3L4-VS7EPL6AK",1,"VMware vSphere 7 Enterprise Plus Acceleration Kit OEM for 6 CPU, 3YR License and Maintenance","TS3-OpzA20VMW03",null,"DELL",null,null,null,""]
["L4N80",75,null,4576,"L4N80","TS3L4-VS7EPL",1,"VMware vSphere 7 Enterprise Plus OEM, 1 CPU (max 32 cores/CPU socket), 3YR License and Maintenance","TS3-OpzA20VMW04",null,"DELL",null,null,null,""]
["L4N81",76,null,7860,"L4N81","TS3L4-VCS7STD",1,"VMware vCenter 7 Standard OEM ,Per Instance,3YR License and Maintenance","TS3-OpzA20VMW05"]
["L4N82",77,null,7196,"L4N82","TS3L4-ST7ENT",1,"VMware vSAN 7 Enterprise OEM, 1 CPU (max 32 cores/CPU socket), 3YR License and Maintenance","TS3-OpzA20VMW06"]
["L4N83",78,null,5028,"L4N83","TS3L4-HZ8ADC10",1,"VMware Horizon 8 Advanced OEM,10 Pack,CCU, 3YR License and Maintenance","TS3-OpzA20VMW07"]
["L4N84",79,null,7116,"L4N84","TS3L4-HZ8ENC10",1,"VMware Horizon 8 Enterprise OEM,10 Pack,CCU, 3YR License and Maintenance","TS3-OpzA20VMW08"]
["L4N85",80,null,3089,"L4N85","TS3L4-HZ8ADN10",1,"VMware Horizon Advanced OEM, 10 Pack, Named User, 3YR License and Maintenance","TS3-OpzA20VMW09"]
["L4N86",81,null,4398,"L4N86","TS3L4-HZ8ENN10",1,"VMware Horizon 8 Enterprise OEM,10 Pack, Named User, 3YR License and Maintenance","TS3-OpzA20VMW10"]
["L4N87",82,null,2727,"L4N87","TS3L4-Encl13Y4H",1,"Enclosure SAS 12 Slot 3.5\", 3YR ProSupport and 4hr Mission Critical","TS3-OpzA20E13Y4"]
["L4N88",83,null,2827,"L4N88","TS3L4-Encl25Y4H",1,"Enclosure SAS 12 Slot 3.5\", 5YR ProSupport and 4hr Mission Critical","TS3-OpzA20E25Y4"]
["L4N89",84,null,2653,"L4N89","TS3L4-RACKM32A",1,"Armadio Rack 42U 600x1200, 2 x PDU Monofase 2G, ZeroU, 32A, 230V, (36) C13 & (6) C19","TS3-OpzA20RAPCM"]
["L4N90",85,null,4311,"L4N90","TS3L4-RACKT32A",1,"Armadio Rack 42U 600x1200, 2 x PDU Trifase 2G, ZeroU, 22.0kW(32A) 17.3kW(24A), 230V, (30) C13 & (12) C19","TS3-OpzA20RAPCT"]
["L4N91",86,null,84,"L4N91","TS3L4-DAC3SFP",1,"Dell Networking, Cable, SFP+ to SFP+, 10GbE, Copper Twinax Direct Attach Cable, 3 Meter","TS3-OpzA20DAC3S"]
["L4N92",87,null,258,"L4N92","TS3L4-MLX100M3",1,"Mellanox LinkX 100Gb/s Passive Copper DAC 3m per scheda TS3L4-CONX6DP","TS3-OpzA20ML100"]
["L4N93",88,null,99,"L4N93","TS3L4-DAC3SFP28",1,"Dell Cable SFP28 to SFP28 25GbE Passive Copper Twinax Direct Attach Cable 3 Meter ","TS3-OpzA20DAC28"]
["L4N94",89,null,419,"L4N94","TS3L4-MCX4DP",1,"Mellanox ConnectX-4 Lx Dual Port 25GbE SFP28 Network Adapter, PCIe Full Height, 2 x SFP28 SR Optic, 25GbE","TS3-OpzA20MCX4F"]
["L4N95",90,null,419,"L4N95","TS3L4-MCX4DP-L",1,"Mellanox ConnectX-4 Lx Dual Port 25GbE SFP28 Network Adapter, Low Profile, 2 x SFP28 SR Optic, 25GbE","TS3-OpzA20MCX4L"]
["L4N96",91,null,214,"L4N96","TS3L4-OMEA",1,"OpenManage Enterprise Advanced","TS3-OpzA20OMEA"]
["L4N97",97,null,80,"L4N97","TS3L4-PWRFLEX",1,"Kit upgrade chassies for Server PowerFlex Ready","TS3-OpzA20PWRFLX","330-BBLV","DELL",null,null,null,""]
["L4N98",98,null,3027,"L4N98","TS3L4-Encl33Y4H",1,"Enclosure SAS 24 Slot 2.5\", 3YR ProSupport and 4hr Mission Critical","TS3-OpzA20E33Y4","210-ADBP","DELL"]
["L4N99",99,null,3327,"L4N99","TS3L4-Encl45Y4H",1,"Enclosure SAS 24 Slot 2.5\", 5YR ProSupport and 4hr Mission Critical","TS3-OpzA20E45Y4","210-ADBP","DELL"]
["L4N100",100,null,92,"L4N100","TS3L4-SAS12-L",1,"SAS 12Gbps HBA External Controller, Low Profile","TS3-OpzA20SAS12L","405-AAES","DELL"]
["L4N101",101,null,92,"L4N101","TS3L4-SAS12",1,"SAS 12Gbps HBA External Controller, Full Height","TS3-OpzA20SAS12","405-AADZ","DELL"]
["L4N102",102,null,479,"L4N102","TS3L4-H840-L",1,"PERC H840 RAID Adapter, Low Profile for External Enclosure ","TS3-OpzA20H840L","405-AANN","DELL"]
["L4N103",103,null,494,"L4N103","TS3L4-ED16TB",1,"HDD 16TB SAS 12Gbps 7k 3.5in Hot-Plug per Enclosure 3.5\"","TS3-OpzA20ED16TB","400-BJKO","DELL"]
["L4N104",104,null,443,"L4N104","TS3L4-ED12TB",1,"HDD 12TB SAS 12Gbps 7k 3.5in Hot-Plug per Enclosure 3.5\"","TS3-OpzA20ED12TB","400-AXLG","DELL"]
["L4N105",105,null,281,"L4N105","TS3L4-ED08TB",1,"HDD 8TB SAS 12Gbps 7k 3.5in Hot-Plug per Enclosure 3.5\"","TS3-OpzA20ED8TB","400-BLCE","DELL"]
["L4N106",106,null,226,"L4N106","TS3L4-ED2TB",1,"HDD 2400GB 10K SAS 12Gbps 2.5in Hot-plug per Enclosure 2.5\"","L2N05-OpzHDD2TB","400-AUQX","DELL"]
["L4N107",107,null,727,"L4N107","TS3L2-EDRI800",1,"SSD 960GB SAS RI 12Gbps 2.5in Hot-plug, 1 DWPD per Enclosure 2.5\"","L2N08-OpzSSD-RI800GB","400-BBOU","DELL"]
["L4N108",108,null,10130,"L4N108","TS3L4-A100",1,"NVIDIA Ampere A100, PCIe, 250W , 40GB Passive, Double Wide, Full Height GPU","TS3-OpzA20A100","490-BGFV","DELL"]
["L4N109",109,null,126,"L4N109","TS3L4-OT10GB",1,"SFP+ SR Optic for SFP+ ports (Intel X710)","TS3-OpzA20O10GB","407-BCBN","DELL"]
["L4N110",110,null,8.66,"L4N110","TS3L4-VAPPS1Y",1,"NVIDIA vApps Subscription License 1 Year, 1 CCU","TS3-OpzA20NVIDIA1","A9923501","DELL"]
["L4N111",111,null,25.98,"L4N111","TS3L4-VAPPS3Y",1,"NVIDIA vApps Subscription License 3 Years, 1 CCU","TS3-OpzA20NVIDIA2","A9923502","DELL"]
["L4N112",112,null,43.3,"L4N112","TS3L4-VAPPS5Y",1,"NVIDIA vApps Subscription License 5 Years, 1 CCU","TS3-OpzA20NVIDIA3","AA121477","DELL"]
["L4N113",113,null,43.3,"L4N113","TS3L4-VPC1Y",1,"NVIDIA vPC Subscription License 1 Year, 1 CCU","TS3-OpzA20NVIDIA4","A9923507","DELL"]
["L4N114",114,null,129.91,"L4N114","TS3L4-VPC3Y",1,"NVIDIA vPC Subscription License 3 Years, 1 CCU","TS3-OpzA20NVIDIA5","A9923508","DELL"]
["L4N115",115,null,173.2,"L4N115","TS3L4-VPC5Y",1,"NVIDIA vPC Subscription License 5 Years, 1 CCU","TS3-OpzA20NVIDIA6","AA121478","DELL"]
["L4N116",116,null,210.13,"L4N116","TS3L4-VWS1Y",1,"NVIDIA RTX vWS Subscription License 1 Year, 1 CCU","TS3-OpzA20NVIDIA7","A9923513","DELL"]
["L4N117",117,null,649.5,"L4N117","TS3L4-VWS3Y",1,"NVIDIA RTX vWS Subscription License 3 Years, 1 CCU","TS3-OpzA20NVIDIA8","A9923514","DELL"]
["L4N118",118,null,1082.51,"L4N118","TS3L4-VWS5Y",1,"NVIDIA RTX vWS Subscription License 5 Years, 1 CCU","TS3-OpzA20NVIDIA9","AA121476","DELL"]
["L4N119",119,null,129.91,"L4N119","TS3L4-VCS1Y",1,"NVIDIA Virtual Compute Server Subscription, 1 GPU (Max 8 CC VMs), 1 Year","TS3-OpzA20NVIDIA10","AA731569","DELL"]
["L4N120",120,null,378.25,"L4N120","TS3L4-VCS3Y",1,"NVIDIA Virtual Compute Server Subscription, 1 GPU (Max 8 CC VMs), 3 Years","TS3-OpzA20NVIDIA11","AB229530","DELL"]
["L4N121",121,null,630.41,"L4N121","TS3L4-VCS5Y",1,"NVIDIA Virtual Compute Server Subscription, 1 GPU (Max 8 CC VMs), 5 Years","TS3-OpzA20NVIDIA12","AB229531","DELL"]
["L4N122",122,null,36.56,"L4N122","TS3L4-VAPPS-P4Y",1,"NVIDIA vApps Bundle Perpetual License Plus 4yr vApps SUMS, 1CCU","TS3-OpzA20NVIDIA13","AA787756","DELL"]
["L4N123",123,null,41.37,"L4N123","TS3L4-VAPPS-P5Y",1,"NVIDIA vApps Bundle Perpetual License Plus 5yr vApps SUMS, 1CCU","TS3-OpzA20NVIDIA14","AA787759","DELL"]
["L4N124",124,null,182.82,"L4N124","TS3L4-VPC-P4Y",1,"NVIDIA vPC Bundle Perpetual License Plus 4yr vPC SUMS, 1CCU","TS3-OpzA20NVIDIA15","AA787765","DELL"]
["L4N125",125,null,206.87,"L4N125","TS3L4-VPC-P5Y",1,"NVIDIA vPC Bundle Perpetual License Plus 5yr vPC SUMS, 1CCU","TS3-OpzA20NVIDIA16","AA787768","DELL"]
["L4N126",126,null,774.6,"L4N126","TS3L4-VWS-P4Y",1,"NVIDIA RTX vWS Bundle Perpetual License Plus 4yr RTX vWS SUMS, 1CCU","TS3-OpzA20NVIDIA17","AA787774","DELL"]
["L4N127",127,null,870.81,"L4N127","TS3L4-VWS-P5Y",1,"NVIDIA RTX vWS Bundle Perpetual License Plus 5yr RTX vWS SUMS, 1CCU","TS3-OpzA20NVIDIA18","AA787777","DELL"]
["L4N128",128,null,1,"L4N128","TS3L4-VWSUPG4Y",1,"NVIDIA vPC to NVIDIA RTX vWS Upgrade 4 year SUMS Bundle","TS3-OpzA20NVIDIA19","AB284633","DELL"]
["L4N129",129,null,1,"L4N129","TS3L4-VWSUPG5Y",1,"NVIDIA vPC to NVIDIA RTX vWS Upgrade 5 year SUMS Bundle","TS3-OpzA20NVIDIA20","AB284636","DELL"]
["L4N130",130,null,69,"L4N130","TS3L4-OM4M3",1,"Dell Networking Cable, OM4 LC/LC Fiber Cable, 3 Meter","TS3L4-OM4M3",null,"DELL"]
["L4N131",131,null,12460,"L4N131","TS3L4-A10080GB",1,"NVIDIA Ampere A100, PCIe, 300W, 80GB Passive, Double Wide, Full Height GPU","TS3-OpzA20A10080","490-BHBK","DELL"]
["L4N132",132,null,1269,"L4N132","TS3L4-GPUA2",1,"NVIDIA Ampere A2, PCIe, 60W, 16GB Passive, Single Wide, Full Height GPU","TS3-OpzA20A2","490-BHMC","DELL"]
["L4N133",133,null,4657,"L4N133","TS3L4-GPUA30",1,"NVIDIA Ampere A30, PCIe, 165W, 24GB Passive, Double Wide, Full Height GPU","TS3-OpzA20A30","490-BGUS","DELL"]
["L4N134",134,null,3394,"L4N134","TS3L4-GPUA16",1,"NVIDIA Ampere A16, PCIe, 250W, 64GB Passive, Double Wide, Full Height GPU","TS3-OpzA20A16","490-BHES","DELL"]
["L4N135",135,null,50,"L4N135","TS3L4-CMA2U",1,"2U Cable Management Arm","TS3-OpzA20CMA2U","770-BBIP","DELL"]

{"sheet":"Riepilogo","index":6,"n_rows":166,"n_cols":28,"rows_kept":166,"cut":false,"hidden":false,"merged":[[164,1,164,5],[161,4,161,5],[161,1,161,2],[160,1,160,5],[163,1,163,5],[162,4,162,5],[162,1,162,3],[57,1,57,6],[20,1,20,6],[17,4,17,6],[1,3,1,6],[15,1,15,2],[10,3,10,6],[15,3,15,6],[12,4,12,6],[1,1,1,2],[3,1,3,2],[5,1,5,2],[7,1,7,2],[10,1,10,2]]}
[null,null,null,null,null,null,null,null,null,1]
[null,"Ente:",null,null,null,null,null,null,null,1,null,"ente",{"$f":"IF(D2>0,0,1)","v":1}]
[null,null,null,null,null,null,null,null,null,1,null,null,null,null,"Conf 1","Conf 2","Conf 3"]
[null,"Ordine N.",null,null,{"$f":"M7","v":"ERRORE DI MANCATA COMPILAZIONE DATI NECESSARI PER L'ORDINATIVO"},null,null,null,null,1,null,"N°ordine",{"$f":"IF(D4>0,0,1)","v":1},"Vsan Boot Check",{"$f":"IF(M68>0,IF(M63+M101=0,\"ERRORE vSAN Config 1\",\"\"),\"\")","v":""},{"$f":"IF(N68>0,IF(N63+N101=0,\" - ERRORE vSAN Config 2 - \",\"\"),\"\")","v":""},{"$f":"IF(O68>0,IF(O63+O101=0,\"ERRORE vSAN Config 3\",\"\"),\"\")","v":""},{"$f":"IF(R5>0,\" - ERRORE BOSS CARD\",\"\")","v":""}]
[null,null,null,null,{"$f":"M8","v":""},null,null,null,null,1,null,null,null,"Check BOSS card",{"$f":"IF(Lotto4_R740XD_1!M98>1,1,0)","v":0},{"$f":"IF(Lotto4_R740XD_2!M98>1,1,0)","v":0},{"$f":"IF(Lotto4_R740XD_3!M98>1,1,0)","v":0},{"$f":"SUM(O5:Q5)","v":0}]
[null,"Data",null,null,{"$f":"M9","v":""},null,null,null,null,1,null,"data",{"$f":"IF(D6>0,0,1)","v":1}]
[null,null,null,null,{"$f":"M10","v":""},null,null,null,null,1,null,"ERRORE1",{"$f":"IF(M2+M4+M6+M11+M13+M16+M18+O18+O13,\"ERRORE DI MANCATA COMPILAZIONE DATI NECESSARI PER L'ORDINATIVO\",\"\")","v":"ERRORE DI MANCATA COMPILAZIONE DATI NECESSARI PER L'ORDINATIVO"},{"$f":"IF(M7=\"\",0,1)","v":1}]
[null,"Totale IVA incl.",null,{"$f":"G165","v":0},{"$f":"IF(Q11=0,\"CONFIGURATORE OK\", \"\")","v":""},null,"Version 5.1",null,null,1,null,"Warning2",{"$f":"IF(G162>D162,\"!!! ATTENZIONE !!! L'IMPORTO 20% SUPERA IL VALORE MASSIMO CONSENTITO\",\"\")","v":""},{"$f":"IF(M8=\"\",0,1)","v":0}]
[null,null,null,null,null,null,null,null,null,1,null,"ERRORE3",{"$f":"CONCATENATE(O4,P4,Q4,R4)","v":""},{"$f":"IF(M9=\"\",0,1)","v":0}]
[null,null,null,null,null,null,null,null,null,1,null,"Waning4",{"$f":"IF(N10>0,\"!!! ATTENZIONE !!! COMPLETARE IL CAMPO NOTE NELLE CONFIGURAZIONI\",\"\")","v":""},{"$f":"IF(M22>0,O10,0)+IF(N22>0,P10,0)+IF(O22>0,Q10,0)","v":0},{"$f":"IF(Lotto4_R740XD_1!$H$35=\"Specificare la configurazione RAID per l'installazione del Sistema Operativo, se richiesto.\ne/o\ninserire eventuali note.\",1,0)","v":1},{"$f":"IF(Lotto4_R740XD_2!$H$30=\"Specificare la configurazione RAID per l'installazione del Sistema Operativo, se richiesto.\ne/o\ninserire eventuali note.\",1,0)","v":0},{"$f":"IF(Lotto4_R740XD_3!$H$30=\"Specificare la configurazione RAID per l'installazione del Sistema Operativo, se richiesto.\ne/o\ninserire eventuali note.\",1,0)","v":0}]
[null,"Referente Consegna",null,null,null,null,null,null,null,1,null,"ref1",{"$f":"IF(D11>0,0,1)","v":1},null,"Verifica Errori",null,{"$f":"N7+N9","v":1}]
[null,null,null,null,null,null,null,null,null,1]
[null,"Telefono",null,"email",null,null,null,null,null,1,null,"tel1",{"$f":"IF(C13>0,0,1)","v":1},"mail1",{"$f":"IF(E13>0,0,1)","v":1}]
[null,null,null,null,null,null,null,null,null,1]
[null,null,null,null,null,null,null,null,null,1]
[null,"Referente Installazione",null,null,null,null,null,null,null,1,null,"ref2",{"$f":"IF(D16>0,0,1)","v":1}]
[null,null,null,null,null,null,null,null,null,1]
[null,"Telefono",null,"email",null,null,null,null,null,1,null,"tel2",{"$f":"IF(C18>0,0,1)","v":1},"mail2",{"$f":"IF(E18>0,0,1)","v":1}]
[null,null,null,null,null,null,null,null,null,1]
[null,null,null,null,null,null,null,null,null,1,null,null,"Server1","Server2","Server3","Totale"]
[null,"TECNOLOGIE SERVER 3 LOTTO 4 - LISTA ARTICOLI IN CONVENZIONE -",null,null,null,null,null,null,null,{"$f":"IF($G$161>0,1,0)","v":0}]
[null,"Quantità","Codice Articolo Produttore","Codice Articolo Convenzione","Descrizione","Costo unitario","Costo complessivo",null,null,{"$f":"IF($G$161>0,1,0)","v":0},"Codice Convenzione","N°",{"$f":"Lotto4_R740XD_1!F5","v":0},{"$f":"Lotto4_R740XD_2!F5","v":0},{"$f":"Lotto4_R740XD_3!F5","v":0},null,"Qty_1","Qty_2","Qty_3"]
[null,{"$f":"IF(P23>0,P23,\"\")","v":""},{"$f":"IF(B23=\"\",\"\",VLOOKUP(L23,Tabella_prezzi!$A$3:$K$303,9,FALSE))","v":""},{"$f":"IF(B23=\"\",\"\",VLOOKUP(L23,Tabella_prezzi!$A$3:$K$303,6,FALSE))","v":""},{"$f":"IF(B23=\"\",\"\",VLOOKUP(L23,Tabella_prezzi!$A$3:$K$303,8,FALSE))","v":""},{"$f":"IF(B23=\"\",\"\",VLOOKUP(L23,Tabella_prezzi!$A$3:$K$303,4,FALSE))","v":""},{"$f":"IF(C23=\"\",\"\",F23*B23)","v":""},null,null,{"$f":"IF(B23=\"\",0,1)","v":0},{"$f":"VLOOKUP(L23,Tabella_prezzi!A2:K303,6,FALSE)","v":"TS3L4-SRV-U"},"L4N01",{"$f":"COUNTIF(TS3L4_L4N_1,L23)*$M$22","v":0},{"$f":"COUNTIF(TS3L4_L4N_2,L23)*$N$22","v":0},{"$f":"COUNTIF(TS3L4_L4N_3,L23)*$O$22","v":0},{"$f":"SUM(M23:O23)","v":0},null,null,null,{"$f":"Lotto4_R740XD_1!L9","v":"L4N01"},{"$f":"Lotto4_R740XD_1!F9","v":""},{"$f":"Lotto4_R740XD_2!L9","v":"L4N01"},{"$f":"Lotto4_R740XD_2!F9","v":""},{"$f":"Lotto4_R740XD_3!L9","v":"L4N01"},{"$f":"Lotto4_R740XD_3!F9","v":""},null,{"$f":"ISODD(J23)","v":false},"server"]
[null,"",{"$f":"IF(B24=\"\",\"\",VLOOKUP(L24,Tabella_prezzi!$A$3:$K$303,9,FALSE))","v":""},{"$f":"IF(B24=\"\",\"\",VLOOKUP(L24,Tabella_prezzi!$A$3:$K$303,6,FALSE))","v":""},{"$f":"IF(B24=\"\",\"\",VLOOKUP(L24,Tabella_prezzi!$A$3:$K$303,8,FALSE))","v":""},{"$f":"IF(B24=\"\",\"\",VLOOKUP(L24,Tabella_prezzi!$A$3:$K$303,4,FALSE))","v":""},"",null,null,{"$f":"IF(B24=\"\",0,1)","v":0},{"$f":"VLOOKUP(L24,Tabella_prezzi!A3:K304,6,FALSE)","v":"TS3L4-CPU"},"L4N02",{"$f":"COUNTIF(TS3L4_L4N_1,L24)*$M$22","v":0},{"$f":"COUNTIF(TS3L4_L4N_2,L24)*$N$22","v":0},{"$f":"COUNTIF(TS3L4_L4N_3,L24)*$O$22","v":0},0,null,null,null,{"$f":"Lotto4_R740XD_1!L21","v":""},{"$f":"Lotto4_R740XD_1!F21","v":0},{"$f":"Lotto4_R740XD_2!L20","v":0},{"$f":"Lotto4_R740XD_2!F20","v":0},{"$f":"Lotto4_R740XD_3!L20","v":0},{"$f":"Lotto4_R740XD_3!F20","v":0},null,{"$f":"ISODD(SUM($J$23:J24))","v":false},"Cpu"]
[null,"",{"$f":"IF(B25=\"\",\"\",VLOOKUP(L25,Tabella_prezzi!$A$3:$K$303,9,FALSE))","v":""},{"$f":"IF(B25=\"\",\"\",VLOOKUP(L25,Tabella_prezzi!$A$3:$K$303,6,FALSE))","v":""},{"$f":"IF(B25=\"\",\"\",VLOOKUP(L25,Tabella_prezzi!$A$3:$K$303,8,FALSE))","v":""},{"$f":"IF(B25=\"\",\"\",VLOOKUP(L25,Tabella_prezzi!$A$3:$K$303,4,FALSE))","v":""},"",null,null,0,{"$f":"VLOOKUP(L25,Tabella_prezzi!A4:K305,6,FALSE)","v":"TS3L4-RAM32"},"L4N03",{"$f":"COUNTIF(TS3L4_L4N_1,L25)*$M$22","v":0},{"$f":"COUNTIF(TS3L4_L4N_2,L25)*$N$22","v":0},{"$f":"COUNTIF(TS3L4_L4N_3,L25)*$O$22","v":0},0,null,null,null,{"$f":"Lotto4_R740XD_1!L24","v":""},{"$f":"Lotto4_R740XD_1!F24","v":0},{"$f":"Lotto4_R740XD_2!L23","v":0},{"$f":"Lotto4_R740XD_2!F23","v":0},{"$f":"Lotto4_R740XD_3!L23","v":0},{"$f":"Lotto4_R740XD_3!F23","v":0},null,{"$f":"ISODD(SUM($J$23:J25))","v":false},"ram"]
[null,"",{"$f":"IF(B26=\"\",\"\",VLOOKUP(L26,Tabella_prezzi!$A$3:$K$303,9,FALSE))","v":""},{"$f":"IF(B26=\"\",\"\",VLOOKUP(L26,Tabella_prezzi!$A$3:$K$303,6,FALSE))","v":""},{"$f":"IF(B26=\"\",\"\",VLOOKUP(L26,Tabella_prezzi!$A$3:$K$303,8,FALSE))","v":""},{"$f":"IF(B26=\"\",\"\",VLOOKUP(L26,Tabella_prezzi!$A$3:$K$303,4,FALSE))","v":""},"",null,null,0,{"$f":"VLOOKUP(L26,Tabella_prezzi!A5:K306,6,FALSE)","v":"TS3L4-RAM64"},"L4N04",{"$f":"COUNTIF(TS3L4_L4N_1,L26)*$M$22*Q26","v":0},{"$f":"COUNTIF(TS3L4_L4N_2,L26)*$N$22*R26","v":0},{"$f":"COUNTIF(TS3L4_L4N_3,L26)*$O$22*S26","v":0},0,{"$f":"Lotto4_R740XD_1!$F$24","v":0},{"$f":"Lotto4_R740XD_2!$F$24","v":0},{"$f":"Lotto4_R740XD_3!$F$24","v":0},{"$f":"Lotto4_R740XD_1!L27","v":""},{"$f":"Lotto4_R740XD_1!F27","v":0},{"$f":"Lotto4_R740XD_2!L26","v":0},{"$f":"Lotto4_R740XD_2!F26","v":0},{"$f":"Lotto4_R740XD_3!L26","v":0},{"$f":"Lotto4_R740XD_3!F26","v":0},null,{"$f":"ISODD(SUM($J$23:J26))","v":false},"ram"]
[null,"",{"$f":"IF(B27=\"\",\"\",VLOOKUP(L27,Tabella_prezzi!$A$3:$K$303,9,FALSE))","v":""},{"$f":"IF(B27=\"\",\"\",VLOOKUP(L27,Tabella_prezzi!$A$3:$K$303,6,FALSE))","v":""},{"$f":"IF(B27=\"\",\"\",VLOOKUP(L27,Tabella_prezzi!$A$3:$K$303,8,FALSE))","v":""},{"$f":"IF(B27=\"\",\"\",VLOOKUP(L27,Tabella_prezzi!$A$3:$K$303,4,FALSE))","v":""},"",null,null,0,{"$f":"VLOOKUP(L27,Tabella_prezzi!A6:K307,6,FALSE)","v":"TS3L4-LAN1"},"L4N05",{"$f":"COUNTIF(TS3L4_L4N_1,L27)*$M$22","v":0},{"$f":"COUNTIF(TS3L4_L4N_2,L27)*$N$22","v":0},{"$f":"COUNTIF(TS3L4_L4N_3,L27)*$O$22","v":0},0,null,null,null,{"$f":"Lotto4_R740XD_1!L35","v":"L4N12"},{"$f":"Lotto4_R740XD_1!F35","v":0},{"$f":"Lotto4_R740XD_2!L34","v":0},{"$f":"Lotto4_R740XD_2!F34","v":0},{"$f":"Lotto4_R740XD_3!L34","v":0},{"$f":"Lotto4_R740XD_3!F34","v":0},null,{"$f":"ISODD(SUM($J$23:J27))","v":false},"Sist Op"]
[null,"",{"$f":"IF(B28=\"\",\"\",VLOOKUP(L28,Tabella_prezzi!$A$3:$K$303,9,FALSE))","v":""},{"$f":"IF(B28=\"\",\"\",VLOOKUP(L28,Tabella_prezzi!$A$3:$K$303,6,FALSE))","v":""},{"$f":"IF(B28=\"\",\"\",VLOOKUP(L28,Tabella_prezzi!$A$3:$K$303,8,FALSE))","v":""},{"$f":"IF(B28=\"\",\"\",VLOOKUP(L28,Tabella_prezzi!$A$3:$K$303,4,FALSE))","v":""},"",null,null,0,{"$f":"VLOOKUP(L28,Tabella_prezzi!A7:K308,6,FALSE)","v":"TS3L4-LAN1-L"},"L4N75",0,0,0,0,null,null,null,{"$f":"Lotto4_R740XD_1!L37","v":"L4N11"},{"$f":"Lotto4_R740XD_1!F37","v":0},{"$f":"Lotto4_R740XD_2!L36","v":0},{"$f":"Lotto4_R740XD_2!F36","v":0},{"$f":"Lotto4_R740XD_3!L36","v":0},{"$f":"Lotto4_R740XD_3!F36","v":0},null,{"$f":"ISODD(SUM($J$23:J28))","v":false},"hd2tb"]
[null,"",{"$f":"IF(B29=\"\",\"\",VLOOKUP(L29,Tabella_prezzi!$A$3:$K$303,9,FALSE))","v":""},{"$f":"IF(B29=\"\",\"\",VLOOKUP(L29,Tabella_prezzi!$A$3:$K$303,6,FALSE))","v":""},{"$f":"IF(B29=\"\",\"\",VLOOKUP(L29,Tabella_prezzi!$A$3:$K$303,8,FALSE))","v":""},{"$f":"IF(B29=\"\",\"\",VLOOKUP(L29,Tabella_prezzi!$A$3:$K$303,4,FALSE))","v":""},"",null,null,0,{"$f":"VLOOKUP(L29,Tabella_prezzi!A8:K309,6,FALSE)","v":"TS3L4-LAN10"},"L4N06",0,0,0,0,null,null,null,{"$f":"Lotto4_R740XD_1!L39","v":"L4N10"},{"$f":"Lotto4_R740XD_1!F39","v":0},{"$f":"Lotto4_R740XD_2!L38","v":0},{"$f":"Lotto4_R740XD_2!F38","v":0},{"$f":"Lotto4_R740XD_3!L38","v":0},{"$f":"Lotto4_R740XD_3!F38","v":0},null,{"$f":"ISODD(SUM($J$23:J29))","v":false},"hd1tb"]
[null,"",{"$f":"IF(B30=\"\",\"\",VLOOKUP(L30,Tabella_prezzi!$A$3:$K$303,9,FALSE))","v":""},{"$f":"IF(B30=\"\",\"\",VLOOKUP(L30,Tabella_prezzi!$A$3:$K$303,6,FALSE))","v":""},{"$f":"IF(B30=\"\",\"\",VLOOKUP(L30,Tabella_prezzi!$A$3:$K$303,8,FALSE))","v":""},{"$f":"IF(B30=\"\",\"\",VLOOKUP(L30,Tabella_prezzi!$A$3:$K$303,4,FALSE))","v":""},"",null,null,0,{"$f":"VLOOKUP(L30,Tabella_prezzi!A9:K310,6,FALSE)","v":"TS3L4-LAN10-L"},"L4N76",0,0,0,0,null,null,null,{"$f":"Lotto4_R740XD_1!L45","v":"L4N51"},{"$f":"Lotto4_R740XD_1!F45","v":0},{"$f":"Lotto4_R740XD_2!L40","v":0},{"$f":"Lotto4_R740XD_2!F40","v":0},{"$f":"Lotto4_R740XD_3!L40","v":0},{"$f":"Lotto4_R740XD_3!F40","v":0},null,{"$f":"ISODD(SUM($J$23:J30))","v":false},"hd300gb"]
[null,"",{"$f":"IF(B31=\"\",\"\",VLOOKUP(L31,Tabella_prezzi!$A$3:$K$303,9,FALSE))","v":""},{"$f":"IF(B31=\"\",\"\",VLOOKUP(L31,Tabella_prezzi!$A$3:$K$303,6,FALSE))","v":""},{"$f":"IF(B31=\"\",\"\",VLOOKUP(L31,Tabella_prezzi!$A$3:$K$303,8,FALSE))","v":""},{"$f":"IF(B31=\"\",\"\",VLOOKUP(L31,Tabella_prezzi!$A$3:$K$303,4,FALSE))","v":""},"",null,null,0,{"$f":"VLOOKUP(L31,Tabella_prezzi!A10:K311,6,FALSE)","v":"TS3L4-LAN25"},"L4N07",0,0,0,0,null,null,null,{"$f":"Lotto4_R740XD_1!L51","v":"L4N14"},{"$f":"Lotto4_R740XD_1!F51","v":0},{"$f":"Lotto4_R740XD_2!L42","v":0},{"$f":"Lotto4_R740XD_2!F42","v":0},{"$f":"Lotto4_R740XD_3!L42","v":0},{"$f":"Lotto4_R740XD_3!F42","v":0},null,{"$f":"ISODD(SUM($J$23:J31))","v":false},"ssd960GB"]
[null,"",{"$f":"IF(B32=\"\",\"\",VLOOKUP(L32,Tabella_prezzi!$A$3:$K$303,9,FALSE))","v":""},{"$f":"IF(B32=\"\",\"\",VLOOKUP(L32,Tabella_prezzi!$A$3:$K$303,6,FALSE))","v":""},{"$f":"IF(B32=\"\",\"\",VLOOKUP(L32,Tabella_prezzi!$A$3:$K$303,8,FALSE))","v":""},{"$f":"IF(B32=\"\",\"\",VLOOKUP(L32,Tabella_prezzi!$A$3:$K$303,4,FALSE))","v":""},"",null,null,0,{"$f":"VLOOKUP(L32,Tabella_prezzi!A11:K312,6,FALSE)","v":"TS3L4-LAN25-L"},"L4N77",0,0,0,0,null,null,null,{"$f":"Lotto4_R740XD_1!L77","v":""},{"$f":"Lotto4_R740XD_1!F77","v":""},{"$f":"Lotto4_R740XD_2!L54","v":0},{"$f":"Lotto4_R740XD_2!F54","v":0},{"$f":"Lotto4_R740XD_3!L54","v":0},{"$f":"Lotto4_R740XD_3!F54","v":0},null,{"$f":"ISODD(SUM($J$23:J32))","v":false},"ssd480GB"]
[null,"",{"$f":"IF(B33=\"\",\"\",VLOOKUP(L33,Tabella_prezzi!$A$3:$K$303,9,FALSE))","v":""},{"$f":"IF(B33=\"\",\"\",VLOOKUP(L33,Tabella_prezzi!$A$3:$K$303,6,FALSE))","v":""},{"$f":"IF(B33=\"\",\"\",VLOOKUP(L33,Tabella_prezzi!$A$3:$K$303,8,FALSE))","v":""},{"$f":"IF(B33=\"\",\"\",VLOOKUP(L33,Tabella_prezzi!$A$3:$K$303,4,FALSE))","v":""},"",null,null,0,{"$f":"VLOOKUP(L33,Tabella_prezzi!A12:K313,6,FALSE)","v":"TS3L4-CNA10"},"L4N08",0,0,0,0,null,null,null,{"$f":"Lotto4_R740XD_1!L80","v":""},{"$f":"Lotto4_R740XD_1!F80","v":""},{"$f":"Lotto4_R740XD_2!L57","v":0},{"$f":"Lotto4_R740XD_2!F57","v":0},{"$f":"Lotto4_R740XD_3!L57","v":0},{"$f":"Lotto4_R740XD_3!F57","v":0},null,{"$f":"ISODD(SUM($J$23:J33))","v":false},"pci1"]
[null,{"$f":"IF(P34>0,P34,\"\")","v":""},{"$f":"IF(B34=\"\",\"\",VLOOKUP(L34,Tabella_prezzi!$A$3:$K$303,9,FALSE))","v":""},{"$f":"IF(B34=\"\",\"\",VLOOKUP(L34,Tabella_prezzi!$A$3:$K$303,6,FALSE))","v":""},{"$f":"IF(B34=\"\",\"\",VLOOKUP(L34,Tabella_prezzi!$A$3:$K$303,8,FALSE))","v":""},{"$f":"IF(B34=\"\",\"\",VLOOKUP(L34,Tabella_prezzi!$A$3:$K$303,4,FALSE))","v":""},{"$f":"IF(C34=\"\",\"\",F34*B34)","v":""},null,null,0,{"$f":"VLOOKUP(L34,Tabella_prezzi!A13:K314,6,FALSE)","v":"TS3L4-CNA10-L"},"L4N78",0,0,0,0,null,null,null,{"$f":"Lotto4_R740XD_1!L83","v":""},{"$f":"Lotto4_R740XD_1!F83","v":""},{"$f":"Lotto4_R740XD_2!L60","v":""},{"$f":"Lotto4_R740XD_2!F60","v":""},{"$f":"Lotto4_R740XD_3!L60","v":""},{"$f":"Lotto4_R740XD_3!F60","v":""},null,{"$f":"ISODD(SUM($J$23:J34))","v":false},"pci2"]
[null,"",{"$f":"IF(B35=\"\",\"\",VLOOKUP(L35,Tabella_prezzi!$A$3:$K$303,9,FALSE))","v":""},{"$f":"IF(B35=\"\",\"\",VLOOKUP(L35,Tabella_prezzi!$A$3:$K$303,6,FALSE))","v":""},{"$f":"IF(B35=\"\",\"\",VLOOKUP(L35,Tabella_prezzi!$A$3:$K$303,8,FALSE))","v":""},{"$f":"IF(B35=\"\",\"\",VLOOKUP(L35,Tabella_prezzi!$A$3:$K$303,4,FALSE))","v":""},"",null,null,0,{"$f":"VLOOKUP(L35,Tabella_prezzi!A14:K315,6,FALSE)","v":"TS3L4-FC16"},"L4N09",0,0,0,0,null,null,null,{"$f":"Lotto4_R740XD_1!L86","v":""},{"$f":"Lotto4_R740XD_1!F86","v":""},{"$f":"Lotto4_R740XD_2!L63","v":""},{"$f":"Lotto4_R740XD_2!F63","v":""},{"$f":"Lotto4_R740XD_3!L63","v":""},{"$f":"Lotto4_R740XD_3!F63","v":""},null,{"$f":"ISODD(SUM($J$23:J35))","v":false},"pci3"]
[null,"",{"$f":"IF(B36=\"\",\"\",VLOOKUP(L36,Tabella_prezzi!$A$3:$K$303,9,FALSE))","v":""},{"$f":"IF(B36=\"\",\"\",VLOOKUP(L36,Tabella_prezzi!$A$3:$K$303,6,FALSE))","v":""},{"$f":"IF(B36=\"\",\"\",VLOOKUP(L36,Tabella_prezzi!$A$3:$K$303,8,FALSE))","v":""},{"$f":"IF(B36=\"\",\"\",VLOOKUP(L36,Tabella_prezzi!$A$3:$K$303,4,FALSE))","v":""},"",null,null,0,{"$f":"VLOOKUP(L36,Tabella_prezzi!A15:K316,6,FALSE)","v":"TS3L4-FC16-L"},"L4N79",0,0,0,0,null,null,null,{"$f":"Lotto4_R740XD_1!L89","v":""},{"$f":"Lotto4_R740XD_1!F89","v":""},{"$f":"Lotto4_R740XD_2!L66","v":0},{"$f":"Lotto4_R740XD_2!F66","v":0},{"$f":"Lotto4_R740XD_3!L66","v":0},{"$f":"Lotto4_R740XD_3!F66","v":0},null,{"$f":"ISODD(SUM($J$23:J36))","v":false},"pci4"]
[null,"",{"$f":"IF(B37=\"\",\"\",VLOOKUP(L37,Tabella_prezzi!$A$3:$K$303,9,FALSE))","v":""},{"$f":"IF(B37=\"\",\"\",VLOOKUP(L37,Tabella_prezzi!$A$3:$K$303,6,FALSE))","v":""},{"$f":"IF(B37=\"\",\"\",VLOOKUP(L37,Tabella_prezzi!$A$3:$K$303,8,FALSE))","v":""},{"$f":"IF(B37=\"\",\"\",VLOOKUP(L37,Tabella_prezzi!$A$3:$K$303,4,FALSE))","v":""},"",null,null,0,{"$f":"VLOOKUP(L37,Tabella_prezzi!A16:K317,6,FALSE)","v":"TS3L4-HDD2TB"},"L4N10",{"$f":"COUNTIF(TS3L4_L4N_1,L37)*$M$22*Q37","v":0},{"$f":"COUNTIF(TS3L4_L4N_2,L37)*$N$22*R37","v":0},{"$f":"COUNTIF(TS3L4_L4N_3,L37)*$O$22*S37","v":0},0,{"$f":"Lotto4_R740XD_1!$F$39","v":0},{"$f":"Lotto4_R740XD_2!$F$39","v":0},{"$f":"Lotto4_R740XD_3!$F$39","v":0},{"$f":"Lotto4_R740XD_1!L92","v":""},{"$f":"Lotto4_R740XD_1!F92","v":""},{"$f":"Lotto4_R740XD_2!L72","v":0},{"$f":"Lotto4_R740XD_2!F72","v":0},{"$f":"Lotto4_R740XD_3!L72","v":0},{"$f":"Lotto4_R740XD_3!F72","v":0},null,{"$f":"ISODD(SUM($J$23:J37))","v":false},"pci5"]
[null,"",{"$f":"IF(B38=\"\",\"\",VLOOKUP(L38,Tabella_prezzi!$A$3:$K$303,9,FALSE))","v":""},{"$f":"IF(B38=\"\",\"\",VLOOKUP(L38,Tabella_prezzi!$A$3:$K$303,6,FALSE))","v":""},{"$f":"IF(B38=\"\",\"\",VLOOKUP(L38,Tabella_prezzi!$A$3:$K$303,8,FALSE))","v":""},{"$f":"IF(B38=\"\",\"\",VLOOKUP(L38,Tabella_prezzi!$A$3:$K$303,4,FALSE))","v":""},"",null,null,0,{"$f":"VLOOKUP(L38,Tabella_prezzi!A17:K318,6,FALSE)","v":"TS3L4-HDD1TB"},"L4N11",0,0,0,0,{"$f":"Lotto4_R740XD_1!$F$37","v":0},{"$f":"Lotto4_R740XD_2!$F$37","v":0},{"$f":"Lotto4_R740XD_3!$F$37","v":0},{"$f":"Lotto4_R740XD_1!L95","v":""},{"$f":"Lotto4_R740XD_1!F95","v":""},{"$f":"Lotto4_R740XD_2!L75","v":0},{"$f":"Lotto4_R740XD_2!F75","v":0},{"$f":"Lotto4_R740XD_3!L75","v":0},{"$f":"Lotto4_R740XD_3!F75","v":0},null,{"$f":"ISODD(SUM($J$23:J38))","v":false},"pci6"]
[null,"",{"$f":"IF(B39=\"\",\"\",VLOOKUP(L39,Tabella_prezzi!$A$3:$K$303,9,FALSE))","v":""},{"$f":"IF(B39=\"\",\"\",VLOOKUP(L39,Tabella_prezzi!$A$3:$K$303,6,FALSE))","v":""},{"$f":"IF(B39=\"\",\"\",VLOOKUP(L39,Tabella_prezzi!$A$3:$K$303,8,FALSE))","v":""},{"$f":"IF(B39=\"\",\"\",VLOOKUP(L39,Tabella_prezzi!$A$3:$K$303,4,FALSE))","v":""},"",null,null,0,{"$f":"VLOOKUP(L39,Tabella_prezzi!A18:K319,6,FALSE)","v":"TS3L4-HDD300GB"},"L4N12",0,0,0,0,{"$f":"Lotto4_R740XD_1!$F$35","v":0},{"$f":"Lotto4_R740XD_2!$F$35","v":0},{"$f":"Lotto4_R740XD_3!$F$35","v":0},{"$f":"Lotto4_R740XD_1!L98","v":""},{"$f":"Lotto4_R740XD_1!F98","v":""},{"$f":"Lotto4_R740XD_2!L78","v":0},{"$f":"Lotto4_R740XD_2!F78","v":0},{"$f":"Lotto4_R740XD_3!L78","v":0},{"$f":"Lotto4_R740XD_3!F78","v":0},null,{"$f":"ISODD(SUM($J$23:J39))","v":false},"pci7"]
[null,"",{"$f":"IF(B40=\"\",\"\",VLOOKUP(L40,Tabella_prezzi!$A$3:$K$303,9,FALSE))","v":""},{"$f":"IF(B40=\"\",\"\",VLOOKUP(L40,Tabella_prezzi!$A$3:$K$303,6,FALSE))","v":""},{"$f":"IF(B40=\"\",\"\",VLOOKUP(L40,Tabella_prezzi!$A$3:$K$303,8,FALSE))","v":""},{"$f":"IF(B40=\"\",\"\",VLOOKUP(L40,Tabella_prezzi!$A$3:$K$303,4,FALSE))","v":""},"",null,null,0,{"$f":"VLOOKUP(L40,Tabella_prezzi!A19:K320,6,FALSE)","v":"TS3L4-RI1600GB"},"L4N13",0,0,0,0,{"$f":"Lotto4_R740XD_1!$F$43","v":0},{"$f":"Lotto4_R740XD_2!$F$43","v":0},{"$f":"Lotto4_R740XD_3!$F$43","v":0},{"$f":"Lotto4_R740XD_1!L28","v":0},{"$f":"Lotto4_R740XD_1!F28","v":0},{"$f":"Lotto4_R740XD_2!L27","v":""},{"$f":"Lotto4_R740XD_2!F27","v":0},{"$f":"Lotto4_R740XD_3!L27","v":""},{"$f":"Lotto4_R740XD_3!F27","v":0},null,{"$f":"ISODD(SUM($J$23:J40))","v":false},"pci8"]
[null,"",{"$f":"IF(B41=\"\",\"\",VLOOKUP(L41,Tabella_prezzi!$A$3:$K$303,9,FALSE))","v":""},{"$f":"IF(B41=\"\",\"\",VLOOKUP(L41,Tabella_prezzi!$A$3:$K$303,6,FALSE))","v":""},{"$f":"IF(B41=\"\",\"\",VLOOKUP(L41,Tabella_prezzi!$A$3:$K$303,8,FALSE))","v":""},{"$f":"IF(B41=\"\",\"\",VLOOKUP(L41,Tabella_prezzi!$A$3:$K$303,4,FALSE))","v":""},"",null,null,0,{"$f":"VLOOKUP(L41,Tabella_prezzi!A20:K321,6,FALSE)","v":"TS3L4-MU1600GB"},"L4N14",0,0,0,0,{"$f":"Lotto4_R740XD_1!$F$51","v":0},{"$f":"Lotto4_R740XD_2!$F$51","v":0},{"$f":"Lotto4_R740XD_3!$F$51","v":0},null,null,null,null,null,null,null,{"$f":"ISODD(SUM($J$23:J41))","v":false},"win2core"]
[null,"",{"$f":"IF(B42=\"\",\"\",VLOOKUP(L42,Tabella_prezzi!$A$3:$K$303,9,FALSE))","v":""},{"$f":"IF(B42=\"\",\"\",VLOOKUP(L42,Tabella_prezzi!$A$3:$K$303,6,FALSE))","v":""},{"$f":"IF(B42=\"\",\"\",VLOOKUP(L42,Tabella_prezzi!$A$3:$K$303,8,FALSE))","v":""},{"$f":"IF(B42=\"\",\"\",VLOOKUP(L42,Tabella_prezzi!$A$3:$K$303,4,FALSE))","v":""},"",null,null,0,{"$f":"VLOOKUP(L42,Tabella_prezzi!A21:K322,6,FALSE)","v":"TS3L4-RI800GB"},"L4N15",0,0,0,0,{"$f":"IF(Lotto4_R740XD_1!$F$41>2,Lotto4_R740XD_1!$F$41-2,0)","v":0},{"$f":"IF(Lotto4_R740XD_2!$F$41>2,Lotto4_R740XD_2!$F$41-2,0)","v":0},{"$f":"IF(Lotto4_R740XD_3!$F$41>2,Lotto4_R740XD_3!$F$41-2,0)","v":0},null,null,null,null,null,null,null,{"$f":"ISODD(SUM($J$23:J42))","v":false}]
[null,"",{"$f":"IF(B43=\"\",\"\",VLOOKUP(L43,Tabella_prezzi!$A$3:$K$303,9,FALSE))","v":""},{"$f":"IF(B43=\"\",\"\",VLOOKUP(L43,Tabella_prezzi!$A$3:$K$303,6,FALSE))","v":""},{"$f":"IF(B43=\"\",\"\",VLOOKUP(L43,Tabella_prezzi!$A$3:$K$303,8,FALSE))","v":""},{"$f":"IF(B43=\"\",\"\",VLOOKUP(L43,Tabella_prezzi!$A$3:$K$303,4,FALSE))","v":""},"",null,null,0,{"$f":"VLOOKUP(L43,Tabella_prezzi!A22:K323,6,FALSE)","v":"TS3L4-MU800GB"},"L4N16",0,0,0,0,{"$f":"Lotto4_R740XD_1!$F$49","v":0},{"$f":"Lotto4_R740XD_2!$F$49","v":0},{"$f":"Lotto4_R740XD_3!$F$49","v":0},null,null,null,null,null,null,null,{"$f":"ISODD(SUM($J$23:J43))","v":false}]
[null,"",{"$f":"IF(B44=\"\",\"\",VLOOKUP(L44,Tabella_prezzi!$A$3:$K$303,9,FALSE))","v":""},{"$f":"IF(B44=\"\",\"\",VLOOKUP(L44,Tabella_prezzi!$A$3:$K$303,6,FALSE))","v":""},{"$f":"IF(B44=\"\",\"\",VLOOKUP(L44,Tabella_prezzi!$A$3:$K$303,8,FALSE))","v":""},{"$f":"IF(B44=\"\",\"\",VLOOKUP(L44,Tabella_prezzi!$A$3:$K$303,4,FALSE))","v":""},"",null,null,0,{"$f":"VLOOKUP(L44,Tabella_prezzi!A23:K324,6,FALSE)","v":"TS3L4-NVME1600"},"L4N17",{"$f":"COUNTIF(TS3L4_L4N_1,L44)*$M$22","v":0},{"$f":"COUNTIF(TS3L4_L4N_2,L44)*$N$22","v":0},{"$f":"COUNTIF(TS3L4_L4N_3,L44)*$O$22","v":0},0,null,null,null,null,null,null,null,null,null,null,{"$f":"ISODD(SUM($J$23:J44))","v":false}]
[null,"",{"$f":"IF(B45=\"\",\"\",VLOOKUP(L45,Tabella_prezzi!$A$3:$K$303,9,FALSE))","v":""},{"$f":"IF(B45=\"\",\"\",VLOOKUP(L45,Tabella_prezzi!$A$3:$K$303,6,FALSE))","v":""},{"$f":"IF(B45=\"\",\"\",VLOOKUP(L45,Tabella_prezzi!$A$3:$K$303,8,FALSE))","v":""},{"$f":"IF(B45=\"\",\"\",VLOOKUP(L45,Tabella_prezzi!$A$3:$K$303,4,FALSE))","v":""},"",null,null,0,{"$f":"VLOOKUP(L45,Tabella_prezzi!A24:K325,6,FALSE)","v":"TS3L4-NVME800"},"L4N18",0,0,0,0,null,null,null,null,null,null,null,null,null,null,{"$f":"ISODD(SUM($J$23:J45))","v":false}]
[null,"",{"$f":"IF(B46=\"\",\"\",VLOOKUP(L46,Tabella_prezzi!$A$3:$K$303,9,FALSE))","v":""},{"$f":"IF(B46=\"\",\"\",VLOOKUP(L46,Tabella_prezzi!$A$3:$K$303,6,FALSE))","v":""},{"$f":"IF(B46=\"\",\"\",VLOOKUP(L46,Tabella_prezzi!$A$3:$K$303,8,FALSE))","v":""},{"$f":"IF(B46=\"\",\"\",VLOOKUP(L46,Tabella_prezzi!$A$3:$K$303,4,FALSE))","v":""},"",null,null,0,{"$f":"VLOOKUP(L46,Tabella_prezzi!A25:K326,6,FALSE)","v":"TS3L4-UPS"},"L4N19",null,null,null,{"$f":"Altre_Opzioni!F72","v":0},null,null,null,null,null,null,null,null,null,null,{"$f":"ISODD(SUM($J$23:J46))","v":false}]
[null,"",{"$f":"IF(B47=\"\",\"\",VLOOKUP(L47,Tabella_prezzi!$A$3:$K$303,9,FALSE))","v":""},{"$f":"IF(B47=\"\",\"\",VLOOKUP(L47,Tabella_prezzi!$A$3:$K$303,6,FALSE))","v":""},{"$f":"IF(B47=\"\",\"\",VLOOKUP(L47,Tabella_prezzi!$A$3:$K$303,8,FALSE))","v":""},{"$f":"IF(B47=\"\",\"\",VLOOKUP(L47,Tabella_prezzi!$A$3:$K$303,4,FALSE))","v":""},"",null,null,0,{"$f":"VLOOKUP(L47,Tabella_prezzi!A26:K327,6,FALSE)","v":"TS3L4-GUI"},"L4N20",null,null,null,{"$f":"Altre_Opzioni!F76","v":0},null,null,null,null,null,null,null,null,null,null,{"$f":"ISODD(SUM($J$23:J47))","v":false}]
[null,"",{"$f":"IF(B48=\"\",\"\",VLOOKUP(L48,Tabella_prezzi!$A$3:$K$303,9,FALSE))","v":""},{"$f":"IF(B48=\"\",\"\",VLOOKUP(L48,Tabella_prezzi!$A$3:$K$303,6,FALSE))","v":""},{"$f":"IF(B48=\"\",\"\",VLOOKUP(L48,Tabella_prezzi!$A$3:$K$303,8,FALSE))","v":""},{"$f":"IF(B48=\"\",\"\",VLOOKUP(L48,Tabella_prezzi!$A$3:$K$303,4,FALSE))","v":""},"",null,null,0,{"$f":"VLOOKUP(L48,Tabella_prezzi!A27:K328,6,FALSE)","v":"TS3L4-SWKVM"},"L4N21",null,null,null,{"$f":"Altre_Opzioni!F80","v":0},null,null,null,null,null,null,null,null,null,null,{"$f":"ISODD(SUM($J$23:J48))","v":false}]
[null,"",{"$f":"IF(B49=\"\",\"\",VLOOKUP(L49,Tabella_prezzi!$A$3:$K$303,9,FALSE))","v":""},{"$f":"IF(B49=\"\",\"\",VLOOKUP(L49,Tabella_prezzi!$A$3:$K$303,6,FALSE))","v":""},{"$f":"IF(B49=\"\",\"\",VLOOKUP(L49,Tabella_prezzi!$A$3:$K$303,8,FALSE))","v":""},{"$f":"IF(B49=\"\",\"\",VLOOKUP(L49,Tabella_prezzi!$A$3:$K$303,4,FALSE))","v":""},"",null,null,0,{"$f":"VLOOKUP(L49,Tabella_prezzi!A28:K329,6,FALSE)","v":"TS3L4-WINSRVSTD"},"L4N22",0,0,0,0,null,null,null,null,null,null,null,null,null,null,{"$f":"ISODD(SUM($J$23:J49))","v":false}]
[null,"",{"$f":"IF(B50=\"\",\"\",VLOOKUP(L50,Tabella_prezzi!$A$3:$K$303,9,FALSE))","v":""},{"$f":"IF(B50=\"\",\"\",VLOOKUP(L50,Tabella_prezzi!$A$3:$K$303,6,FALSE))","v":""},{"$f":"IF(B50=\"\",\"\",VLOOKUP(L50,Tabella_prezzi!$A$3:$K$303,8,FALSE))","v":""},{"$f":"IF(B50=\"\",\"\",VLOOKUP(L50,Tabella_prezzi!$A$3:$K$303,4,FALSE))","v":""},"",null,null,0,{"$f":"VLOOKUP(L50,Tabella_prezzi!A29:K330,6,FALSE)","v":"TS3L4-WINDEVCAL"},"L4N23",null,null,null,{"$f":"Altre_Opzioni!F83","v":0},null,null,null,null,null,null,null,null,null,null,{"$f":"ISODD(SUM($J$23:J50))","v":false}]
[null,"",{"$f":"IF(B51=\"\",\"\",VLOOKUP(L51,Tabella_prezzi!$A$3:$K$303,9,FALSE))","v":""},{"$f":"IF(B51=\"\",\"\",VLOOKUP(L51,Tabella_prezzi!$A$3:$K$303,6,FALSE))","v":""},{"$f":"IF(B51=\"\",\"\",VLOOKUP(L51,Tabella_prezzi!$A$3:$K$303,8,FALSE))","v":""},{"$f":"IF(B51=\"\",\"\",VLOOKUP(L51,Tabella_prezzi!$A$3:$K$303,4,FALSE))","v":""},"",null,null,0,{"$f":"VLOOKUP(L51,Tabella_prezzi!A30:K331,6,FALSE)","v":"TS3L4-WINUSRCAL"},"L4N24",null,null,null,{"$f":"Altre_Opzioni!F86","v":0},null,null,null,null,null,null,null,null,null,null,{"$f":"ISODD(SUM($J$23:J51))","v":false}]
[null,"",{"$f":"IF(B52=\"\",\"\",VLOOKUP(L52,Tabella_prezzi!$A$3:$K$303,9,FALSE))","v":""},{"$f":"IF(B52=\"\",\"\",VLOOKUP(L52,Tabella_prezzi!$A$3:$K$303,6,FALSE))","v":""},{"$f":"IF(B52=\"\",\"\",VLOOKUP(L52,Tabella_prezzi!$A$3:$K$303,8,FALSE))","v":""},{"$f":"IF(B52=\"\",\"\",VLOOKUP(L52,Tabella_prezzi!$A$3:$K$303,4,FALSE))","v":""},"",null,null,0,{"$f":"VLOOKUP(L52,Tabella_prezzi!A31:K332,6,FALSE)","v":"TS3L4-WINSRV2C"},"L4N25",{"$f":"COUNTIF(TS3L4_L4N_1,L52)*$M$22*Q52","v":0},{"$f":"COUNTIF(TS3L4_L4N_2,L52)*$N$22*R52","v":0},{"$f":"COUNTIF(TS3L4_L4N_3,L52)*$O$22*S52","v":0},0,{"$f":"Lotto4_R740XD_1!$F$28","v":0},{"$f":"Lotto4_R740XD_2!$F$28","v":0},{"$f":"Lotto4_R740XD_3!$F$28","v":0},null,null,null,null,null,null,null,{"$f":"ISODD(SUM($J$23:J52))","v":false}]
[null,"",{"$f":"IF(B53=\"\",\"\",VLOOKUP(L53,Tabella_prezzi!$A$3:$K$303,9,FALSE))","v":""},{"$f":"IF(B53=\"\",\"\",VLOOKUP(L53,Tabella_prezzi!$A$3:$K$303,6,FALSE))","v":""},{"$f":"IF(B53=\"\",\"\",VLOOKUP(L53,Tabella_prezzi!$A$3:$K$303,8,FALSE))","v":""},{"$f":"IF(B53=\"\",\"\",VLOOKUP(L53,Tabella_prezzi!$A$3:$K$303,4,FALSE))","v":""},"",null,null,0,{"$f":"VLOOKUP(L53,Tabella_prezzi!A32:K333,6,FALSE)","v":"TS3L4-LINUX"},"L4N26",{"$f":"COUNTIF(TS3L4_L4N_1,L53)*$M$22","v":0},{"$f":"COUNTIF(TS3L4_L4N_2,L53)*$N$22","v":0},{"$f":"COUNTIF(TS3L4_L4N_3,L53)*$O$22","v":0},0,null,null,null,null,null,null,null,null,null,null,{"$f":"ISODD(SUM($J$23:J53))","v":false}]
[null,"",{"$f":"IF(B54=\"\",\"\",VLOOKUP(L54,Tabella_prezzi!$A$3:$K$303,9,FALSE))","v":""},{"$f":"IF(B54=\"\",\"\",VLOOKUP(L54,Tabella_prezzi!$A$3:$K$303,6,FALSE))","v":""},{"$f":"IF(B54=\"\",\"\",VLOOKUP(L54,Tabella_prezzi!$A$3:$K$303,8,FALSE))","v":""},{"$f":"IF(B54=\"\",\"\",VLOOKUP(L54,Tabella_prezzi!$A$3:$K$303,4,FALSE))","v":""},"",null,null,0,{"$f":"VLOOKUP(L54,Tabella_prezzi!A33:K334,6,FALSE)","v":"TS3L4-HDRTNTN"},"L4N27",0,0,0,0,null,null,null,null,null,null,null,null,null,null,{"$f":"ISODD(SUM($J$23:J54))","v":false}]
[null,"",{"$f":"IF(B55=\"\",\"\",VLOOKUP(L55,Tabella_prezzi!$A$3:$K$303,9,FALSE))","v":""},{"$f":"IF(B55=\"\",\"\",VLOOKUP(L55,Tabella_prezzi!$A$3:$K$303,6,FALSE))","v":""},{"$f":"IF(B55=\"\",\"\",VLOOKUP(L55,Tabella_prezzi!$A$3:$K$303,8,FALSE))","v":""},{"$f":"IF(B55=\"\",\"\",VLOOKUP(L55,Tabella_prezzi!$A$3:$K$303,4,FALSE))","v":""},"",null,null,0,{"$f":"VLOOKUP(L55,Tabella_prezzi!A34:K335,6,FALSE)","v":"TS3L4-5Y"},"L4N28",0,0,0,0,null,null,null,null,null,null,null,null,null,null,{"$f":"ISODD(SUM($J$23:J55))","v":false}]
[null,"",{"$f":"IF(B56=\"\",\"\",VLOOKUP(L56,Tabella_prezzi!$A$3:$K$303,9,FALSE))","v":""},{"$f":"IF(B56=\"\",\"\",VLOOKUP(L56,Tabella_prezzi!$A$3:$K$303,6,FALSE))","v":""},{"$f":"IF(B56=\"\",\"\",VLOOKUP(L56,Tabella_prezzi!$A$3:$K$303,8,FALSE))","v":""},{"$f":"IF(B56=\"\",\"\",VLOOKUP(L56,Tabella_prezzi!$A$3:$K$303,4,FALSE))","v":""},"",null,null,0,{"$f":"VLOOKUP(L56,Tabella_prezzi!A35:K336,6,FALSE)","v":"TS3L4-RACK"},"L4N29",null,null,null,{"$f":"Altre_Opzioni!F16","v":0},null,null,null,null,null,null,null,null,null,null,{"$f":"ISODD(SUM($J$23:J56))","v":false}]
[null,"",{"$f":"IF(B57=\"\",\"\",VLOOKUP(L57,Tabella_prezzi!$A$3:$K$303,9,FALSE))","v":""},{"$f":"IF(B57=\"\",\"\",VLOOKUP(L57,Tabella_prezzi!$A$3:$K$303,6,FALSE))","v":""},{"$f":"IF(B57=\"\",\"\",VLOOKUP(L57,Tabella_prezzi!$A$3:$K$303,8,FALSE))","v":""},{"$f":"IF(B57=\"\",\"\",VLOOKUP(L57,Tabella_prezzi!$A$3:$K$303,4,FALSE))","v":""},{"$f":"IF(C57=\"\",\"\",F57*B57)","v":""},null,null,0,{"$f":"VLOOKUP(L57,Tabella_prezzi!A19:K320,6,FALSE)","v":"TS3L4-HDRTNTN60"},"L4N30",{"$f":"COUNTIF(TS3L4_L4N_1,L57)*$M$22","v":0},{"$f":"COUNTIF(TS3L4_L4N_2,L57)*$N$22","v":0},{"$f":"COUNTIF(TS3L4_L4N_3,L57)*$O$22","v":0},{"$f":"SUM(M57:O57)","v":0}]
[null,"TECNOLOGIE SERVER 3 LOTTO 4 - LISTA ULTERIORI ARTICOLI IN CONVENZIONE (20%) -",null,null,null,null,null,null,null,{"$f":"IF($G$162>0,1,0)","v":0},null,null,null,null,null,null,null,null,null,{"$f":"Lotto4_R740XD_1!L96","v":0},{"$f":"Lotto4_R740XD_1!F135","v":""},{"$f":"Lotto4_R740XD_2!L96","v":0},{"$f":"Lotto4_R740XD_2!F96","v":0},{"$f":"Lotto4_R740XD_3!L96","v":0},{"$f":"Lotto4_R740XD_3!F96","v":0},null,{"$f":"ISODD(SUM($J$23:J58))","v":false},"retention"]
[null,"Quantità","Codice Articolo Produttore","Codice Articolo Convenzione","Descrizione","Costo unitario","Costo complessivo",null,null,{"$f":"IF($G$162>0,1,0)","v":0},null,null,null,null,null,null,null,null,null,{"$f":"Lotto4_R740XD_1!L132","v":""},{"$f":"Lotto4_R740XD_1!F132","v":""},{"$f":"Lotto4_R740XD_2!L93","v":0},{"$f":"Lotto4_R740XD_2!F93","v":0},{"$f":"Lotto4_R740XD_3!L93","v":0},{"$f":"Lotto4_R740XD_3!F93","v":0},null,{"$f":"ISODD(SUM($J$23:J59))","v":false},"warranty"]
[null,null,null,null,null,null,null,null,null,{"$f":"IF(B60=\"\",0,1)","v":0},null,null,null,null,null,null,null,null,null,{"$f":"Lotto4_R740XD_1!L139","v":""},{"$f":"Lotto4_R740XD_1!F139","v":{"$error":"#NAME?"}},{"$f":"Lotto4_R740XD_2!L100","v":0},{"$f":"Lotto4_R740XD_2!F100","v":0},{"$f":"Lotto4_R740XD_3!L100","v":0},{"$f":"Lotto4_R740XD_3!F100","v":0},null,{"$f":"ISODD(SUM($J$23:J60))","v":false},"ups"]
[null,{"$f":"IF(P61>0,P61,\"\")","v":""},{"$f":"IF(B61=\"\",\"\",VLOOKUP(L61,Tabella_prezzi!$A$3:$K$303,9,FALSE))","v":""},{"$f":"IF(B61=\"\",\"\",VLOOKUP(L61,Tabella_prezzi!$A$3:$K$303,6,FALSE))","v":""},{"$f":"IF(B61=\"\",\"\",VLOOKUP(L61,Tabella_prezzi!$A$3:$K$303,8,FALSE))","v":""},{"$f":"IF(B61=\"\",\"\",VLOOKUP(L61,Tabella_prezzi!$A$3:$K$303,4,FALSE))","v":""},{"$f":"IF(C61=\"\",\"\",F61*B61)","v":""},null,null,0,{"$f":"VLOOKUP(L61,Tabella_prezzi!A23:K324,6,FALSE)","v":"TS3L4-57416-L"},"L4N31",0,{"$f":"COUNTIF(TS3L4_L4N_2,L61)*$N$22","v":0},{"$f":"COUNTIF(TS3L4_L4N_3,L61)*$O$22","v":0},0,null,null,null,{"$f":"Lotto4_R740XD_1!L142","v":""},{"$f":"Lotto4_R740XD_1!F142","v":{"$error":"#NAME?"}},{"$f":"Lotto4_R740XD_2!L103","v":0},{"$f":"Lotto4_R740XD_2!F103","v":0},{"$f":"Lotto4_R740XD_3!L103","v":0},{"$f":"Lotto4_R740XD_3!F103","v":0},null,{"$f":"ISODD(SUM($J$23:J61))","v":false},"gui"]
[null,{"$f":"IF(P62>0,P62,\"\")","v":""},{"$f":"IF(B62=\"\",\"\",VLOOKUP(L62,Tabella_prezzi!$A$3:$K$303,9,FALSE))","v":""},{"$f":"IF(B62=\"\",\"\",VLOOKUP(L62,Tabella_prezzi!$A$3:$K$303,6,FALSE))","v":""},{"$f":"IF(B62=\"\",\"\",VLOOKUP(L62,Tabella_prezzi!$A$3:$K$303,8,FALSE))","v":""},{"$f":"IF(B62=\"\",\"\",VLOOKUP(L62,Tabella_prezzi!$A$3:$K$303,4,FALSE))","v":""},{"$f":"IF(C62=\"\",\"\",F62*B62)","v":""},null,null,0,{"$f":"VLOOKUP(L62,Tabella_prezzi!A24:K325,6,FALSE)","v":"TS3L4-BOSS240"},"L4N32",0,0,0,0,null,null,null,{"$f":"Lotto4_R740XD_1!L129","v":""},{"$f":"Lotto4_R740XD_1!F129","v":""},{"$f":"Lotto4_R740XD_2!L90","v":0},{"$f":"Lotto4_R740XD_2!F90","v":0},{"$f":"Lotto4_R740XD_3!L90","v":0},{"$f":"Lotto4_R740XD_3!F90","v":0},null,{"$f":"ISODD(SUM($J$23:J62))","v":false}]
[null,"",{"$f":"IF(B63=\"\",\"\",VLOOKUP(L63,Tabella_prezzi!$A$3:$K$303,9,FALSE))","v":""},{"$f":"IF(B63=\"\",\"\",VLOOKUP(L63,Tabella_prezzi!$A$3:$K$303,6,FALSE))","v":""},{"$f":"IF(B63=\"\",\"\",VLOOKUP(L63,Tabella_prezzi!$A$3:$K$303,8,FALSE))","v":""},{"$f":"IF(B63=\"\",\"\",VLOOKUP(L63,Tabella_prezzi!$A$3:$K$303,4,FALSE))","v":""},"",null,null,0,{"$f":"VLOOKUP(L63,Tabella_prezzi!A25:K326,6,FALSE)","v":"TS3L4-BOSS480"},"L4N33",0,0,0,0,null,null,null,{"$f":"Lotto4_R740XD_1!L115","v":"L4N62"},{"$f":"Lotto4_R740XD_1!F115","v":5},{"$f":"Lotto4_R740XD_2!L87","v":0},{"$f":"Lotto4_R740XD_2!F87","v":0},{"$f":"Lotto4_R740XD_3!L87","v":0},{"$f":"Lotto4_R740XD_3!F87","v":0},null,{"$f":"ISODD(SUM($J$23:J63))","v":false}]
[null,"",{"$f":"IF(B64=\"\",\"\",VLOOKUP(L64,Tabella_prezzi!$A$3:$K$303,9,FALSE))","v":""},{"$f":"IF(B64=\"\",\"\",VLOOKUP(L64,Tabella_prezzi!$A$3:$K$303,6,FALSE))","v":""},{"$f":"IF(B64=\"\",\"\",VLOOKUP(L64,Tabella_prezzi!$A$3:$K$303,8,FALSE))","v":""},{"$f":"IF(B64=\"\",\"\",VLOOKUP(L64,Tabella_prezzi!$A$3:$K$303,4,FALSE))","v":""},"",null,null,0,{"$f":"VLOOKUP(L64,Tabella_prezzi!A26:K327,6,FALSE)","v":"TS3L4-HBA330-L"},"L4N34",0,0,0,0,null,null,null,{"$f":"Lotto4_R740XD_1!L104","v":0},{"$f":"Lotto4_R740XD_1!F104","v":0},{"$f":"Lotto4_R740XD_2!L84","v":0},{"$f":"Lotto4_R740XD_2!F84","v":0},{"$f":"Lotto4_R740XD_3!L84","v":0},{"$f":"Lotto4_R740XD_3!F84","v":0},null,{"$f":"ISODD(SUM($J$23:J64))","v":false}]
[null,"",{"$f":"IF(B65=\"\",\"\",VLOOKUP(L65,Tabella_prezzi!$A$3:$K$303,9,FALSE))","v":""},{"$f":"IF(B65=\"\",\"\",VLOOKUP(L65,Tabella_prezzi!$A$3:$K$303,6,FALSE))","v":""},{"$f":"IF(B65=\"\",\"\",VLOOKUP(L65,Tabella_prezzi!$A$3:$K$303,8,FALSE))","v":""},{"$f":"IF(B65=\"\",\"\",VLOOKUP(L65,Tabella_prezzi!$A$3:$K$303,4,FALSE))","v":""},"",null,null,0,{"$f":"VLOOKUP(L65,Tabella_prezzi!A27:K328,6,FALSE)","v":"TS3L4-HBA330M"},"L4N35",0,0,0,0,null,null,null,{"$f":"Lotto4_R740XD_1!L101","v":0},{"$f":"Lotto4_R740XD_1!F101","v":0},{"$f":"Lotto4_R740XD_2!L81","v":0},{"$f":"Lotto4_R740XD_2!F81","v":0},{"$f":"Lotto4_R740XD_3!L81","v":0},{"$f":"Lotto4_R740XD_3!F81","v":0},null,{"$f":"ISODD(SUM($J$23:J65))","v":false}]
[null,"",{"$f":"IF(B66=\"\",\"\",VLOOKUP(L66,Tabella_prezzi!$A$3:$K$303,9,FALSE))","v":""},{"$f":"IF(B66=\"\",\"\",VLOOKUP(L66,Tabella_prezzi!$A$3:$K$303,6,FALSE))","v":""},{"$f":"IF(B66=\"\",\"\",VLOOKUP(L66,Tabella_prezzi!$A$3:$K$303,8,FALSE))","v":""},{"$f":"IF(B66=\"\",\"\",VLOOKUP(L66,Tabella_prezzi!$A$3:$K$303,4,FALSE))","v":""},"",null,null,0,{"$f":"VLOOKUP(L66,Tabella_prezzi!A28:K329,6,FALSE)","v":"TS3L4-GPUSW"},"L4N36",0,0,0,0,null,null,null,{"$f":"Lotto4_R740XD_1!L12","v":""},{"$f":"Lotto4_R740XD_1!F12","v":""},{"$f":"Lotto4_R740XD_2!L11","v":0},{"$f":"Lotto4_R740XD_2!F11","v":0},{"$f":"Lotto4_R740XD_3!L11","v":0},{"$f":"Lotto4_R740XD_3!F11","v":0},null,{"$f":"ISODD(SUM($J$23:J66))","v":false}]
[null,"",{"$f":"IF(B67=\"\",\"\",VLOOKUP(L67,Tabella_prezzi!$A$3:$K$303,9,FALSE))","v":""},{"$f":"IF(B67=\"\",\"\",VLOOKUP(L67,Tabella_prezzi!$A$3:$K$303,6,FALSE))","v":""},{"$f":"IF(B67=\"\",\"\",VLOOKUP(L67,Tabella_prezzi!$A$3:$K$303,8,FALSE))","v":""},{"$f":"IF(B67=\"\",\"\",VLOOKUP(L67,Tabella_prezzi!$A$3:$K$303,4,FALSE))","v":""},"",null,null,0,{"$f":"VLOOKUP(L67,Tabella_prezzi!A29:K330,6,FALSE)","v":"TS3L4-GPUDW"},"L4N37",0,0,0,0,null,null,null,null,null,null,null,null,null,null,{"$f":"ISODD(SUM($J$23:J67))","v":false}]
[null,"",{"$f":"IF(B68=\"\",\"\",VLOOKUP(L68,Tabella_prezzi!$A$3:$K$303,9,FALSE))","v":""},{"$f":"IF(B68=\"\",\"\",VLOOKUP(L68,Tabella_prezzi!$A$3:$K$303,6,FALSE))","v":""},{"$f":"IF(B68=\"\",\"\",VLOOKUP(L68,Tabella_prezzi!$A$3:$K$303,8,FALSE))","v":""},{"$f":"IF(B68=\"\",\"\",VLOOKUP(L68,Tabella_prezzi!$A$3:$K$303,4,FALSE))","v":""},"",null,null,0,{"$f":"VLOOKUP(L68,Tabella_prezzi!A30:K331,6,FALSE)","v":"TS3L4-VSAN"},"L4N38",0,0,0,0,null,null,null,null,null,null,null,null,null,null,{"$f":"ISODD(SUM($J$23:J68))","v":false}]
[null,"",{"$f":"IF(B69=\"\",\"\",VLOOKUP(L69,Tabella_prezzi!$A$3:$K$303,9,FALSE))","v":""},{"$f":"IF(B69=\"\",\"\",VLOOKUP(L69,Tabella_prezzi!$A$3:$K$303,6,FALSE))","v":""},{"$f":"IF(B69=\"\",\"\",VLOOKUP(L69,Tabella_prezzi!$A$3:$K$303,8,FALSE))","v":""},{"$f":"IF(B69=\"\",\"\",VLOOKUP(L69,Tabella_prezzi!$A$3:$K$303,4,FALSE))","v":""},"",null,null,0,{"$f":"VLOOKUP(L69,Tabella_prezzi!A31:K332,6,FALSE)","v":"TS3L4-CONX6SP"},"L4N39",0,0,0,0,null,null,null,null,null,null,null,null,null,null,{"$f":"ISODD(SUM($J$23:J69))","v":false}]
[null,"",{"$f":"IF(B70=\"\",\"\",VLOOKUP(L70,Tabella_prezzi!$A$3:$K$303,9,FALSE))","v":""},{"$f":"IF(B70=\"\",\"\",VLOOKUP(L70,Tabella_prezzi!$A$3:$K$303,6,FALSE))","v":""},{"$f":"IF(B70=\"\",\"\",VLOOKUP(L70,Tabella_prezzi!$A$3:$K$303,8,FALSE))","v":""},{"$f":"IF(B70=\"\",\"\",VLOOKUP(L70,Tabella_prezzi!$A$3:$K$303,4,FALSE))","v":""},"",null,null,0,{"$f":"VLOOKUP(L70,Tabella_prezzi!A32:K333,6,FALSE)","v":"TS3L4-CONX6DP"},"L4N40",0,0,0,0,null,null,null,null,null,null,null,null,null,null,{"$f":"ISODD(SUM($J$23:J70))","v":false}]
[null,"",{"$f":"IF(B71=\"\",\"\",VLOOKUP(L71,Tabella_prezzi!$A$3:$K$303,9,FALSE))","v":""},{"$f":"IF(B71=\"\",\"\",VLOOKUP(L71,Tabella_prezzi!$A$3:$K$303,6,FALSE))","v":""},{"$f":"IF(B71=\"\",\"\",VLOOKUP(L71,Tabella_prezzi!$A$3:$K$303,8,FALSE))","v":""},{"$f":"IF(B71=\"\",\"\",VLOOKUP(L71,Tabella_prezzi!$A$3:$K$303,4,FALSE))","v":""},"",null,null,0,{"$f":"VLOOKUP(L71,Tabella_prezzi!A33:K334,6,FALSE)","v":"TS3L4-X710DP-L"},"L4N41",0,0,0,0,null,null,null,null,null,null,null,null,null,null,{"$f":"ISODD(SUM($J$23:J71))","v":false}]
[null,"",{"$f":"IF(B72=\"\",\"\",VLOOKUP(L72,Tabella_prezzi!$A$3:$K$303,9,FALSE))","v":""},{"$f":"IF(B72=\"\",\"\",VLOOKUP(L72,Tabella_prezzi!$A$3:$K$303,6,FALSE))","v":""},{"$f":"IF(B72=\"\",\"\",VLOOKUP(L72,Tabella_prezzi!$A$3:$K$303,8,FALSE))","v":""},{"$f":"IF(B72=\"\",\"\",VLOOKUP(L72,Tabella_prezzi!$A$3:$K$303,4,FALSE))","v":""},"",null,null,0,{"$f":"VLOOKUP(L72,Tabella_prezzi!A34:K335,6,FALSE)","v":"TS3L4-X710DP"},"L4N42",0,0,0,0,null,null,null,null,null,null,null,null,null,null,{"$f":"ISODD(SUM($J$23:J72))","v":false}]
[null,"",{"$f":"IF(B73=\"\",\"\",VLOOKUP(L73,Tabella_prezzi!$A$3:$K$303,9,FALSE))","v":""},{"$f":"IF(B73=\"\",\"\",VLOOKUP(L73,Tabella_prezzi!$A$3:$K$303,6,FALSE))","v":""},{"$f":"IF(B73=\"\",\"\",VLOOKUP(L73,Tabella_prezzi!$A$3:$K$303,8,FALSE))","v":""},{"$f":"IF(B73=\"\",\"\",VLOOKUP(L73,Tabella_prezzi!$A$3:$K$303,4,FALSE))","v":""},"",null,null,0,{"$f":"VLOOKUP(L73,Tabella_prezzi!A35:K336,6,FALSE)","v":"TS3L4-X710QP"},"L4N43",0,0,0,0,null,null,null,null,null,null,null,null,null,null,{"$f":"ISODD(SUM($J$23:J73))","v":false}]
[null,"",{"$f":"IF(B74=\"\",\"\",VLOOKUP(L74,Tabella_prezzi!$A$3:$K$303,9,FALSE))","v":""},{"$f":"IF(B74=\"\",\"\",VLOOKUP(L74,Tabella_prezzi!$A$3:$K$303,6,FALSE))","v":""},{"$f":"IF(B74=\"\",\"\",VLOOKUP(L74,Tabella_prezzi!$A$3:$K$303,8,FALSE))","v":""},{"$f":"IF(B74=\"\",\"\",VLOOKUP(L74,Tabella_prezzi!$A$3:$K$303,4,FALSE))","v":""},"",null,null,0,{"$f":"VLOOKUP(L74,Tabella_prezzi!A36:K337,6,FALSE)","v":0},"L4N44",0,0,0,0,null,null,null,null,null,null,null,null,null,null,{"$f":"ISODD(SUM($J$23:J74))","v":false}]
[null,"",{"$f":"IF(B75=\"\",\"\",VLOOKUP(L75,Tabella_prezzi!$A$3:$K$303,9,FALSE))","v":""},{"$f":"IF(B75=\"\",\"\",VLOOKUP(L75,Tabella_prezzi!$A$3:$K$303,6,FALSE))","v":""},{"$f":"IF(B75=\"\",\"\",VLOOKUP(L75,Tabella_prezzi!$A$3:$K$303,8,FALSE))","v":""},{"$f":"IF(B75=\"\",\"\",VLOOKUP(L75,Tabella_prezzi!$A$3:$K$303,4,FALSE))","v":""},"",null,null,0,{"$f":"VLOOKUP(L75,Tabella_prezzi!A37:K338,6,FALSE)","v":0},"L4N45",0,0,0,0,null,null,null,null,null,null,null,null,null,null,{"$f":"ISODD(SUM($J$23:J75))","v":false}]
[null,"",{"$f":"IF(B76=\"\",\"\",VLOOKUP(L76,Tabella_prezzi!$A$3:$K$303,9,FALSE))","v":""},{"$f":"IF(B76=\"\",\"\",VLOOKUP(L76,Tabella_prezzi!$A$3:$K$303,6,FALSE))","v":""},{"$f":"IF(B76=\"\",\"\",VLOOKUP(L76,Tabella_prezzi!$A$3:$K$303,8,FALSE))","v":""},{"$f":"IF(B76=\"\",\"\",VLOOKUP(L76,Tabella_prezzi!$A$3:$K$303,4,FALSE))","v":""},"",null,null,0,{"$f":"VLOOKUP(L76,Tabella_prezzi!A38:K339,6,FALSE)","v":"TS3L4-57416"},"L4N46",0,0,0,0,null,null,null,null,null,null,null,null,null,null,{"$f":"ISODD(SUM($J$23:J76))","v":false}]
[null,"",{"$f":"IF(B77=\"\",\"\",VLOOKUP(L77,Tabella_prezzi!$A$3:$K$303,9,FALSE))","v":""},{"$f":"IF(B77=\"\",\"\",VLOOKUP(L77,Tabella_prezzi!$A$3:$K$303,6,FALSE))","v":""},{"$f":"IF(B77=\"\",\"\",VLOOKUP(L77,Tabella_prezzi!$A$3:$K$303,8,FALSE))","v":""},{"$f":"IF(B77=\"\",\"\",VLOOKUP(L77,Tabella_prezzi!$A$3:$K$303,4,FALSE))","v":""},"",null,null,0,{"$f":"VLOOKUP(L77,Tabella_prezzi!A39:K340,6,FALSE)","v":"TS3L4-SRV8CORE"},"L4N47",0,0,0,0,null,null,null,null,null,null,null,null,null,null,{"$f":"ISODD(SUM($J$23:J77))","v":false}]
[null,"",{"$f":"IF(B78=\"\",\"\",VLOOKUP(L78,Tabella_prezzi!$A$3:$K$303,9,FALSE))","v":""},{"$f":"IF(B78=\"\",\"\",VLOOKUP(L78,Tabella_prezzi!$A$3:$K$303,6,FALSE))","v":""},{"$f":"IF(B78=\"\",\"\",VLOOKUP(L78,Tabella_prezzi!$A$3:$K$303,8,FALSE))","v":""},{"$f":"IF(B78=\"\",\"\",VLOOKUP(L78,Tabella_prezzi!$A$3:$K$303,4,FALSE))","v":""},"",null,null,0,{"$f":"VLOOKUP(L78,Tabella_prezzi!A40:K341,6,FALSE)","v":"TS3L4-CPU8CORE"},"L4N48",0,0,0,0,null,null,null,null,null,null,null,null,null,null,{"$f":"ISODD(SUM($J$23:J78))","v":false}]
[null,"",{"$f":"IF(B79=\"\",\"\",VLOOKUP(L79,Tabella_prezzi!$A$3:$K$303,9,FALSE))","v":""},{"$f":"IF(B79=\"\",\"\",VLOOKUP(L79,Tabella_prezzi!$A$3:$K$303,6,FALSE))","v":""},{"$f":"IF(B79=\"\",\"\",VLOOKUP(L79,Tabella_prezzi!$A$3:$K$303,8,FALSE))","v":""},{"$f":"IF(B79=\"\",\"\",VLOOKUP(L79,Tabella_prezzi!$A$3:$K$303,4,FALSE))","v":""},"",null,null,0,{"$f":"VLOOKUP(L79,Tabella_prezzi!A41:K342,6,FALSE)","v":"TS3L4-PSU1100W"},"L4N49",0,0,0,0,null,null,null,null,null,null,null,null,null,null,{"$f":"ISODD(SUM($J$23:J79))","v":false}]
[null,"",{"$f":"IF(B80=\"\",\"\",VLOOKUP(L80,Tabella_prezzi!$A$3:$K$303,9,FALSE))","v":""},{"$f":"IF(B80=\"\",\"\",VLOOKUP(L80,Tabella_prezzi!$A$3:$K$303,6,FALSE))","v":""},{"$f":"IF(B80=\"\",\"\",VLOOKUP(L80,Tabella_prezzi!$A$3:$K$303,8,FALSE))","v":""},{"$f":"IF(B80=\"\",\"\",VLOOKUP(L80,Tabella_prezzi!$A$3:$K$303,4,FALSE))","v":""},"",null,null,0,{"$f":"VLOOKUP(L80,Tabella_prezzi!A42:K343,6,FALSE)","v":"TS3L4-PSU2000W"},"L4N50",0,0,0,0,null,null,null,null,null,null,null,null,null,null,{"$f":"ISODD(SUM($J$23:J80))","v":false}]
[null,"",{"$f":"IF(B81=\"\",\"\",VLOOKUP(L81,Tabella_prezzi!$A$3:$K$303,9,FALSE))","v":""},{"$f":"IF(B81=\"\",\"\",VLOOKUP(L81,Tabella_prezzi!$A$3:$K$303,6,FALSE))","v":""},{"$f":"IF(B81=\"\",\"\",VLOOKUP(L81,Tabella_prezzi!$A$3:$K$303,8,FALSE))","v":""},{"$f":"IF(B81=\"\",\"\",VLOOKUP(L81,Tabella_prezzi!$A$3:$K$303,4,FALSE))","v":""},"",null,null,0,{"$f":"VLOOKUP(L81,Tabella_prezzi!A43:K344,6,FALSE)","v":"TS3L4-RI3840GB"},"L4N51",{"$f":"COUNTIF(TS3L4_L4N_1,L81)*$M$22*Q81","v":0},{"$f":"COUNTIF(TS3L4_L4N_2,L81)*$N$22*R81","v":0},{"$f":"COUNTIF(TS3L4_L4N_3,L81)*$O$22*S81","v":0},0,{"$f":"Lotto4_R740XD_1!$F$45","v":0},{"$f":"Lotto4_R740XD_2!$F$45","v":0},{"$f":"Lotto4_R740XD_3!$F$45","v":0},null,null,null,null,null,null,null,{"$f":"ISODD(SUM($J$23:J81))","v":false}]
[null,"",{"$f":"IF(B82=\"\",\"\",VLOOKUP(L82,Tabella_prezzi!$A$3:$K$303,9,FALSE))","v":""},{"$f":"IF(B82=\"\",\"\",VLOOKUP(L82,Tabella_prezzi!$A$3:$K$303,6,FALSE))","v":""},{"$f":"IF(B82=\"\",\"\",VLOOKUP(L82,Tabella_prezzi!$A$3:$K$303,8,FALSE))","v":""},{"$f":"IF(B82=\"\",\"\",VLOOKUP(L82,Tabella_prezzi!$A$3:$K$303,4,FALSE))","v":""},"",null,null,0,{"$f":"VLOOKUP(L82,Tabella_prezzi!A44:K345,6,FALSE)","v":"TS3L4-RI7680GB"},"L4N52",{"$f":"COUNTIF(TS3L4_L4N_1,L82)*$M$22*Q82","v":0},{"$f":"COUNTIF(TS3L4_L4N_2,L82)*$N$22*R82","v":0},{"$f":"COUNTIF(TS3L4_L4N_3,L82)*$O$22*S82","v":0},0,{"$f":"Lotto4_R740XD_1!$F$47","v":0},{"$f":"Lotto4_R740XD_2!$F$47","v":0},{"$f":"Lotto4_R740XD_3!$F$47","v":0},null,null,null,null,null,null,null,{"$f":"ISODD(SUM($J$23:J82))","v":false}]
[null,"",{"$f":"IF(B83=\"\",\"\",VLOOKUP(L83,Tabella_prezzi!$A$3:$K$303,9,FALSE))","v":""},{"$f":"IF(B83=\"\",\"\",VLOOKUP(L83,Tabella_prezzi!$A$3:$K$303,6,FALSE))","v":""},{"$f":"IF(B83=\"\",\"\",VLOOKUP(L83,Tabella_prezzi!$A$3:$K$303,8,FALSE))","v":""},{"$f":"IF(B83=\"\",\"\",VLOOKUP(L83,Tabella_prezzi!$A$3:$K$303,4,FALSE))","v":""},"",null,null,0,{"$f":"VLOOKUP(L83,Tabella_prezzi!A45:K346,6,FALSE)","v":"TS3L4-WI800GB"},"L4N53",{"$f":"COUNTIF(TS3L4_L4N_1,L83)*$M$22*Q83","v":0},{"$f":"COUNTIF(TS3L4_L4N_2,L83)*$N$22*R83","v":0},{"$f":"COUNTIF(TS3L4_L4N_3,L83)*$O$22*S83","v":0},0,{"$f":"Lotto4_R740XD_1!$F$53","v":0},{"$f":"Lotto4_R740XD_2!$F$53","v":0},{"$f":"Lotto4_R740XD_3!$F$53","v":0},null,null,null,null,null,null,null,{"$f":"ISODD(SUM($J$23:J83))","v":false}]
[null,"",{"$f":"IF(B84=\"\",\"\",VLOOKUP(L84,Tabella_prezzi!$A$3:$K$303,9,FALSE))","v":""},{"$f":"IF(B84=\"\",\"\",VLOOKUP(L84,Tabella_prezzi!$A$3:$K$303,6,FALSE))","v":""},{"$f":"IF(B84=\"\",\"\",VLOOKUP(L84,Tabella_prezzi!$A$3:$K$303,8,FALSE))","v":""},{"$f":"IF(B84=\"\",\"\",VLOOKUP(L84,Tabella_prezzi!$A$3:$K$303,4,FALSE))","v":""},"",null,null,0,{"$f":"VLOOKUP(L84,Tabella_prezzi!A46:K347,6,FALSE)","v":"TS3L4-WI1600GB"},"L4N54",{"$f":"COUNTIF(TS3L4_L4N_1,L84)*$M$22*Q84","v":0},{"$f":"COUNTIF(TS3L4_L4N_2,L84)*$N$22*R84","v":0},{"$f":"COUNTIF(TS3L4_L4N_3,L84)*$O$22*S84","v":0},0,{"$f":"Lotto4_R740XD_1!$F$55","v":0},{"$f":"Lotto4_R740XD_2!$F$55","v":0},{"$f":"Lotto4_R740XD_3!$F$55","v":0},null,null,null,null,null,null,null,{"$f":"ISODD(SUM($J$23:J84))","v":false}]
[null,"",{"$f":"IF(B85=\"\",\"\",VLOOKUP(L85,Tabella_prezzi!$A$3:$K$303,9,FALSE))","v":""},{"$f":"IF(B85=\"\",\"\",VLOOKUP(L85,Tabella_prezzi!$A$3:$K$303,6,FALSE))","v":""},{"$f":"IF(B85=\"\",\"\",VLOOKUP(L85,Tabella_prezzi!$A$3:$K$303,8,FALSE))","v":""},{"$f":"IF(B85=\"\",\"\",VLOOKUP(L85,Tabella_prezzi!$A$3:$K$303,4,FALSE))","v":""},"",null,null,0,{"$f":"VLOOKUP(L85,Tabella_prezzi!A47:K348,6,FALSE)","v":"TS3L4-TESLAT4"},"L4N55",{"$f":"COUNTIF(TS3L4_L4N_1,L85)*$M$22","v":0},{"$f":"COUNTIF(TS3L4_L4N_2,L85)*$N$22","v":0},{"$f":"COUNTIF(TS3L4_L4N_3,L85)*$O$22","v":0},0,null,null,null,null,null,null,null,null,null,null,{"$f":"ISODD(SUM($J$23:J85))","v":false}]
[null,"",{"$f":"IF(B86=\"\",\"\",VLOOKUP(L86,Tabella_prezzi!$A$3:$K$303,9,FALSE))","v":""},{"$f":"IF(B86=\"\",\"\",VLOOKUP(L86,Tabella_prezzi!$A$3:$K$303,6,FALSE))","v":""},{"$f":"IF(B86=\"\",\"\",VLOOKUP(L86,Tabella_prezzi!$A$3:$K$303,8,FALSE))","v":""},{"$f":"IF(B86=\"\",\"\",VLOOKUP(L86,Tabella_prezzi!$A$3:$K$303,4,FALSE))","v":""},"",null,null,0,{"$f":"VLOOKUP(L86,Tabella_prezzi!A48:K349,6,FALSE)","v":"TS3L4-RTX6000"},"L4N56",{"$f":"COUNTIF(TS3L4_L4N_1,L86)*$M$22","v":0},{"$f":"COUNTIF(TS3L4_L4N_2,L86)*$N$22","v":0},{"$f":"COUNTIF(TS3L4_L4N_3,L86)*$O$22","v":0},0,null,null,null,null,null,null,null,null,null,null,{"$f":"ISODD(SUM($J$23:J86))","v":false}]
[null,"",{"$f":"IF(B87=\"\",\"\",VLOOKUP(L87,Tabella_prezzi!$A$3:$K$303,9,FALSE))","v":""},{"$f":"IF(B87=\"\",\"\",VLOOKUP(L87,Tabella_prezzi!$A$3:$K$303,6,FALSE))","v":""},{"$f":"IF(B87=\"\",\"\",VLOOKUP(L87,Tabella_prezzi!$A$3:$K$303,8,FALSE))","v":""},{"$f":"IF(B87=\"\",\"\",VLOOKUP(L87,Tabella_prezzi!$A$3:$K$303,4,FALSE))","v":""},"",null,null,0,{"$f":"VLOOKUP(L87,Tabella_prezzi!A49:K350,6,FALSE)","v":"TS3L4-TESLAM10"},"L4N57",{"$f":"COUNTIF(TS3L4_L4N_1,L87)*$M$22","v":0},{"$f":"COUNTIF(TS3L4_L4N_2,L87)*$N$22","v":0},{"$f":"COUNTIF(TS3L4_L4N_3,L87)*$O$22","v":0},0,null,null,null,null,null,null,null,null,null,null,{"$f":"ISODD(SUM($J$23:J87))","v":false}]
[null,"",{"$f":"IF(B88=\"\",\"\",VLOOKUP(L88,Tabella_prezzi!$A$3:$K$303,9,FALSE))","v":""},{"$f":"IF(B88=\"\",\"\",VLOOKUP(L88,Tabella_prezzi!$A$3:$K$303,6,FALSE))","v":""},{"$f":"IF(B88=\"\",\"\",VLOOKUP(L88,Tabella_prezzi!$A$3:$K$303,8,FALSE))","v":""},{"$f":"IF(B88=\"\",\"\",VLOOKUP(L88,Tabella_prezzi!$A$3:$K$303,4,FALSE))","v":""},"",null,null,0,{"$f":"VLOOKUP(L88,Tabella_prezzi!A50:K351,6,FALSE)","v":"TS3L4-V100S32G"},"L4N58",{"$f":"COUNTIF(TS3L4_L4N_1,L88)*$M$22","v":0},{"$f":"COUNTIF(TS3L4_L4N_2,L88)*$N$22","v":0},{"$f":"COUNTIF(TS3L4_L4N_3,L88)*$O$22","v":0},{"$f":"SUM(M88:O88)","v":0},null,null,null,null,null,null,null,null,null,null,{"$f":"ISODD(SUM($J$23:J88))","v":false}]
[null,"",{"$f":"IF(B89=\"\",\"\",VLOOKUP(L89,Tabella_prezzi!$A$3:$K$303,9,FALSE))","v":""},{"$f":"IF(B89=\"\",\"\",VLOOKUP(L89,Tabella_prezzi!$A$3:$K$303,6,FALSE))","v":""},{"$f":"IF(B89=\"\",\"\",VLOOKUP(L89,Tabella_prezzi!$A$3:$K$303,8,FALSE))","v":""},{"$f":"IF(B89=\"\",\"\",VLOOKUP(L89,Tabella_prezzi!$A$3:$K$303,4,FALSE))","v":""},"",null,null,{"$f":"IF(B89=\"\",0,1)","v":0},{"$f":"VLOOKUP(L89,Tabella_prezzi!A51:K352,6,FALSE)","v":"TS3L4-WINDC"},"L4N59",{"$f":"COUNTIF(TS3L4_L4N_1,L89)*$M$22","v":0},{"$f":"COUNTIF(TS3L4_L4N_2,L89)*$N$22","v":0},{"$f":"COUNTIF(TS3L4_L4N_3,L89)*$O$22","v":0},0,null,null,null,null,null,null,null,null,null,null,{"$f":"ISODD(SUM($J$23:J89))","v":false}]
[null,"",{"$f":"IF(B90=\"\",\"\",VLOOKUP(L90,Tabella_prezzi!$A$3:$K$303,9,FALSE))","v":""},{"$f":"IF(B90=\"\",\"\",VLOOKUP(L90,Tabella_prezzi!$A$3:$K$303,6,FALSE))","v":""},{"$f":"IF(B90=\"\",\"\",VLOOKUP(L90,Tabella_prezzi!$A$3:$K$303,8,FALSE))","v":""},{"$f":"IF(B90=\"\",\"\",VLOOKUP(L90,Tabella_prezzi!$A$3:$K$303,4,FALSE))","v":""},"",null,null,0,{"$f":"VLOOKUP(L90,Tabella_prezzi!A52:K353,6,FALSE)","v":"TS3L4-WINDC2C"},"L4N60",{"$f":"COUNTIF(TS3L4_L4N_1,L90)*$M$22*Q90","v":0},{"$f":"COUNTIF(TS3L4_L4N_2,L90)*$N$22*R90","v":0},{"$f":"COUNTIF(TS3L4_L4N_3,L90)*$O$22*S90","v":0},0,{"$f":"Lotto4_R740XD_1!$F$28","v":0},{"$f":"Lotto4_R740XD_2!$F$28","v":0},{"$f":"Lotto4_R740XD_3!$F$28","v":0},null,null,null,null,null,null,null,{"$f":"ISODD(SUM($J$23:J90))","v":false}]
[null,"",{"$f":"IF(B91=\"\",\"\",VLOOKUP(L91,Tabella_prezzi!$A$3:$K$303,9,FALSE))","v":""},{"$f":"IF(B91=\"\",\"\",VLOOKUP(L91,Tabella_prezzi!$A$3:$K$303,6,FALSE))","v":""},{"$f":"IF(B91=\"\",\"\",VLOOKUP(L91,Tabella_prezzi!$A$3:$K$303,8,FALSE))","v":""},{"$f":"IF(B91=\"\",\"\",VLOOKUP(L91,Tabella_prezzi!$A$3:$K$303,4,FALSE))","v":""},"",null,null,0,{"$f":"VLOOKUP(L91,Tabella_prezzi!A53:K354,6,FALSE)","v":"TS3L4-WINDC16C"},"L4N61",{"$f":"COUNTIF(TS3L4_L4N_1,L91)*$M$22","v":0},{"$f":"COUNTIF(TS3L4_L4N_2,L91)*$N$22","v":0},{"$f":"COUNTIF(TS3L4_L4N_3,L91)*$O$22","v":0},0,null,null,null,null,null,null,null,null,null,null,{"$f":"ISODD(SUM($J$23:J91))","v":false}]
[null,"",{"$f":"IF(B92=\"\",\"\",VLOOKUP(L92,Tabella_prezzi!$A$3:$K$303,9,FALSE))","v":""},{"$f":"IF(B92=\"\",\"\",VLOOKUP(L92,Tabella_prezzi!$A$3:$K$303,6,FALSE))","v":""},{"$f":"IF(B92=\"\",\"\",VLOOKUP(L92,Tabella_prezzi!$A$3:$K$303,8,FALSE))","v":""},{"$f":"IF(B92=\"\",\"\",VLOOKUP(L92,Tabella_prezzi!$A$3:$K$303,4,FALSE))","v":""},"",null,null,{"$f":"IF(B92=\"\",0,1)","v":0},{"$f":"VLOOKUP(L92,Tabella_prezzi!A57:K358,6,FALSE)","v":"TS3L4-OT10GB"},"L4N109",{"$f":"COUNTIF(TS3L4_L4N_1,L92)*$M$22*Q92","v":0},{"$f":"COUNTIF(TS3L4_L4N_2,L92)*$N$22*R92","v":0},{"$f":"COUNTIF(TS3L4_L4N_3,L92)*$O$22*S92","v":0},{"$f":"SUM(M92:O92)","v":0},{"$f":"Lotto4_R740XD_1!$F$101","v":0},{"$f":"Lotto4_R740XD_2!$F$101","v":0},{"$f":"Lotto4_R740XD_3!$F$101","v":0},null,null,null,null,null,null,null,{"$f":"ISODD(SUM($J$23:J92))","v":false}]
[null,"",{"$f":"IF(B93=\"\",\"\",VLOOKUP(L93,Tabella_prezzi!$A$3:$K$303,9,FALSE))","v":""},{"$f":"IF(B93=\"\",\"\",VLOOKUP(L93,Tabella_prezzi!$A$3:$K$303,6,FALSE))","v":""},{"$f":"IF(B93=\"\",\"\",VLOOKUP(L93,Tabella_prezzi!$A$3:$K$303,8,FALSE))","v":""},{"$f":"IF(B93=\"\",\"\",VLOOKUP(L93,Tabella_prezzi!$A$3:$K$303,4,FALSE))","v":""},"",null,null,0,{"$f":"VLOOKUP(L93,Tabella_prezzi!A54:K355,6,FALSE)","v":"TS3L4-RJ453M"},"L4N62",{"$f":"COUNTIF(TS3L4_L4N_1,L93)*$M$22*Q93","v":0},{"$f":"COUNTIF(TS3L4_L4N_2,L93)*$N$22*R93","v":0},{"$f":"COUNTIF(TS3L4_L4N_3,L93)*$O$22*S93","v":0},0,{"$f":"Lotto4_R740XD_1!$F$115","v":5},{"$f":"Lotto4_R740XD_2!$F$115","v":5},{"$f":"Lotto4_R740XD_3!$F$115","v":5},null,null,null,null,null,null,null,{"$f":"ISODD(SUM($J$23:J93))","v":false}]
[null,"",{"$f":"IF(B94=\"\",\"\",VLOOKUP(L94,Tabella_prezzi!$A$3:$K$303,9,FALSE))","v":""},{"$f":"IF(B94=\"\",\"\",VLOOKUP(L94,Tabella_prezzi!$A$3:$K$303,6,FALSE))","v":""},{"$f":"IF(B94=\"\",\"\",VLOOKUP(L94,Tabella_prezzi!$A$3:$K$303,8,FALSE))","v":""},{"$f":"IF(B94=\"\",\"\",VLOOKUP(L94,Tabella_prezzi!$A$3:$K$303,4,FALSE))","v":""},"",null,null,0,{"$f":"VLOOKUP(L94,Tabella_prezzi!A55:K356,6,FALSE)","v":"TS3L4-MEL100M3"},"L4N63",0,0,0,0,{"$f":"Lotto4_R740XD_1!$F$110","v":0},{"$f":"Lotto4_R740XD_2!$F$110","v":0},{"$f":"Lotto4_R740XD_3!$F$110","v":0},null,null,null,null,null,null,null,{"$f":"ISODD(SUM($J$23:J94))","v":false}]
[null,"",{"$f":"IF(B95=\"\",\"\",VLOOKUP(L95,Tabella_prezzi!$A$3:$K$303,9,FALSE))","v":""},{"$f":"IF(B95=\"\",\"\",VLOOKUP(L95,Tabella_prezzi!$A$3:$K$303,6,FALSE))","v":""},{"$f":"IF(B95=\"\",\"\",VLOOKUP(L95,Tabella_prezzi!$A$3:$K$303,8,FALSE))","v":""},{"$f":"IF(B95=\"\",\"\",VLOOKUP(L95,Tabella_prezzi!$A$3:$K$303,4,FALSE))","v":""},"",null,null,0,{"$f":"VLOOKUP(L95,Tabella_prezzi!A56:K357,6,FALSE)","v":"TS3L4-MEL100M10"},"L4N64",0,0,0,0,{"$f":"Lotto4_R740XD_1!$F$112","v":0},{"$f":"Lotto4_R740XD_2!$F$112","v":0},{"$f":"Lotto4_R740XD_3!$F$112","v":0},null,null,null,null,null,null,null,{"$f":"ISODD(SUM($J$23:J95))","v":false}]
[null,"",{"$f":"IF(B96=\"\",\"\",VLOOKUP(L96,Tabella_prezzi!$A$3:$K$303,9,FALSE))","v":""},{"$f":"IF(B96=\"\",\"\",VLOOKUP(L96,Tabella_prezzi!$A$3:$K$303,6,FALSE))","v":""},{"$f":"IF(B96=\"\",\"\",VLOOKUP(L96,Tabella_prezzi!$A$3:$K$303,8,FALSE))","v":""},{"$f":"IF(B96=\"\",\"\",VLOOKUP(L96,Tabella_prezzi!$A$3:$K$303,4,FALSE))","v":""},"",null,null,0,{"$f":"VLOOKUP(L96,Tabella_prezzi!A57:K358,6,FALSE)","v":"TS3L4-QSFP28"},"L4N65",0,0,0,0,{"$f":"Lotto4_R740XD_1!$F$107","v":0},{"$f":"Lotto4_R740XD_2!$F$107","v":0},{"$f":"Lotto4_R740XD_3!$F$107","v":0},null,null,null,null,null,null,null,{"$f":"ISODD(SUM($J$23:J96))","v":false}]
[null,"",{"$f":"IF(B97=\"\",\"\",VLOOKUP(L97,Tabella_prezzi!$A$3:$K$303,9,FALSE))","v":""},{"$f":"IF(B97=\"\",\"\",VLOOKUP(L97,Tabella_prezzi!$A$3:$K$303,6,FALSE))","v":""},{"$f":"IF(B97=\"\",\"\",VLOOKUP(L97,Tabella_prezzi!$A$3:$K$303,8,FALSE))","v":""},{"$f":"IF(B97=\"\",\"\",VLOOKUP(L97,Tabella_prezzi!$A$3:$K$303,4,FALSE))","v":""},"",null,null,0,{"$f":"VLOOKUP(L97,Tabella_prezzi!A58:K359,6,FALSE)","v":"TS3L4-10GBIC"},"L4N66",0,0,0,0,{"$f":"Lotto4_R740XD_1!$F$101","v":0},{"$f":"Lotto4_R740XD_2!$F$101","v":0},{"$f":"Lotto4_R740XD_3!$F$101","v":0},null,null,null,null,null,null,null,{"$f":"ISODD(SUM($J$23:J97))","v":false}]
[null,"",{"$f":"IF(B98=\"\",\"\",VLOOKUP(L98,Tabella_prezzi!$A$3:$K$303,9,FALSE))","v":""},{"$f":"IF(B98=\"\",\"\",VLOOKUP(L98,Tabella_prezzi!$A$3:$K$303,6,FALSE))","v":""},{"$f":"IF(B98=\"\",\"\",VLOOKUP(L98,Tabella_prezzi!$A$3:$K$303,8,FALSE))","v":""},{"$f":"IF(B98=\"\",\"\",VLOOKUP(L98,Tabella_prezzi!$A$3:$K$303,4,FALSE))","v":""},"",null,null,0,{"$f":"VLOOKUP(L98,Tabella_prezzi!A59:K360,6,FALSE)","v":"TS3L4-DAC3M"},"L4N67",0,0,0,0,{"$f":"Lotto4_R740XD_1!$F$104","v":0},{"$f":"Lotto4_R740XD_2!$F$104","v":0},{"$f":"Lotto4_R740XD_3!$F$104","v":0},null,null,null,null,null,null,null,{"$f":"ISODD(SUM($J$23:J98))","v":false}]
[null,"",{"$f":"IF(B99=\"\",\"\",VLOOKUP(L99,Tabella_prezzi!$A$3:$K$303,9,FALSE))","v":""},{"$f":"IF(B99=\"\",\"\",VLOOKUP(L99,Tabella_prezzi!$A$3:$K$303,6,FALSE))","v":""},{"$f":"IF(B99=\"\",\"\",VLOOKUP(L99,Tabella_prezzi!$A$3:$K$303,8,FALSE))","v":""},{"$f":"IF(B99=\"\",\"\",VLOOKUP(L99,Tabella_prezzi!$A$3:$K$303,4,FALSE))","v":""},"",null,null,0,{"$f":"VLOOKUP(L99,Tabella_prezzi!A60:K361,6,FALSE)","v":"TS3L4-BZLLCD"},"L4N68",{"$f":"COUNTIF(TS3L4_L4N_1,L99)*$M$22","v":0},{"$f":"COUNTIF(TS3L4_L4N_2,L99)*$N$22","v":0},{"$f":"COUNTIF(TS3L4_L4N_3,L99)*$O$22","v":0},0,null,null,null,null,null,null,null,null,null,null,{"$f":"ISODD(SUM($J$23:J99))","v":false}]
[null,"",{"$f":"IF(B100=\"\",\"\",VLOOKUP(L100,Tabella_prezzi!$A$3:$K$303,9,FALSE))","v":""},{"$f":"IF(B100=\"\",\"\",VLOOKUP(L100,Tabella_prezzi!$A$3:$K$303,6,FALSE))","v":""},{"$f":"IF(B100=\"\",\"\",VLOOKUP(L100,Tabella_prezzi!$A$3:$K$303,8,FALSE))","v":""},{"$f":"IF(B100=\"\",\"\",VLOOKUP(L100,Tabella_prezzi!$A$3:$K$303,4,FALSE))","v":""},"",null,null,0,{"$f":"VLOOKUP(L100,Tabella_prezzi!A61:K362,6,FALSE)","v":"TS3L4-BZLSTD"},"L4N69",0,0,0,0,null,null,null,null,null,null,null,null,null,null,{"$f":"ISODD(SUM($J$23:J100))","v":false}]
[null,"",{"$f":"IF(B101=\"\",\"\",VLOOKUP(L101,Tabella_prezzi!$A$3:$K$303,9,FALSE))","v":""},{"$f":"IF(B101=\"\",\"\",VLOOKUP(L101,Tabella_prezzi!$A$3:$K$303,6,FALSE))","v":""},{"$f":"IF(B101=\"\",\"\",VLOOKUP(L101,Tabella_prezzi!$A$3:$K$303,8,FALSE))","v":""},{"$f":"IF(B101=\"\",\"\",VLOOKUP(L101,Tabella_prezzi!$A$3:$K$303,4,FALSE))","v":""},"",null,null,0,{"$f":"VLOOKUP(L101,Tabella_prezzi!A62:K363,6,FALSE)","v":"TS3L4-ISDM32GB"},"L4N70",0,0,0,0,null,null,null,null,null,null,null,null,null,null,{"$f":"ISODD(SUM($J$23:J101))","v":false}]
[null,"",{"$f":"IF(B102=\"\",\"\",VLOOKUP(L102,Tabella_prezzi!$A$3:$K$303,9,FALSE))","v":""},{"$f":"IF(B102=\"\",\"\",VLOOKUP(L102,Tabella_prezzi!$A$3:$K$303,6,FALSE))","v":""},{"$f":"IF(B102=\"\",\"\",VLOOKUP(L102,Tabella_prezzi!$A$3:$K$303,8,FALSE))","v":""},{"$f":"IF(B102=\"\",\"\",VLOOKUP(L102,Tabella_prezzi!$A$3:$K$303,4,FALSE))","v":""},"",null,null,0,{"$f":"VLOOKUP(L102,Tabella_prezzi!A63:K364,6,FALSE)","v":"TS3L4-H840"},"L4N71",0,0,0,{"$f":"SUM(M102:O102)","v":0},null,null,null,null,null,null,null,null,null,null,{"$f":"ISODD(SUM($J$23:J102))","v":false}]
[null,"",{"$f":"IF(B103=\"\",\"\",VLOOKUP(L103,Tabella_prezzi!$A$3:$K$303,9,FALSE))","v":""},{"$f":"IF(B103=\"\",\"\",VLOOKUP(L103,Tabella_prezzi!$A$3:$K$303,6,FALSE))","v":""},{"$f":"IF(B103=\"\",\"\",VLOOKUP(L103,Tabella_prezzi!$A$3:$K$303,8,FALSE))","v":""},{"$f":"IF(B103=\"\",\"\",VLOOKUP(L103,Tabella_prezzi!$A$3:$K$303,4,FALSE))","v":""},"",null,null,0,{"$f":"VLOOKUP(L103,Tabella_prezzi!A64:K365,6,FALSE)","v":"TS3L4-VS7STD6AK"},"L4N72",null,null,null,{"$f":"Altre_Opzioni!F20","v":0},null,null,null,null,null,null,null,null,null,null,{"$f":"ISODD(SUM($J$23:J103))","v":false}]
[null,"",{"$f":"IF(B104=\"\",\"\",VLOOKUP(L104,Tabella_prezzi!$A$3:$K$303,9,FALSE))","v":""},{"$f":"IF(B104=\"\",\"\",VLOOKUP(L104,Tabella_prezzi!$A$3:$K$303,6,FALSE))","v":""},{"$f":"IF(B104=\"\",\"\",VLOOKUP(L104,Tabella_prezzi!$A$3:$K$303,8,FALSE))","v":""},{"$f":"IF(B104=\"\",\"\",VLOOKUP(L104,Tabella_prezzi!$A$3:$K$303,4,FALSE))","v":""},"",null,null,0,{"$f":"VLOOKUP(L104,Tabella_prezzi!A65:K366,6,FALSE)","v":"TS3L4-VS7STD"},"L4N73",null,null,null,{"$f":"Altre_Opzioni!F21","v":0},null,null,null,null,null,null,null,null,null,null,{"$f":"ISODD(SUM($J$23:J104))","v":false}]
[null,"",{"$f":"IF(B105=\"\",\"\",VLOOKUP(L105,Tabella_prezzi!$A$3:$K$303,9,FALSE))","v":""},{"$f":"IF(B105=\"\",\"\",VLOOKUP(L105,Tabella_prezzi!$A$3:$K$303,6,FALSE))","v":""},{"$f":"IF(B105=\"\",\"\",VLOOKUP(L105,Tabella_prezzi!$A$3:$K$303,8,FALSE))","v":""},{"$f":"IF(B105=\"\",\"\",VLOOKUP(L105,Tabella_prezzi!$A$3:$K$303,4,FALSE))","v":""},"",null,null,0,{"$f":"VLOOKUP(L105,Tabella_prezzi!A66:K367,6,FALSE)","v":"TS3L4-VS7EPL6AK"},"L4N74",null,null,null,{"$f":"Altre_Opzioni!F22","v":0},null,null,null,null,null,null,null,null,null,null,{"$f":"ISODD(SUM($J$23:J105))","v":false}]
[null,"",{"$f":"IF(B106=\"\",\"\",VLOOKUP(L106,Tabella_prezzi!$A$3:$K$303,9,FALSE))","v":""},{"$f":"IF(B106=\"\",\"\",VLOOKUP(L106,Tabella_prezzi!$A$3:$K$303,6,FALSE))","v":""},{"$f":"IF(B106=\"\",\"\",VLOOKUP(L106,Tabella_prezzi!$A$3:$K$303,8,FALSE))","v":""},{"$f":"IF(B106=\"\",\"\",VLOOKUP(L106,Tabella_prezzi!$A$3:$K$303,4,FALSE))","v":""},"",null,null,0,{"$f":"VLOOKUP(L106,Tabella_prezzi!A67:K368,6,FALSE)","v":"TS3L4-VS7EPL"},"L4N80",null,null,null,{"$f":"Altre_Opzioni!F23","v":0},null,null,null,null,null,null,null,null,null,null,{"$f":"ISODD(SUM($J$23:J106))","v":false}]
[null,"",{"$f":"IF(B107=\"\",\"\",VLOOKUP(L107,Tabella_prezzi!$A$3:$K$303,9,FALSE))","v":""},{"$f":"IF(B107=\"\",\"\",VLOOKUP(L107,Tabella_prezzi!$A$3:$K$303,6,FALSE))","v":""},{"$f":"IF(B107=\"\",\"\",VLOOKUP(L107,Tabella_prezzi!$A$3:$K$303,8,FALSE))","v":""},{"$f":"IF(B107=\"\",\"\",VLOOKUP(L107,Tabella_prezzi!$A$3:$K$303,4,FALSE))","v":""},"",null,null,0,{"$f":"VLOOKUP(L107,Tabella_prezzi!A68:K369,6,FALSE)","v":"TS3L4-VCS7STD"},"L4N81",null,null,null,{"$f":"Altre_Opzioni!F24","v":0},null,null,null,null,null,null,null,null,null,null,{"$f":"ISODD(SUM($J$23:J107))","v":false}]
[null,"",{"$f":"IF(B108=\"\",\"\",VLOOKUP(L108,Tabella_prezzi!$A$3:$K$303,9,FALSE))","v":""},{"$f":"IF(B108=\"\",\"\",VLOOKUP(L108,Tabella_prezzi!$A$3:$K$303,6,FALSE))","v":""},{"$f":"IF(B108=\"\",\"\",VLOOKUP(L108,Tabella_prezzi!$A$3:$K$303,8,FALSE))","v":""},{"$f":"IF(B108=\"\",\"\",VLOOKUP(L108,Tabella_prezzi!$A$3:$K$303,4,FALSE))","v":""},"",null,null,0,{"$f":"VLOOKUP(L108,Tabella_prezzi!A69:K370,6,FALSE)","v":"TS3L4-ST7ENT"},"L4N82",null,null,null,{"$f":"Altre_Opzioni!F25","v":0},null,null,null,null,null,null,null,null,null,null,{"$f":"ISODD(SUM($J$23:J108))","v":false}]
[null,"",{"$f":"IF(B109=\"\",\"\",VLOOKUP(L109,Tabella_prezzi!$A$3:$K$303,9,FALSE))","v":""},{"$f":"IF(B109=\"\",\"\",VLOOKUP(L109,Tabella_prezzi!$A$3:$K$303,6,FALSE))","v":""},{"$f":"IF(B109=\"\",\"\",VLOOKUP(L109,Tabella_prezzi!$A$3:$K$303,8,FALSE))","v":""},{"$f":"IF(B109=\"\",\"\",VLOOKUP(L109,Tabella_prezzi!$A$3:$K$303,4,FALSE))","v":""},"",null,null,0,{"$f":"VLOOKUP(L109,Tabella_prezzi!A70:K371,6,FALSE)","v":"TS3L4-HZ8ADC10"},"L4N83",null,null,null,{"$f":"Altre_Opzioni!F26","v":0},null,null,null,null,null,null,null,null,null,null,{"$f":"ISODD(SUM($J$23:J109))","v":false}]
[null,"",{"$f":"IF(B110=\"\",\"\",VLOOKUP(L110,Tabella_prezzi!$A$3:$K$303,9,FALSE))","v":""},{"$f":"IF(B110=\"\",\"\",VLOOKUP(L110,Tabella_prezzi!$A$3:$K$303,6,FALSE))","v":""},{"$f":"IF(B110=\"\",\"\",VLOOKUP(L110,Tabella_prezzi!$A$3:$K$303,8,FALSE))","v":""},{"$f":"IF(B110=\"\",\"\",VLOOKUP(L110,Tabella_prezzi!$A$3:$K$303,4,FALSE))","v":""},"",null,null,0,{"$f":"VLOOKUP(L110,Tabella_prezzi!A71:K372,6,FALSE)","v":"TS3L4-HZ8ENC10"},"L4N84",null,null,null,{"$f":"Altre_Opzioni!F27","v":0},null,null,null,null,null,null,null,null,null,null,{"$f":"ISODD(SUM($J$23:J110))","v":false}]
[null,"",{"$f":"IF(B111=\"\",\"\",VLOOKUP(L111,Tabella_prezzi!$A$3:$K$303,9,FALSE))","v":""},{"$f":"IF(B111=\"\",\"\",VLOOKUP(L111,Tabella_prezzi!$A$3:$K$303,6,FALSE))","v":""},{"$f":"IF(B111=\"\",\"\",VLOOKUP(L111,Tabella_prezzi!$A$3:$K$303,8,FALSE))","v":""},{"$f":"IF(B111=\"\",\"\",VLOOKUP(L111,Tabella_prezzi!$A$3:$K$303,4,FALSE))","v":""},"",null,null,0,{"$f":"VLOOKUP(L111,Tabella_prezzi!A72:K373,6,FALSE)","v":"TS3L4-HZ8ADN10"},"L4N85",null,null,null,{"$f":"Altre_Opzioni!F28","v":0},null,null,null,null,null,null,null,null,null,null,{"$f":"ISODD(SUM($J$23:J111))","v":false}]
[null,"",{"$f":"IF(B112=\"\",\"\",VLOOKUP(L112,Tabella_prezzi!$A$3:$K$303,9,FALSE))","v":""},{"$f":"IF(B112=\"\",\"\",VLOOKUP(L112,Tabella_prezzi!$A$3:$K$303,6,FALSE))","v":""},{"$f":"IF(B112=\"\",\"\",VLOOKUP(L112,Tabella_prezzi!$A$3:$K$303,8,FALSE))","v":""},{"$f":"IF(B112=\"\",\"\",VLOOKUP(L112,Tabella_prezzi!$A$3:$K$303,4,FALSE))","v":""},"",null,null,0,{"$f":"VLOOKUP(L112,Tabella_prezzi!A73:K374,6,FALSE)","v":"TS3L4-HZ8ENN10"},"L4N86",null,null,null,{"$f":"Altre_Opzioni!F29","v":0},null,null,null,null,null,null,null,null,null,null,{"$f":"ISODD(SUM($J$23:J112))","v":false}]
[null,{"$f":"IF(P113>0,P113,\"\")","v":""},{"$f":"IF(B113=\"\",\"\",VLOOKUP(L113,Tabella_prezzi!$A$3:$K$303,9,FALSE))","v":""},{"$f":"IF(B113=\"\",\"\",VLOOKUP(L113,Tabella_prezzi!$A$3:$K$303,6,FALSE))","v":""},{"$f":"IF(B113=\"\",\"\",VLOOKUP(L113,Tabella_prezzi!$A$3:$K$303,8,FALSE))","v":""},{"$f":"IF(B113=\"\",\"\",VLOOKUP(L113,Tabella_prezzi!$A$3:$K$303,4,FALSE))","v":""},"",null,null,0,{"$f":"VLOOKUP(L113,Tabella_prezzi!A74:K375,6,FALSE)","v":"TS3L4-Encl13Y4H"},"L4N87",null,null,null,{"$f":"Altre_Opzioni!F33","v":0},null,null,null,null,null,null,null,null,null,null,{"$f":"ISODD(SUM($J$23:J113))","v":false}]
[null,{"$f":"IF(P114>0,P114,\"\")","v":""},{"$f":"IF(B114=\"\",\"\",VLOOKUP(L114,Tabella_prezzi!$A$3:$K$303,9,FALSE))","v":""},{"$f":"IF(B114=\"\",\"\",VLOOKUP(L114,Tabella_prezzi!$A$3:$K$303,6,FALSE))","v":""},{"$f":"IF(B114=\"\",\"\",VLOOKUP(L114,Tabella_prezzi!$A$3:$K$303,8,FALSE))","v":""},{"$f":"IF(B114=\"\",\"\",VLOOKUP(L114,Tabella_prezzi!$A$3:$K$303,4,FALSE))","v":""},"",null,null,0,{"$f":"VLOOKUP(L114,Tabella_prezzi!A75:K376,6,FALSE)","v":"TS3L4-Encl25Y4H"},"L4N88",null,null,null,{"$f":"Altre_Opzioni!F34","v":0},null,null,null,null,null,null,null,null,null,null,{"$f":"ISODD(SUM($J$23:J114))","v":false}]
[null,"",{"$f":"IF(B115=\"\",\"\",VLOOKUP(L115,Tabella_prezzi!$A$3:$K$303,9,FALSE))","v":""},{"$f":"IF(B115=\"\",\"\",VLOOKUP(L115,Tabella_prezzi!$A$3:$K$303,6,FALSE))","v":""},{"$f":"IF(B115=\"\",\"\",VLOOKUP(L115,Tabella_prezzi!$A$3:$K$303,8,FALSE))","v":""},{"$f":"IF(B115=\"\",\"\",VLOOKUP(L115,Tabella_prezzi!$A$3:$K$303,4,FALSE))","v":""},"",null,null,0,{"$f":"VLOOKUP(L115,Tabella_prezzi!A76:K377,6,FALSE)","v":"TS3L4-RACKM32A"},"L4N89",null,null,null,{"$f":"Altre_Opzioni!F9","v":0},null,null,null,null,null,null,null,null,null,null,{"$f":"ISODD(SUM($J$23:J115))","v":false}]
[null,{"$f":"IF(P116>0,P116,\"\")","v":""},{"$f":"IF(B116=\"\",\"\",VLOOKUP(L116,Tabella_prezzi!$A$3:$K$303,9,FALSE))","v":""},{"$f":"IF(B116=\"\",\"\",VLOOKUP(L116,Tabella_prezzi!$A$3:$K$303,6,FALSE))","v":""},{"$f":"IF(B116=\"\",\"\",VLOOKUP(L116,Tabella_prezzi!$A$3:$K$303,8,FALSE))","v":""},{"$f":"IF(B116=\"\",\"\",VLOOKUP(L116,Tabella_prezzi!$A$3:$K$303,4,FALSE))","v":""},"",null,null,0,{"$f":"VLOOKUP(L116,Tabella_prezzi!A77:K378,6,FALSE)","v":"TS3L4-RACKT32A"},"L4N90",null,null,null,{"$f":"Altre_Opzioni!F12","v":0},null,null,null,null,null,null,null,null,null,null,{"$f":"ISODD(SUM($J$23:J116))","v":false}]
[null,{"$f":"IF(P117>0,P117,\"\")","v":""},{"$f":"IF(B117=\"\",\"\",VLOOKUP(L117,Tabella_prezzi!$A$3:$K$303,9,FALSE))","v":""},{"$f":"IF(B117=\"\",\"\",VLOOKUP(L117,Tabella_prezzi!$A$3:$K$303,6,FALSE))","v":""},{"$f":"IF(B117=\"\",\"\",VLOOKUP(L117,Tabella_prezzi!$A$3:$K$303,8,FALSE))","v":""},{"$f":"IF(B117=\"\",\"\",VLOOKUP(L117,Tabella_prezzi!$A$3:$K$303,4,FALSE))","v":""},{"$f":"IF(C117=\"\",\"\",F117*B117)","v":""},null,null,{"$f":"IF(B117=\"\",0,1)","v":0},{"$f":"VLOOKUP(L117,Tabella_prezzi!A83:K384,6,FALSE)","v":"TS3L4-ED16TB"},"L4N103",null,null,null,{"$f":"Altre_Opzioni!F36","v":0},null,null,null,null,null,null,null,null,null,null,{"$f":"ISODD(SUM($J$23:J117))","v":false}]
[null,{"$f":"IF(P118>0,P118,\"\")","v":""},{"$f":"IF(B118=\"\",\"\",VLOOKUP(L118,Tabella_prezzi!$A$3:$K$303,9,FALSE))","v":""},{"$f":"IF(B118=\"\",\"\",VLOOKUP(L118,Tabella_prezzi!$A$3:$K$303,6,FALSE))","v":""},{"$f":"IF(B118=\"\",\"\",VLOOKUP(L118,Tabella_prezzi!$A$3:$K$303,8,FALSE))","v":""},{"$f":"IF(B118=\"\",\"\",VLOOKUP(L118,Tabella_prezzi!$A$3:$K$303,4,FALSE))","v":""},{"$f":"IF(C118=\"\",\"\",F118*B118)","v":""},null,null,{"$f":"IF(B118=\"\",0,1)","v":0},{"$f":"VLOOKUP(L118,Tabella_prezzi!A84:K385,6,FALSE)","v":"TS3L4-ED12TB"},"L4N104",null,null,null,{"$f":"Altre_Opzioni!F37","v":0},null,null,null,null,null,null,null,null,null,null,{"$f":"ISODD(SUM($J$23:J118))","v":false}]
[null,{"$f":"IF(P119>0,P119,\"\")","v":""},{"$f":"IF(B119=\"\",\"\",VLOOKUP(L119,Tabella_prezzi!$A$3:$K$303,9,FALSE))","v":""},{"$f":"IF(B119=\"\",\"\",VLOOKUP(L119,Tabella_prezzi!$A$3:$K$303,6,FALSE))","v":""},{"$f":"IF(B119=\"\",\"\",VLOOKUP(L119,Tabella_prezzi!$A$3:$K$303,8,FALSE))","v":""},{"$f":"IF(B119=\"\",\"\",VLOOKUP(L119,Tabella_prezzi!$A$3:$K$303,4,FALSE))","v":""},{"$f":"IF(C119=\"\",\"\",F119*B119)","v":""},null,null,{"$f":"IF(B119=\"\",0,1)","v":0},{"$f":"VLOOKUP(L119,Tabella_prezzi!A85:K386,6,FALSE)","v":"TS3L4-ED08TB"},"L4N105",null,null,null,{"$f":"Altre_Opzioni!F38","v":0},null,null,null,null,null,null,null,null,null,null,{"$f":"ISODD(SUM($J$23:J119))","v":false}]
[null,{"$f":"IF(P120>0,P120,\"\")","v":""},{"$f":"IF(B120=\"\",\"\",VLOOKUP(L120,Tabella_prezzi!$A$3:$K$303,9,FALSE))","v":""},{"$f":"IF(B120=\"\",\"\",VLOOKUP(L120,Tabella_prezzi!$A$3:$K$303,6,FALSE))","v":""},{"$f":"IF(B120=\"\",\"\",VLOOKUP(L120,Tabella_prezzi!$A$3:$K$303,8,FALSE))","v":""},{"$f":"IF(B120=\"\",\"\",VLOOKUP(L120,Tabella_prezzi!$A$3:$K$303,4,FALSE))","v":""},{"$f":"IF(C120=\"\",\"\",F120*B120)","v":""},null,null,0,{"$f":"VLOOKUP(L120,Tabella_prezzi!A78:K379,6,FALSE)","v":"TS3L4-Encl33Y4H"},"L4N98",null,null,null,{"$f":"Altre_Opzioni!F41","v":0},null,null,null,null,null,null,null,null,null,null,{"$f":"ISODD(SUM($J$23:J120))","v":false}]
[null,{"$f":"IF(P121>0,P121,\"\")","v":""},{"$f":"IF(B121=\"\",\"\",VLOOKUP(L121,Tabella_prezzi!$A$3:$K$303,9,FALSE))","v":""},{"$f":"IF(B121=\"\",\"\",VLOOKUP(L121,Tabella_prezzi!$A$3:$K$303,6,FALSE))","v":""},{"$f":"IF(B121=\"\",\"\",VLOOKUP(L121,Tabella_prezzi!$A$3:$K$303,8,FALSE))","v":""},{"$f":"IF(B121=\"\",\"\",VLOOKUP(L121,Tabella_prezzi!$A$3:$K$303,4,FALSE))","v":""},"",null,null,0,{"$f":"VLOOKUP(L121,Tabella_prezzi!A79:K380,6,FALSE)","v":"TS3L4-Encl45Y4H"},"L4N99",null,null,null,{"$f":"Altre_Opzioni!F42","v":0},null,null,null,null,null,null,null,null,null,null,{"$f":"ISODD(SUM($J$23:J121))","v":false}]
[null,"",{"$f":"IF(B122=\"\",\"\",VLOOKUP(L122,Tabella_prezzi!$A$3:$K$303,9,FALSE))","v":""},{"$f":"IF(B122=\"\",\"\",VLOOKUP(L122,Tabella_prezzi!$A$3:$K$303,6,FALSE))","v":""},{"$f":"IF(B122=\"\",\"\",VLOOKUP(L122,Tabella_prezzi!$A$3:$K$303,8,FALSE))","v":""},{"$f":"IF(B122=\"\",\"\",VLOOKUP(L122,Tabella_prezzi!$A$3:$K$303,4,FALSE))","v":""},"",null,null,0,{"$f":"VLOOKUP(L122,Tabella_prezzi!A86:K387,6,FALSE)","v":"TS3L4-ED2TB"},"L4N106",null,null,null,{"$f":"Altre_Opzioni!F44","v":0},null,null,null,null,null,null,null,null,null,null,{"$f":"ISODD(SUM($J$23:J122))","v":false}]
[null,"",{"$f":"IF(B123=\"\",\"\",VLOOKUP(L123,Tabella_prezzi!$A$3:$K$303,9,FALSE))","v":""},{"$f":"IF(B123=\"\",\"\",VLOOKUP(L123,Tabella_prezzi!$A$3:$K$303,6,FALSE))","v":""},{"$f":"IF(B123=\"\",\"\",VLOOKUP(L123,Tabella_prezzi!$A$3:$K$303,8,FALSE))","v":""},{"$f":"IF(B123=\"\",\"\",VLOOKUP(L123,Tabella_prezzi!$A$3:$K$303,4,FALSE))","v":""},"",null,null,0,{"$f":"VLOOKUP(L123,Tabella_prezzi!A87:K388,6,FALSE)","v":"TS3L2-EDRI800"},"L4N107",null,null,null,{"$f":"Altre_Opzioni!F45","v":0},null,null,null,null,null,null,null,null,null,null,{"$f":"ISODD(SUM($J$23:J123))","v":false}]
[null,"",{"$f":"IF(B124=\"\",\"\",VLOOKUP(L124,Tabella_prezzi!$A$3:$K$303,9,FALSE))","v":""},{"$f":"IF(B124=\"\",\"\",VLOOKUP(L124,Tabella_prezzi!$A$3:$K$303,6,FALSE))","v":""},{"$f":"IF(B124=\"\",\"\",VLOOKUP(L124,Tabella_prezzi!$A$3:$K$303,8,FALSE))","v":""},{"$f":"IF(B124=\"\",\"\",VLOOKUP(L124,Tabella_prezzi!$A$3:$K$303,4,FALSE))","v":""},"",null,null,0,{"$f":"VLOOKUP(L124,Tabella_prezzi!A90:K391,6,FALSE)","v":"TS3L4-VAPPS1Y"},"L4N110",null,null,null,{"$f":"Altre_Opzioni!F49","v":0},null,null,null,null,null,null,null,null,null,null,{"$f":"ISODD(SUM($J$23:J124))","v":false}]
[null,"",{"$f":"IF(B125=\"\",\"\",VLOOKUP(L125,Tabella_prezzi!$A$3:$K$303,9,FALSE))","v":""},{"$f":"IF(B125=\"\",\"\",VLOOKUP(L125,Tabella_prezzi!$A$3:$K$303,6,FALSE))","v":""},{"$f":"IF(B125=\"\",\"\",VLOOKUP(L125,Tabella_prezzi!$A$3:$K$303,8,FALSE))","v":""},{"$f":"IF(B125=\"\",\"\",VLOOKUP(L125,Tabella_prezzi!$A$3:$K$303,4,FALSE))","v":""},"",null,null,0,{"$f":"VLOOKUP(L125,Tabella_prezzi!A91:K392,6,FALSE)","v":"TS3L4-VAPPS3Y"},"L4N111",null,null,null,{"$f":"Altre_Opzioni!F50","v":0},null,null,null,null,null,null,null,null,null,null,{"$f":"ISODD(SUM($J$23:J125))","v":false}]
[null,"",{"$f":"IF(B126=\"\",\"\",VLOOKUP(L126,Tabella_prezzi!$A$3:$K$303,9,FALSE))","v":""},{"$f":"IF(B126=\"\",\"\",VLOOKUP(L126,Tabella_prezzi!$A$3:$K$303,6,FALSE))","v":""},{"$f":"IF(B126=\"\",\"\",VLOOKUP(L126,Tabella_prezzi!$A$3:$K$303,8,FALSE))","v":""},{"$f":"IF(B126=\"\",\"\",VLOOKUP(L126,Tabella_prezzi!$A$3:$K$303,4,FALSE))","v":""},"",null,null,0,{"$f":"VLOOKUP(L126,Tabella_prezzi!A92:K393,6,FALSE)","v":"TS3L4-VAPPS5Y"},"L4N112",null,null,null,{"$f":"Altre_Opzioni!F51","v":0},null,null,null,null,null,null,null,null,null,null,{"$f":"ISODD(SUM($J$23:J126))","v":false}]
[null,"",{"$f":"IF(B127=\"\",\"\",VLOOKUP(L127,Tabella_prezzi!$A$3:$K$303,9,FALSE))","v":""},{"$f":"IF(B127=\"\",\"\",VLOOKUP(L127,Tabella_prezzi!$A$3:$K$303,6,FALSE))","v":""},{"$f":"IF(B127=\"\",\"\",VLOOKUP(L127,Tabella_prezzi!$A$3:$K$303,8,FALSE))","v":""},{"$f":"IF(B127=\"\",\"\",VLOOKUP(L127,Tabella_prezzi!$A$3:$K$303,4,FALSE))","v":""},"",null,null,0,{"$f":"VLOOKUP(L127,Tabella_prezzi!A93:K394,6,FALSE)","v":"TS3L4-VPC1Y"},"L4N113",null,null,null,{"$f":"Altre_Opzioni!F52","v":0},null,null,null,null,null,null,null,null,null,null,{"$f":"ISODD(SUM($J$23:J127))","v":false}]
[null,"",{"$f":"IF(B128=\"\",\"\",VLOOKUP(L128,Tabella_prezzi!$A$3:$K$303,9,FALSE))","v":""},{"$f":"IF(B128=\"\",\"\",VLOOKUP(L128,Tabella_prezzi!$A$3:$K$303,6,FALSE))","v":""},{"$f":"IF(B128=\"\",\"\",VLOOKUP(L128,Tabella_prezzi!$A$3:$K$303,8,FALSE))","v":""},{"$f":"IF(B128=\"\",\"\",VLOOKUP(L128,Tabella_prezzi!$A$3:$K$303,4,FALSE))","v":""},"",null,null,0,{"$f":"VLOOKUP(L128,Tabella_prezzi!A94:K395,6,FALSE)","v":"TS3L4-VPC3Y"},"L4N114",null,null,null,{"$f":"Altre_Opzioni!F53","v":0},null,null,null,null,null,null,null,null,null,null,{"$f":"ISODD(SUM($J$23:J128))","v":false}]
[null,"",{"$f":"IF(B129=\"\",\"\",VLOOKUP(L129,Tabella_prezzi!$A$3:$K$303,9,FALSE))","v":""},{"$f":"IF(B129=\"\",\"\",VLOOKUP(L129,Tabella_prezzi!$A$3:$K$303,6,FALSE))","v":""},{"$f":"IF(B129=\"\",\"\",VLOOKUP(L129,Tabella_prezzi!$A$3:$K$303,8,FALSE))","v":""},{"$f":"IF(B129=\"\",\"\",VLOOKUP(L129,Tabella_prezzi!$A$3:$K$303,4,FALSE))","v":""},"",null,null,0,{"$f":"VLOOKUP(L129,Tabella_prezzi!A95:K396,6,FALSE)","v":"TS3L4-VPC5Y"},"L4N115",null,null,null,{"$f":"Altre_Opzioni!F54","v":0},null,null,null,null,null,null,null,null,null,null,{"$f":"ISODD(SUM($J$23:J129))","v":false}]
[null,"",{"$f":"IF(B130=\"\",\"\",VLOOKUP(L130,Tabella_prezzi!$A$3:$K$303,9,FALSE))","v":""},{"$f":"IF(B130=\"\",\"\",VLOOKUP(L130,Tabella_prezzi!$A$3:$K$303,6,FALSE))","v":""},{"$f":"IF(B130=\"\",\"\",VLOOKUP(L130,Tabella_prezzi!$A$3:$K$303,8,FALSE))","v":""},{"$f":"IF(B130=\"\",\"\",VLOOKUP(L130,Tabella_prezzi!$A$3:$K$303,4,FALSE))","v":""},"",null,null,0,{"$f":"VLOOKUP(L130,Tabella_prezzi!A96:K397,6,FALSE)","v":"TS3L4-VWS1Y"},"L4N116",null,null,null,{"$f":"Altre_Opzioni!F55","v":0},null,null,null,null,null,null,null,null,null,null,{"$f":"ISODD(SUM($J$23:J130))","v":false}]
[null,"",{"$f":"IF(B131=\"\",\"\",VLOOKUP(L131,Tabella_prezzi!$A$3:$K$303,9,FALSE))","v":""},{"$f":"IF(B131=\"\",\"\",VLOOKUP(L131,Tabella_prezzi!$A$3:$K$303,6,FALSE))","v":""},{"$f":"IF(B131=\"\",\"\",VLOOKUP(L131,Tabella_prezzi!$A$3:$K$303,8,FALSE))","v":""},{"$f":"IF(B131=\"\",\"\",VLOOKUP(L131,Tabella_prezzi!$A$3:$K$303,4,FALSE))","v":""},"",null,null,0,{"$f":"VLOOKUP(L131,Tabella_prezzi!A97:K398,6,FALSE)","v":"TS3L4-VWS3Y"},"L4N117",null,null,null,{"$f":"Altre_Opzioni!F56","v":0},null,null,null,null,null,null,null,null,null,null,{"$f":"ISODD(SUM($J$23:J131))","v":false}]
[null,"",{"$f":"IF(B132=\"\",\"\",VLOOKUP(L132,Tabella_prezzi!$A$3:$K$303,9,FALSE))","v":""},{"$f":"IF(B132=\"\",\"\",VLOOKUP(L132,Tabella_prezzi!$A$3:$K$303,6,FALSE))","v":""},{"$f":"IF(B132=\"\",\"\",VLOOKUP(L132,Tabella_prezzi!$A$3:$K$303,8,FALSE))","v":""},{"$f":"IF(B132=\"\",\"\",VLOOKUP(L132,Tabella_prezzi!$A$3:$K$303,4,FALSE))","v":""},"",null,null,0,{"$f":"VLOOKUP(L132,Tabella_prezzi!A98:K399,6,FALSE)","v":"TS3L4-VWS5Y"},"L4N118",null,null,null,{"$f":"Altre_Opzioni!F57","v":0},null,null,null,null,null,null,null,null,null,null,{"$f":"ISODD(SUM($J$23:J132))","v":false}]
[null,"",{"$f":"IF(B133=\"\",\"\",VLOOKUP(L133,Tabella_prezzi!$A$3:$K$303,9,FALSE))","v":""},{"$f":"IF(B133=\"\",\"\",VLOOKUP(L133,Tabella_prezzi!$A$3:$K$303,6,FALSE))","v":""},{"$f":"IF(B133=\"\",\"\",VLOOKUP(L133,Tabella_prezzi!$A$3:$K$303,8,FALSE))","v":""},{"$f":"IF(B133=\"\",\"\",VLOOKUP(L133,Tabella_prezzi!$A$3:$K$303,4,FALSE))","v":""},"",null,null,0,{"$f":"VLOOKUP(L133,Tabella_prezzi!A99:K400,6,FALSE)","v":"TS3L4-VCS1Y"},"L4N119",null,null,null,{"$f":"Altre_Opzioni!F58","v":0},null,null,null,null,null,null,null,null,null,null,{"$f":"ISODD(SUM($J$23:J133))","v":false}]
[null,"",{"$f":"IF(B134=\"\",\"\",VLOOKUP(L134,Tabella_prezzi!$A$3:$K$303,9,FALSE))","v":""},{"$f":"IF(B134=\"\",\"\",VLOOKUP(L134,Tabella_prezzi!$A$3:$K$303,6,FALSE))","v":""},{"$f":"IF(B134=\"\",\"\",VLOOKUP(L134,Tabella_prezzi!$A$3:$K$303,8,FALSE))","v":""},{"$f":"IF(B134=\"\",\"\",VLOOKUP(L134,Tabella_prezzi!$A$3:$K$303,4,FALSE))","v":""},"",null,null,0,{"$f":"VLOOKUP(L134,Tabella_prezzi!A100:K401,6,FALSE)","v":"TS3L4-VCS3Y"},"L4N120",null,null,null,{"$f":"Altre_Opzioni!F59","v":0},null,null,null,null,null,null,null,null,null,null,{"$f":"ISODD(SUM($J$23:J134))","v":false}]
[null,"",{"$f":"IF(B135=\"\",\"\",VLOOKUP(L135,Tabella_prezzi!$A$3:$K$303,9,FALSE))","v":""},{"$f":"IF(B135=\"\",\"\",VLOOKUP(L135,Tabella_prezzi!$A$3:$K$303,6,FALSE))","v":""},{"$f":"IF(B135=\"\",\"\",VLOOKUP(L135,Tabella_prezzi!$A$3:$K$303,8,FALSE))","v":""},{"$f":"IF(B135=\"\",\"\",VLOOKUP(L135,Tabella_prezzi!$A$3:$K$303,4,FALSE))","v":""},"",null,null,0,{"$f":"VLOOKUP(L135,Tabella_prezzi!A101:K402,6,FALSE)","v":"TS3L4-VCS5Y"},"L4N121",null,null,null,{"$f":"Altre_Opzioni!F60","v":0},null,null,null,null,null,null,null,null,null,null,{"$f":"ISODD(SUM($J$23:J135))","v":false}]
[null,"",{"$f":"IF(B136=\"\",\"\",VLOOKUP(L136,Tabella_prezzi!$A$3:$K$303,9,FALSE))","v":""},{"$f":"IF(B136=\"\",\"\",VLOOKUP(L136,Tabella_prezzi!$A$3:$K$303,6,FALSE))","v":""},{"$f":"IF(B136=\"\",\"\",VLOOKUP(L136,Tabella_prezzi!$A$3:$K$303,8,FALSE))","v":""},{"$f":"IF(B136=\"\",\"\",VLOOKUP(L136,Tabella_prezzi!$A$3:$K$303,4,FALSE))","v":""},"",null,null,0,{"$f":"VLOOKUP(L136,Tabella_prezzi!A102:K403,6,FALSE)","v":"TS3L4-VAPPS-P4Y"},"L4N122",null,null,null,{"$f":"Altre_Opzioni!F61","v":0},null,null,null,null,null,null,null,null,null,null,{"$f":"ISODD(SUM($J$23:J136))","v":false}]
[null,"",{"$f":"IF(B137=\"\",\"\",VLOOKUP(L137,Tabella_prezzi!$A$3:$K$303,9,FALSE))","v":""},{"$f":"IF(B137=\"\",\"\",VLOOKUP(L137,Tabella_prezzi!$A$3:$K$303,6,FALSE))","v":""},{"$f":"IF(B137=\"\",\"\",VLOOKUP(L137,Tabella_prezzi!$A$3:$K$303,8,FALSE))","v":""},{"$f":"IF(B137=\"\",\"\",VLOOKUP(L137,Tabella_prezzi!$A$3:$K$303,4,FALSE))","v":""},"",null,null,0,{"$f":"VLOOKUP(L137,Tabella_prezzi!A103:K404,6,FALSE)","v":"TS3L4-VAPPS-P5Y"},"L4N123",null,null,null,{"$f":"Altre_Opzioni!F62","v":0},null,null,null,null,null,null,null,null,null,null,{"$f":"ISODD(SUM($J$23:J137))","v":false}]
[null,"",{"$f":"IF(B138=\"\",\"\",VLOOKUP(L138,Tabella_prezzi!$A$3:$K$303,9,FALSE))","v":""},{"$f":"IF(B138=\"\",\"\",VLOOKUP(L138,Tabella_prezzi!$A$3:$K$303,6,FALSE))","v":""},{"$f":"IF(B138=\"\",\"\",VLOOKUP(L138,Tabella_prezzi!$A$3:$K$303,8,FALSE))","v":""},{"$f":"IF(B138=\"\",\"\",VLOOKUP(L138,Tabella_prezzi!$A$3:$K$303,4,FALSE))","v":""},"",null,null,0,{"$f":"VLOOKUP(L138,Tabella_prezzi!A104:K405,6,FALSE)","v":"TS3L4-VPC-P4Y"},"L4N124",null,null,null,{"$f":"Altre_Opzioni!F63","v":0},null,null,null,null,null,null,null,null,null,null,{"$f":"ISODD(SUM($J$23:J138))","v":false}]
[null,"",{"$f":"IF(B139=\"\",\"\",VLOOKUP(L139,Tabella_prezzi!$A$3:$K$303,9,FALSE))","v":""},{"$f":"IF(B139=\"\",\"\",VLOOKUP(L139,Tabella_prezzi!$A$3:$K$303,6,FALSE))","v":""},{"$f":"IF(B139=\"\",\"\",VLOOKUP(L139,Tabella_prezzi!$A$3:$K$303,8,FALSE))","v":""},{"$f":"IF(B139=\"\",\"\",VLOOKUP(L139,Tabella_prezzi!$A$3:$K$303,4,FALSE))","v":""},"",null,null,0,{"$f":"VLOOKUP(L139,Tabella_prezzi!A105:K406,6,FALSE)","v":"TS3L4-VPC-P5Y"},"L4N125",null,null,null,{"$f":"Altre_Opzioni!F64","v":0},null,null,null,null,null,null,null,null,null,null,{"$f":"ISODD(SUM($J$23:J139))","v":false}]
[null,"",{"$f":"IF(B140=\"\",\"\",VLOOKUP(L140,Tabella_prezzi!$A$3:$K$303,9,FALSE))","v":""},{"$f":"IF(B140=\"\",\"\",VLOOKUP(L140,Tabella_prezzi!$A$3:$K$303,6,FALSE))","v":""},{"$f":"IF(B140=\"\",\"\",VLOOKUP(L140,Tabella_prezzi!$A$3:$K$303,8,FALSE))","v":""},{"$f":"IF(B140=\"\",\"\",VLOOKUP(L140,Tabella_prezzi!$A$3:$K$303,4,FALSE))","v":""},"",null,null,0,{"$f":"VLOOKUP(L140,Tabella_prezzi!A106:K407,6,FALSE)","v":"TS3L4-VWS-P4Y"},"L4N126",null,null,null,{"$f":"Altre_Opzioni!F65","v":0},null,null,null,null,null,null,null,null,null,null,{"$f":"ISODD(SUM($J$23:J140))","v":false}]
[null,"",{"$f":"IF(B141=\"\",\"\",VLOOKUP(L141,Tabella_prezzi!$A$3:$K$303,9,FALSE))","v":""},{"$f":"IF(B141=\"\",\"\",VLOOKUP(L141,Tabella_prezzi!$A$3:$K$303,6,FALSE))","v":""},{"$f":"IF(B141=\"\",\"\",VLOOKUP(L141,Tabella_prezzi!$A$3:$K$303,8,FALSE))","v":""},{"$f":"IF(B141=\"\",\"\",VLOOKUP(L141,Tabella_prezzi!$A$3:$K$303,4,FALSE))","v":""},"",null,null,0,{"$f":"VLOOKUP(L141,Tabella_prezzi!A107:K408,6,FALSE)","v":"TS3L4-VWS-P5Y"},"L4N127",null,null,null,{"$f":"Altre_Opzioni!F66","v":0},null,null,null,null,null,null,null,null,null,null,{"$f":"ISODD(SUM($J$23:J141))","v":false}]
[null,"",{"$f":"IF(B142=\"\",\"\",VLOOKUP(L142,Tabella_prezzi!$A$3:$K$303,9,FALSE))","v":""},{"$f":"IF(B142=\"\",\"\",VLOOKUP(L142,Tabella_prezzi!$A$3:$K$303,6,FALSE))","v":""},{"$f":"IF(B142=\"\",\"\",VLOOKUP(L142,Tabella_prezzi!$A$3:$K$303,8,FALSE))","v":""},{"$f":"IF(B142=\"\",\"\",VLOOKUP(L142,Tabella_prezzi!$A$3:$K$303,4,FALSE))","v":""},"",null,null,0,{"$f":"VLOOKUP(L142,Tabella_prezzi!A108:K409,6,FALSE)","v":"TS3L4-VWSUPG4Y"},"L4N128",null,null,null,{"$f":"Altre_Opzioni!F67","v":0},null,null,null,null,null,null,null,null,null,null,{"$f":"ISODD(SUM($J$23:J142))","v":false}]
[null,"",{"$f":"IF(B143=\"\",\"\",VLOOKUP(L143,Tabella_prezzi!$A$3:$K$303,9,FALSE))","v":""},{"$f":"IF(B143=\"\",\"\",VLOOKUP(L143,Tabella_prezzi!$A$3:$K$303,6,FALSE))","v":""},{"$f":"IF(B143=\"\",\"\",VLOOKUP(L143,Tabella_prezzi!$A$3:$K$303,8,FALSE))","v":""},{"$f":"IF(B143=\"\",\"\",VLOOKUP(L143,Tabella_prezzi!$A$3:$K$303,4,FALSE))","v":""},"",null,null,0,{"$f":"VLOOKUP(L143,Tabella_prezzi!A109:K410,6,FALSE)","v":"TS3L4-VWSUPG5Y"},"L4N129",null,null,null,{"$f":"Altre_Opzioni!F68","v":0},null,null,null,null,null,null,null,null,null,null,{"$f":"ISODD(SUM($J$23:J143))","v":false}]
[null,"",{"$f":"IF(B144=\"\",\"\",VLOOKUP(L144,Tabella_prezzi!$A$3:$K$303,9,FALSE))","v":""},{"$f":"IF(B144=\"\",\"\",VLOOKUP(L144,Tabella_prezzi!$A$3:$K$303,6,FALSE))","v":""},{"$f":"IF(B144=\"\",\"\",VLOOKUP(L144,Tabella_prezzi!$A$3:$K$303,8,FALSE))","v":""},{"$f":"IF(B144=\"\",\"\",VLOOKUP(L144,Tabella_prezzi!$A$3:$K$303,4,FALSE))","v":""},"",null,null,{"$f":"IF(B144=\"\",0,1)","v":0},{"$f":"VLOOKUP(L144,Tabella_prezzi!A110:K411,6,FALSE)","v":"TS3L4-OM4M3"},"L4N130",{"$f":"COUNTIF(TS3L4_L4N_1,L144)*$M$22*Q144","v":0},{"$f":"COUNTIF(TS3L4_L4N_2,L144)*$N$22*R144","v":0},{"$f":"COUNTIF(TS3L4_L4N_3,L144)*$O$22*S144","v":0},{"$f":"SUM(M144:O144)","v":0},{"$f":"Lotto4_R740XD_1!$F$118","v":0},{"$f":"Lotto4_R740XD_2!$F$118","v":0},{"$f":"Lotto4_R740XD_3!$F$118","v":0}]
[null,"",{"$f":"IF(B145=\"\",\"\",VLOOKUP(L145,Tabella_prezzi!$A$3:$K$303,9,FALSE))","v":""},{"$f":"IF(B145=\"\",\"\",VLOOKUP(L145,Tabella_prezzi!$A$3:$K$303,6,FALSE))","v":""},{"$f":"IF(B145=\"\",\"\",VLOOKUP(L145,Tabella_prezzi!$A$3:$K$303,8,FALSE))","v":""},{"$f":"IF(B145=\"\",\"\",VLOOKUP(L145,Tabella_prezzi!$A$3:$K$303,4,FALSE))","v":""},"",null,null,0,"TS3L4-A10080GB","L4N131",{"$f":"COUNTIF(TS3L4_L4N_1,L145)*$M$22","v":0},{"$f":"COUNTIF(TS3L4_L4N_2,L145)*$N$22","v":0},{"$f":"COUNTIF(TS3L4_L4N_3,L145)*$O$22","v":0},{"$f":"SUM(M145:O145)","v":0}]
[null,"",{"$f":"IF(B146=\"\",\"\",VLOOKUP(L146,Tabella_prezzi!$A$3:$K$303,9,FALSE))","v":""},{"$f":"IF(B146=\"\",\"\",VLOOKUP(L146,Tabella_prezzi!$A$3:$K$303,6,FALSE))","v":""},{"$f":"IF(B146=\"\",\"\",VLOOKUP(L146,Tabella_prezzi!$A$3:$K$303,8,FALSE))","v":""},{"$f":"IF(B146=\"\",\"\",VLOOKUP(L146,Tabella_prezzi!$A$3:$K$303,4,FALSE))","v":""},"",null,null,0,"TS3L4-GPUA2","L4N132",{"$f":"COUNTIF(TS3L4_L4N_1,L146)*$M$22","v":0},{"$f":"COUNTIF(TS3L4_L4N_2,L146)*$N$22","v":0},{"$f":"COUNTIF(TS3L4_L4N_3,L146)*$O$22","v":0},0]
[null,"",{"$f":"IF(B147=\"\",\"\",VLOOKUP(L147,Tabella_prezzi!$A$3:$K$303,9,FALSE))","v":""},{"$f":"IF(B147=\"\",\"\",VLOOKUP(L147,Tabella_prezzi!$A$3:$K$303,6,FALSE))","v":""},{"$f":"IF(B147=\"\",\"\",VLOOKUP(L147,Tabella_prezzi!$A$3:$K$303,8,FALSE))","v":""},{"$f":"IF(B147=\"\",\"\",VLOOKUP(L147,Tabella_prezzi!$A$3:$K$303,4,FALSE))","v":""},"",null,null,0,"TS3L4-GPUA30","L4N133",{"$f":"COUNTIF(TS3L4_L4N_1,L147)*$M$22","v":0},{"$f":"COUNTIF(TS3L4_L4N_2,L147)*$N$22","v":0},{"$f":"COUNTIF(TS3L4_L4N_3,L147)*$O$22","v":0},0]
[null,"",{"$f":"IF(B148=\"\",\"\",VLOOKUP(L148,Tabella_prezzi!$A$3:$K$303,9,FALSE))","v":""},{"$f":"IF(B148=\"\",\"\",VLOOKUP(L148,Tabella_prezzi!$A$3:$K$303,6,FALSE))","v":""},{"$f":"IF(B148=\"\",\"\",VLOOKUP(L148,Tabella_prezzi!$A$3:$K$303,8,FALSE))","v":""},{"$f":"IF(B148=\"\",\"\",VLOOKUP(L148,Tabella_prezzi!$A$3:$K$303,4,FALSE))","v":""},"",null,null,0,"TS3L4-GPUA16","L4N134",{"$f":"COUNTIF(TS3L4_L4N_1,L148)*$M$22","v":0},{"$f":"COUNTIF(TS3L4_L4N_2,L148)*$N$22","v":0},{"$f":"COUNTIF(TS3L4_L4N_3,L148)*$O$22","v":0},0]
[null,"",{"$f":"IF(B149=\"\",\"\",VLOOKUP(L149,Tabella_prezzi!$A$3:$K$303,9,FALSE))","v":""},{"$f":"IF(B149=\"\",\"\",VLOOKUP(L149,Tabella_prezzi!$A$3:$K$303,6,FALSE))","v":""},{"$f":"IF(B149=\"\",\"\",VLOOKUP(L149,Tabella_prezzi!$A$3:$K$303,8,FALSE))","v":""},{"$f":"IF(B149=\"\",\"\",VLOOKUP(L149,Tabella_prezzi!$A$3:$K$303,4,FALSE))","v":""},"",null,null,0,"TS3L4-CMA2U","L4N135",{"$f":"COUNTIF(TS3L4_L4N_1,L149)*$M$22","v":0},{"$f":"COUNTIF(TS3L4_L4N_2,L149)*$N$22","v":0},{"$f":"COUNTIF(TS3L4_L4N_3,L149)*$O$22","v":0},0]
[null,"",{"$f":"IF(B150=\"\",\"\",VLOOKUP(L150,Tabella_prezzi!$A$3:$K$303,9,FALSE))","v":""},{"$f":"IF(B150=\"\",\"\",VLOOKUP(L150,Tabella_prezzi!$A$3:$K$303,6,FALSE))","v":""},{"$f":"IF(B150=\"\",\"\",VLOOKUP(L150,Tabella_prezzi!$A$3:$K$303,8,FALSE))","v":""},{"$f":"IF(B150=\"\",\"\",VLOOKUP(L150,Tabella_prezzi!$A$3:$K$303,4,FALSE))","v":""},"",null,null,0,"TS3L4-PWRFLEX","L4N97",{"$f":"COUNTIF(TS3L4_L4N_1,L150)*$M$22","v":0},{"$f":"COUNTIF(TS3L4_L4N_2,L150)*$N$22","v":0},{"$f":"COUNTIF(TS3L4_L4N_3,L150)*$O$22","v":0},{"$f":"SUM(M150:O150)","v":0},null,null,null,null,null,null,null,null,null,null,{"$f":"ISODD(SUM($J$23:J150))","v":false}]
[null,"",{"$f":"IF(B151=\"\",\"\",VLOOKUP(L151,Tabella_prezzi!$A$3:$K$303,9,FALSE))","v":""},{"$f":"IF(B151=\"\",\"\",VLOOKUP(L151,Tabella_prezzi!$A$3:$K$303,6,FALSE))","v":""},{"$f":"IF(B151=\"\",\"\",VLOOKUP(L151,Tabella_prezzi!$A$3:$K$303,8,FALSE))","v":""},{"$f":"IF(B151=\"\",\"\",VLOOKUP(L151,Tabella_prezzi!$A$3:$K$303,4,FALSE))","v":""},"",null,null,0,{"$f":"VLOOKUP(L151,Tabella_prezzi!A74:K375,6,FALSE)","v":"TS3L4-DAC3SFP28"},"L4N93",{"$f":"COUNTIF(TS3L4_L4N_1,L151)*$M$22*Q151","v":0},{"$f":"COUNTIF(TS3L4_L4N_2,L151)*$N$22*R151","v":0},{"$f":"COUNTIF(TS3L4_L4N_3,L151)*$O$22*S151","v":0},{"$f":"SUM(M151:O151)","v":0},{"$f":"Lotto4_R740XD_1!$F$123","v":0},{"$f":"Lotto4_R740XD_2!$F$123","v":0},{"$f":"Lotto4_R740XD_3!$F$123","v":0},null,null,null,null,null,null,null,{"$f":"ISODD(SUM($J$23:J151))","v":false}]
[null,"",{"$f":"IF(B152=\"\",\"\",VLOOKUP(L152,Tabella_prezzi!$A$3:$K$303,9,FALSE))","v":""},{"$f":"IF(B152=\"\",\"\",VLOOKUP(L152,Tabella_prezzi!$A$3:$K$303,6,FALSE))","v":""},{"$f":"IF(B152=\"\",\"\",VLOOKUP(L152,Tabella_prezzi!$A$3:$K$303,8,FALSE))","v":""},{"$f":"IF(B152=\"\",\"\",VLOOKUP(L152,Tabella_prezzi!$A$3:$K$303,4,FALSE))","v":""},"",null,null,0,"TS3L4-DAC3SFP","L4N91",{"$f":"COUNTIF(TS3L4_L4N_1,L152)*$M$22*Q152","v":0},{"$f":"COUNTIF(TS3L4_L4N_2,L152)*$N$22*R152","v":0},{"$f":"COUNTIF(TS3L4_L4N_3,L152)*$O$22*S152","v":0},{"$f":"SUM(M152:O152)","v":0},{"$f":"Lotto4_R740XD_1!$F$121","v":0},{"$f":"Lotto4_R740XD_2!$F$121","v":0},{"$f":"Lotto4_R740XD_3!$F$121","v":0},null,null,null,null,null,null,null,{"$f":"ISODD(SUM($J$23:J152))","v":false}]
[null,"",{"$f":"IF(B153=\"\",\"\",VLOOKUP(L153,Tabella_prezzi!$A$3:$K$303,9,FALSE))","v":""},{"$f":"IF(B153=\"\",\"\",VLOOKUP(L153,Tabella_prezzi!$A$3:$K$303,6,FALSE))","v":""},{"$f":"IF(B153=\"\",\"\",VLOOKUP(L153,Tabella_prezzi!$A$3:$K$303,8,FALSE))","v":""},{"$f":"IF(B153=\"\",\"\",VLOOKUP(L153,Tabella_prezzi!$A$3:$K$303,4,FALSE))","v":""},"",null,null,0,"TS3L4-MLX100M3","L4N92",{"$f":"COUNTIF(TS3L4_L4N_1,L153)*$M$22*Q153","v":0},{"$f":"COUNTIF(TS3L4_L4N_2,L153)*$N$22*R153","v":0},{"$f":"COUNTIF(TS3L4_L4N_3,L153)*$O$22*S153","v":0},{"$f":"SUM(M153:O153)","v":0},{"$f":"Lotto4_R740XD_1!$F$122","v":0},{"$f":"Lotto4_R740XD_2!$F$122","v":0},{"$f":"Lotto4_R740XD_3!$F$122","v":0},null,null,null,null,null,null,null,{"$f":"ISODD(SUM($J$23:J153))","v":false}]
[null,"",{"$f":"IF(B154=\"\",\"\",VLOOKUP(L154,Tabella_prezzi!$A$3:$K$303,9,FALSE))","v":""},{"$f":"IF(B154=\"\",\"\",VLOOKUP(L154,Tabella_prezzi!$A$3:$K$303,6,FALSE))","v":""},{"$f":"IF(B154=\"\",\"\",VLOOKUP(L154,Tabella_prezzi!$A$3:$K$303,8,FALSE))","v":""},{"$f":"IF(B154=\"\",\"\",VLOOKUP(L154,Tabella_prezzi!$A$3:$K$303,4,FALSE))","v":""},"",null,null,{"$f":"IF(B154=\"\",0,1)","v":0},"TS3L4-MCX4DP","L4N94",{"$f":"COUNTIF(TS3L4_L4N_1,L154)*$M$22","v":0},{"$f":"COUNTIF(TS3L4_L4N_2,L154)*$N$22","v":0},{"$f":"COUNTIF(TS3L4_L4N_3,L154)*$O$22","v":0},{"$f":"SUM(M154:O154)","v":0},null,null,null,null,null,null,null,null,null,null,{"$f":"ISODD(SUM($J$23:J154))","v":false}]
[null,"",{"$f":"IF(B155=\"\",\"\",VLOOKUP(L155,Tabella_prezzi!$A$3:$K$303,9,FALSE))","v":""},{"$f":"IF(B155=\"\",\"\",VLOOKUP(L155,Tabella_prezzi!$A$3:$K$303,6,FALSE))","v":""},{"$f":"IF(B155=\"\",\"\",VLOOKUP(L155,Tabella_prezzi!$A$3:$K$303,8,FALSE))","v":""},{"$f":"IF(B155=\"\",\"\",VLOOKUP(L155,Tabella_prezzi!$A$3:$K$303,4,FALSE))","v":""},"",null,null,0,"TS3L4-MCX4DP-L","L4N95",0,0,0,0,null,null,null,null,null,null,null,null,null,null,{"$f":"ISODD(SUM($J$23:J155))","v":false}]
[null,"",{"$f":"IF(B156=\"\",\"\",VLOOKUP(L156,Tabella_prezzi!$A$3:$K$303,9,FALSE))","v":""},{"$f":"IF(B156=\"\",\"\",VLOOKUP(L156,Tabella_prezzi!$A$3:$K$303,6,FALSE))","v":""},{"$f":"IF(B156=\"\",\"\",VLOOKUP(L156,Tabella_prezzi!$A$3:$K$303,8,FALSE))","v":""},{"$f":"IF(B156=\"\",\"\",VLOOKUP(L156,Tabella_prezzi!$A$3:$K$303,4,FALSE))","v":""},"",null,null,0,"TS3L4-OMEA","L4N96",0,0,0,0,null,null,null,null,null,null,null,null,null,null,{"$f":"ISODD(SUM($J$23:J156))","v":false}]
[null,"",{"$f":"IF(B157=\"\",\"\",VLOOKUP(L157,Tabella_prezzi!$A$3:$K$303,9,FALSE))","v":""},{"$f":"IF(B157=\"\",\"\",VLOOKUP(L157,Tabella_prezzi!$A$3:$K$303,6,FALSE))","v":""},{"$f":"IF(B157=\"\",\"\",VLOOKUP(L157,Tabella_prezzi!$A$3:$K$303,8,FALSE))","v":""},{"$f":"IF(B157=\"\",\"\",VLOOKUP(L157,Tabella_prezzi!$A$3:$K$303,4,FALSE))","v":""},"",null,null,0,{"$f":"VLOOKUP(L157,Tabella_prezzi!A88:K389,6,FALSE)","v":"TS3L4-A100"},"L4N108",{"$f":"COUNTIF(TS3L4_L4N_1,L157)*$M$22","v":0},{"$f":"COUNTIF(TS3L4_L4N_2,L157)*$N$22","v":0},{"$f":"COUNTIF(TS3L4_L4N_3,L157)*$O$22","v":0},{"$f":"SUM(M157:O157)","v":0},null,null,null,null,null,null,null,null,null,null,{"$f":"ISODD(SUM($J$23:J157))","v":false}]
[null,"",{"$f":"IF(B158=\"\",\"\",VLOOKUP(L158,Tabella_prezzi!$A$3:$K$303,9,FALSE))","v":""},{"$f":"IF(B158=\"\",\"\",VLOOKUP(L158,Tabella_prezzi!$A$3:$K$303,6,FALSE))","v":""},{"$f":"IF(B158=\"\",\"\",VLOOKUP(L158,Tabella_prezzi!$A$3:$K$303,8,FALSE))","v":""},{"$f":"IF(B158=\"\",\"\",VLOOKUP(L158,Tabella_prezzi!$A$3:$K$303,4,FALSE))","v":""},"",null,null,0,{"$f":"VLOOKUP(L158,Tabella_prezzi!A80:K381,6,FALSE)","v":"TS3L4-SAS12-L"},"L4N100",{"$f":"COUNTIF(TS3L4_L4N_1,L158)*$M$22","v":0},{"$f":"COUNTIF(TS3L4_L4N_2,L158)*$N$22","v":0},{"$f":"COUNTIF(TS3L4_L4N_3,L158)*$O$22","v":0},0,null,null,null,null,null,null,null,null,null,null,{"$f":"ISODD(SUM($J$23:J158))","v":false}]
[null,"",{"$f":"IF(B159=\"\",\"\",VLOOKUP(L159,Tabella_prezzi!$A$3:$K$303,9,FALSE))","v":""},{"$f":"IF(B159=\"\",\"\",VLOOKUP(L159,Tabella_prezzi!$A$3:$K$303,6,FALSE))","v":""},{"$f":"IF(B159=\"\",\"\",VLOOKUP(L159,Tabella_prezzi!$A$3:$K$303,8,FALSE))","v":""},{"$f":"IF(B159=\"\",\"\",VLOOKUP(L159,Tabella_prezzi!$A$3:$K$303,4,FALSE))","v":""},"",null,null,0,{"$f":"VLOOKUP(L159,Tabella_prezzi!A81:K382,6,FALSE)","v":"TS3L4-SAS12"},"L4N101",{"$f":"COUNTIF(TS3L4_L4N_1,L159)*$M$22","v":0},{"$f":"COUNTIF(TS3L4_L4N_2,L159)*$N$22","v":0},{"$f":"COUNTIF(TS3L4_L4N_3,L159)*$O$22","v":0},0,null,null,null,null,null,null,null,null,null,null,{"$f":"ISODD(SUM($J$23:J159))","v":false}]
[null,"",{"$f":"IF(B160=\"\",\"\",VLOOKUP(L160,Tabella_prezzi!$A$3:$K$303,9,FALSE))","v":""},{"$f":"IF(B160=\"\",\"\",VLOOKUP(L160,Tabella_prezzi!$A$3:$K$303,6,FALSE))","v":""},{"$f":"IF(B160=\"\",\"\",VLOOKUP(L160,Tabella_prezzi!$A$3:$K$303,8,FALSE))","v":""},{"$f":"IF(B160=\"\",\"\",VLOOKUP(L160,Tabella_prezzi!$A$3:$K$303,4,FALSE))","v":""},"",null,null,0,{"$f":"VLOOKUP(L160,Tabella_prezzi!A82:K383,6,FALSE)","v":"TS3L4-H840-L"},"L4N102",{"$f":"COUNTIF(TS3L4_L4N_1,L160)*$M$22","v":0},{"$f":"COUNTIF(TS3L4_L4N_2,L160)*$N$22","v":0},{"$f":"COUNTIF(TS3L4_L4N_3,L160)*$O$22","v":0},0,null,null,null,null,null,null,null,null,null,null,{"$f":"ISODD(SUM($J$23:J160))","v":false}]
[null,"Convenzione",null,null,null,null,{"$f":"SUM(G23:G57)","v":0},null,null,{"$f":"IF(G161=0,0,1)","v":0}]
[null,"Valore economico 20% consentito",null,{"$f":"G161/100*20","v":0},"Ulteriori componenti opzionali (20%)",null,{"$f":"SUM(G60:G160)","v":0},null,null,{"$f":"IF(G162=0,0,1)","v":0}]
[null,{"$f":"IF(M163+N163+O163>0,\"Le estensioni di garanzia e/o i servizi di Hard Disk Retention sono inferiori al numero dei server\",\"\")","v":""},null,null,"Totale iva esclusa",null,{"$f":"G162+G161","v":0},null,null,{"$f":"IF(G163=0,0,1)","v":0},"Verifica garanzia",null,{"$f":"IF(B55=\"\",0,IF(B23=B55,0,1))","v":0},{"$f":"IF(B57=\"\",0,IF(B23=B57,0,1))","v":0},{"$f":"IF(B54=\"\",0,IF(B23=B54,0,1))","v":0}]
[null,"I.V.A.",null,null,null,null,{"$f":"G163/100*22","v":0},null,null,{"$f":"IF(G164=0,0,1)","v":0}]
[null,"TOTALE ORDINE",null,null,null,null,{"$f":"G163+G164","v":0},null,null,{"$f":"IF(G165=0,0,1)","v":0}]
[null,null,null,null,null,null,null,null,null,1]

{"sheet":"Configurazione","index":7,"n_rows":175,"n_cols":29,"rows_kept":175,"cut":false,"hidden":false,"merged":[[2,1,2,2],[2,4,2,5],[2,7,2,8],[154,1,154,8],[156,1,156,3],[156,6,156,8],[139,1,139,2],[140,1,151,2],[139,4,139,5],[140,4,151,5],[139,7,139,8],[140,7,151,8]]}
[null,null,null,null,null,null,null,null,null,null,null,null,null,null,null,null,null,null,null,null,null,1,null,"TS3L4-GPUSW","TS3L4-GPUDW","TS3L4-GPUSW","TS3L4-GPUDW","TS3L4-GPUSW","TS3L4-GPUDW"]
[null,{"$f":"Riepilogo!M22","v":0},"PowerEdge R740xd Configurazione 1",null,{"$f":"Riepilogo!N22","v":0},"PowerEdge R740xd Configurazione 2",null,{"$f":"Riepilogo!O22","v":0},"PowerEdge R740xd Configurazione 3",null,null,null,null,null,null,null,null,null,null,null,null,1]
[null,{"$f":"IF(X3=1,\"Configurazione Single-Wide\",IF(Y3=1,\"Configurazione Double-Wide\",\"\"))","v":""},null,null,{"$f":"IF(Z3=1,\"Configurazione Single-Wide\",IF(AA3=1,\"Configurazione Double-Wide\",\"\"))","v":""},null,null,{"$f":"IF(AB3=1,\"Configurazione Single-Wide\",IF(AC3=1,\"Configurazione Double-Wide\",\"\"))","v":""},null,null,null,null,null,null,null,null,null,null,null,null,{"$f":"SUM(X3:AC3)","v":0},{"$f":"IF(U3>0,1,0)","v":0},null,{"$f":"COUNTIF($C$5:$C$106,X1)","v":0},{"$f":"COUNTIF($C$5:$C$106,Y1)","v":0},{"$f":"COUNTIF($F$5:$F$106,Z1)","v":0},{"$f":"COUNTIF($F$5:$F$106,AA1)","v":0},{"$f":"COUNTIF($I$5:$I$106,AB1)","v":0},{"$f":"COUNTIF($I$5:$I$106,AC1)","v":0}]
[null,null,null,null,null,null,null,null,null,null,null,null,null,null,null,null,null,null,null,null,null,{"$f":"IF($U$5>0,1,0)","v":0}]
[null,{"$f":"IF(Riepilogo!M23>0,Riepilogo!M23/$B$2,\"\")","v":""},{"$f":"IF(B5=\"\",\"\",CONCATENATE(Riepilogo!K23,ConfigurationTS3L4!J420))","v":""},null,{"$f":"IF(Riepilogo!N23>0,Riepilogo!N23/$E$2,\"\")","v":""},{"$f":"IF(E5=\"\",\"\",CONCATENATE(Riepilogo!K23,ConfigurationTS3L4!T420))","v":""},null,{"$f":"IF(Riepilogo!O23>0,Riepilogo!O23/$H$2,\"\")","v":""},{"$f":"IF(H5=\"\",\"\",CONCATENATE(Riepilogo!K23,ConfigurationTS3L4!AD420))","v":""},null,null,{"$f":"IF(B5=\"\",0,B5)","v":0},null,null,{"$f":"IF(E5=\"\",0,E5)","v":0},null,null,{"$f":"IF(H5=\"\",0,H5)","v":0},null,null,{"$f":"SUM(L5:T5)","v":0},{"$f":"IF(U5>0,1,0)","v":0},{"$f":"ISODD(V5)","v":false}]
[null,{"$f":"IF(Riepilogo!M24>0,Riepilogo!M24/$B$2,\"\")","v":""},{"$f":"IF(B6=\"\",\"\",CONCATENATE(Riepilogo!K24,ConfigurationTS3L4!J421))","v":""},null,{"$f":"IF(Riepilogo!N24>0,Riepilogo!N24/$E$2,\"\")","v":""},{"$f":"IF(E6=\"\",\"\",CONCATENATE(Riepilogo!K24,ConfigurationTS3L4!T421))","v":""},null,{"$f":"IF(Riepilogo!O24>0,Riepilogo!O24/$H$2,\"\")","v":""},{"$f":"IF(H6=\"\",\"\",CONCATENATE(Riepilogo!K24,ConfigurationTS3L4!AD421))","v":""},null,null,{"$f":"IF(B6=\"\",0,B6)","v":0},null,null,{"$f":"IF(E6=\"\",0,E6)","v":0},null,null,{"$f":"IF(H6=\"\",0,H6)","v":0},null,null,{"$f":"SUM(L6:T6)","v":0},{"$f":"IF(U6>0,1,0)","v":0},{"$f":"ISODD(SUM($V$5:V6))","v":false}]
[null,{"$f":"IF(Riepilogo!M25>0,Riepilogo!M25/$B$2,\"\")","v":""},{"$f":"IF(B7=\"\",\"\",CONCATENATE(Riepilogo!K25,ConfigurationTS3L4!J422))","v":""},null,{"$f":"IF(Riepilogo!N25>0,Riepilogo!N25/$E$2,\"\")","v":""},{"$f":"IF(E7=\"\",\"\",CONCATENATE(Riepilogo!K25,ConfigurationTS3L4!T422))","v":""},null,{"$f":"IF(Riepilogo!O25>0,Riepilogo!O25/$H$2,\"\")","v":""},{"$f":"IF(H7=\"\",\"\",CONCATENATE(Riepilogo!K25,ConfigurationTS3L4!AD422))","v":""},null,null,0,null,null,0,null,null,0,null,null,0,0,{"$f":"ISODD(SUM($V$5:V7))","v":false}]
[null,{"$f":"IF(Riepilogo!M26>0,Riepilogo!M26/$B$2,\"\")","v":""},{"$f":"IF(B8=\"\",\"\",CONCATENATE(Riepilogo!K26,ConfigurationTS3L4!J423))","v":""},null,{"$f":"IF(Riepilogo!N26>0,Riepilogo!N26/$E$2,\"\")","v":""},{"$f":"IF(E8=\"\",\"\",CONCATENATE(Riepilogo!K26,ConfigurationTS3L4!T423))","v":""},null,{"$f":"IF(Riepilogo!O26>0,Riepilogo!O26/$H$2,\"\")","v":""},{"$f":"IF(H8=\"\",\"\",CONCATENATE(Riepilogo!K26,ConfigurationTS3L4!AD423))","v":""},null,null,0,null,null,0,null,null,0,null,null,0,0,{"$f":"ISODD(SUM($V$5:V8))","v":false}]
[null,{"$f":"IF(Riepilogo!M27>0,Riepilogo!M27/$B$2,\"\")","v":""},{"$f":"IF(B9=\"\",\"\",CONCATENATE(Riepilogo!K27,ConfigurationTS3L4!J424))","v":""},null,{"$f":"IF(Riepilogo!N27>0,Riepilogo!N27/$E$2,\"\")","v":""},{"$f":"IF(E9=\"\",\"\",CONCATENATE(Riepilogo!K27,ConfigurationTS3L4!T424))","v":""},null,{"$f":"IF(Riepilogo!O27>0,Riepilogo!O27/$H$2,\"\")","v":""},{"$f":"IF(H9=\"\",\"\",CONCATENATE(Riepilogo!K27,ConfigurationTS3L4!AD424))","v":""},null,null,0,null,null,0,null,null,0,null,null,0,0,{"$f":"ISODD(SUM($V$5:V9))","v":false}]
[null,{"$f":"IF(Riepilogo!M28>0,Riepilogo!M28/$B$2,\"\")","v":""},{"$f":"IF(B10=\"\",\"\",CONCATENATE(Riepilogo!K28,ConfigurationTS3L4!J425))","v":""},null,{"$f":"IF(Riepilogo!N28>0,Riepilogo!N28/$E$2,\"\")","v":""},{"$f":"IF(E10=\"\",\"\",CONCATENATE(Riepilogo!K28,ConfigurationTS3L4!T425))","v":""},null,{"$f":"IF(Riepilogo!O28>0,Riepilogo!O28/$H$2,\"\")","v":""},{"$f":"IF(H10=\"\",\"\",CONCATENATE(Riepilogo!K28,ConfigurationTS3L4!AD425))","v":""},null,null,0,null,null,0,null,null,0,null,null,0,0,{"$f":"ISODD(SUM($V$5:V10))","v":false}]
[null,{"$f":"IF(Riepilogo!M29>0,Riepilogo!M29/$B$2,\"\")","v":""},{"$f":"IF(B11=\"\",\"\",CONCATENATE(Riepilogo!K29,ConfigurationTS3L4!J426))","v":""},null,{"$f":"IF(Riepilogo!N29>0,Riepilogo!N29/$E$2,\"\")","v":""},{"$f":"IF(E11=\"\",\"\",CONCATENATE(Riepilogo!K29,ConfigurationTS3L4!T426))","v":""},null,{"$f":"IF(Riepilogo!O29>0,Riepilogo!O29/$H$2,\"\")","v":""},{"$f":"IF(H11=\"\",\"\",CONCATENATE(Riepilogo!K29,ConfigurationTS3L4!AD426))","v":""},null,null,0,null,null,0,null,null,0,null,null,0,0,{"$f":"ISODD(SUM($V$5:V11))","v":false}]
[null,{"$f":"IF(Riepilogo!M30>0,Riepilogo!M30/$B$2,\"\")","v":""},{"$f":"IF(B12=\"\",\"\",CONCATENATE(Riepilogo!K30,ConfigurationTS3L4!J427))","v":""},null,{"$f":"IF(Riepilogo!N30>0,Riepilogo!N30/$E$2,\"\")","v":""},{"$f":"IF(E12=\"\",\"\",CONCATENATE(Riepilogo!K30,ConfigurationTS3L4!T427))","v":""},null,{"$f":"IF(Riepilogo!O30>0,Riepilogo!O30/$H$2,\"\")","v":""},{"$f":"IF(H12=\"\",\"\",CONCATENATE(Riepilogo!K30,ConfigurationTS3L4!AD427))","v":""},null,null,0,null,null,0,null,null,0,null,null,0,0,{"$f":"ISODD(SUM($V$5:V12))","v":false}]
[null,{"$f":"IF(Riepilogo!M31>0,Riepilogo!M31/$B$2,\"\")","v":""},{"$f":"IF(B13=\"\",\"\",CONCATENATE(Riepilogo!K31,ConfigurationTS3L4!J428))","v":""},null,{"$f":"IF(Riepilogo!N31>0,Riepilogo!N31/$E$2,\"\")","v":""},{"$f":"IF(E13=\"\",\"\",CONCATENATE(Riepilogo!K31,ConfigurationTS3L4!T428))","v":""},null,{"$f":"IF(Riepilogo!O31>0,Riepilogo!O31/$H$2,\"\")","v":""},{"$f":"IF(H13=\"\",\"\",CONCATENATE(Riepilogo!K31,ConfigurationTS3L4!AD428))","v":""},null,null,0,null,null,0,null,null,0,null,null,0,0,{"$f":"ISODD(SUM($V$5:V13))","v":false}]
[null,{"$f":"IF(Riepilogo!M32>0,Riepilogo!M32/$B$2,\"\")","v":""},{"$f":"IF(B14=\"\",\"\",CONCATENATE(Riepilogo!K32,ConfigurationTS3L4!J429))","v":""},null,{"$f":"IF(Riepilogo!N32>0,Riepilogo!N32/$E$2,\"\")","v":""},{"$f":"IF(E14=\"\",\"\",CONCATENATE(Riepilogo!K32,ConfigurationTS3L4!T429))","v":""},null,{"$f":"IF(Riepilogo!O32>0,Riepilogo!O32/$H$2,\"\")","v":""},{"$f":"IF(H14=\"\",\"\",CONCATENATE(Riepilogo!K32,ConfigurationTS3L4!AD429))","v":""},null,null,0,null,null,0,null,null,0,null,null,0,0,{"$f":"ISODD(SUM($V$5:V14))","v":false}]
[null,{"$f":"IF(Riepilogo!M33>0,Riepilogo!M33/$B$2,\"\")","v":""},{"$f":"IF(B15=\"\",\"\",CONCATENATE(Riepilogo!K33,ConfigurationTS3L4!J430))","v":""},null,{"$f":"IF(Riepilogo!N33>0,Riepilogo!N33/$E$2,\"\")","v":""},{"$f":"IF(E15=\"\",\"\",CONCATENATE(Riepilogo!K33,ConfigurationTS3L4!T430))","v":""},null,{"$f":"IF(Riepilogo!O33>0,Riepilogo!O33/$H$2,\"\")","v":""},{"$f":"IF(H15=\"\",\"\",CONCATENATE(Riepilogo!K33,ConfigurationTS3L4!AD430))","v":""},null,null,0,null,null,0,null,null,0,null,null,0,0,{"$f":"ISODD(SUM($V$5:V15))","v":false}]
[null,{"$f":"IF(Riepilogo!M34>0,Riepilogo!M34/$B$2,\"\")","v":""},{"$f":"IF(B16=\"\",\"\",CONCATENATE(Riepilogo!K34,ConfigurationTS3L4!J431))","v":""},null,{"$f":"IF(Riepilogo!N34>0,Riepilogo!N34/$E$2,\"\")","v":""},{"$f":"IF(E16=\"\",\"\",CONCATENATE(Riepilogo!K34,ConfigurationTS3L4!T431))","v":""},null,{"$f":"IF(Riepilogo!O34>0,Riepilogo!O34/$H$2,\"\")","v":""},{"$f":"IF(H16=\"\",\"\",CONCATENATE(Riepilogo!K34,ConfigurationTS3L4!AD431))","v":""},null,null,0,null,null,0,null,null,0,null,null,0,0,{"$f":"ISODD(SUM($V$5:V16))","v":false}]
[null,{"$f":"IF(Riepilogo!M35>0,Riepilogo!M35/$B$2,\"\")","v":""},{"$f":"IF(B17=\"\",\"\",CONCATENATE(Riepilogo!K35,ConfigurationTS3L4!J432))","v":""},null,{"$f":"IF(Riepilogo!N35>0,Riepilogo!N35/$E$2,\"\")","v":""},{"$f":"IF(E17=\"\",\"\",CONCATENATE(Riepilogo!K35,ConfigurationTS3L4!T432))","v":""},null,{"$f":"IF(Riepilogo!O35>0,Riepilogo!O35/$H$2,\"\")","v":""},{"$f":"IF(H17=\"\",\"\",CONCATENATE(Riepilogo!K35,ConfigurationTS3L4!AD432))","v":""},null,null,0,null,null,0,null,null,0,null,null,0,0,{"$f":"ISODD(SUM($V$5:V17))","v":false}]
[null,{"$f":"IF(Riepilogo!M36>0,Riepilogo!M36/$B$2,\"\")","v":""},{"$f":"IF(B18=\"\",\"\",CONCATENATE(Riepilogo!K36,ConfigurationTS3L4!J433))","v":""},null,{"$f":"IF(Riepilogo!N36>0,Riepilogo!N36/$E$2,\"\")","v":""},{"$f":"IF(E18=\"\",\"\",CONCATENATE(Riepilogo!K36,ConfigurationTS3L4!T433))","v":""},null,{"$f":"IF(Riepilogo!O36>0,Riepilogo!O36/$H$2,\"\")","v":""},{"$f":"IF(H18=\"\",\"\",CONCATENATE(Riepilogo!K36,ConfigurationTS3L4!AD433))","v":""},null,null,0,null,null,0,null,null,0,null,null,0,0,{"$f":"ISODD(SUM($V$5:V18))","v":false}]
[null,{"$f":"IF(Riepilogo!M37>0,Riepilogo!M37/$B$2,\"\")","v":""},{"$f":"IF(B19=\"\",\"\",CONCATENATE(Riepilogo!K37,ConfigurationTS3L4!J434))","v":""},null,{"$f":"IF(Riepilogo!N37>0,Riepilogo!N37/$E$2,\"\")","v":""},{"$f":"IF(E19=\"\",\"\",CONCATENATE(Riepilogo!K37,ConfigurationTS3L4!T434))","v":""},null,{"$f":"IF(Riepilogo!O37>0,Riepilogo!O37/$H$2,\"\")","v":""},{"$f":"IF(H19=\"\",\"\",CONCATENATE(Riepilogo!K37,ConfigurationTS3L4!AD434))","v":""},null,null,0,null,null,0,null,null,0,null,null,0,0,{"$f":"ISODD(SUM($V$5:V19))","v":false}]
[null,{"$f":"IF(Riepilogo!M38>0,Riepilogo!M38/$B$2,\"\")","v":""},{"$f":"IF(B20=\"\",\"\",CONCATENATE(Riepilogo!K38,ConfigurationTS3L4!J435))","v":""},null,{"$f":"IF(Riepilogo!N38>0,Riepilogo!N38/$E$2,\"\")","v":""},{"$f":"IF(E20=\"\",\"\",CONCATENATE(Riepilogo!K38,ConfigurationTS3L4!T435))","v":""},null,{"$f":"IF(Riepilogo!O38>0,Riepilogo!O38/$H$2,\"\")","v":""},{"$f":"IF(H20=\"\",\"\",CONCATENATE(Riepilogo!K38,ConfigurationTS3L4!AD435))","v":""},null,null,0,null,null,0,null,null,0,null,null,0,0,{"$f":"ISODD(SUM($V$5:V20))","v":false}]
[null,{"$f":"IF(Riepilogo!M39>0,Riepilogo!M39/$B$2,\"\")","v":""},{"$f":"IF(B21=\"\",\"\",CONCATENATE(Riepilogo!K39,ConfigurationTS3L4!J436))","v":""},null,{"$f":"IF(Riepilogo!N39>0,Riepilogo!N39/$E$2,\"\")","v":""},{"$f":"IF(E21=\"\",\"\",CONCATENATE(Riepilogo!K39,ConfigurationTS3L4!T436))","v":""},null,{"$f":"IF(Riepilogo!O39>0,Riepilogo!O39/$H$2,\"\")","v":""},{"$f":"IF(H21=\"\",\"\",CONCATENATE(Riepilogo!K39,ConfigurationTS3L4!AD436))","v":""},null,null,0,null,null,0,null,null,0,null,null,0,0,{"$f":"ISODD(SUM($V$5:V21))","v":false}]
[null,{"$f":"IF(Riepilogo!M40>0,Riepilogo!M40/$B$2,\"\")","v":""},{"$f":"IF(B22=\"\",\"\",CONCATENATE(Riepilogo!K40,ConfigurationTS3L4!J437))","v":""},null,{"$f":"IF(Riepilogo!N40>0,Riepilogo!N40/$E$2,\"\")","v":""},{"$f":"IF(E22=\"\",\"\",CONCATENATE(Riepilogo!K40,ConfigurationTS3L4!T437))","v":""},null,{"$f":"IF(Riepilogo!O40>0,Riepilogo!O40/$H$2,\"\")","v":""},{"$f":"IF(H22=\"\",\"\",CONCATENATE(Riepilogo!K40,ConfigurationTS3L4!AD437))","v":""},null,null,0,null,null,0,null,null,0,null,null,0,0,{"$f":"ISODD(SUM($V$5:V22))","v":false}]
[null,{"$f":"IF(Riepilogo!M41>0,Riepilogo!M41/$B$2,\"\")","v":""},{"$f":"IF(B23=\"\",\"\",CONCATENATE(Riepilogo!K41,ConfigurationTS3L4!J438))","v":""},null,{"$f":"IF(Riepilogo!N41>0,Riepilogo!N41/$E$2,\"\")","v":""},{"$f":"IF(E23=\"\",\"\",CONCATENATE(Riepilogo!K41,ConfigurationTS3L4!T438))","v":""},null,{"$f":"IF(Riepilogo!O41>0,Riepilogo!O41/$H$2,\"\")","v":""},{"$f":"IF(H23=\"\",\"\",CONCATENATE(Riepilogo!K41,ConfigurationTS3L4!AD438))","v":""},null,null,0,null,null,0,null,null,0,null,null,0,0,{"$f":"ISODD(SUM($V$5:V23))","v":false}]
[null,{"$f":"IF(Riepilogo!M42>0,Riepilogo!M42/$B$2,\"\")","v":""},{"$f":"IF(B24=\"\",\"\",CONCATENATE(Riepilogo!K42,ConfigurationTS3L4!J439))","v":""},null,{"$f":"IF(Riepilogo!N42>0,Riepilogo!N42/$E$2,\"\")","v":""},{"$f":"IF(E24=\"\",\"\",CONCATENATE(Riepilogo!K42,ConfigurationTS3L4!T439))","v":""},null,{"$f":"IF(Riepilogo!O42>0,Riepilogo!O42/$H$2,\"\")","v":""},{"$f":"IF(H24=\"\",\"\",CONCATENATE(Riepilogo!K42,ConfigurationTS3L4!AD439))","v":""},null,null,0,null,null,0,null,null,0,null,null,0,0,{"$f":"ISODD(SUM($V$5:V24))","v":false}]
[null,{"$f":"IF(Riepilogo!M43>0,Riepilogo!M43/$B$2,\"\")","v":""},{"$f":"IF(B25=\"\",\"\",CONCATENATE(Riepilogo!K43,ConfigurationTS3L4!J440))","v":""},null,{"$f":"IF(Riepilogo!N43>0,Riepilogo!N43/$E$2,\"\")","v":""},{"$f":"IF(E25=\"\",\"\",CONCATENATE(Riepilogo!K43,ConfigurationTS3L4!T440))","v":""},null,{"$f":"IF(Riepilogo!O43>0,Riepilogo!O43/$H$2,\"\")","v":""},{"$f":"IF(H25=\"\",\"\",CONCATENATE(Riepilogo!K43,ConfigurationTS3L4!AD440))","v":""},null,null,0,null,null,0,null,null,0,null,null,0,0,{"$f":"ISODD(SUM($V$5:V25))","v":false}]
[null,{"$f":"IF(Riepilogo!M44>0,Riepilogo!M44/$B$2,\"\")","v":""},{"$f":"IF(B26=\"\",\"\",CONCATENATE(Riepilogo!K44,ConfigurationTS3L4!J441))","v":""},null,{"$f":"IF(Riepilogo!N44>0,Riepilogo!N44/$E$2,\"\")","v":""},{"$f":"IF(E26=\"\",\"\",CONCATENATE(Riepilogo!K44,ConfigurationTS3L4!T441))","v":""},null,{"$f":"IF(Riepilogo!O44>0,Riepilogo!O44/$H$2,\"\")","v":""},{"$f":"IF(H26=\"\",\"\",CONCATENATE(Riepilogo!K44,ConfigurationTS3L4!AD441))","v":""},null,null,0,null,null,0,null,null,0,null,null,0,0,{"$f":"ISODD(SUM($V$5:V26))","v":false}]
[null,{"$f":"IF(Riepilogo!M45>0,Riepilogo!M45/$B$2,\"\")","v":""},{"$f":"IF(B27=\"\",\"\",CONCATENATE(Riepilogo!K45,ConfigurationTS3L4!J442))","v":""},null,{"$f":"IF(Riepilogo!N45>0,Riepilogo!N45/$E$2,\"\")","v":""},{"$f":"IF(E27=\"\",\"\",CONCATENATE(Riepilogo!K45,ConfigurationTS3L4!T442))","v":""},null,{"$f":"IF(Riepilogo!O45>0,Riepilogo!O45/$H$2,\"\")","v":""},{"$f":"IF(H27=\"\",\"\",CONCATENATE(Riepilogo!K45,ConfigurationTS3L4!AD442))","v":""},null,null,0,null,null,0,null,null,0,null,null,0,0,{"$f":"ISODD(SUM($V$5:V27))","v":false}]
[null,{"$f":"IF(Riepilogo!M46>0,Riepilogo!M46/$B$2,\"\")","v":""},{"$f":"IF(B28=\"\",\"\",CONCATENATE(Riepilogo!K46,ConfigurationTS3L4!J443))","v":""},null,{"$f":"IF(Riepilogo!N46>0,Riepilogo!N46/$E$2,\"\")","v":""},{"$f":"IF(E28=\"\",\"\",CONCATENATE(Riepilogo!K46,ConfigurationTS3L4!T443))","v":""},null,{"$f":"IF(Riepilogo!O46>0,Riepilogo!O46/$H$2,\"\")","v":""},{"$f":"IF(H28=\"\",\"\",CONCATENATE(Riepilogo!K46,ConfigurationTS3L4!AD443))","v":""},null,null,0,null,null,0,null,null,0,null,null,0,0,{"$f":"ISODD(SUM($V$5:V28))","v":false}]
[null,{"$f":"IF(Riepilogo!M47>0,Riepilogo!M47/$B$2,\"\")","v":""},{"$f":"IF(B29=\"\",\"\",CONCATENATE(Riepilogo!K47,ConfigurationTS3L4!J444))","v":""},null,{"$f":"IF(Riepilogo!N47>0,Riepilogo!N47/$E$2,\"\")","v":""},{"$f":"IF(E29=\"\",\"\",CONCATENATE(Riepilogo!K47,ConfigurationTS3L4!T444))","v":""},null,{"$f":"IF(Riepilogo!O47>0,Riepilogo!O47/$H$2,\"\")","v":""},{"$f":"IF(H29=\"\",\"\",CONCATENATE(Riepilogo!K47,ConfigurationTS3L4!AD444))","v":""},null,null,0,null,null,0,null,null,0,null,null,0,0,{"$f":"ISODD(SUM($V$5:V29))","v":false}]
[null,{"$f":"IF(Riepilogo!M48>0,Riepilogo!M48/$B$2,\"\")","v":""},{"$f":"IF(B30=\"\",\"\",CONCATENATE(Riepilogo!K48,ConfigurationTS3L4!J445))","v":""},null,{"$f":"IF(Riepilogo!N48>0,Riepilogo!N48/$E$2,\"\")","v":""},{"$f":"IF(E30=\"\",\"\",CONCATENATE(Riepilogo!K48,ConfigurationTS3L4!T445))","v":""},null,{"$f":"IF(Riepilogo!O48>0,Riepilogo!O48/$H$2,\"\")","v":""},{"$f":"IF(H30=\"\",\"\",CONCATENATE(Riepilogo!K48,ConfigurationTS3L4!AD445))","v":""},null,null,0,null,null,0,null,null,0,null,null,0,0,{"$f":"ISODD(SUM($V$5:V30))","v":false}]
[null,{"$f":"IF(Riepilogo!M49>0,Riepilogo!M49/$B$2,\"\")","v":""},{"$f":"IF(B31=\"\",\"\",CONCATENATE(Riepilogo!K49,ConfigurationTS3L4!J446))","v":""},null,{"$f":"IF(Riepilogo!N49>0,Riepilogo!N49/$E$2,\"\")","v":""},{"$f":"IF(E31=\"\",\"\",CONCATENATE(Riepilogo!K49,ConfigurationTS3L4!T446))","v":""},null,{"$f":"IF(Riepilogo!O49>0,Riepilogo!O49/$H$2,\"\")","v":""},{"$f":"IF(H31=\"\",\"\",CONCATENATE(Riepilogo!K49,ConfigurationTS3L4!AD446))","v":""},null,null,0,null,null,0,null,null,0,null,null,0,0,{"$f":"ISODD(SUM($V$5:V31))","v":false}]
[null,{"$f":"IF(Riepilogo!M50>0,Riepilogo!M50/$B$2,\"\")","v":""},{"$f":"IF(B32=\"\",\"\",CONCATENATE(Riepilogo!K50,ConfigurationTS3L4!J447))","v":""},null,{"$f":"IF(Riepilogo!N50>0,Riepilogo!N50/$E$2,\"\")","v":""},{"$f":"IF(E32=\"\",\"\",CONCATENATE(Riepilogo!K50,ConfigurationTS3L4!T447))","v":""},null,{"$f":"IF(Riepilogo!O50>0,Riepilogo!O50/$H$2,\"\")","v":""},{"$f":"IF(H32=\"\",\"\",CONCATENATE(Riepilogo!K50,ConfigurationTS3L4!AD447))","v":""},null,null,0,null,null,0,null,null,0,null,null,0,0,{"$f":"ISODD(SUM($V$5:V32))","v":false}]
[null,{"$f":"IF(Riepilogo!M51>0,Riepilogo!M51/$B$2,\"\")","v":""},{"$f":"IF(B33=\"\",\"\",CONCATENATE(Riepilogo!K51,ConfigurationTS3L4!J448))","v":""},null,{"$f":"IF(Riepilogo!N51>0,Riepilogo!N51/$E$2,\"\")","v":""},{"$f":"IF(E33=\"\",\"\",CONCATENATE(Riepilogo!K51,ConfigurationTS3L4!T448))","v":""},null,{"$f":"IF(Riepilogo!O51>0,Riepilogo!O51/$H$2,\"\")","v":""},{"$f":"IF(H33=\"\",\"\",CONCATENATE(Riepilogo!K51,ConfigurationTS3L4!AD448))","v":""},null,null,0,null,null,0,null,null,0,null,null,0,0,{"$f":"ISODD(SUM($V$5:V33))","v":false}]
[null,{"$f":"IF(Riepilogo!M52>0,Riepilogo!M52/$B$2,\"\")","v":""},{"$f":"IF(B34=\"\",\"\",CONCATENATE(Riepilogo!K52,ConfigurationTS3L4!J449))","v":""},null,{"$f":"IF(Riepilogo!N52>0,Riepilogo!N52/$E$2,\"\")","v":""},{"$f":"IF(E34=\"\",\"\",CONCATENATE(Riepilogo!K52,ConfigurationTS3L4!T449))","v":""},null,{"$f":"IF(Riepilogo!O52>0,Riepilogo!O52/$H$2,\"\")","v":""},{"$f":"IF(H34=\"\",\"\",CONCATENATE(Riepilogo!K52,ConfigurationTS3L4!AD449))","v":""},null,null,0,null,null,0,null,null,0,null,null,0,0,{"$f":"ISODD(SUM($V$5:V34))","v":false}]
[null,{"$f":"IF(Riepilogo!M53>0,Riepilogo!M53/$B$2,\"\")","v":""},{"$f":"IF(B35=\"\",\"\",CONCATENATE(Riepilogo!K53,ConfigurationTS3L4!J450))","v":""},null,{"$f":"IF(Riepilogo!N53>0,Riepilogo!N53/$E$2,\"\")","v":""},{"$f":"IF(E35=\"\",\"\",CONCATENATE(Riepilogo!K53,ConfigurationTS3L4!T450))","v":""},null,{"$f":"IF(Riepilogo!O53>0,Riepilogo!O53/$H$2,\"\")","v":""},{"$f":"IF(H35=\"\",\"\",CONCATENATE(Riepilogo!K53,ConfigurationTS3L4!AD450))","v":""},null,null,0,null,null,0,null,null,0,null,null,0,0,{"$f":"ISODD(SUM($V$5:V35))","v":false}]
[null,{"$f":"IF(Riepilogo!M54>0,Riepilogo!M54/$B$2,\"\")","v":""},{"$f":"IF(B36=\"\",\"\",CONCATENATE(Riepilogo!K54,ConfigurationTS3L4!J451))","v":""},null,{"$f":"IF(Riepilogo!N54>0,Riepilogo!N54/$E$2,\"\")","v":""},{"$f":"IF(E36=\"\",\"\",CONCATENATE(Riepilogo!K54,ConfigurationTS3L4!T451))","v":""},null,{"$f":"IF(Riepilogo!O54>0,Riepilogo!O54/$H$2,\"\")","v":""},{"$f":"IF(H36=\"\",\"\",CONCATENATE(Riepilogo!K54,ConfigurationTS3L4!AD451))","v":""},null,null,0,null,null,0,null,null,0,null,null,0,0,{"$f":"ISODD(SUM($V$5:V36))","v":false}]
[null,{"$f":"IF(Riepilogo!M55>0,Riepilogo!M55/$B$2,\"\")","v":""},{"$f":"IF(B37=\"\",\"\",CONCATENATE(Riepilogo!K55,ConfigurationTS3L4!J452))","v":""},null,{"$f":"IF(Riepilogo!N55>0,Riepilogo!N55/$E$2,\"\")","v":""},{"$f":"IF(E37=\"\",\"\",CONCATENATE(Riepilogo!K55,ConfigurationTS3L4!T452))","v":""},null,{"$f":"IF(Riepilogo!O55>0,Riepilogo!O55/$H$2,\"\")","v":""},{"$f":"IF(H37=\"\",\"\",CONCATENATE(Riepilogo!K55,ConfigurationTS3L4!AD452))","v":""},null,null,0,null,null,0,null,null,0,null,null,0,0,{"$f":"ISODD(SUM($V$5:V37))","v":false}]
[null,{"$f":"IF(Riepilogo!M56>0,Riepilogo!M56/$B$2,\"\")","v":""},{"$f":"IF(B38=\"\",\"\",CONCATENATE(Riepilogo!K56,ConfigurationTS3L4!J453))","v":""},null,{"$f":"IF(Riepilogo!N56>0,Riepilogo!N56/$E$2,\"\")","v":""},{"$f":"IF(E38=\"\",\"\",CONCATENATE(Riepilogo!K56,ConfigurationTS3L4!T453))","v":""},null,{"$f":"IF(Riepilogo!O56>0,Riepilogo!O56/$H$2,\"\")","v":""},{"$f":"IF(H38=\"\",\"\",CONCATENATE(Riepilogo!K56,ConfigurationTS3L4!AD453))","v":""},null,null,0,null,null,0,null,null,0,null,null,0,0,{"$f":"ISODD(SUM($V$5:V38))","v":false}]
[null,{"$f":"IF(Riepilogo!M57>0,Riepilogo!M57/$B$2,\"\")","v":""},{"$f":"IF(B39=\"\",\"\",CONCATENATE(Riepilogo!K57,ConfigurationTS3L4!J454))","v":""},null,{"$f":"IF(Riepilogo!N57>0,Riepilogo!N57/$E$2,\"\")","v":""},{"$f":"IF(E39=\"\",\"\",CONCATENATE(Riepilogo!K57,ConfigurationTS3L4!T454))","v":""},null,{"$f":"IF(Riepilogo!O57>0,Riepilogo!O57/$H$2,\"\")","v":""},{"$f":"IF(H39=\"\",\"\",CONCATENATE(Riepilogo!K57,ConfigurationTS3L4!AD454))","v":""},null,null,0,null,null,0,null,null,0,null,null,0,0,{"$f":"ISODD(SUM($V$5:V39))","v":false}]
[null,null,{"$f":"IF(B40=\"\",\"\",CONCATENATE(Riepilogo!K58,ConfigurationTS3L4!J455))","v":""},null,null,{"$f":"IF(E40=\"\",\"\",CONCATENATE(Riepilogo!K58,ConfigurationTS3L4!T455))","v":""},null,null,{"$f":"IF(H40=\"\",\"\",CONCATENATE(Riepilogo!K58,ConfigurationTS3L4!AD455))","v":""},null,null,null,null,null,null,null,null,null,null,null,null,0]
[null,null,{"$f":"IF(B41=\"\",\"\",CONCATENATE(Riepilogo!K59,ConfigurationTS3L4!J456))","v":""},null,null,{"$f":"IF(E41=\"\",\"\",CONCATENATE(Riepilogo!K59,ConfigurationTS3L4!T456))","v":""},null,null,{"$f":"IF(H41=\"\",\"\",CONCATENATE(Riepilogo!K59,ConfigurationTS3L4!AD456))","v":""},null,null,null,null,null,null,null,null,null,null,null,null,0]
[null,{"$f":"IF(Riepilogo!M60>0,Riepilogo!M60/$B$2,\"\")","v":""},{"$f":"IF(B42=\"\",\"\",CONCATENATE(Riepilogo!K60,ConfigurationTS3L4!J457))","v":""},null,{"$f":"IF(Riepilogo!N60>0,Riepilogo!N60/$E$2,\"\")","v":""},{"$f":"IF(E42=\"\",\"\",CONCATENATE(Riepilogo!K60,ConfigurationTS3L4!T457))","v":""},null,{"$f":"IF(Riepilogo!O60>0,Riepilogo!O60/$H$2,\"\")","v":""},{"$f":"IF(H42=\"\",\"\",CONCATENATE(Riepilogo!K60,ConfigurationTS3L4!AD457))","v":""},null,null,{"$f":"IF(B42=\"\",0,B42)","v":0},null,null,{"$f":"IF(E42=\"\",0,E42)","v":0},null,null,{"$f":"IF(H42=\"\",0,H42)","v":0},null,null,{"$f":"SUM(L42:T42)","v":0},{"$f":"IF(U42>0,1,0)","v":0},{"$f":"ISODD(SUM($V$5:V42))","v":false}]
[null,{"$f":"IF(Riepilogo!M61>0,Riepilogo!M61/$B$2,\"\")","v":""},{"$f":"IF(B43=\"\",\"\",CONCATENATE(Riepilogo!K61,ConfigurationTS3L4!J458))","v":""},null,{"$f":"IF(Riepilogo!N61>0,Riepilogo!N61/$E$2,\"\")","v":""},{"$f":"IF(E43=\"\",\"\",CONCATENATE(Riepilogo!K61,ConfigurationTS3L4!T458))","v":""},null,{"$f":"IF(Riepilogo!O61>0,Riepilogo!O61/$H$2,\"\")","v":""},{"$f":"IF(H43=\"\",\"\",CONCATENATE(Riepilogo!K61,ConfigurationTS3L4!AD458))","v":""},null,null,{"$f":"IF(B43=\"\",0,B43)","v":0},null,null,{"$f":"IF(E43=\"\",0,E43)","v":0},null,null,{"$f":"IF(H43=\"\",0,H43)","v":0},null,null,{"$f":"SUM(L43:T43)","v":0},{"$f":"IF(U43>0,1,0)","v":0},{"$f":"ISODD(SUM($V$5:V43))","v":false}]
[null,{"$f":"IF(Riepilogo!M62>0,Riepilogo!M62/$B$2,\"\")","v":""},{"$f":"IF(B44=\"\",\"\",CONCATENATE(Riepilogo!K62,ConfigurationTS3L4!J459))","v":""},null,{"$f":"IF(Riepilogo!N62>0,Riepilogo!N62/$E$2,\"\")","v":""},{"$f":"IF(E44=\"\",\"\",CONCATENATE(Riepilogo!K62,ConfigurationTS3L4!T459))","v":""},null,{"$f":"IF(Riepilogo!O62>0,Riepilogo!O62/$H$2,\"\")","v":""},{"$f":"IF(H44=\"\",\"\",CONCATENATE(Riepilogo!K62,ConfigurationTS3L4!AD459))","v":""},null,null,0,null,null,0,null,null,0,null,null,0,0,{"$f":"ISODD(SUM($V$5:V44))","v":false}]
[null,{"$f":"IF(Riepilogo!M63>0,Riepilogo!M63/$B$2,\"\")","v":""},{"$f":"IF(B45=\"\",\"\",CONCATENATE(Riepilogo!K63,ConfigurationTS3L4!J460))","v":""},null,{"$f":"IF(Riepilogo!N63>0,Riepilogo!N63/$E$2,\"\")","v":""},{"$f":"IF(E45=\"\",\"\",CONCATENATE(Riepilogo!K63,ConfigurationTS3L4!T460))","v":""},null,{"$f":"IF(Riepilogo!O63>0,Riepilogo!O63/$H$2,\"\")","v":""},{"$f":"IF(H45=\"\",\"\",CONCATENATE(Riepilogo!K63,ConfigurationTS3L4!AD460))","v":""},null,null,0,null,null,0,null,null,0,null,null,0,0,{"$f":"ISODD(SUM($V$5:V45))","v":false}]
[null,{"$f":"IF(Riepilogo!M64>0,Riepilogo!M64/$B$2,\"\")","v":""},{"$f":"IF(B46=\"\",\"\",CONCATENATE(Riepilogo!K64,ConfigurationTS3L4!J461))","v":""},null,{"$f":"IF(Riepilogo!N64>0,Riepilogo!N64/$E$2,\"\")","v":""},{"$f":"IF(E46=\"\",\"\",CONCATENATE(Riepilogo!K64,ConfigurationTS3L4!T461))","v":""},null,{"$f":"IF(Riepilogo!O64>0,Riepilogo!O64/$H$2,\"\")","v":""},{"$f":"IF(H46=\"\",\"\",CONCATENATE(Riepilogo!K64,ConfigurationTS3L4!AD461))","v":""},null,null,0,null,null,0,null,null,0,null,null,0,0,{"$f":"ISODD(SUM($V$5:V46))","v":false}]
[null,{"$f":"IF(Riepilogo!M65>0,Riepilogo!M65/$B$2,\"\")","v":""},{"$f":"IF(B47=\"\",\"\",CONCATENATE(Riepilogo!K65,ConfigurationTS3L4!J462))","v":""},null,{"$f":"IF(Riepilogo!N65>0,Riepilogo!N65/$E$2,\"\")","v":""},{"$f":"IF(E47=\"\",\"\",CONCATENATE(Riepilogo!K65,ConfigurationTS3L4!T462))","v":""},null,{"$f":"IF(Riepilogo!O65>0,Riepilogo!O65/$H$2,\"\")","v":""},{"$f":"IF(H47=\"\",\"\",CONCATENATE(Riepilogo!K65,ConfigurationTS3L4!AD462))","v":""},null,null,0,null,null,0,null,null,0,null,null,0,0,{"$f":"ISODD(SUM($V$5:V47))","v":false}]
[null,{"$f":"IF(Riepilogo!M66>0,Riepilogo!M66/$B$2,\"\")","v":""},{"$f":"IF(B48=\"\",\"\",CONCATENATE(Riepilogo!K66,ConfigurationTS3L4!J463))","v":""},null,{"$f":"IF(Riepilogo!N66>0,Riepilogo!N66/$E$2,\"\")","v":""},{"$f":"IF(E48=\"\",\"\",CONCATENATE(Riepilogo!K66,ConfigurationTS3L4!T463))","v":""},null,{"$f":"IF(Riepilogo!O66>0,Riepilogo!O66/$H$2,\"\")","v":""},{"$f":"IF(H48=\"\",\"\",CONCATENATE(Riepilogo!K66,ConfigurationTS3L4!AD463))","v":""},null,null,0,null,null,0,null,null,0,null,null,0,0,{"$f":"ISODD(SUM($V$5:V48))","v":false}]
[null,{"$f":"IF(Riepilogo!M67>0,Riepilogo!M67/$B$2,\"\")","v":""},{"$f":"IF(B49=\"\",\"\",CONCATENATE(Riepilogo!K67,ConfigurationTS3L4!J464))","v":""},null,{"$f":"IF(Riepilogo!N67>0,Riepilogo!N67/$E$2,\"\")","v":""},{"$f":"IF(E49=\"\",\"\",CONCATENATE(Riepilogo!K67,ConfigurationTS3L4!T464))","v":""},null,{"$f":"IF(Riepilogo!O67>0,Riepilogo!O67/$H$2,\"\")","v":""},{"$f":"IF(H49=\"\",\"\",CONCATENATE(Riepilogo!K67,ConfigurationTS3L4!AD464))","v":""},null,null,0,null,null,0,null,null,0,null,null,0,0,{"$f":"ISODD(SUM($V$5:V49))","v":false}]
[null,{"$f":"IF(Riepilogo!M68>0,Riepilogo!M68/$B$2,\"\")","v":""},{"$f":"IF(B50=\"\",\"\",CONCATENATE(Riepilogo!K68,ConfigurationTS3L4!J465))","v":""},null,{"$f":"IF(Riepilogo!N68>0,Riepilogo!N68/$E$2,\"\")","v":""},{"$f":"IF(E50=\"\",\"\",CONCATENATE(Riepilogo!K68,ConfigurationTS3L4!T465))","v":""},null,{"$f":"IF(Riepilogo!O68>0,Riepilogo!O68/$H$2,\"\")","v":""},{"$f":"IF(H50=\"\",\"\",CONCATENATE(Riepilogo!K68,ConfigurationTS3L4!AD465))","v":""},null,null,0,null,null,0,null,null,0,null,null,0,0,{"$f":"ISODD(SUM($V$5:V50))","v":false}]
[null,{"$f":"IF(Riepilogo!M69>0,Riepilogo!M69/$B$2,\"\")","v":""},{"$f":"IF(B51=\"\",\"\",CONCATENATE(Riepilogo!K69,ConfigurationTS3L4!J466))","v":""},null,{"$f":"IF(Riepilogo!N69>0,Riepilogo!N69/$E$2,\"\")","v":""},{"$f":"IF(E51=\"\",\"\",CONCATENATE(Riepilogo!K69,ConfigurationTS3L4!T466))","v":""},null,{"$f":"IF(Riepilogo!O69>0,Riepilogo!O69/$H$2,\"\")","v":""},{"$f":"IF(H51=\"\",\"\",CONCATENATE(Riepilogo!K69,ConfigurationTS3L4!AD466))","v":""},null,null,0,null,null,0,null,null,0,null,null,0,0,{"$f":"ISODD(SUM($V$5:V51))","v":false}]
[null,{"$f":"IF(Riepilogo!M70>0,Riepilogo!M70/$B$2,\"\")","v":""},{"$f":"IF(B52=\"\",\"\",CONCATENATE(Riepilogo!K70,ConfigurationTS3L4!J467))","v":""},null,{"$f":"IF(Riepilogo!N70>0,Riepilogo!N70/$E$2,\"\")","v":""},{"$f":"IF(E52=\"\",\"\",CONCATENATE(Riepilogo!K70,ConfigurationTS3L4!T467))","v":""},null,{"$f":"IF(Riepilogo!O70>0,Riepilogo!O70/$H$2,\"\")","v":""},{"$f":"IF(H52=\"\",\"\",CONCATENATE(Riepilogo!K70,ConfigurationTS3L4!AD467))","v":""},null,null,0,null,null,0,null,null,0,null,null,0,0,{"$f":"ISODD(SUM($V$5:V52))","v":false}]
[null,{"$f":"IF(Riepilogo!M71>0,Riepilogo!M71/$B$2,\"\")","v":""},{"$f":"IF(B53=\"\",\"\",CONCATENATE(Riepilogo!K71,ConfigurationTS3L4!J468))","v":""},null,{"$f":"IF(Riepilogo!N71>0,Riepilogo!N71/$E$2,\"\")","v":""},{"$f":"IF(E53=\"\",\"\",CONCATENATE(Riepilogo!K71,ConfigurationTS3L4!T468))","v":""},null,{"$f":"IF(Riepilogo!O71>0,Riepilogo!O71/$H$2,\"\")","v":""},{"$f":"IF(H53=\"\",\"\",CONCATENATE(Riepilogo!K71,ConfigurationTS3L4!AD468))","v":""},null,null,0,null,null,0,null,null,0,null,null,0,0,{"$f":"ISODD(SUM($V$5:V53))","v":false}]
[null,{"$f":"IF(Riepilogo!M72>0,Riepilogo!M72/$B$2,\"\")","v":""},{"$f":"IF(B54=\"\",\"\",CONCATENATE(Riepilogo!K72,ConfigurationTS3L4!J469))","v":""},null,{"$f":"IF(Riepilogo!N72>0,Riepilogo!N72/$E$2,\"\")","v":""},{"$f":"IF(E54=\"\",\"\",CONCATENATE(Riepilogo!K72,ConfigurationTS3L4!T469))","v":""},null,{"$f":"IF(Riepilogo!O72>0,Riepilogo!O72/$H$2,\"\")","v":""},{"$f":"IF(H54=\"\",\"\",CONCATENATE(Riepilogo!K72,ConfigurationTS3L4!AD469))","v":""},null,null,0,null,null,0,null,null,0,null,null,0,0,{"$f":"ISODD(SUM($V$5:V54))","v":false}]
[null,{"$f":"IF(Riepilogo!M73>0,Riepilogo!M73/$B$2,\"\")","v":""},{"$f":"IF(B55=\"\",\"\",CONCATENATE(Riepilogo!K73,ConfigurationTS3L4!J470))","v":""},null,{"$f":"IF(Riepilogo!N73>0,Riepilogo!N73/$E$2,\"\")","v":""},{"$f":"IF(E55=\"\",\"\",CONCATENATE(Riepilogo!K73,ConfigurationTS3L4!T470))","v":""},null,{"$f":"IF(Riepilogo!O73>0,Riepilogo!O73/$H$2,\"\")","v":""},{"$f":"IF(H55=\"\",\"\",CONCATENATE(Riepilogo!K73,ConfigurationTS3L4!AD470))","v":""},null,null,{"$f":"IF(B55=\"\",0,B55)","v":0},null,null,{"$f":"IF(E55=\"\",0,E55)","v":0},null,null,{"$f":"IF(H55=\"\",0,H55)","v":0},null,null,{"$f":"SUM(L55:T55)","v":0},{"$f":"IF(U55>0,1,0)","v":0},{"$f":"ISODD(SUM($V$5:V55))","v":false}]
[null,{"$f":"IF(Riepilogo!M74>0,Riepilogo!M74/$B$2,\"\")","v":""},{"$f":"IF(B56=\"\",\"\",CONCATENATE(Riepilogo!K74,ConfigurationTS3L4!J471))","v":""},null,{"$f":"IF(Riepilogo!N74>0,Riepilogo!N74/$E$2,\"\")","v":""},{"$f":"IF(E56=\"\",\"\",CONCATENATE(Riepilogo!K74,ConfigurationTS3L4!T471))","v":""},null,{"$f":"IF(Riepilogo!O74>0,Riepilogo!O74/$H$2,\"\")","v":""},{"$f":"IF(H56=\"\",\"\",CONCATENATE(Riepilogo!K74,ConfigurationTS3L4!AD471))","v":""},null,null,0,null,null,0,null,null,0,null,null,0,0,{"$f":"ISODD(SUM($V$5:V56))","v":false}]
[null,{"$f":"IF(Riepilogo!M75>0,Riepilogo!M75/$B$2,\"\")","v":""},{"$f":"IF(B57=\"\",\"\",CONCATENATE(Riepilogo!K75,ConfigurationTS3L4!J472))","v":""},null,{"$f":"IF(Riepilogo!N75>0,Riepilogo!N75/$E$2,\"\")","v":""},{"$f":"IF(E57=\"\",\"\",CONCATENATE(Riepilogo!K75,ConfigurationTS3L4!T472))","v":""},null,{"$f":"IF(Riepilogo!O75>0,Riepilogo!O75/$H$2,\"\")","v":""},{"$f":"IF(H57=\"\",\"\",CONCATENATE(Riepilogo!K75,ConfigurationTS3L4!AD472))","v":""},null,null,0,null,null,0,null,null,0,null,null,0,0,{"$f":"ISODD(SUM($V$5:V57))","v":false}]
[null,{"$f":"IF(Riepilogo!M76>0,Riepilogo!M76/$B$2,\"\")","v":""},{"$f":"IF(B58=\"\",\"\",CONCATENATE(Riepilogo!K76,ConfigurationTS3L4!J473))","v":""},null,{"$f":"IF(Riepilogo!N76>0,Riepilogo!N76/$E$2,\"\")","v":""},{"$f":"IF(E58=\"\",\"\",CONCATENATE(Riepilogo!K76,ConfigurationTS3L4!T473))","v":""},null,{"$f":"IF(Riepilogo!O76>0,Riepilogo!O76/$H$2,\"\")","v":""},{"$f":"IF(H58=\"\",\"\",CONCATENATE(Riepilogo!K76,ConfigurationTS3L4!AD473))","v":""},null,null,0,null,null,0,null,null,0,null,null,0,0,{"$f":"ISODD(SUM($V$5:V58))","v":false}]
[null,{"$f":"IF(Riepilogo!M77>0,Riepilogo!M77/$B$2,\"\")","v":""},{"$f":"IF(B59=\"\",\"\",CONCATENATE(Riepilogo!K77,ConfigurationTS3L4!J474))","v":""},null,{"$f":"IF(Riepilogo!N77>0,Riepilogo!N77/$E$2,\"\")","v":""},{"$f":"IF(E59=\"\",\"\",CONCATENATE(Riepilogo!K77,ConfigurationTS3L4!T474))","v":""},null,{"$f":"IF(Riepilogo!O77>0,Riepilogo!O77/$H$2,\"\")","v":""},{"$f":"IF(H59=\"\",\"\",CONCATENATE(Riepilogo!K77,ConfigurationTS3L4!AD474))","v":""},null,null,0,null,null,0,null,null,0,null,null,0,0,{"$f":"ISODD(SUM($V$5:V59))","v":false}]
[null,{"$f":"IF(Riepilogo!M78>0,Riepilogo!M78/$B$2,\"\")","v":""},{"$f":"IF(B60=\"\",\"\",CONCATENATE(Riepilogo!K78,ConfigurationTS3L4!J475))","v":""},null,{"$f":"IF(Riepilogo!N78>0,Riepilogo!N78/$E$2,\"\")","v":""},{"$f":"IF(E60=\"\",\"\",CONCATENATE(Riepilogo!K78,ConfigurationTS3L4!T475))","v":""},null,{"$f":"IF(Riepilogo!O78>0,Riepilogo!O78/$H$2,\"\")","v":""},{"$f":"IF(H60=\"\",\"\",CONCATENATE(Riepilogo!K78,ConfigurationTS3L4!AD475))","v":""},null,null,0,null,null,0,null,null,0,null,null,0,0,{"$f":"ISODD(SUM($V$5:V60))","v":false}]
[null,{"$f":"IF(Riepilogo!M79>0,Riepilogo!M79/$B$2,\"\")","v":""},{"$f":"IF(B61=\"\",\"\",CONCATENATE(Riepilogo!K79,ConfigurationTS3L4!J476))","v":""},null,{"$f":"IF(Riepilogo!N79>0,Riepilogo!N79/$E$2,\"\")","v":""},{"$f":"IF(E61=\"\",\"\",CONCATENATE(Riepilogo!K79,ConfigurationTS3L4!T476))","v":""},null,{"$f":"IF(Riepilogo!O79>0,Riepilogo!O79/$H$2,\"\")","v":""},{"$f":"IF(H61=\"\",\"\",CONCATENATE(Riepilogo!K79,ConfigurationTS3L4!AD476))","v":""},null,null,0,null,null,0,null,null,0,null,null,0,0,{"$f":"ISODD(SUM($V$5:V61))","v":false}]
[null,{"$f":"IF(Riepilogo!M80>0,Riepilogo!M80/$B$2,\"\")","v":""},{"$f":"IF(B62=\"\",\"\",CONCATENATE(Riepilogo!K80,ConfigurationTS3L4!J477))","v":""},null,{"$f":"IF(Riepilogo!N80>0,Riepilogo!N80/$E$2,\"\")","v":""},{"$f":"IF(E62=\"\",\"\",CONCATENATE(Riepilogo!K80,ConfigurationTS3L4!T477))","v":""},null,{"$f":"IF(Riepilogo!O80>0,Riepilogo!O80/$H$2,\"\")","v":""},{"$f":"IF(H62=\"\",\"\",CONCATENATE(Riepilogo!K80,ConfigurationTS3L4!AD477))","v":""},null,null,0,null,null,0,null,null,0,null,null,0,0,{"$f":"ISODD(SUM($V$5:V62))","v":false}]
[null,{"$f":"IF(Riepilogo!M81>0,Riepilogo!M81/$B$2,\"\")","v":""},{"$f":"IF(B63=\"\",\"\",CONCATENATE(Riepilogo!K81,ConfigurationTS3L4!J478))","v":""},null,{"$f":"IF(Riepilogo!N81>0,Riepilogo!N81/$E$2,\"\")","v":""},{"$f":"IF(E63=\"\",\"\",CONCATENATE(Riepilogo!K81,ConfigurationTS3L4!T478))","v":""},null,{"$f":"IF(Riepilogo!O81>0,Riepilogo!O81/$H$2,\"\")","v":""},{"$f":"IF(H63=\"\",\"\",CONCATENATE(Riepilogo!K81,ConfigurationTS3L4!AD478))","v":""},null,null,0,null,null,0,null,null,0,null,null,0,0,{"$f":"ISODD(SUM($V$5:V63))","v":false}]
[null,{"$f":"IF(Riepilogo!M82>0,Riepilogo!M82/$B$2,\"\")","v":""},{"$f":"IF(B64=\"\",\"\",CONCATENATE(Riepilogo!K82,ConfigurationTS3L4!J479))","v":""},null,{"$f":"IF(Riepilogo!N82>0,Riepilogo!N82/$E$2,\"\")","v":""},{"$f":"IF(E64=\"\",\"\",CONCATENATE(Riepilogo!K82,ConfigurationTS3L4!T479))","v":""},null,{"$f":"IF(Riepilogo!O82>0,Riepilogo!O82/$H$2,\"\")","v":""},{"$f":"IF(H64=\"\",\"\",CONCATENATE(Riepilogo!K82,ConfigurationTS3L4!AD479))","v":""},null,null,0,null,null,0,null,null,0,null,null,0,0,{"$f":"ISODD(SUM($V$5:V64))","v":false}]
[null,{"$f":"IF(Riepilogo!M83>0,Riepilogo!M83/$B$2,\"\")","v":""},{"$f":"IF(B65=\"\",\"\",CONCATENATE(Riepilogo!K83,ConfigurationTS3L4!J480))","v":""},null,{"$f":"IF(Riepilogo!N83>0,Riepilogo!N83/$E$2,\"\")","v":""},{"$f":"IF(E65=\"\",\"\",CONCATENATE(Riepilogo!K83,ConfigurationTS3L4!T480))","v":""},null,{"$f":"IF(Riepilogo!O83>0,Riepilogo!O83/$H$2,\"\")","v":""},{"$f":"IF(H65=\"\",\"\",CONCATENATE(Riepilogo!K83,ConfigurationTS3L4!AD480))","v":""},null,null,0,null,null,0,null,null,0,null,null,0,0,{"$f":"ISODD(SUM($V$5:V65))","v":false}]
[null,{"$f":"IF(Riepilogo!M84>0,Riepilogo!M84/$B$2,\"\")","v":""},{"$f":"IF(B66=\"\",\"\",CONCATENATE(Riepilogo!K84,ConfigurationTS3L4!J481))","v":""},null,{"$f":"IF(Riepilogo!N84>0,Riepilogo!N84/$E$2,\"\")","v":""},{"$f":"IF(E66=\"\",\"\",CONCATENATE(Riepilogo!K84,ConfigurationTS3L4!T481))","v":""},null,{"$f":"IF(Riepilogo!O84>0,Riepilogo!O84/$H$2,\"\")","v":""},{"$f":"IF(H66=\"\",\"\",CONCATENATE(Riepilogo!K84,ConfigurationTS3L4!AD481))","v":""},null,null,0,null,null,0,null,null,0,null,null,0,0,{"$f":"ISODD(SUM($V$5:V66))","v":false}]
[null,{"$f":"IF(Riepilogo!M85>0,Riepilogo!M85/$B$2,\"\")","v":""},{"$f":"IF(B67=\"\",\"\",CONCATENATE(Riepilogo!K85,ConfigurationTS3L4!J482))","v":""},null,{"$f":"IF(Riepilogo!N85>0,Riepilogo!N85/$E$2,\"\")","v":""},{"$f":"IF(E67=\"\",\"\",CONCATENATE(Riepilogo!K85,ConfigurationTS3L4!T482))","v":""},null,{"$f":"IF(Riepilogo!O85>0,Riepilogo!O85/$H$2,\"\")","v":""},{"$f":"IF(H67=\"\",\"\",CONCATENATE(Riepilogo!K85,ConfigurationTS3L4!AD482))","v":""},null,null,0,null,null,0,null,null,0,null,null,0,0,{"$f":"ISODD(SUM($V$5:V67))","v":false}]
[null,{"$f":"IF(Riepilogo!M86>0,Riepilogo!M86/$B$2,\"\")","v":""},{"$f":"IF(B68=\"\",\"\",CONCATENATE(Riepilogo!K86,ConfigurationTS3L4!J483))","v":""},null,{"$f":"IF(Riepilogo!N86>0,Riepilogo!N86/$E$2,\"\")","v":""},{"$f":"IF(E68=\"\",\"\",CONCATENATE(Riepilogo!K86,ConfigurationTS3L4!T483))","v":""},null,{"$f":"IF(Riepilogo!O86>0,Riepilogo!O86/$H$2,\"\")","v":""},{"$f":"IF(H68=\"\",\"\",CONCATENATE(Riepilogo!K86,ConfigurationTS3L4!AD483))","v":""},null,null,0,null,null,0,null,null,0,null,null,0,0,{"$f":"ISODD(SUM($V$5:V68))","v":false}]
[null,{"$f":"IF(Riepilogo!M87>0,Riepilogo!M87/$B$2,\"\")","v":""},{"$f":"IF(B69=\"\",\"\",CONCATENATE(Riepilogo!K87,ConfigurationTS3L4!J484))","v":""},null,{"$f":"IF(Riepilogo!N87>0,Riepilogo!N87/$E$2,\"\")","v":""},{"$f":"IF(E69=\"\",\"\",CONCATENATE(Riepilogo!K87,ConfigurationTS3L4!T484))","v":""},null,{"$f":"IF(Riepilogo!O87>0,Riepilogo!O87/$H$2,\"\")","v":""},{"$f":"IF(H69=\"\",\"\",CONCATENATE(Riepilogo!K87,ConfigurationTS3L4!AD484))","v":""},null,null,0,null,null,0,null,null,0,null,null,0,0,{"$f":"ISODD(SUM($V$5:V69))","v":false}]
[null,{"$f":"IF(Riepilogo!M88>0,Riepilogo!M88/$B$2,\"\")","v":""},{"$f":"IF(B70=\"\",\"\",CONCATENATE(Riepilogo!K88,ConfigurationTS3L4!J485))","v":""},null,{"$f":"IF(Riepilogo!N88>0,Riepilogo!N88/$E$2,\"\")","v":""},{"$f":"IF(E70=\"\",\"\",CONCATENATE(Riepilogo!K88,ConfigurationTS3L4!T485))","v":""},null,{"$f":"IF(Riepilogo!O88>0,Riepilogo!O88/$H$2,\"\")","v":""},{"$f":"IF(H70=\"\",\"\",CONCATENATE(Riepilogo!K88,ConfigurationTS3L4!AD485))","v":""},null,null,0,null,null,0,null,null,0,null,null,0,0,{"$f":"ISODD(SUM($V$5:V70))","v":false}]
[null,{"$f":"IF(Riepilogo!M89>0,Riepilogo!M89/$B$2,\"\")","v":""},{"$f":"IF(B71=\"\",\"\",CONCATENATE(Riepilogo!K89,ConfigurationTS3L4!J486))","v":""},null,{"$f":"IF(Riepilogo!N89>0,Riepilogo!N89/$E$2,\"\")","v":""},{"$f":"IF(E71=\"\",\"\",CONCATENATE(Riepilogo!K89,ConfigurationTS3L4!T486))","v":""},null,{"$f":"IF(Riepilogo!O89>0,Riepilogo!O89/$H$2,\"\")","v":""},{"$f":"IF(H71=\"\",\"\",CONCATENATE(Riepilogo!K89,ConfigurationTS3L4!AD486))","v":""},null,null,{"$f":"IF(B71=\"\",0,B71)","v":0},null,null,{"$f":"IF(E71=\"\",0,E71)","v":0},null,null,{"$f":"IF(H71=\"\",0,H71)","v":0},null,null,{"$f":"SUM(L71:T71)","v":0},{"$f":"IF(U71>0,1,0)","v":0},{"$f":"ISODD(SUM($V$5:V71))","v":false}]
[null,{"$f":"IF(Riepilogo!M90>0,Riepilogo!M90/$B$2,\"\")","v":""},{"$f":"IF(B72=\"\",\"\",CONCATENATE(Riepilogo!K90,ConfigurationTS3L4!J487))","v":""},null,{"$f":"IF(Riepilogo!N90>0,Riepilogo!N90/$E$2,\"\")","v":""},{"$f":"IF(E72=\"\",\"\",CONCATENATE(Riepilogo!K90,ConfigurationTS3L4!T487))","v":""},null,{"$f":"IF(Riepilogo!O90>0,Riepilogo!O90/$H$2,\"\")","v":""},{"$f":"IF(H72=\"\",\"\",CONCATENATE(Riepilogo!K90,ConfigurationTS3L4!AD487))","v":""},null,null,0,null,null,0,null,null,0,null,null,0,0,{"$f":"ISODD(SUM($V$5:V72))","v":false}]
[null,{"$f":"IF(Riepilogo!M91>0,Riepilogo!M91/$B$2,\"\")","v":""},{"$f":"IF(B73=\"\",\"\",CONCATENATE(Riepilogo!K91,ConfigurationTS3L4!J488))","v":""},null,{"$f":"IF(Riepilogo!N91>0,Riepilogo!N91/$E$2,\"\")","v":""},{"$f":"IF(E73=\"\",\"\",CONCATENATE(Riepilogo!K91,ConfigurationTS3L4!T488))","v":""},null,{"$f":"IF(Riepilogo!O91>0,Riepilogo!O91/$H$2,\"\")","v":""},{"$f":"IF(H73=\"\",\"\",CONCATENATE(Riepilogo!K91,ConfigurationTS3L4!AD488))","v":""},null,null,0,null,null,0,null,null,0,null,null,0,0,{"$f":"ISODD(SUM($V$5:V73))","v":false}]
[null,{"$f":"IF(Riepilogo!M92>0,Riepilogo!M92/$B$2,\"\")","v":""},{"$f":"IF(B74=\"\",\"\",CONCATENATE(Riepilogo!K92,ConfigurationTS3L4!J489))","v":""},null,{"$f":"IF(Riepilogo!N92>0,Riepilogo!N92/$E$2,\"\")","v":""},{"$f":"IF(E74=\"\",\"\",CONCATENATE(Riepilogo!K92,ConfigurationTS3L4!T489))","v":""},null,{"$f":"IF(Riepilogo!O92>0,Riepilogo!O92/$H$2,\"\")","v":""},{"$f":"IF(H74=\"\",\"\",CONCATENATE(Riepilogo!K92,ConfigurationTS3L4!AD489))","v":""},null,null,{"$f":"IF(B74=\"\",0,B74)","v":0},null,null,{"$f":"IF(E74=\"\",0,E74)","v":0},null,null,{"$f":"IF(H74=\"\",0,H74)","v":0},null,null,{"$f":"SUM(L74:T74)","v":0},{"$f":"IF(U74>0,1,0)","v":0},{"$f":"ISODD(SUM($V$5:V74))","v":false}]
[null,{"$f":"IF(Riepilogo!M93>0,Riepilogo!M93/$B$2,\"\")","v":""},{"$f":"IF(B75=\"\",\"\",CONCATENATE(Riepilogo!K93,ConfigurationTS3L4!J490))","v":""},null,{"$f":"IF(Riepilogo!N93>0,Riepilogo!N93/$E$2,\"\")","v":""},{"$f":"IF(E75=\"\",\"\",CONCATENATE(Riepilogo!K93,ConfigurationTS3L4!T490))","v":""},null,{"$f":"IF(Riepilogo!O93>0,Riepilogo!O93/$H$2,\"\")","v":""},{"$f":"IF(H75=\"\",\"\",CONCATENATE(Riepilogo!K93,ConfigurationTS3L4!AD490))","v":""},null,null,0,null,null,0,null,null,0,null,null,0,0,{"$f":"ISODD(SUM($V$5:V75))","v":false}]
[null,{"$f":"IF(Riepilogo!M94>0,Riepilogo!M94/$B$2,\"\")","v":""},{"$f":"IF(B76=\"\",\"\",CONCATENATE(Riepilogo!K94,ConfigurationTS3L4!J490))","v":""},null,{"$f":"IF(Riepilogo!N94>0,Riepilogo!N94/$E$2,\"\")","v":""},{"$f":"IF(E76=\"\",\"\",CONCATENATE(Riepilogo!K94,ConfigurationTS3L4!T490))","v":""},null,{"$f":"IF(Riepilogo!O94>0,Riepilogo!O94/$H$2,\"\")","v":""},{"$f":"IF(H76=\"\",\"\",CONCATENATE(Riepilogo!K94,ConfigurationTS3L4!AD490))","v":""},null,null,0,null,null,0,null,null,0,null,null,0,0,{"$f":"ISODD(SUM($V$5:V76))","v":false}]
[null,{"$f":"IF(Riepilogo!M95>0,Riepilogo!M95/$B$2,\"\")","v":""},{"$f":"IF(B77=\"\",\"\",CONCATENATE(Riepilogo!K95,ConfigurationTS3L4!J491))","v":""},null,{"$f":"IF(Riepilogo!N95>0,Riepilogo!N95/$E$2,\"\")","v":""},{"$f":"IF(E77=\"\",\"\",CONCATENATE(Riepilogo!K95,ConfigurationTS3L4!T491))","v":""},null,{"$f":"IF(Riepilogo!O95>0,Riepilogo!O95/$H$2,\"\")","v":""},{"$f":"IF(H77=\"\",\"\",CONCATENATE(Riepilogo!K95,ConfigurationTS3L4!AD491))","v":""},null,null,0,null,null,0,null,null,0,null,null,0,0,{"$f":"ISODD(SUM($V$5:V77))","v":false}]
[null,{"$f":"IF(Riepilogo!M96>0,Riepilogo!M96/$B$2,\"\")","v":""},{"$f":"IF(B78=\"\",\"\",CONCATENATE(Riepilogo!K96,ConfigurationTS3L4!J492))","v":""},null,{"$f":"IF(Riepilogo!N96>0,Riepilogo!N96/$E$2,\"\")","v":""},{"$f":"IF(E78=\"\",\"\",CONCATENATE(Riepilogo!K96,ConfigurationTS3L4!T492))","v":""},null,{"$f":"IF(Riepilogo!O96>0,Riepilogo!O96/$H$2,\"\")","v":""},{"$f":"IF(H78=\"\",\"\",CONCATENATE(Riepilogo!K96,ConfigurationTS3L4!AD492))","v":""},null,null,0,null,null,0,null,null,0,null,null,0,0,{"$f":"ISODD(SUM($V$5:V78))","v":false}]
[null,{"$f":"IF(Riepilogo!M97>0,Riepilogo!M97/$B$2,\"\")","v":""},{"$f":"IF(B79=\"\",\"\",CONCATENATE(Riepilogo!K97,ConfigurationTS3L4!J493))","v":""},null,{"$f":"IF(Riepilogo!N97>0,Riepilogo!N97/$E$2,\"\")","v":""},{"$f":"IF(E79=\"\",\"\",CONCATENATE(Riepilogo!K97,ConfigurationTS3L4!T493))","v":""},null,{"$f":"IF(Riepilogo!O97>0,Riepilogo!O97/$H$2,\"\")","v":""},{"$f":"IF(H79=\"\",\"\",CONCATENATE(Riepilogo!K97,ConfigurationTS3L4!AD493))","v":""},null,null,0,null,null,0,null,null,0,null,null,0,0,{"$f":"ISODD(SUM($V$5:V79))","v":false}]
[null,{"$f":"IF(Riepilogo!M98>0,Riepilogo!M98/$B$2,\"\")","v":""},{"$f":"IF(B80=\"\",\"\",CONCATENATE(Riepilogo!K98,ConfigurationTS3L4!J494))","v":""},null,{"$f":"IF(Riepilogo!N98>0,Riepilogo!N98/$E$2,\"\")","v":""},{"$f":"IF(E80=\"\",\"\",CONCATENATE(Riepilogo!K98,ConfigurationTS3L4!T494))","v":""},null,{"$f":"IF(Riepilogo!O98>0,Riepilogo!O98/$H$2,\"\")","v":""},{"$f":"IF(H80=\"\",\"\",CONCATENATE(Riepilogo!K98,ConfigurationTS3L4!AD494))","v":""},null,null,0,null,null,0,null,null,0,null,null,0,0,{"$f":"ISODD(SUM($V$5:V80))","v":false}]
[null,{"$f":"IF(Riepilogo!M99>0,Riepilogo!M99/$B$2,\"\")","v":""},{"$f":"IF(B81=\"\",\"\",CONCATENATE(Riepilogo!K99,ConfigurationTS3L4!J495))","v":""},null,{"$f":"IF(Riepilogo!N99>0,Riepilogo!N99/$E$2,\"\")","v":""},{"$f":"IF(E81=\"\",\"\",CONCATENATE(Riepilogo!K99,ConfigurationTS3L4!T495))","v":""},null,{"$f":"IF(Riepilogo!O99>0,Riepilogo!O99/$H$2,\"\")","v":""},{"$f":"IF(H81=\"\",\"\",CONCATENATE(Riepilogo!K99,ConfigurationTS3L4!AD495))","v":""},null,null,0,null,null,0,null,null,0,null,null,0,0,{"$f":"ISODD(SUM($V$5:V81))","v":false}]
[null,{"$f":"IF(Riepilogo!M100>0,Riepilogo!M100/$B$2,\"\")","v":""},{"$f":"IF(B82=\"\",\"\",CONCATENATE(Riepilogo!K100,ConfigurationTS3L4!J496))","v":""},null,{"$f":"IF(Riepilogo!N100>0,Riepilogo!N100/$E$2,\"\")","v":""},{"$f":"IF(E82=\"\",\"\",CONCATENATE(Riepilogo!K100,ConfigurationTS3L4!T496))","v":""},null,{"$f":"IF(Riepilogo!O100>0,Riepilogo!O100/$H$2,\"\")","v":""},{"$f":"IF(H82=\"\",\"\",CONCATENATE(Riepilogo!K100,ConfigurationTS3L4!AD496))","v":""},null,null,0,null,null,0,null,null,0,null,null,0,0,{"$f":"ISODD(SUM($V$5:V82))","v":false}]
[null,{"$f":"IF(Riepilogo!M101>0,Riepilogo!M101/$B$2,\"\")","v":""},{"$f":"IF(B83=\"\",\"\",CONCATENATE(Riepilogo!K101,ConfigurationTS3L4!J497))","v":""},null,{"$f":"IF(Riepilogo!N101>0,Riepilogo!N101/$E$2,\"\")","v":""},{"$f":"IF(E83=\"\",\"\",CONCATENATE(Riepilogo!K101,ConfigurationTS3L4!T497))","v":""},null,{"$f":"IF(Riepilogo!O101>0,Riepilogo!O101/$H$2,\"\")","v":""},{"$f":"IF(H83=\"\",\"\",CONCATENATE(Riepilogo!K101,ConfigurationTS3L4!AD497))","v":""},null,null,0,null,null,0,null,null,0,null,null,0,0,{"$f":"ISODD(SUM($V$5:V83))","v":false}]
[null,{"$f":"IF(Riepilogo!M102>0,Riepilogo!M102/$B$2,\"\")","v":""},{"$f":"IF(B84=\"\",\"\",CONCATENATE(Riepilogo!K102,ConfigurationTS3L4!J498))","v":""},null,{"$f":"IF(Riepilogo!N102>0,Riepilogo!N102/$E$2,\"\")","v":""},{"$f":"IF(E84=\"\",\"\",CONCATENATE(Riepilogo!K102,ConfigurationTS3L4!T498))","v":""},null,{"$f":"IF(Riepilogo!O102>0,Riepilogo!O102/$H$2,\"\")","v":""},{"$f":"IF(H84=\"\",\"\",CONCATENATE(Riepilogo!K102,ConfigurationTS3L4!AD498))","v":""},null,null,0,null,null,0,null,null,0,null,null,0,0,{"$f":"ISODD(SUM($V$5:V84))","v":false}]
[null,{"$f":"IF(Riepilogo!M103>0,Riepilogo!M103/$B$2,\"\")","v":""},{"$f":"IF(B85=\"\",\"\",CONCATENATE(Riepilogo!K103,ConfigurationTS3L4!J499))","v":""},null,{"$f":"IF(Riepilogo!N103>0,Riepilogo!N103/$E$2,\"\")","v":""},{"$f":"IF(E85=\"\",\"\",CONCATENATE(Riepilogo!K103,ConfigurationTS3L4!T499))","v":""},null,{"$f":"IF(Riepilogo!O103>0,Riepilogo!O103/$H$2,\"\")","v":""},{"$f":"IF(H85=\"\",\"\",CONCATENATE(Riepilogo!K103,ConfigurationTS3L4!AD499))","v":""},null,null,0,null,null,0,null,null,0,null,null,0,0,{"$f":"ISODD(SUM($V$5:V85))","v":false}]
[null,{"$f":"IF(Riepilogo!M104>0,Riepilogo!M104/$B$2,\"\")","v":""},{"$f":"IF(B86=\"\",\"\",CONCATENATE(Riepilogo!K104,ConfigurationTS3L4!J500))","v":""},null,{"$f":"IF(Riepilogo!N104>0,Riepilogo!N104/$E$2,\"\")","v":""},{"$f":"IF(E86=\"\",\"\",CONCATENATE(Riepilogo!K104,ConfigurationTS3L4!T500))","v":""},null,{"$f":"IF(Riepilogo!O104>0,Riepilogo!O104/$H$2,\"\")","v":""},{"$f":"IF(H86=\"\",\"\",CONCATENATE(Riepilogo!K104,ConfigurationTS3L4!AD500))","v":""},null,null,0,null,null,0,null,null,0,null,null,0,0,{"$f":"ISODD(SUM($V$5:V86))","v":false}]
[null,{"$f":"IF(Riepilogo!M105>0,Riepilogo!M105/$B$2,\"\")","v":""},{"$f":"IF(B87=\"\",\"\",CONCATENATE(Riepilogo!K105,ConfigurationTS3L4!J501))","v":""},null,{"$f":"IF(Riepilogo!N105>0,Riepilogo!N105/$E$2,\"\")","v":""},{"$f":"IF(E87=\"\",\"\",CONCATENATE(Riepilogo!K105,ConfigurationTS3L4!T501))","v":""},null,{"$f":"IF(Riepilogo!O105>0,Riepilogo!O105/$H$2,\"\")","v":""},{"$f":"IF(H87=\"\",\"\",CONCATENATE(Riepilogo!K105,ConfigurationTS3L4!AD501))","v":""},null,null,0,null,null,0,null,null,0,null,null,0,0,{"$f":"ISODD(SUM($V$5:V87))","v":false}]
[null,{"$f":"IF(Riepilogo!M106>0,Riepilogo!M106/$B$2,\"\")","v":""},{"$f":"IF(B88=\"\",\"\",CONCATENATE(Riepilogo!K106,ConfigurationTS3L4!J502))","v":""},null,{"$f":"IF(Riepilogo!N106>0,Riepilogo!N106/$E$2,\"\")","v":""},{"$f":"IF(E88=\"\",\"\",CONCATENATE(Riepilogo!K106,ConfigurationTS3L4!T502))","v":""},null,{"$f":"IF(Riepilogo!O106>0,Riepilogo!O106/$H$2,\"\")","v":""},{"$f":"IF(H88=\"\",\"\",CONCATENATE(Riepilogo!K106,ConfigurationTS3L4!AD502))","v":""},null,null,0,null,null,0,null,null,0,null,null,0,0,{"$f":"ISODD(SUM($V$5:V88))","v":false}]
[null,{"$f":"IF(Riepilogo!M107>0,Riepilogo!M107/$B$2,\"\")","v":""},{"$f":"IF(B89=\"\",\"\",CONCATENATE(Riepilogo!K107,ConfigurationTS3L4!J503))","v":""},null,{"$f":"IF(Riepilogo!N107>0,Riepilogo!N107/$E$2,\"\")","v":""},{"$f":"IF(E89=\"\",\"\",CONCATENATE(Riepilogo!K107,ConfigurationTS3L4!T503))","v":""},null,{"$f":"IF(Riepilogo!O107>0,Riepilogo!O107/$H$2,\"\")","v":""},{"$f":"IF(H89=\"\",\"\",CONCATENATE(Riepilogo!K107,ConfigurationTS3L4!AD503))","v":""},null,null,0,null,null,0,null,null,0,null,null,0,0,{"$f":"ISODD(SUM($V$5:V89))","v":false}]
[null,{"$f":"IF(Riepilogo!M108>0,Riepilogo!M108/$B$2,\"\")","v":""},{"$f":"IF(B90=\"\",\"\",CONCATENATE(Riepilogo!K108,ConfigurationTS3L4!J504))","v":""},null,{"$f":"IF(Riepilogo!N108>0,Riepilogo!N108/$E$2,\"\")","v":""},{"$f":"IF(E90=\"\",\"\",CONCATENATE(Riepilogo!K108,ConfigurationTS3L4!T504))","v":""},null,{"$f":"IF(Riepilogo!O108>0,Riepilogo!O108/$H$2,\"\")","v":""},{"$f":"IF(H90=\"\",\"\",CONCATENATE(Riepilogo!K108,ConfigurationTS3L4!AD504))","v":""},null,null,0,null,null,0,null,null,0,null,null,0,0,{"$f":"ISODD(SUM($V$5:V90))","v":false}]
[null,{"$f":"IF(Riepilogo!M109>0,Riepilogo!M109/$B$2,\"\")","v":""},{"$f":"IF(B91=\"\",\"\",CONCATENATE(Riepilogo!K109,ConfigurationTS3L4!J505))","v":""},null,{"$f":"IF(Riepilogo!N109>0,Riepilogo!N109/$E$2,\"\")","v":""},{"$f":"IF(E91=\"\",\"\",CONCATENATE(Riepilogo!K109,ConfigurationTS3L4!T505))","v":""},null,{"$f":"IF(Riepilogo!O109>0,Riepilogo!O109/$H$2,\"\")","v":""},{"$f":"IF(H91=\"\",\"\",CONCATENATE(Riepilogo!K109,ConfigurationTS3L4!AD505))","v":""},null,null,0,null,null,0,null,null,0,null,null,0,0,{"$f":"ISODD(SUM($V$5:V91))","v":false}]
[null,{"$f":"IF(Riepilogo!M110>0,Riepilogo!M110/$B$2,\"\")","v":""},{"$f":"IF(B92=\"\",\"\",CONCATENATE(Riepilogo!K110,ConfigurationTS3L4!J506))","v":""},null,{"$f":"IF(Riepilogo!N110>0,Riepilogo!N110/$E$2,\"\")","v":""},{"$f":"IF(E92=\"\",\"\",CONCATENATE(Riepilogo!K110,ConfigurationTS3L4!T506))","v":""},null,{"$f":"IF(Riepilogo!O110>0,Riepilogo!O110/$H$2,\"\")","v":""},{"$f":"IF(H92=\"\",\"\",CONCATENATE(Riepilogo!K110,ConfigurationTS3L4!AD506))","v":""},null,null,0,null,null,0,null,null,0,null,null,0,0,{"$f":"ISODD(SUM($V$5:V92))","v":false}]
[null,{"$f":"IF(Riepilogo!M111>0,Riepilogo!M111/$B$2,\"\")","v":""},{"$f":"IF(B93=\"\",\"\",CONCATENATE(Riepilogo!K111,ConfigurationTS3L4!J507))","v":""},null,{"$f":"IF(Riepilogo!N111>0,Riepilogo!N111/$E$2,\"\")","v":""},{"$f":"IF(E93=\"\",\"\",CONCATENATE(Riepilogo!K111,ConfigurationTS3L4!T507))","v":""},null,{"$f":"IF(Riepilogo!O111>0,Riepilogo!O111/$H$2,\"\")","v":""},{"$f":"IF(H93=\"\",\"\",CONCATENATE(Riepilogo!K111,ConfigurationTS3L4!AD507))","v":""},null,null,0,null,null,0,null,null,0,null,null,0,0,{"$f":"ISODD(SUM($V$5:V93))","v":false}]
[null,{"$f":"IF(Riepilogo!M112>0,Riepilogo!M112/$B$2,\"\")","v":""},{"$f":"IF(B94=\"\",\"\",CONCATENATE(Riepilogo!K112,ConfigurationTS3L4!J508))","v":""},null,{"$f":"IF(Riepilogo!N112>0,Riepilogo!N112/$E$2,\"\")","v":""},{"$f":"IF(E94=\"\",\"\",CONCATENATE(Riepilogo!K112,ConfigurationTS3L4!T508))","v":""},null,{"$f":"IF(Riepilogo!O112>0,Riepilogo!O112/$H$2,\"\")","v":""},{"$f":"IF(H94=\"\",\"\",CONCATENATE(Riepilogo!K112,ConfigurationTS3L4!AD508))","v":""},null,null,0,null,null,0,null,null,0,null,null,0,0,{"$f":"ISODD(SUM($V$5:V94))","v":false}]
[null,{"$f":"IF(Riepilogo!M113>0,Riepilogo!M113/$B$2,\"\")","v":""},{"$f":"IF(B95=\"\",\"\",CONCATENATE(Riepilogo!K113,ConfigurationTS3L4!J509))","v":""},null,{"$f":"IF(Riepilogo!N113>0,Riepilogo!N113/$E$2,\"\")","v":""},{"$f":"IF(E95=\"\",\"\",CONCATENATE(Riepilogo!K113,ConfigurationTS3L4!T509))","v":""},null,{"$f":"IF(Riepilogo!O113>0,Riepilogo!O113/$H$2,\"\")","v":""},{"$f":"IF(H95=\"\",\"\",CONCATENATE(Riepilogo!K113,ConfigurationTS3L4!AD509))","v":""},null,null,0,null,null,0,null,null,0,null,null,0,0,{"$f":"ISODD(SUM($V$5:V95))","v":false}]
[null,{"$f":"IF(Riepilogo!M114>0,Riepilogo!M114/$B$2,\"\")","v":""},{"$f":"IF(B96=\"\",\"\",CONCATENATE(Riepilogo!K114,ConfigurationTS3L4!J510))","v":""},null,{"$f":"IF(Riepilogo!N114>0,Riepilogo!N114/$E$2,\"\")","v":""},{"$f":"IF(E96=\"\",\"\",CONCATENATE(Riepilogo!K114,ConfigurationTS3L4!T510))","v":""},null,{"$f":"IF(Riepilogo!O114>0,Riepilogo!O114/$H$2,\"\")","v":""},{"$f":"IF(H96=\"\",\"\",CONCATENATE(Riepilogo!K114,ConfigurationTS3L4!AD510))","v":""},null,null,0,null,null,0,null,null,0,null,null,0,0,{"$f":"ISODD(SUM($V$5:V96))","v":false}]
[null,{"$f":"IF(Riepilogo!M115>0,Riepilogo!M115/$B$2,\"\")","v":""},{"$f":"IF(B97=\"\",\"\",CONCATENATE(Riepilogo!K115,ConfigurationTS3L4!J511))","v":""},null,{"$f":"IF(Riepilogo!N115>0,Riepilogo!N115/$E$2,\"\")","v":""},{"$f":"IF(E97=\"\",\"\",CONCATENATE(Riepilogo!K115,ConfigurationTS3L4!T511))","v":""},null,{"$f":"IF(Riepilogo!O115>0,Riepilogo!O115/$H$2,\"\")","v":""},{"$f":"IF(H97=\"\",\"\",CONCATENATE(Riepilogo!K115,ConfigurationTS3L4!AD511))","v":""},null,null,0,null,null,0,null,null,0,null,null,0,0,{"$f":"ISODD(SUM($V$5:V97))","v":false}]
[null,{"$f":"IF(Riepilogo!M116>0,Riepilogo!M116/$B$2,\"\")","v":""},{"$f":"IF(B98=\"\",\"\",CONCATENATE(Riepilogo!K116,ConfigurationTS3L4!J512))","v":""},null,{"$f":"IF(Riepilogo!N116>0,Riepilogo!N116/$E$2,\"\")","v":""},{"$f":"IF(E98=\"\",\"\",CONCATENATE(Riepilogo!K116,ConfigurationTS3L4!T512))","v":""},null,{"$f":"IF(Riepilogo!O116>0,Riepilogo!O116/$H$2,\"\")","v":""},{"$f":"IF(H98=\"\",\"\",CONCATENATE(Riepilogo!K116,ConfigurationTS3L4!AD512))","v":""},null,null,0,null,null,0,null,null,0,null,null,0,0,{"$f":"ISODD(SUM($V$5:V98))","v":false}]
[null,{"$f":"IF(Riepilogo!M120>0,Riepilogo!M120/$B$2,\"\")","v":""},{"$f":"IF(B99=\"\",\"\",CONCATENATE(Riepilogo!K120,ConfigurationTS3L4!J513))","v":""},null,{"$f":"IF(Riepilogo!N120>0,Riepilogo!N120/$E$2,\"\")","v":""},{"$f":"IF(E99=\"\",\"\",CONCATENATE(Riepilogo!K120,ConfigurationTS3L4!T513))","v":""},null,{"$f":"IF(Riepilogo!O120>0,Riepilogo!O120/$H$2,\"\")","v":""},{"$f":"IF(H99=\"\",\"\",CONCATENATE(Riepilogo!K120,ConfigurationTS3L4!AD513))","v":""},null,null,0,null,null,0,null,null,0,null,null,0,0,{"$f":"ISODD(SUM($V$5:V99))","v":false}]
[null,{"$f":"IF(Riepilogo!M121>0,Riepilogo!M121/$B$2,\"\")","v":""},{"$f":"IF(B100=\"\",\"\",CONCATENATE(Riepilogo!K121,ConfigurationTS3L4!J514))","v":""},null,{"$f":"IF(Riepilogo!N121>0,Riepilogo!N121/$E$2,\"\")","v":""},{"$f":"IF(E100=\"\",\"\",CONCATENATE(Riepilogo!K121,ConfigurationTS3L4!T514))","v":""},null,{"$f":"IF(Riepilogo!O121>0,Riepilogo!O121/$H$2,\"\")","v":""},{"$f":"IF(H100=\"\",\"\",CONCATENATE(Riepilogo!K121,ConfigurationTS3L4!AD514))","v":""},null,null,0,null,null,0,null,null,0,null,null,0,0,{"$f":"ISODD(SUM($V$5:V100))","v":false}]
[null,{"$f":"IF(Riepilogo!M122>0,Riepilogo!M122/$B$2,\"\")","v":""},{"$f":"IF(B101=\"\",\"\",CONCATENATE(Riepilogo!K122,ConfigurationTS3L4!J515))","v":""},null,{"$f":"IF(Riepilogo!N122>0,Riepilogo!N122/$E$2,\"\")","v":""},{"$f":"IF(E101=\"\",\"\",CONCATENATE(Riepilogo!K122,ConfigurationTS3L4!T515))","v":""},null,{"$f":"IF(Riepilogo!O122>0,Riepilogo!O122/$H$2,\"\")","v":""},{"$f":"IF(H101=\"\",\"\",CONCATENATE(Riepilogo!K122,ConfigurationTS3L4!AD515))","v":""},null,null,0,null,null,0,null,null,0,null,null,0,0,{"$f":"ISODD(SUM($V$5:V101))","v":false}]
[null,{"$f":"IF(Riepilogo!M123>0,Riepilogo!M123/$B$2,\"\")","v":""},{"$f":"IF(B102=\"\",\"\",CONCATENATE(Riepilogo!K123,ConfigurationTS3L4!J516))","v":""},null,{"$f":"IF(Riepilogo!N123>0,Riepilogo!N123/$E$2,\"\")","v":""},{"$f":"IF(E102=\"\",\"\",CONCATENATE(Riepilogo!K123,ConfigurationTS3L4!T516))","v":""},null,{"$f":"IF(Riepilogo!O123>0,Riepilogo!O123/$H$2,\"\")","v":""},{"$f":"IF(H102=\"\",\"\",CONCATENATE(Riepilogo!K123,ConfigurationTS3L4!AD516))","v":""},null,null,0,null,null,0,null,null,0,null,null,0,0,{"$f":"ISODD(SUM($V$5:V102))","v":false}]
[null,{"$f":"IF(Riepilogo!M124>0,Riepilogo!M124/$B$2,\"\")","v":""},{"$f":"IF(B103=\"\",\"\",CONCATENATE(Riepilogo!K124,ConfigurationTS3L4!J517))","v":""},null,{"$f":"IF(Riepilogo!N124>0,Riepilogo!N124/$E$2,\"\")","v":""},{"$f":"IF(E103=\"\",\"\",CONCATENATE(Riepilogo!K124,ConfigurationTS3L4!T517))","v":""},null,{"$f":"IF(Riepilogo!O124>0,Riepilogo!O124/$H$2,\"\")","v":""},{"$f":"IF(H103=\"\",\"\",CONCATENATE(Riepilogo!K124,ConfigurationTS3L4!AD517))","v":""},null,null,0,null,null,0,null,null,0,null,null,0,0,{"$f":"ISODD(SUM($V$5:V103))","v":false}]
[null,{"$f":"IF(Riepilogo!M125>0,Riepilogo!M125/$B$2,\"\")","v":""},{"$f":"IF(B104=\"\",\"\",CONCATENATE(Riepilogo!K125,ConfigurationTS3L4!J518))","v":""},null,{"$f":"IF(Riepilogo!N125>0,Riepilogo!N125/$E$2,\"\")","v":""},{"$f":"IF(E104=\"\",\"\",CONCATENATE(Riepilogo!K125,ConfigurationTS3L4!T518))","v":""},null,{"$f":"IF(Riepilogo!O125>0,Riepilogo!O125/$H$2,\"\")","v":""},{"$f":"IF(H104=\"\",\"\",CONCATENATE(Riepilogo!K125,ConfigurationTS3L4!AD518))","v":""},null,null,0,null,null,0,null,null,0,null,null,0,0,{"$f":"ISODD(SUM($V$5:V104))","v":false}]
[null,{"$f":"IF(Riepilogo!M126>0,Riepilogo!M126/$B$2,\"\")","v":""},{"$f":"IF(B105=\"\",\"\",CONCATENATE(Riepilogo!K126,ConfigurationTS3L4!J519))","v":""},null,{"$f":"IF(Riepilogo!N126>0,Riepilogo!N126/$E$2,\"\")","v":""},{"$f":"IF(E105=\"\",\"\",CONCATENATE(Riepilogo!K126,ConfigurationTS3L4!T519))","v":""},null,{"$f":"IF(Riepilogo!O126>0,Riepilogo!O126/$H$2,\"\")","v":""},{"$f":"IF(H105=\"\",\"\",CONCATENATE(Riepilogo!K126,ConfigurationTS3L4!AD519))","v":""},null,null,0,null,null,0,null,null,0,null,null,0,0,{"$f":"ISODD(SUM($V$5:V105))","v":false}]
[null,{"$f":"IF(Riepilogo!M127>0,Riepilogo!M127/$B$2,\"\")","v":""},{"$f":"IF(B106=\"\",\"\",CONCATENATE(Riepilogo!K127,ConfigurationTS3L4!J520))","v":""},null,{"$f":"IF(Riepilogo!N127>0,Riepilogo!N127/$E$2,\"\")","v":""},{"$f":"IF(E106=\"\",\"\",CONCATENATE(Riepilogo!K127,ConfigurationTS3L4!T520))","v":""},null,{"$f":"IF(Riepilogo!O127>0,Riepilogo!O127/$H$2,\"\")","v":""},{"$f":"IF(H106=\"\",\"\",CONCATENATE(Riepilogo!K127,ConfigurationTS3L4!AD520))","v":""},null,null,0,null,null,0,null,null,0,null,null,0,0,{"$f":"ISODD(SUM($V$5:V106))","v":false}]
[null,{"$f":"IF(Riepilogo!M128>0,Riepilogo!M128/$B$2,\"\")","v":""},{"$f":"IF(B107=\"\",\"\",CONCATENATE(Riepilogo!K128,ConfigurationTS3L4!J521))","v":""},null,{"$f":"IF(Riepilogo!N128>0,Riepilogo!N128/$E$2,\"\")","v":""},{"$f":"IF(E107=\"\",\"\",CONCATENATE(Riepilogo!K128,ConfigurationTS3L4!T521))","v":""},null,{"$f":"IF(Riepilogo!O128>0,Riepilogo!O128/$H$2,\"\")","v":""},{"$f":"IF(H107=\"\",\"\",CONCATENATE(Riepilogo!K128,ConfigurationTS3L4!AD521))","v":""},null,null,{"$f":"IF(B107=\"\",0,B107)","v":0},null,null,{"$f":"IF(E107=\"\",0,E107)","v":0},null,null,{"$f":"IF(H107=\"\",0,H107)","v":0},null,null,{"$f":"SUM(L107:T107)","v":0},{"$f":"IF(U107>0,1,0)","v":0},{"$f":"ISODD(SUM($V$5:V107))","v":false}]
[null,{"$f":"IF(Riepilogo!M129>0,Riepilogo!M129/$B$2,\"\")","v":""},{"$f":"IF(B108=\"\",\"\",CONCATENATE(Riepilogo!K129,ConfigurationTS3L4!J522))","v":""},null,{"$f":"IF(Riepilogo!N129>0,Riepilogo!N129/$E$2,\"\")","v":""},{"$f":"IF(E108=\"\",\"\",CONCATENATE(Riepilogo!K129,ConfigurationTS3L4!T522))","v":""},null,{"$f":"IF(Riepilogo!O129>0,Riepilogo!O129/$H$2,\"\")","v":""},{"$f":"IF(H108=\"\",\"\",CONCATENATE(Riepilogo!K129,ConfigurationTS3L4!AD522))","v":""},null,null,{"$f":"IF(B108=\"\",0,B108)","v":0},null,null,{"$f":"IF(E108=\"\",0,E108)","v":0},null,null,{"$f":"IF(H108=\"\",0,H108)","v":0},null,null,{"$f":"SUM(L108:T108)","v":0},{"$f":"IF(U108>0,1,0)","v":0},{"$f":"ISODD(SUM($V$5:V108))","v":false}]
[null,{"$f":"IF(Riepilogo!M130>0,Riepilogo!M130/$B$2,\"\")","v":""},{"$f":"IF(B109=\"\",\"\",CONCATENATE(Riepilogo!K130,ConfigurationTS3L4!J523))","v":""},null,{"$f":"IF(Riepilogo!N130>0,Riepilogo!N130/$E$2,\"\")","v":""},{"$f":"IF(E109=\"\",\"\",CONCATENATE(Riepilogo!K130,ConfigurationTS3L4!T523))","v":""},null,{"$f":"IF(Riepilogo!O130>0,Riepilogo!O130/$H$2,\"\")","v":""},{"$f":"IF(H109=\"\",\"\",CONCATENATE(Riepilogo!K130,ConfigurationTS3L4!AD523))","v":""},null,null,{"$f":"IF(B109=\"\",0,B109)","v":0},null,null,{"$f":"IF(E109=\"\",0,E109)","v":0},null,null,{"$f":"IF(H109=\"\",0,H109)","v":0},null,null,{"$f":"SUM(L109:T109)","v":0},{"$f":"IF(U109>0,1,0)","v":0},{"$f":"ISODD(SUM($V$5:V109))","v":false}]
[null,{"$f":"IF(Riepilogo!M131>0,Riepilogo!M131/$B$2,\"\")","v":""},{"$f":"IF(B110=\"\",\"\",CONCATENATE(Riepilogo!K131,ConfigurationTS3L4!J524))","v":""},null,{"$f":"IF(Riepilogo!N131>0,Riepilogo!N131/$E$2,\"\")","v":""},{"$f":"IF(E110=\"\",\"\",CONCATENATE(Riepilogo!K131,ConfigurationTS3L4!T524))","v":""},null,{"$f":"IF(Riepilogo!O131>0,Riepilogo!O131/$H$2,\"\")","v":""},{"$f":"IF(H110=\"\",\"\",CONCATENATE(Riepilogo!K131,ConfigurationTS3L4!AD524))","v":""},null,null,{"$f":"IF(B110=\"\",0,B110)","v":0},null,null,{"$f":"IF(E110=\"\",0,E110)","v":0},null,null,{"$f":"IF(H110=\"\",0,H110)","v":0},null,null,{"$f":"SUM(L110:T110)","v":0},{"$f":"IF(U110>0,1,0)","v":0},{"$f":"ISODD(SUM($V$5:V110))","v":false}]
[null,{"$f":"IF(Riepilogo!M132>0,Riepilogo!M132/$B$2,\"\")","v":""},{"$f":"IF(B111=\"\",\"\",CONCATENATE(Riepilogo!K132,ConfigurationTS3L4!J525))","v":""},null,{"$f":"IF(Riepilogo!N132>0,Riepilogo!N132/$E$2,\"\")","v":""},{"$f":"IF(E111=\"\",\"\",CONCATENATE(Riepilogo!K132,ConfigurationTS3L4!T525))","v":""},null,{"$f":"IF(Riepilogo!O132>0,Riepilogo!O132/$H$2,\"\")","v":""},{"$f":"IF(H111=\"\",\"\",CONCATENATE(Riepilogo!K132,ConfigurationTS3L4!AD525))","v":""},null,null,{"$f":"IF(B111=\"\",0,B111)","v":0},null,null,{"$f":"IF(E111=\"\",0,E111)","v":0},null,null,{"$f":"IF(H111=\"\",0,H111)","v":0},null,null,{"$f":"SUM(L111:T111)","v":0},{"$f":"IF(U111>0,1,0)","v":0},{"$f":"ISODD(SUM($V$5:V111))","v":false}]
[null,{"$f":"IF(Riepilogo!M133>0,Riepilogo!M133/$B$2,\"\")","v":""},{"$f":"IF(B112=\"\",\"\",CONCATENATE(Riepilogo!K133,ConfigurationTS3L4!J526))","v":""},null,{"$f":"IF(Riepilogo!N133>0,Riepilogo!N133/$E$2,\"\")","v":""},{"$f":"IF(E112=\"\",\"\",CONCATENATE(Riepilogo!K133,ConfigurationTS3L4!T526))","v":""},null,{"$f":"IF(Riepilogo!O133>0,Riepilogo!O133/$H$2,\"\")","v":""},{"$f":"IF(H112=\"\",\"\",CONCATENATE(Riepilogo!K133,ConfigurationTS3L4!AD526))","v":""},null,null,0,null,null,0,null,null,0,null,null,0,0,{"$f":"ISODD(SUM($V$5:V112))","v":false}]
[null,{"$f":"IF(Riepilogo!M134>0,Riepilogo!M134/$B$2,\"\")","v":""},{"$f":"IF(B113=\"\",\"\",CONCATENATE(Riepilogo!K134,ConfigurationTS3L4!J527))","v":""},null,{"$f":"IF(Riepilogo!N134>0,Riepilogo!N134/$E$2,\"\")","v":""},{"$f":"IF(E113=\"\",\"\",CONCATENATE(Riepilogo!K134,ConfigurationTS3L4!T527))","v":""},null,{"$f":"IF(Riepilogo!O134>0,Riepilogo!O134/$H$2,\"\")","v":""},{"$f":"IF(H113=\"\",\"\",CONCATENATE(Riepilogo!K134,ConfigurationTS3L4!AD527))","v":""},null,null,0,null,null,0,null,null,0,null,null,0,0,{"$f":"ISODD(SUM($V$5:V113))","v":false}]
[null,{"$f":"IF(Riepilogo!M135>0,Riepilogo!M135/$B$2,\"\")","v":""},{"$f":"IF(B114=\"\",\"\",CONCATENATE(Riepilogo!K135,ConfigurationTS3L4!J528))","v":""},null,{"$f":"IF(Riepilogo!N135>0,Riepilogo!N135/$E$2,\"\")","v":""},{"$f":"IF(E114=\"\",\"\",CONCATENATE(Riepilogo!K135,ConfigurationTS3L4!T528))","v":""},null,{"$f":"IF(Riepilogo!O135>0,Riepilogo!O135/$H$2,\"\")","v":""},{"$f":"IF(H114=\"\",\"\",CONCATENATE(Riepilogo!K135,ConfigurationTS3L4!AD528))","v":""},null,null,0,null,null,0,null,null,0,null,null,0,0,{"$f":"ISODD(SUM($V$5:V114))","v":false}]
[null,{"$f":"IF(Riepilogo!M136>0,Riepilogo!M136/$B$2,\"\")","v":""},{"$f":"IF(B115=\"\",\"\",CONCATENATE(Riepilogo!K136,ConfigurationTS3L4!J529))","v":""},null,{"$f":"IF(Riepilogo!N136>0,Riepilogo!N136/$E$2,\"\")","v":""},{"$f":"IF(E115=\"\",\"\",CONCATENATE(Riepilogo!K136,ConfigurationTS3L4!T529))","v":""},null,{"$f":"IF(Riepilogo!O136>0,Riepilogo!O136/$H$2,\"\")","v":""},{"$f":"IF(H115=\"\",\"\",CONCATENATE(Riepilogo!K136,ConfigurationTS3L4!AD529))","v":""},null,null,0,null,null,0,null,null,0,null,null,0,0,{"$f":"ISODD(SUM($V$5:V115))","v":false}]
[null,{"$f":"IF(Riepilogo!M137>0,Riepilogo!M137/$B$2,\"\")","v":""},{"$f":"IF(B116=\"\",\"\",CONCATENATE(Riepilogo!K137,ConfigurationTS3L4!J530))","v":""},null,{"$f":"IF(Riepilogo!N137>0,Riepilogo!N137/$E$2,\"\")","v":""},{"$f":"IF(E116=\"\",\"\",CONCATENATE(Riepilogo!K137,ConfigurationTS3L4!T530))","v":""},null,{"$f":"IF(Riepilogo!O137>0,Riepilogo!O137/$H$2,\"\")","v":""},{"$f":"IF(H116=\"\",\"\",CONCATENATE(Riepilogo!K137,ConfigurationTS3L4!AD530))","v":""},null,null,0,null,null,0,null,null,0,null,null,0,0,{"$f":"ISODD(SUM($V$5:V116))","v":false}]
[null,{"$f":"IF(Riepilogo!M138>0,Riepilogo!M138/$B$2,\"\")","v":""},{"$f":"IF(B117=\"\",\"\",CONCATENATE(Riepilogo!K138,ConfigurationTS3L4!J531))","v":""},null,{"$f":"IF(Riepilogo!N138>0,Riepilogo!N138/$E$2,\"\")","v":""},{"$f":"IF(E117=\"\",\"\",CONCATENATE(Riepilogo!K138,ConfigurationTS3L4!T531))","v":""},null,{"$f":"IF(Riepilogo!O138>0,Riepilogo!O138/$H$2,\"\")","v":""},{"$f":"IF(H117=\"\",\"\",CONCATENATE(Riepilogo!K138,ConfigurationTS3L4!AD531))","v":""},null,null,{"$f":"IF(B117=\"\",0,B117)","v":0},null,null,{"$f":"IF(E117=\"\",0,E117)","v":0},null,null,{"$f":"IF(H117=\"\",0,H117)","v":0},null,null,{"$f":"SUM(L117:T117)","v":0},0,{"$f":"ISODD(SUM($V$5:V117))","v":false}]
[null,{"$f":"IF(Riepilogo!M139>0,Riepilogo!M139/$B$2,\"\")","v":""},{"$f":"IF(B118=\"\",\"\",CONCATENATE(Riepilogo!K139,ConfigurationTS3L4!J532))","v":""},null,{"$f":"IF(Riepilogo!N139>0,Riepilogo!N139/$E$2,\"\")","v":""},{"$f":"IF(E118=\"\",\"\",CONCATENATE(Riepilogo!K139,ConfigurationTS3L4!T532))","v":""},null,{"$f":"IF(Riepilogo!O139>0,Riepilogo!O139/$H$2,\"\")","v":""},{"$f":"IF(H118=\"\",\"\",CONCATENATE(Riepilogo!K139,ConfigurationTS3L4!AD532))","v":""},null,null,0,null,null,0,null,null,0,null,null,0,0,{"$f":"ISODD(SUM($V$5:V118))","v":false}]
[null,{"$f":"IF(Riepilogo!M140>0,Riepilogo!M140/$B$2,\"\")","v":""},{"$f":"IF(B119=\"\",\"\",CONCATENATE(Riepilogo!K140,ConfigurationTS3L4!J533))","v":""},null,{"$f":"IF(Riepilogo!N140>0,Riepilogo!N140/$E$2,\"\")","v":""},{"$f":"IF(E119=\"\",\"\",CONCATENATE(Riepilogo!K140,ConfigurationTS3L4!T533))","v":""},null,{"$f":"IF(Riepilogo!O140>0,Riepilogo!O140/$H$2,\"\")","v":""},{"$f":"IF(H119=\"\",\"\",CONCATENATE(Riepilogo!K140,ConfigurationTS3L4!AD533))","v":""},null,null,0,null,null,0,null,null,0,null,null,0,0,{"$f":"ISODD(SUM($V$5:V119))","v":false}]
[null,{"$f":"IF(Riepilogo!M141>0,Riepilogo!M141/$B$2,\"\")","v":""},{"$f":"IF(B120=\"\",\"\",CONCATENATE(Riepilogo!K141,ConfigurationTS3L4!J534))","v":""},null,{"$f":"IF(Riepilogo!N141>0,Riepilogo!N141/$E$2,\"\")","v":""},{"$f":"IF(E120=\"\",\"\",CONCATENATE(Riepilogo!K141,ConfigurationTS3L4!T534))","v":""},null,{"$f":"IF(Riepilogo!O141>0,Riepilogo!O141/$H$2,\"\")","v":""},{"$f":"IF(H120=\"\",\"\",CONCATENATE(Riepilogo!K141,ConfigurationTS3L4!AD534))","v":""},null,null,0,null,null,0,null,null,0,null,null,0,0,{"$f":"ISODD(SUM($V$5:V120))","v":false}]
[null,{"$f":"IF(Riepilogo!M142>0,Riepilogo!M142/$B$2,\"\")","v":""},{"$f":"IF(B121=\"\",\"\",CONCATENATE(Riepilogo!K142,ConfigurationTS3L4!J535))","v":""},null,{"$f":"IF(Riepilogo!N142>0,Riepilogo!N142/$E$2,\"\")","v":""},{"$f":"IF(E121=\"\",\"\",CONCATENATE(Riepilogo!K142,ConfigurationTS3L4!T535))","v":""},null,{"$f":"IF(Riepilogo!O142>0,Riepilogo!O142/$H$2,\"\")","v":""},{"$f":"IF(H121=\"\",\"\",CONCATENATE(Riepilogo!K142,ConfigurationTS3L4!AD535))","v":""},null,null,0,null,null,0,null,null,0,null,null,0,0,{"$f":"ISODD(SUM($V$5:V121))","v":false}]
[null,{"$f":"IF(Riepilogo!M143>0,Riepilogo!M143/$B$2,\"\")","v":""},{"$f":"IF(B122=\"\",\"\",CONCATENATE(Riepilogo!K143,ConfigurationTS3L4!J536))","v":""},null,{"$f":"IF(Riepilogo!N143>0,Riepilogo!N143/$E$2,\"\")","v":""},{"$f":"IF(E122=\"\",\"\",CONCATENATE(Riepilogo!K143,ConfigurationTS3L4!T536))","v":""},null,{"$f":"IF(Riepilogo!O143>0,Riepilogo!O143/$H$2,\"\")","v":""},{"$f":"IF(H122=\"\",\"\",CONCATENATE(Riepilogo!K143,ConfigurationTS3L4!AD536))","v":""},null,null,0,null,null,0,null,null,0,null,null,0,0,{"$f":"ISODD(SUM($V$5:V122))","v":false}]
[null,{"$f":"IF(Riepilogo!M144>0,Riepilogo!M144/$B$2,\"\")","v":""},{"$f":"IF(B123=\"\",\"\",CONCATENATE(Riepilogo!K144,ConfigurationTS3L4!J537))","v":""},null,{"$f":"IF(Riepilogo!N144>0,Riepilogo!N144/$E$2,\"\")","v":""},{"$f":"IF(E123=\"\",\"\",CONCATENATE(Riepilogo!K144,ConfigurationTS3L4!T537))","v":""},null,{"$f":"IF(Riepilogo!O144>0,Riepilogo!O144/$H$2,\"\")","v":""},{"$f":"IF(H123=\"\",\"\",CONCATENATE(Riepilogo!K144,ConfigurationTS3L4!AD537))","v":""},null,null,0,null,null,0,null,null,0,null,null,0,0,{"$f":"ISODD(SUM($V$5:V123))","v":false}]
[null,{"$f":"IF(Riepilogo!M145>0,Riepilogo!M145/$B$2,\"\")","v":""},{"$f":"IF(B124=\"\",\"\",CONCATENATE(Riepilogo!K145,ConfigurationTS3L4!J538))","v":""},null,{"$f":"IF(Riepilogo!N145>0,Riepilogo!N145/$E$2,\"\")","v":""},{"$f":"IF(E124=\"\",\"\",CONCATENATE(Riepilogo!K145,ConfigurationTS3L4!T538))","v":""},null,{"$f":"IF(Riepilogo!O145>0,Riepilogo!O145/$H$2,\"\")","v":""},{"$f":"IF(H124=\"\",\"\",CONCATENATE(Riepilogo!K145,ConfigurationTS3L4!AD538))","v":""},null,null,0,null,null,0,null,null,0,null,null,0,0,{"$f":"ISODD(SUM($V$5:V124))","v":false}]
[null,{"$f":"IF(Riepilogo!M146>0,Riepilogo!M146/$B$2,\"\")","v":""},{"$f":"IF(B125=\"\",\"\",CONCATENATE(Riepilogo!K146,ConfigurationTS3L4!J539))","v":""},null,{"$f":"IF(Riepilogo!N146>0,Riepilogo!N146/$E$2,\"\")","v":""},{"$f":"IF(E125=\"\",\"\",CONCATENATE(Riepilogo!K146,ConfigurationTS3L4!T539))","v":""},null,{"$f":"IF(Riepilogo!O146>0,Riepilogo!O146/$H$2,\"\")","v":""},{"$f":"IF(H125=\"\",\"\",CONCATENATE(Riepilogo!K146,ConfigurationTS3L4!AD539))","v":""},null,null,0,null,null,0,null,null,0,null,null,0,0,{"$f":"ISODD(SUM($V$5:V125))","v":false}]
[null,{"$f":"IF(Riepilogo!M147>0,Riepilogo!M147/$B$2,\"\")","v":""},{"$f":"IF(B126=\"\",\"\",CONCATENATE(Riepilogo!K147,ConfigurationTS3L4!J540))","v":""},null,{"$f":"IF(Riepilogo!N147>0,Riepilogo!N147/$E$2,\"\")","v":""},{"$f":"IF(E126=\"\",\"\",CONCATENATE(Riepilogo!K147,ConfigurationTS3L4!T540))","v":""},null,{"$f":"IF(Riepilogo!O147>0,Riepilogo!O147/$H$2,\"\")","v":""},{"$f":"IF(H126=\"\",\"\",CONCATENATE(Riepilogo!K147,ConfigurationTS3L4!AD540))","v":""},null,null,0,null,null,0,null,null,0,null,null,0,0,{"$f":"ISODD(SUM($V$5:V126))","v":false}]
[null,{"$f":"IF(Riepilogo!M148>0,Riepilogo!M148/$B$2,\"\")","v":""},{"$f":"IF(B127=\"\",\"\",CONCATENATE(Riepilogo!K148,ConfigurationTS3L4!J541))","v":""},null,{"$f":"IF(Riepilogo!N148>0,Riepilogo!N148/$E$2,\"\")","v":""},{"$f":"IF(E127=\"\",\"\",CONCATENATE(Riepilogo!K148,ConfigurationTS3L4!T541))","v":""},null,{"$f":"IF(Riepilogo!O148>0,Riepilogo!O148/$H$2,\"\")","v":""},{"$f":"IF(H127=\"\",\"\",CONCATENATE(Riepilogo!K148,ConfigurationTS3L4!AD541))","v":""},null,null,0,null,null,0,null,null,0,null,null,0,0,{"$f":"ISODD(SUM($V$5:V127))","v":false}]
[null,{"$f":"IF(Riepilogo!M149>0,Riepilogo!M149/$B$2,\"\")","v":""},{"$f":"IF(B128=\"\",\"\",CONCATENATE(Riepilogo!K149,ConfigurationTS3L4!J542))","v":""},null,{"$f":"IF(Riepilogo!N149>0,Riepilogo!N149/$E$2,\"\")","v":""},{"$f":"IF(E128=\"\",\"\",CONCATENATE(Riepilogo!K149,ConfigurationTS3L4!T542))","v":""},null,{"$f":"IF(Riepilogo!O149>0,Riepilogo!O149/$H$2,\"\")","v":""},{"$f":"IF(H128=\"\",\"\",CONCATENATE(Riepilogo!K149,ConfigurationTS3L4!AD542))","v":""},null,null,0,null,null,0,null,null,0,null,null,0,0,{"$f":"ISODD(SUM($V$5:V128))","v":false}]
[null,{"$f":"IF(Riepilogo!M150>0,Riepilogo!M150/$B$2,\"\")","v":""},{"$f":"IF(B129=\"\",\"\",CONCATENATE(Riepilogo!K150,ConfigurationTS3L4!J543))","v":""},null,{"$f":"IF(Riepilogo!N150>0,Riepilogo!N150/$E$2,\"\")","v":""},{"$f":"IF(E129=\"\",\"\",CONCATENATE(Riepilogo!K150,ConfigurationTS3L4!T543))","v":""},null,{"$f":"IF(Riepilogo!O150>0,Riepilogo!O150/$H$2,\"\")","v":""},{"$f":"IF(H129=\"\",\"\",CONCATENATE(Riepilogo!K150,ConfigurationTS3L4!AD543))","v":""},null,null,0,null,null,0,null,null,0,null,null,0,0,{"$f":"ISODD(SUM($V$5:V129))","v":false}]
[null,{"$f":"IF(Riepilogo!M151>0,Riepilogo!M151/$B$2,\"\")","v":""},{"$f":"IF(B130=\"\",\"\",CONCATENATE(Riepilogo!K151,ConfigurationTS3L4!J544))","v":""},null,{"$f":"IF(Riepilogo!N151>0,Riepilogo!N151/$E$2,\"\")","v":""},{"$f":"IF(E130=\"\",\"\",CONCATENATE(Riepilogo!K151,ConfigurationTS3L4!T544))","v":""},null,{"$f":"IF(Riepilogo!O151>0,Riepilogo!O151/$H$2,\"\")","v":""},{"$f":"IF(H130=\"\",\"\",CONCATENATE(Riepilogo!K151,ConfigurationTS3L4!AD544))","v":""},null,null,0,null,null,0,null,null,0,null,null,0,0,{"$f":"ISODD(SUM($V$5:V130))","v":false}]
[null,{"$f":"IF(Riepilogo!M152>0,Riepilogo!M152/$B$2,\"\")","v":""},{"$f":"IF(B131=\"\",\"\",CONCATENATE(Riepilogo!K152,ConfigurationTS3L4!J545))","v":""},null,{"$f":"IF(Riepilogo!N152>0,Riepilogo!N152/$E$2,\"\")","v":""},{"$f":"IF(E131=\"\",\"\",CONCATENATE(Riepilogo!K152,ConfigurationTS3L4!T545))","v":""},null,{"$f":"IF(Riepilogo!O152>0,Riepilogo!O152/$H$2,\"\")","v":""},{"$f":"IF(H131=\"\",\"\",CONCATENATE(Riepilogo!K152,ConfigurationTS3L4!AD545))","v":""},null,null,0,null,null,0,null,null,0,null,null,0,0,{"$f":"ISODD(SUM($V$5:V131))","v":false}]
[null,{"$f":"IF(Riepilogo!M153>0,Riepilogo!M153/$B$2,\"\")","v":""},{"$f":"IF(B132=\"\",\"\",CONCATENATE(Riepilogo!K153,ConfigurationTS3L4!J546))","v":""},null,{"$f":"IF(Riepilogo!N153>0,Riepilogo!N153/$E$2,\"\")","v":""},{"$f":"IF(E132=\"\",\"\",CONCATENATE(Riepilogo!K153,ConfigurationTS3L4!T546))","v":""},null,{"$f":"IF(Riepilogo!O153>0,Riepilogo!O153/$H$2,\"\")","v":""},{"$f":"IF(H132=\"\",\"\",CONCATENATE(Riepilogo!K153,ConfigurationTS3L4!AD546))","v":""},null,null,0,null,null,0,null,null,0,null,null,0,0,{"$f":"ISODD(SUM($V$5:V132))","v":false}]
[null,{"$f":"IF(Riepilogo!M154>0,Riepilogo!M154/$B$2,\"\")","v":""},{"$f":"IF(B133=\"\",\"\",CONCATENATE(Riepilogo!K154,ConfigurationTS3L4!J547))","v":""},null,{"$f":"IF(Riepilogo!N154>0,Riepilogo!N154/$E$2,\"\")","v":""},{"$f":"IF(E133=\"\",\"\",CONCATENATE(Riepilogo!K154,ConfigurationTS3L4!T547))","v":""},null,{"$f":"IF(Riepilogo!O154>0,Riepilogo!O154/$H$2,\"\")","v":""},{"$f":"IF(H133=\"\",\"\",CONCATENATE(Riepilogo!K154,ConfigurationTS3L4!AD547))","v":""},null,null,0,null,null,0,null,null,0,null,null,0,0,{"$f":"ISODD(SUM($V$5:V133))","v":false}]
[null,{"$f":"IF(Riepilogo!M155>0,Riepilogo!M155/$B$2,\"\")","v":""},{"$f":"IF(B134=\"\",\"\",CONCATENATE(Riepilogo!K155,ConfigurationTS3L4!J548))","v":""},null,{"$f":"IF(Riepilogo!N155>0,Riepilogo!N155/$E$2,\"\")","v":""},{"$f":"IF(E134=\"\",\"\",CONCATENATE(Riepilogo!K155,ConfigurationTS3L4!T548))","v":""},null,{"$f":"IF(Riepilogo!O155>0,Riepilogo!O155/$H$2,\"\")","v":""},{"$f":"IF(H134=\"\",\"\",CONCATENATE(Riepilogo!K155,ConfigurationTS3L4!AD548))","v":""},null,null,0,null,null,0,null,null,0,null,null,0,0,{"$f":"ISODD(SUM($V$5:V134))","v":false}]
[null,{"$f":"IF(Riepilogo!M156>0,Riepilogo!M156/$B$2,\"\")","v":""},{"$f":"IF(B135=\"\",\"\",CONCATENATE(Riepilogo!K156,ConfigurationTS3L4!J549))","v":""},null,{"$f":"IF(Riepilogo!N156>0,Riepilogo!N156/$E$2,\"\")","v":""},{"$f":"IF(E135=\"\",\"\",CONCATENATE(Riepilogo!K156,ConfigurationTS3L4!T549))","v":""},null,{"$f":"IF(Riepilogo!O156>0,Riepilogo!O156/$H$2,\"\")","v":""},{"$f":"IF(H135=\"\",\"\",CONCATENATE(Riepilogo!K156,ConfigurationTS3L4!AD549))","v":""},null,null,0,null,null,0,null,null,0,null,null,0,0,{"$f":"ISODD(SUM($V$5:V135))","v":false}]
[null,{"$f":"IF(Riepilogo!M157>0,Riepilogo!M157/$B$2,\"\")","v":""},{"$f":"IF(B136=\"\",\"\",CONCATENATE(Riepilogo!K157,ConfigurationTS3L4!J550))","v":""},null,{"$f":"IF(Riepilogo!N157>0,Riepilogo!N157/$E$2,\"\")","v":""},{"$f":"IF(E136=\"\",\"\",CONCATENATE(Riepilogo!K157,ConfigurationTS3L4!T550))","v":""},null,{"$f":"IF(Riepilogo!O157>0,Riepilogo!O157/$H$2,\"\")","v":""},{"$f":"IF(H136=\"\",\"\",CONCATENATE(Riepilogo!K157,ConfigurationTS3L4!AD550))","v":""},null,null,0,null,null,0,null,null,0,null,null,0,0,{"$f":"ISODD(SUM($V$5:V136))","v":false}]
[null,{"$f":"IF(Riepilogo!M158>0,Riepilogo!M158/$B$2,\"\")","v":""},{"$f":"IF(B137=\"\",\"\",CONCATENATE(Riepilogo!K158,ConfigurationTS3L4!J551))","v":""},null,{"$f":"IF(Riepilogo!N158>0,Riepilogo!N158/$E$2,\"\")","v":""},{"$f":"IF(E137=\"\",\"\",CONCATENATE(Riepilogo!K158,ConfigurationTS3L4!T551))","v":""},null,{"$f":"IF(Riepilogo!O158>0,Riepilogo!O158/$H$2,\"\")","v":""},{"$f":"IF(H137=\"\",\"\",CONCATENATE(Riepilogo!K158,ConfigurationTS3L4!AD551))","v":""},null,null,0,null,null,0,null,null,0,null,null,0,0,{"$f":"ISODD(SUM($V$5:V137))","v":false}]
[null,{"$f":"IF(Riepilogo!M159>0,Riepilogo!M159/$B$2,\"\")","v":""},{"$f":"IF(B138=\"\",\"\",CONCATENATE(Riepilogo!K159,ConfigurationTS3L4!J552))","v":""},null,{"$f":"IF(Riepilogo!N159>0,Riepilogo!N159/$E$2,\"\")","v":""},{"$f":"IF(E138=\"\",\"\",CONCATENATE(Riepilogo!K159,ConfigurationTS3L4!T552))","v":""},null,{"$f":"IF(Riepilogo!O159>0,Riepilogo!O159/$H$2,\"\")","v":""},{"$f":"IF(H138=\"\",\"\",CONCATENATE(Riepilogo!K159,ConfigurationTS3L4!AD552))","v":""},null,null,0,null,null,0,null,null,0,null,null,0,0,{"$f":"ISODD(SUM($V$5:V138))","v":false}]
[null,null,null,null,null,null,null,null,null,null,null,null,null,null,null,null,null,null,null,null,null,{"$f":"IF($U$5>0,1,0)","v":0}]
[null,"Configurazione RAID e/o NOTE",null,null,"Configurazione RAID e/o NOTE",null,null,"Configurazione RAID e/o NOTE",null,null,null,null,null,null,null,null,null,null,null,null,null,{"$f":"IF($U$5>0,1,0)","v":0}]
[null,{"$f":"Lotto4_R740XD_1!H35","v":"Specificare la configurazione RAID per l'installazione del Sistema Operativo, se richiesto.\ne/o\ninserire eventuali note."},null,null,{"$f":"Lotto4_R740XD_2!H35","v":"Specificare la configurazione RAID per l'installazione del Sistema Operativo, se richiesto.\ne/o\ninserire eventuali note."},null,null,{"$f":"Lotto4_R740XD_3!H35","v":"Specificare la configurazione RAID per l'installazione del Sistema Operativo, se richiesto.\ne/o\ninserire eventuali note."},null,null,null,null,null,null,null,null,null,null,null,null,null,0]
[null,null,null,null,null,null,null,null,null,null,null,null,null,null,null,null,null,null,null,null,null,0]
[null,null,null,null,null,null,null,null,null,null,null,null,null,null,null,null,null,null,null,null,null,0]
[null,null,null,null,null,null,null,null,null,null,null,null,null,null,null,null,null,null,null,null,null,0]
[null,null,null,null,null,null,null,null,null,null,null,null,null,null,null,null,null,null,null,null,null,0]
[null,null,null,null,null,null,null,null,null,null,null,null,null,null,null,null,null,null,null,null,null,0]
[null,null,null,null,null,null,null,null,null,null,null,null,null,null,null,null,null,null,null,null,null,0]
[null,null,null,null,null,null,null,null,null,null,null,null,null,null,null,null,null,null,null,null,null,0]
[null,null,null,null,null,null,null,null,null,null,null,null,null,null,null,null,null,null,null,null,null,0]
[null,null,null,null,null,null,null,null,null,null,null,null,null,null,null,null,null,null,null,null,null,0]
[null,null,null,null,null,null,null,null,null,null,null,null,null,null,null,null,null,null,null,null,null,0]
[null,null,null,null,null,null,null,null,null,null,null,null,null,null,null,null,null,null,null,null,null,0]
[null,null,null,null,null,null,null,null,null,null,null,null,null,null,null,null,null,null,null,null,null,1]
[null,null,null,null,null,null,null,null,null,null,null,null,null,null,null,null,null,null,null,null,null,1]
[null,"AREA RISERVATA AL FORNITORE",null,null,null,null,null,null,null,null,null,null,null,null,null,null,null,null,null,null,null,1]
[null,null,null,null,null,null,null,null,null,null,null,null,null,null,null,null,null,null,null,null,null,1]
[null,"VERIFICA STAGING",null,null,null,null,"VERIFICA INSTALLATORE",null,null,null,null,null,null,null,null,null,null,null,null,null,null,1]
[null,null,null,null,null,null,null,null,null,null,null,null,null,null,null,null,null,null,null,null,null,1]
[null,null,null,null,null,null,null,null,null,null,null,null,null,null,null,null,null,null,null,null,null,1]
[null,null,null,null,null,null,null,null,null,null,null,null,null,null,null,null,null,null,null,null,null,1]
[null,null,null,null,null,null,null,null,null,null,null,null,null,null,null,null,null,null,null,null,null,1]
[]
[]
[]
[]
[]
[]
[]
[]
[]
[]
[]
[]
[]
[null,null,null,null,null,null,null,null,null,null,null,null,null,null,null,null,null,null,null,null,null,0]