{"text_format":"1","workbook":"xlsx","n_sheets":8,"sheets":["Lotto6_DL560_1","Lotto6_DL560_2","Lotto6_DL560_3","Altre_Opzioni","ConfigurationTS3L6","Tabella_prezzi","Riepilogo","Configurazione"],"not_rendered":{"charts":0,"images":21,"macros":1,"external_links":0,"defined_names":18,"comments":0,"pivot_tables":0},"unopened":[],"bounds":{"document_bytes":16777216,"sheet_cells":100000,"rows_first":2000,"rows_last":500,"rows_between":2000,"halvings":0,"cell_chars":16384,"cell_head_chars":4096},"cells_cut":0,"cells_raw":0,"read":"whole","date_system":"1900"}

{"sheet":"Lotto6_DL560_1","index":0,"n_rows":123,"n_cols":19,"rows_kept":123,"cut":false,"hidden":false,"merged":[[119,3,120,3],[34,2,35,2],[33,7,54,7],[68,1,68,4],[4,0,4,2],[7,3,8,3],[13,3,14,3],[59,3,60,3],[116,3,117,3],[37,2,37,5],[62,3,63,3],[29,1,29,4]]}
[null,null,null,null,"Convenzione",{"$f":"SUM(J9:J122)*F5","v":0}]
[null,null,null,null,0.2,{"$f":"SUM(K9:K122)*F5","v":0}]
[null,null,null,null,"Totale",{"$f":"SUM(F1:F2)","v":0}]
[null,null,null,null,null,null,null,{"$f":"IF($E$12=\"TS3L4-VSAN\",\"vSAN ReadyNode™\",IF($E$12=\"TS3L4-GPUDW\",\"GPU Double-Wide Server Ready\",IF($E$12=\"TS3L4-GPUSW\",\"GPU Single-Wide Server Ready\",\"\")))","v":""}]
["HPE PROLIANT DL560 Gen10    Consulta la Guida alla Convenzione ->",null,null,{"$f":"HYPERLINK(\"https://convenzioni.converge.it/docs/L6GuidaAllaConvenzioneTecnologieServer3.pdf\",\"&\")","v":"&"},"Quantità Server",null,null,{"$f":"Riepilogo!G8","v":"Version 4.5"}]
[]
[]
[null,null,"Base",{"$f":"HYPERLINK(\"https://convenzioni.converge.it/docs/ts3_datasheet/HPE%20ProLiant%20DL560%20Gen10-spec-sheet.pdf\",\"i\")","v":"i"}]
[null,null,"Proliant DL560 Gen10",null,{"$f":"VLOOKUP($C9,TS3L6_ALL,15,FALSE)","v":"TS3L6-SRV"},{"$f":"IF($F$5>0,1,\"\")","v":""},null,null,null,{"$f":"VLOOKUP($C9,TS3L6_ALL,10,FALSE)","v":5912},null,{"$f":"VLOOKUP($C9,TS3L6_ALL,14,FALSE)","v":"L6N01"},{"$f":"IF(L9=\"L6N01\",1,0)","v":1}]
[]
[null,null,"Chassis Configuration"]
[null,null,{"$f":"VLOOKUP($C$9,TS3L6_Chassis,2,FALSE)","v":"Chassis with 16 x 2.5 Hard Drives"}]
[]
[null,null,"Processor",{"$f":"HYPERLINK(\"https://ark.intel.com/content/www/it/it/ark/products/193951/intel-xeon-gold-6252n-processor-35-75m-cache-2-30-ghz.html\",\"i\")","v":"i"}]
[null,null,"2 x Intel Xeon-Gold 6252N (2.3GHz/24-core/150W)"]
{"$rows_left_out":109}
{"sheet":"Lotto6_DL560_2","index":1,"n_rows":122,"n_cols":19,"rows_kept":122,"cut":false,"hidden":false,"merged":[[119,3,120,3],[33,7,54,7],[34,2,35,2],[68,1,68,4],[4,0,4,2],[7,3,8,3],[13,3,14,3],[59,3,60,3],[116,3,117,3],[37,2,37,5],[29,1,29,4],[62,3,63,3]]}
[null,null,null,null,"Convenzione",{"$f":"SUM(J9:J122)*F5","v":0}]
[null,null,null,null,0.2,{"$f":"SUM(K9:K122)*F5","v":0}]
[null,null,null,null,"Totale",{"$f":"SUM(F1:F2)","v":0}]
[null,null,null,null,null,null,null,{"$f":"IF($E$12=\"TS3L4-VSAN\",\"vSAN ReadyNode™\",IF($E$12=\"TS3L4-GPUDW\",\"GPU Double-Wide Server Ready\",IF($E$12=\"TS3L4-GPUSW\",\"GPU Single-Wide Server Ready\",\"\")))","v":""}]
["HPE PROLIANT DL560 Gen10    Consulta la Guida alla Convenzione ->",null,null,{"$f":"HYPERLINK(\"https://convenzioni.converge.it/docs/L6GuidaAllaConvenzioneTecnologieServer3.pdf\",\"&\")","v":"&"},"Quantità Server",null,null,{"$f":"Riepilogo!G8","v":"Version 4.5"}]
[]
[]
[null,null,"Base",{"$f":"HYPERLINK(\"https://convenzioni.converge.it/docs/ts3_datasheet/HPE%20ProLiant%20DL560%20Gen10-spec-sheet.pdf\",\"i\")","v":"i"}]
[null,null,"Proliant DL560 Gen10",null,{"$f":"VLOOKUP($C9,TS3L6_ALL,15,FALSE)","v":"TS3L6-SRV"},{"$f":"IF($F$5>0,1,\"\")","v":""},null,null,null,{"$f":"VLOOKUP($C9,TS3L6_ALL,10,FALSE)","v":5912},null,{"$f":"VLOOKUP($C9,TS3L6_ALL,14,FALSE)","v":"L6N01"},{"$f":"IF(L9=\"L6N01\",1,0)","v":1}]
[]
[null,null,"Chassis Configuration"]
[null,null,{"$f":"VLOOKUP($C$9,TS3L6_Chassis,2,FALSE)","v":"Chassis with 16 x 2.5 Hard Drives"}]
[]
[null,null,"Processor",{"$f":"HYPERLINK(\"https://ark.intel.com/content/www/it/it/ark/products/193951/intel-xeon-gold-6252n-processor-35-75m-cache-2-30-ghz.html\",\"i\")","v":"i"}]
[null,null,"2 x Intel Xeon-Gold 6252N (2.3GHz/24-core/150W)"]
{"$rows_left_out":108}
{"sheet":"Lotto6_DL560_3","index":2,"n_rows":122,"n_cols":19,"rows_kept":122,"cut":false,"hidden":false,"merged":[[68,1,68,4],[116,3,117,3],[119,3,120,3],[4,0,4,2],[7,3,8,3],[13,3,14,3],[29,1,29,4],[33,7,54,7],[34,2,35,2],[37,2,37,5],[59,3,60,3],[62,3,63,3]]}
[null,null,null,null,"Convenzione",{"$f":"SUM(J9:J121)*F5","v":0}]
[null,null,null,null,0.2,{"$f":"SUM(K9:K121)*F5","v":0}]
[null,null,null,null,"Totale",{"$f":"SUM(F1:F2)","v":0}]
[null,null,null,null,null,null,null,{"$f":"IF($E$12=\"TS3L4-VSAN\",\"vSAN ReadyNode™\",IF($E$12=\"TS3L4-GPUDW\",\"GPU Double-Wide Server Ready\",IF($E$12=\"TS3L4-GPUSW\",\"GPU Single-Wide Server Ready\",\"\")))","v":""}]
["HPE PROLIANT DL560 Gen10    Consulta la Guida alla Convenzione ->",null,null,{"$f":"HYPERLINK(\"https://convenzioni.converge.it/docs/L6GuidaAllaConvenzioneTecnologieServer3.pdf\",\"&\")","v":"&"},"Quantità Server",null,null,{"$f":"Riepilogo!G8","v":"Version 4.5"}]
[]
[]
[null,null,"Base",{"$f":"HYPERLINK(\"https://convenzioni.converge.it/docs/ts3_datasheet/HPE%20ProLiant%20DL560%20Gen10-spec-sheet.pdf\",\"i\")","v":"i"}]
[null,null,"Proliant DL560 Gen10",null,{"$f":"VLOOKUP($C9,TS3L6_ALL,15,FALSE)","v":"TS3L6-SRV"},{"$f":"IF($F$5>0,1,\"\")","v":""},null,null,null,{"$f":"VLOOKUP($C9,TS3L6_ALL,10,FALSE)","v":5912},null,{"$f":"VLOOKUP($C9,TS3L6_ALL,14,FALSE)","v":"L6N01"},{"$f":"IF(L9=\"L6N01\",1,0)","v":1}]
[]
[null,null,"Chassis Configuration"]
[null,null,{"$f":"VLOOKUP($C$9,TS3L6_Chassis,2,FALSE)","v":"Chassis with 16 x 2.5 Hard Drives"}]
[]
[null,null,"Processor",{"$f":"HYPERLINK(\"https://ark.intel.com/content/www/it/it/ark/products/193951/intel-xeon-gold-6252n-processor-35-75m-cache-2-30-ghz.html\",\"i\")","v":"i"}]
[null,null,"2 x Intel Xeon-Gold 6252N (2.3GHz/24-core/150W)"]
{"$rows_left_out":108}
{"sheet":"Altre_Opzioni","index":3,"n_rows":47,"n_cols":12,"rows_kept":47,"cut":false,"hidden":false,"merged":[[7,3,8,3],[11,3,12,3],[21,3,22,3],[45,3,46,3],[15,3,16,3],[33,3,34,3],[36,3,37,3],[39,3,40,3],[42,3,43,3],[30,3,31,3]]}
[null,null,null,null,"Convenzione",{"$f":"SUM(J9:J140)","v":0}]
[null,null,null,null,0.2,{"$f":"SUM(K9:K140)","v":0}]
[null,null,null,null,"Totale",{"$f":"SUM(F1:F2)","v":0}]
[]
[null,null,"Opzioni"]
[]
[]
[null,null,"Opzione Rack HPE con PDU Monofase",{"$f":"HYPERLINK(\"https://convenzioni.converge.it/docs/ts3_datasheet/RACK_HPE.pdf\",\"i\")","v":"i"}]
[null,null,"Armadio Rack HPE 42U 600x1200, comprensivo di 2 PDU Monofase 7.3kVA con 36 connettori C13 e 12 connettori C19 collegamento spina industriale 32A IEC-60309 3 poli (2P+T)",null,{"$f":"IF(Riepilogo!$P$129>=1,Riepilogo!$K$129,Riepilogo!$K$130)","v":"TS3L6-RACKMONON"},null,null,null,null,{"$f":"VLOOKUP($C9,TS3L6_ALL,10,FALSE)*F9","v":0},{"$f":"VLOOKUP($C9,TS3L6_ALL,11,FALSE)*F9","v":0},{"$f":"VLOOKUP($C9,TS3L6_ALL,12,FALSE)","v":"L6N47b"}]
[]
[]
[null,null,"Opzione Rack HPE con PDU Trifase",{"$f":"HYPERLINK(\"https://convenzioni.converge.it/docs/ts3_datasheet/RACK_HPE.pdf\",\"i\")","v":"i"}]
[null,null,"Armadio Rack HPE 42U 600x1200, comprensivo di 2 PDU Trifase 22kVA con 36 connettori C13 e 12 connettori C19 collegamento spina industriale 32A IEC-60309 5 poli (3P+N+T)",null,{"$f":"IF(Riepilogo!$P$131>=1,Riepilogo!$K$131,Riepilogo!$K$132)","v":"TS3L6-RACK3PHN"},null,null,null,null,{"$f":"VLOOKUP($C13,TS3L6_ALL,10,FALSE)*F13","v":0},{"$f":"VLOOKUP($C13,TS3L6_ALL,11,FALSE)*F13","v":0},{"$f":"VLOOKUP($C13,TS3L6_ALL,12,FALSE)","v":"L6N48b"}]
[]
[]
{"$rows_left_out":33}
{"sheet":"ConfigurationTS3L6","index":4,"n_rows":173,"n_cols":25,"rows_kept":173,"cut":false,"hidden":true,"merged":[]}
[1,2,3,4,5,6,7,8,9,10,11,12,13,14,15,16,17,18,19,20,21,22,23,24,25]
[null,"Module Name","Option ID","Option Name","Option List Price","SKUs","Qty","SKU Customer Kit","Attributo","Valore inserito",null,null,null,"N°","Codice Convenzione"]
["Proliant DL560 Gen10","Chassis with 16 x 2.5 Hard Drives",null,{"$f":"VLOOKUP(N3,Tabella_prezzi!$A$3:$K$138,8,FALSE)","v":"Proliant DL560 Gen10"},null,null,null,{"$f":"VLOOKUP(N3,Tabella_prezzi!$A$3:$K$138,9,FALSE)","v":"L6N01-ServerDL560"},{"$f":"VLOOKUP(N3,Tabella_prezzi!$A$3:$K$138,3,FALSE)","v":"Server rackable quad-processore prest."},{"$f":"VLOOKUP(N3,Tabella_prezzi!$A$3:$K$138,4,FALSE)","v":5912},null,null,null,"L6N01",{"$f":"VLOOKUP(N3,Tabella_prezzi!$A$3:$K$138,6,FALSE)","v":"TS3L6-SRV"}]
["Proliant DL560 Gen10 NVMe Configuration","Chassis with 12 x 2.5 Hard Drives and 4 x 2.5 NVMe",null,{"$f":"VLOOKUP(N4,Tabella_prezzi!$A$3:$K$138,8,FALSE)","v":"Proliant DL560 Gen10 NVMe Configuration"},null,null,null,{"$f":"VLOOKUP(N4,Tabella_prezzi!$A$3:$K$138,9,FALSE)","v":"L6N01b-ServerDL560"},{"$f":"VLOOKUP(N4,Tabella_prezzi!$A$3:$K$138,3,FALSE)","v":"Server rackable quad-processore prest."},{"$f":"VLOOKUP(N4,Tabella_prezzi!$A$3:$K$138,4,FALSE)","v":5912},null,null,null,"L6N01b",{"$f":"VLOOKUP(N4,Tabella_prezzi!$A$3:$K$138,6,FALSE)","v":"TS3L6-SRVNVME"}]
[]
["TS3L6_Chassis"]
["Proliant DL560 Gen10","Chassis with 16 x 2.5 Hard Drives"]
["Proliant DL560 Gen10 NVMe Configuration","Chassis with 12 x 2.5 Hard Drives and 4 x 2.5 NVMe"]
[]
["TS3L6_CPU"]
["No Additional Processor",null,null,null,null,null,0,null,{"$f":"\"\"","v":""},null,null,null,{"$f":"\"\"","v":""},{"$f":"\"\"","v":""},{"$f":"\"\"","v":""}]
["2 x Intel Xeon-Gold 6252N (2.3GHz/24-core/150W)",null,null,{"$f":"VLOOKUP(N12,Tabella_prezzi!$A$3:$K$138,8,FALSE)","v":"Intel Xeon-Gold 6252N (2.3GHz/24-core/150W) Processor Kit for HPE ProLiant DL560 Gen10"},null,null,1,{"$f":"VLOOKUP(N12,Tabella_prezzi!$A$3:$K$138,9,FALSE)","v":"L6N02-OpzCPU"},{"$f":"VLOOKUP(N12,Tabella_prezzi!$A$3:$K$138,3,FALSE)","v":"Kit n. 2 Processori aggiuntivi"},{"$f":"VLOOKUP(N12,Tabella_prezzi!$A$3:$K$138,4,FALSE)","v":2475},null,"L6N02B",{"$f":"VLOOKUP(L12,Tabella_prezzi!$A$3:$K$138,6,FALSE)","v":"TS3L6-CPUN"},"L6N02",{"$f":"VLOOKUP(N12,Tabella_prezzi!$A$3:$K$138,6,FALSE)","v":"TS3L6-CPU"}]
["2 x Intel \"POCHI CORE\"",null,null,{"$f":"VLOOKUP(N13,Tabella_prezzi!$A$3:$K$138,8,FALSE)","v":{"$error":"#N/A"}},null,null,1,{"$f":"VLOOKUP(N13,Tabella_prezzi!$A$3:$K$138,9,FALSE)","v":{"$error":"#N/A"}},{"$f":"VLOOKUP(N13,Tabella_prezzi!$A$3:$K$138,3,FALSE)","v":{"$error":"#N/A"}},null,{"$f":"VLOOKUP(N13,Tabella_prezzi!$A$3:$K$138,4,FALSE)","v":{"$error":"#N/A"}},"L4N48B",{"$f":"VLOOKUP(L13,Tabella_prezzi!$A$3:$K$138,6,FALSE)","v":{"$error":"#N/A"}},"L4N48",{"$f":"VLOOKUP(N13,Tabella_prezzi!$A$3:$K$138,6,FALSE)","v":{"$error":"#N/A"}}]
[]
["TS3L6_CPU8core"]
{"$rows_left_out":159}
{"sheet":"Tabella_prezzi","index":5,"n_rows":177,"n_cols":11,"rows_kept":177,"cut":false,"hidden":true,"merged":[[95,5,96,5],[95,10,96,10],[95,0,96,0],[95,1,96,1],[95,2,96,2],[95,3,96,3],[95,4,96,4],[80,5,81,5],[82,0,83,0],[82,1,83,1],[82,2,83,2],[82,3,83,3],[82,4,83,4],[82,5,83,5],[80,0,81,0],[80,1,81,1],[80,2,81,2],[80,3,81,3],[80,4,81,4],[73,5,74,5],[78,0,79,0],[78,1,79,1],[78,2,79,2],[78,3,79,3],[78,4,79,4],[78,5,79,5],[73,0,74,0],[73,1,74,1],[73,2,74,2],[73,3,74,3],[73,4,74,4],[25,10,26,10],[3,4,4,4],[8,4,9,4],[10,4,11,4],[12,4,13,4],[25,4,26,4],[3,5,4,5],[8,5,9,5],[10,5,11,5],[12,5,13,5],[25,5,26,5],[3,1,4,1],[8,1,9,1],[10,1,11,1],[12,1,13,1],[25,1,26,1],[3,3,4,3],[8,3,9,3],[10,3,11,3],[12,3,13,3],[25,3,26,3],[3,2,4,2],[8,2,9,2],[10,2,11,2],[12,2,13,2],[25,2,26,2],[3,0,4,0],[8,0,9,0],[10,0,11,0],[12,0,13,0],[25,0,26,0]]}
[]
["N°",null,"Attributo","Valore inserito","N°","Codice Convenzione","Qty:","Description:","Manufacturer Part","Sku Number:","Brand"]
["L6N01",1,"Server rackable quad-processore prest.",5912,"L6N01","TS3L6-SRV",1,"Proliant DL560 Gen10","L6N01-ServerDL560","-","HPE"]
["L6N02",2,"Kit n. 2 Processori aggiuntivi",2475,"L6N02","TS3L6-CPU",2,"Intel Xeon-Gold 6252N (2.3GHz/24-core/150W) Processor Kit for HPE ProLiant DL560 Gen10","L6N02-OpzCPU","P02960-B21","HPE"]
[null,null,null,null,null,null,1,"HPE DL5x0 Gen10 CPU Version 2 Mezzanine Board Kit",null,"P07991-B21","HPE"]
["L6N03",3,"OpzRAM32GB",184,"L6N03","TS3L6-RAM32",1,"HPE 32GB (1x32GB) Dual Rank x4 DDR4-2933 CAS-21-21-21 Registered Smart Memory Kit","L6N03-OpzRAM32GB","P00924-B21","HPE"]
["L6N04",4,"OpzRAM64GB",589,"L6N04","TS3L6-RAM64",1,"HPE 64GB (1x64GB) Dual Rank x4 DDR4-2933 CAS-21-21-21 Registered Smart Memory Kit","L6N04-OpzRAM64GB","P00930-B21","HPE"]
["L6N05",5,"OpzGigabit",25,"L6N05","TS3L6-LAN1",1,"HPE Ethernet 1Gb 2-port 332T Adapter","L6N05-OpzGigabit","615732-B21","HPE"]
["L6N06",6,"OpzGigabit10Gbps",218,"L6N06","TS3L6-LAN10",1,"HPE Ethernet 10Gb 2-port 548SFP+ Adapter","L6N06-OpzGigabit10Gbps","P11338-B21","HPE"]
[null,null,null,null,null,null,2,"HPE BladeSystem c-Class 10Gb SFP+ SR Transceiver",null,"455883-B21","HPE"]
["L6N07",7,"OpzGigabit25Gbps",669,"L6N07","TS3L6-LAN25",1,"HPE Ethernet 10/25Gb 2-port 640SFP28 Adapter","L6N07-OpzGigabit25Gbps","817753-B21","HPE"]
[null,null,null,null,null,null,2,"HPE 25Gb SFP28 SR 100m Transceiver",null,"845398-B21","HPE"]
["L6N08",8,"OpzGigabit10Gbps CNA",402,"L6N08","TS3L6-CNA10",1,"HPE StoreFabric CN1300R 10/25Gb Dual Port Converged Network Adapter","L6N08-OpzCNA10Gbps","Q0F09A","HPE"]
[null,null,null,null,null,null,2,"HPE BladeSystem c-Class 10Gb SFP+ SR Transceiver",null,"455883-B21","HPE"]
["L6N09",9,"OpzFibreChannel",325,"L6N09","TS3L6-FC16",1,"HPE StoreFabric SN1100Q 16Gb Dual Port Fibre Channel Host Bus Adapter","L6N09-OpzFibreChannel","P9D94A","HPE"]
{"$rows_left_out":163}
{"sheet":"Riepilogo","index":6,"n_rows":157,"n_cols":28,"rows_kept":157,"cut":false,"hidden":false,"merged":[[155,1,155,5],[152,4,152,5],[152,1,152,2],[151,1,151,5],[154,1,154,5],[153,1,153,3],[153,4,153,5],[86,1,86,6],[20,1,20,6],[17,4,17,6],[1,3,1,6],[15,1,15,2],[10,3,10,6],[15,3,15,6],[12,4,12,6],[1,1,1,2],[3,1,3,2],[5,1,5,2],[7,1,7,2],[10,1,10,2]]}
[null,null,null,null,null,null,null,null,null,1]
[null,"Ente:",null,null,null,null,null,null,null,1,null,"ente",{"$f":"IF(D2>0,0,1)","v":1}]
[null,null,null,null,null,null,null,null,null,1]
[null,"Ordine N.",null,null,{"$f":"M7","v":"ERRORE DI MANCATA COMPILAZIONE DATI NECESSARI PER L'ORDINATIVO"},null,null,null,null,1,null,"N°ordine",{"$f":"IF(D4>0,0,1)","v":1}]
[null,null,null,null,{"$f":"M8","v":""},null,null,null,null,1]
[null,"Data",null,null,{"$f":"M9","v":""},null,null,null,null,1,null,"data",{"$f":"IF(D6>0,0,1)","v":1}]
[null,null,null,null,{"$f":"M10","v":""},null,null,null,null,1,null,"ERRORE1",{"$f":"IF(M2+M4+M6+M11+M13+M16+M18+O18+O13,\"ERRORE DI MANCATA COMPILAZIONE DATI NECESSARI PER L'ORDINATIVO\",\"\")","v":"ERRORE DI MANCATA COMPILAZIONE DATI NECESSARI PER L'ORDINATIVO"},{"$f":"IF(M7=\"\",0,1)","v":1}]
[null,"Totale IVA incl.",null,{"$f":"G156","v":0},{"$f":"IF(Q11=0,\"CONFIGURATORE OK\", \"\")","v":""},null,"Version 4.5",null,null,1,null,"Warning2",{"$f":"IF(G153>D153,\"!!! ATTENZIONE !!! L'IMPORTO 20% SUPERA IL VALORE MASSIMO CONSENTITO\",\"\")","v":""},{"$f":"IF(M8=\"\",0,1)","v":0}]
[null,null,null,null,null,null,null,null,null,1,null,"ERRORE3",{"$f":"\"\"","v":""},{"$f":"IF(M9=\"\",0,1)","v":0}]
[null,null,null,null,null,null,null,null,null,1,null,"Waning4",{"$f":"IF(N10>0,\"!!! ATTENZIONE !!! COMPLETARE IL CAMPO NOTE NELLE CONFIGURAZIONI\",\"\")","v":""},{"$f":"IF(M22>0,O10,0)+IF(N22>0,P10,0)+IF(O22>0,Q10,0)","v":0},{"$f":"IF(Lotto6_DL560_1!$H$34=\"Specificare la configurazione RAID per l'installazione del Sistema Operativo, se richiesto.\ne/o\ninserire eventuali note.\",1,0)","v":1},{"$f":"IF(Lotto6_DL560_2!$H$36=\"Specificare la configurazione RAID per l'installazione del Sistema Operativo, se richiesto.\ne/o\ninserire eventuali note.\",1,0)","v":0},{"$f":"IF(Lotto6_DL560_3!$H$31=\"Specificare la configurazione RAID per l'installazione del Sistema Operativo, se richiesto.\ne/o\ninserire eventuali note.\",1,0)","v":0}]
[null,"Referente Consegna",null,null,null,null,null,null,null,1,null,"ref1",{"$f":"IF(D11>0,0,1)","v":1},null,"Verifica Errori",null,{"$f":"N7+N9","v":1}]
[null,null,null,null,null,null,null,null,null,1]
[null,"Telefono",null,"email",null,null,null,null,null,1,null,"tel1",{"$f":"IF(C13>0,0,1)","v":1},"mail1",{"$f":"IF(E13>0,0,1)","v":1}]
[null,null,null,null,null,null,null,null,null,1]
[null,null,null,null,null,null,null,null,null,1]
{"$rows_left_out":143}
{"sheet":"Configurazione","index":7,"n_rows":122,"n_cols":24,"rows_kept":122,"cut":false,"hidden":false,"merged":[[115,1,115,8],[117,1,117,3],[117,6,117,8],[100,1,100,2],[101,1,112,2],[100,4,100,5],[101,4,112,5],[100,7,100,8],[101,7,112,8]]}
[null,null,null,null,null,null,null,null,null,null,null,null,null,null,null,null,null,null,null,null,null,1]
[null,{"$f":"Riepilogo!M22","v":0},"Proliant DL560 Gen10 Configurazione 1",null,{"$f":"Riepilogo!N22","v":0},"Proliant DL560 Gen10 Configurazione 2",null,{"$f":"Riepilogo!O22","v":0},"Proliant DL560 Gen10 Configurazione 3",null,null,null,null,null,null,null,null,null,null,null,null,1]
[null,null,{"$f":"IF(B2>0,CONCATENATE(Lotto6_DL560_1!$F$21*32+Lotto6_DL560_1!$F$22*64+128,\"GB \",RIGHT(Lotto6_DL560_1!$C$21,6)),\"\")","v":""},null,null,{"$f":"IF(E2>0,CONCATENATE(Lotto6_DL560_2!$F$21*32+Lotto6_DL560_2!$F$22*64+128,\"GB \",RIGHT(Lotto6_DL560_2!$C$21,6)),\"\")","v":""},null,null,{"$f":"IF(H2>0,CONCATENATE(Lotto6_DL560_3!$F$21*32+Lotto6_DL560_3!$F$22*64+128,\"GB \",RIGHT(Lotto6_DL560_3!$C$21,6)),\"\")","v":""},null,null,null,null,null,null,null,null,null,null,null,null,1]
[null,null,null,null,null,null,null,null,null,null,null,null,null,null,null,null,null,null,null,null,null,{"$f":"IF($U$5+$U$6>0,1,0)","v":0}]
[null,{"$f":"IF(Riepilogo!M23>0,Riepilogo!M23/$B$2,\"\")","v":""},{"$f":"IF(B5=\"\",\"\",Riepilogo!K23)","v":""},null,{"$f":"IF(Riepilogo!N23>0,Riepilogo!N23/$E$2,\"\")","v":""},{"$f":"IF(E5=\"\",\"\",Riepilogo!K23)","v":""},null,{"$f":"IF(Riepilogo!O23>0,Riepilogo!O23/$H$2,\"\")","v":""},{"$f":"IF(H5=\"\",\"\",Riepilogo!K23)","v":""},null,null,{"$f":"IF(B5=\"\",0,B5)","v":0},null,null,{"$f":"IF(E5=\"\",0,E5)","v":0},null,null,{"$f":"IF(H5=\"\",0,H5)","v":0},null,null,{"$f":"SUM(L5:T5)","v":0},{"$f":"IF($U$5+$U$6>0,1,0)","v":0},{"$f":"ISODD(SUM($V$5:V5))","v":false}]
[null,{"$f":"IF(Riepilogo!M24>0,Riepilogo!M24/$B$2,\"\")","v":""},{"$f":"IF(B6=\"\",\"\",Riepilogo!K24)","v":""},null,{"$f":"IF(Riepilogo!N24>0,Riepilogo!N24/$E$2,\"\")","v":""},{"$f":"IF(E6=\"\",\"\",Riepilogo!K24)","v":""},null,{"$f":"IF(Riepilogo!O24>0,Riepilogo!O24/$H$2,\"\")","v":""},{"$f":"IF(H6=\"\",\"\",Riepilogo!K24)","v":""},null,null,{"$f":"IF(B6=\"\",0,B6)","v":0},null,null,{"$f":"IF(E6=\"\",0,E6)","v":0},null,null,{"$f":"IF(H6=\"\",0,H6)","v":0},null,null,{"$f":"SUM(L6:T6)","v":0},{"$f":"IF(U6>0,1,0)","v":0},{"$f":"ISODD(SUM($V$5:V6))","v":false}]
[null,{"$f":"IF(Riepilogo!M25>0,Riepilogo!M25/$B$2,\"\")","v":""},{"$f":"IF(B7=\"\",\"\",Riepilogo!K25)","v":""},null,{"$f":"IF(Riepilogo!N25>0,Riepilogo!N25/$E$2,\"\")","v":""},{"$f":"IF(E7=\"\",\"\",Riepilogo!K25)","v":""},null,{"$f":"IF(Riepilogo!O25>0,Riepilogo!O25/$H$2,\"\")","v":""},{"$f":"IF(H7=\"\",\"\",Riepilogo!K25)","v":""},null,null,{"$f":"IF(B7=\"\",0,B7)","v":0},null,null,{"$f":"IF(E7=\"\",0,E7)","v":0},null,null,{"$f":"IF(H7=\"\",0,H7)","v":0},null,null,{"$f":"SUM(L7:T7)","v":0},0,{"$f":"ISODD(SUM($V$5:V7))","v":false}]
[null,{"$f":"IF(Riepilogo!M26>0,Riepilogo!M26/$B$2,\"\")","v":""},{"$f":"IF(B8=\"\",\"\",Riepilogo!K26)","v":""},null,{"$f":"IF(Riepilogo!N26>0,Riepilogo!N26/$E$2,\"\")","v":""},{"$f":"IF(E8=\"\",\"\",Riepilogo!K26)","v":""},null,{"$f":"IF(Riepilogo!O26>0,Riepilogo!O26/$H$2,\"\")","v":""},{"$f":"IF(H8=\"\",\"\",Riepilogo!K26)","v":""},null,null,0,null,null,0,null,null,0,null,null,0,0,{"$f":"ISODD(SUM($V$5:V8))","v":false}]
[null,{"$f":"IF(Riepilogo!M27>0,Riepilogo!M27/$B$2,\"\")","v":""},{"$f":"IF(B9=\"\",\"\",Riepilogo!K27)","v":""},null,{"$f":"IF(Riepilogo!N27>0,Riepilogo!N27/$E$2,\"\")","v":""},{"$f":"IF(E9=\"\",\"\",Riepilogo!K27)","v":""},null,{"$f":"IF(Riepilogo!O27>0,Riepilogo!O27/$H$2,\"\")","v":""},{"$f":"IF(H9=\"\",\"\",Riepilogo!K27)","v":""},null,null,0,null,null,0,null,null,0,null,null,0,0,{"$f":"ISODD(SUM($V$5:V9))","v":false}]
[null,{"$f":"IF(Riepilogo!M28>0,Riepilogo!M28/$B$2,\"\")","v":""},{"$f":"IF(B10=\"\",\"\",Riepilogo!K28)","v":""},null,{"$f":"IF(Riepilogo!N28>0,Riepilogo!N28/$E$2,\"\")","v":""},{"$f":"IF(E10=\"\",\"\",Riepilogo!K28)","v":""},null,{"$f":"IF(Riepilogo!O28>0,Riepilogo!O28/$H$2,\"\")","v":""},{"$f":"IF(H10=\"\",\"\",Riepilogo!K28)","v":""},null,null,{"$f":"IF(B10=\"\",0,B10)","v":0},null,null,{"$f":"IF(E10=\"\",0,E10)","v":0},null,null,{"$f":"IF(H10=\"\",0,H10)","v":0},null,null,{"$f":"SUM(L10:T10)","v":0},{"$f":"IF(U10>0,1,0)","v":0},{"$f":"ISODD(SUM($V$5:V10))","v":false}]
[null,{"$f":"IF(Riepilogo!M29>0,Riepilogo!M29/$B$2,\"\")","v":""},{"$f":"IF(B11=\"\",\"\",Riepilogo!K29)","v":""},null,{"$f":"IF(Riepilogo!N29>0,Riepilogo!N29/$E$2,\"\")","v":""},{"$f":"IF(E11=\"\",\"\",Riepilogo!K29)","v":""},null,{"$f":"IF(Riepilogo!O29>0,Riepilogo!O29/$H$2,\"\")","v":""},{"$f":"IF(H11=\"\",\"\",Riepilogo!K29)","v":""},null,null,0,null,null,0,null,null,0,null,null,0,0,{"$f":"ISODD(SUM($V$5:V11))","v":false}]
[null,{"$f":"IF(Riepilogo!M30>0,Riepilogo!M30/$B$2,\"\")","v":""},{"$f":"IF(B12=\"\",\"\",Riepilogo!K30)","v":""},null,{"$f":"IF(Riepilogo!N30>0,Riepilogo!N30/$E$2,\"\")","v":""},{"$f":"IF(E12=\"\",\"\",Riepilogo!K30)","v":""},null,{"$f":"IF(Riepilogo!O30>0,Riepilogo!O30/$H$2,\"\")","v":""},{"$f":"IF(H12=\"\",\"\",Riepilogo!K30)","v":""},null,null,0,null,null,0,null,null,0,null,null,0,0,{"$f":"ISODD(SUM($V$5:V12))","v":false}]
[null,{"$f":"IF(Riepilogo!M31>0,Riepilogo!M31/$B$2,\"\")","v":""},{"$f":"IF(B13=\"\",\"\",Riepilogo!K31)","v":""},null,{"$f":"IF(Riepilogo!N31>0,Riepilogo!N31/$E$2,\"\")","v":""},{"$f":"IF(E13=\"\",\"\",Riepilogo!K31)","v":""},null,{"$f":"IF(Riepilogo!O31>0,Riepilogo!O31/$H$2,\"\")","v":""},{"$f":"IF(H13=\"\",\"\",Riepilogo!K31)","v":""},null,null,0,null,null,0,null,null,0,null,null,0,0,{"$f":"ISODD(SUM($V$5:V13))","v":false}]
[null,{"$f":"IF(Riepilogo!M32>0,Riepilogo!M32/$B$2,\"\")","v":""},{"$f":"IF(B14=\"\",\"\",Riepilogo!K32)","v":""},null,{"$f":"IF(Riepilogo!N32>0,Riepilogo!N32/$E$2,\"\")","v":""},{"$f":"IF(E14=\"\",\"\",Riepilogo!K32)","v":""},null,{"$f":"IF(Riepilogo!O32>0,Riepilogo!O32/$H$2,\"\")","v":""},{"$f":"IF(H14=\"\",\"\",Riepilogo!K32)","v":""},null,null,0,null,null,0,null,null,0,null,null,0,0,{"$f":"ISODD(SUM($V$5:V14))","v":false}]
[null,{"$f":"IF(Riepilogo!M33>0,Riepilogo!M33/$B$2,\"\")","v":""},{"$f":"IF(B15=\"\",\"\",Riepilogo!K33)","v":""},null,{"$f":"IF(Riepilogo!N33>0,Riepilogo!N33/$E$2,\"\")","v":""},{"$f":"IF(E15=\"\",\"\",Riepilogo!K33)","v":""},null,{"$f":"IF(Riepilogo!O33>0,Riepilogo!O33/$H$2,\"\")","v":""},{"$f":"IF(H15=\"\",\"\",Riepilogo!K33)","v":""},null,null,0,null,null,0,null,null,0,null,null,0,0,{"$f":"ISODD(SUM($V$5:V15))","v":false}]
{"$rows_left_out":107}