{"text_format":"1","workbook":"xlsx","n_sheets":8,"sheets":["Lotto6_DL560_1","Lotto6_DL560_2","Lotto6_DL560_3","Altre_Opzioni","ConfigurationTS3L6","Tabella_prezzi","Riepilogo","Configurazione"],"not_rendered":{"charts":0,"images":21,"macros":1,"external_links":0,"defined_names":18,"comments":0,"pivot_tables":0},"unopened":[],"bounds":{"document_bytes":16777216,"sheet_cells":100000,"rows_first":2000,"rows_last":500,"rows_between":2000,"halvings":0,"cell_chars":16384,"cell_head_chars":4096},"cells_cut":0,"cells_raw":0,"read":"whole","date_system":"1900"}

{"sheet":"Lotto6_DL560_1","index":0,"n_rows":123,"n_cols":19,"rows_kept":123,"cut":false,"hidden":false,"merged":[[119,3,120,3],[34,2,35,2],[33,7,54,7],[68,1,68,4],[4,0,4,2],[7,3,8,3],[13,3,14,3],[59,3,60,3],[116,3,117,3],[37,2,37,5],[62,3,63,3],[29,1,29,4]]}
[null,null,null,null,"Convenzione",{"$f":"SUM(J9:J122)*F5","v":0}]
[null,null,null,null,0.2,{"$f":"SUM(K9:K122)*F5","v":0}]
[null,null,null,null,"Totale",{"$f":"SUM(F1:F2)","v":0}]
[null,null,null,null,null,null,null,{"$f":"IF($E$12=\"TS3L4-VSAN\",\"vSAN ReadyNode™\",IF($E$12=\"TS3L4-GPUDW\",\"GPU Double-Wide Server Ready\",IF($E$12=\"TS3L4-GPUSW\",\"GPU Single-Wide Server Ready\",\"\")))","v":""}]
["HPE PROLIANT DL560 Gen10    Consulta la Guida alla Convenzione ->",null,null,{"$f":"HYPERLINK(\"https://convenzioni.converge.it/docs/L6GuidaAllaConvenzioneTecnologieServer3.pdf\",\"&\")","v":"&"},"Quantità Server",null,null,{"$f":"Riepilogo!G8","v":"Version 4.5"}]
[]
[]
[null,null,"Base",{"$f":"HYPERLINK(\"https://convenzioni.converge.it/docs/ts3_datasheet/HPE%20ProLiant%20DL560%20Gen10-spec-sheet.pdf\",\"i\")","v":"i"}]
[null,null,"Proliant DL560 Gen10",null,{"$f":"VLOOKUP($C9,TS3L6_ALL,15,FALSE)","v":"TS3L6-SRV"},{"$f":"IF($F$5>0,1,\"\")","v":""},null,null,null,{"$f":"VLOOKUP($C9,TS3L6_ALL,10,FALSE)","v":5912},null,{"$f":"VLOOKUP($C9,TS3L6_ALL,14,FALSE)","v":"L6N01"},{"$f":"IF(L9=\"L6N01\",1,0)","v":1}]
[]
[null,null,"Chassis Configuration"]
[null,null,{"$f":"VLOOKUP($C$9,TS3L6_Chassis,2,FALSE)","v":"Chassis with 16 x 2.5 Hard Drives"}]
[]
[null,null,"Processor",{"$f":"HYPERLINK(\"https://ark.intel.com/content/www/it/it/ark/products/193951/intel-xeon-gold-6252n-processor-35-75m-cache-2-30-ghz.html\",\"i\")","v":"i"}]
[null,null,"2 x Intel Xeon-Gold 6252N (2.3GHz/24-core/150W)"]
[]
[null,null,"Additional Processor"]
[null,null,"No Additional Processor",null,{"$f":"IF($M$9=1,VLOOKUP($C$18,TS3L6_CPU,15,FALSE),VLOOKUP($C$18,TS3L6_CPU,13,FALSE))","v":""},{"$f":"IF(F12=1,VLOOKUP($C$15,TS3L6_CPU,7,FALSE),VLOOKUP($C$18,TS3L6_CPU,7,FALSE))","v":0},null,null,null,{"$f":"IF(F12=1,VLOOKUP($C$15,TS3L6_CPU,10,FALSE),VLOOKUP($C$18,TS3L6_CPU,10,FALSE))","v":0},{"$f":"IF(F12=1,VLOOKUP($C$15,TS3L6_CPU,11,FALSE),VLOOKUP($C$18,TS3L6_CPU,11,FALSE))","v":0},{"$f":"IF($M$9=1,VLOOKUP(C18,TS3L6_ALL,14,FALSE),VLOOKUP(C18,TS3L6_ALL,12,FALSE))","v":""}]
[null,null,null,null,{"$f":"IF(E18=\"TS3L4-CPU8CORE\",\"TS3L4-CPU\",\"\")","v":""},{"$f":"IFERROR(O19,\"\")","v":""},null,null,null,{"$f":"IFERROR(N19,0)","v":0},null,{"$f":"IF(E19=\"TS3L4-CPU\",\"L4N02\",0)","v":0},null,{"$f":"VLOOKUP($L$19,Tabella_prezzi!$A$3:$K$331,4,FALSE)","v":{"$error":"#N/A"}},{"$f":"VLOOKUP($L$19,Tabella_prezzi!$A$3:$K$331,7,FALSE)","v":{"$error":"#N/A"}}]
[null,null,"Memory Capacity"]
[null,null,"128GB (32GB)",null,{"$f":"IF(J21>0,IF(M9=0,\"TS3L6-RAM32N\",\"TS3L6-RAM32\"),\"\")","v":""},{"$f":"IFERROR(O21,4)","v":0},null,null,null,{"$f":"IFERROR(P21,(184*4))","v":0},null,{"$f":"IFERROR(Q21,IF(M9=0,N23,N23))","v":""},"32GB",{"$f":"IF($M$9=1,VLOOKUP($C$21,TS3L6_RAM2CPU,15,FALSE),VLOOKUP($C$21,TS3L6_RAM1CPU,13,FALSE))","v":{"$error":"#N/A"}},{"$f":"IF($F$18=1,VLOOKUP($C$21,TS3L6_RAM2CPU,7,FALSE),VLOOKUP($C$21,TS3L6_RAM1CPU,7,FALSE))","v":0},{"$f":"IF($F$18=1,VLOOKUP($C$21,TS3L6_RAM2CPU,10,FALSE),VLOOKUP($C$21,TS3L6_RAM1CPU,10,FALSE))","v":0},{"$f":"IF(M9=0,IF($F$18=1,VLOOKUP($C$21,TS3L6_RAM2CPU,12,FALSE),VLOOKUP($C$21,TS3L6_RAM1CPU,12,FALSE)),IF($F$18=1,VLOOKUP($C$21,TS3L6_RAM2CPU,14,FALSE),VLOOKUP($C$21,TS3L6_RAM1CPU,14,FALSE)))","v":""}]
[null,null,null,null,{"$f":"IF(J22>0,IF(M9=0,\"TS3L6-RAM64N\",\"TS3L6-RAM64\"),\"\")","v":""},{"$f":"IFERROR(O22,0)","v":0},null,null,null,{"$f":"IFERROR(P22,0)","v":0},null,{"$f":"IFERROR(Q22,IF(M9=0,N24,N24))","v":""},"64GB",{"$f":"IF($M$9=1,VLOOKUP($C$21,TS3L6_RAM2CPU,23,FALSE),VLOOKUP($C$21,TS3L6_RAM1CPU,21,FALSE))","v":{"$error":"#N/A"}},{"$f":"IF($F$18=1,VLOOKUP($C$21,TS3L6_RAM2CPU,24,FALSE),VLOOKUP($C$21,TS3L6_RAM1CPU,24,FALSE))","v":0},{"$f":"IF($F$18=1,VLOOKUP($C$21,TS3L6_RAM2CPU,18,FALSE),VLOOKUP($C$21,TS3L6_RAM1CPU,18,FALSE))","v":0},{"$f":"IF(M9=0,IF($F$18=1,VLOOKUP($C$21,TS3L6_RAM2CPU,20,FALSE),VLOOKUP($C$21,TS3L6_RAM1CPU,20,FALSE)),IF($F$18=1,VLOOKUP($C$21,TS3L6_RAM2CPU,22,FALSE),VLOOKUP($C$21,TS3L6_RAM1CPU,22,FALSE)))","v":""}]
[null,null,null,null,null,null,null,null,null,null,null,null,"32GB",{"$f":"IF(M9=1,\"L6N03\",\"L6N03B\")","v":"L6N03"}]
[null,null,"Operating System",null,null,null,null,null,null,null,null,null,"64GB",{"$f":"IF(M9=1,\"L6N04\",\"L6N04B\")","v":"L6N04"}]
[null,null,"No Operating System",null,{"$f":"IF($M$9=1,VLOOKUP($C$25,TS3L6_OS,15,FALSE),VLOOKUP($C$25,TS3L6_OS,13,FALSE))","v":""},{"$f":"VLOOKUP($C$25,TS3L6_OS,7,FALSE)","v":0},null,null,null,{"$f":"VLOOKUP($C$25,TS3L6_OS,10,FALSE)","v":0},{"$f":"VLOOKUP($C$25,TS3L6_OS,11,FALSE)","v":0},{"$f":"IF($M$9=1,VLOOKUP($C25,TS3L6_ALL,14,FALSE),VLOOKUP($C25,TS3L6_ALL,12,FALSE))","v":""}]
[null,null,null,null,{"$f":"IF($M$9=1,VLOOKUP($C$25,TS3L6_OS,25,FALSE),VLOOKUP($C$25,TS3L6_OS,24,FALSE))","v":""},{"$f":"IF(F18=1,VLOOKUP($C$25,TS3L6_OS,16,FALSE),VLOOKUP($C$25,TS3L6_OS,21,FALSE))","v":0},null,null,null,{"$f":"IF(F18=1,VLOOKUP($C$25,TS3L6_OS,19,FALSE),VLOOKUP($C$25,TS3L6_OS,20,FALSE))","v":0},null,{"$f":"IF($M$9=1,VLOOKUP($C25,TS3L6_OS,23,FALSE),VLOOKUP($C25,TS3L6_OS,22,FALSE))","v":0}]
[]
[null,null,"Configurazione opzionale dello chassis"]
[null,null,"Standard",null,{"$f":"IF($M$9=1,VLOOKUP($C$29,TS3L6_ALL,15,FALSE),VLOOKUP($C$29,TS3L6_ALL,13,FALSE))","v":""},{"$f":"VLOOKUP($C$29,TS3L6_ALL,7,FALSE)","v":""},null,null,null,{"$f":"VLOOKUP($C29,TS3L6_ALL,10,FALSE)","v":0},{"$f":"VLOOKUP($C29,TS3L6_ALL,11,FALSE)","v":0},{"$f":"IF($M$9=1,VLOOKUP($C29,TS3L6_ALL,14,FALSE),VLOOKUP($C29,TS3L6_ALL,12,FALSE))","v":""}]
[]
[]
[null,null,"Raid Controller"]
[null,null,"HPE Smart Array P816i-a SR G10",{"$f":"IF($C$33=\"HBA330 12Gbps SAS HBA Controller (NON-RAID)\",\"vSAN HCL\",\"\")","v":""},{"$f":"IF($M$9=1,VLOOKUP($C$33,TS3L6_ALL,15,FALSE),VLOOKUP($C$33,TS3L6_ALL,13,FALSE))","v":""},{"$f":"VLOOKUP($C$33,TS3L6_ALL,7,FALSE)","v":""},null,"Configurazione RAID e/o NOTE",null,{"$f":"VLOOKUP($C33,TS3L6_ALL,10,FALSE)","v":0},{"$f":"VLOOKUP($C33,TS3L6_ALL,11,FALSE)","v":0},{"$f":"IF($M$9=1,VLOOKUP($C33,TS3L6_ALL,14,FALSE),VLOOKUP($C33,TS3L6_ALL,12,FALSE))","v":""}]
[null,null,null,null,null,null,null,"Specificare la configurazione RAID per l'installazione del Sistema Operativo, se richiesto.\ne/o\ninserire eventuali note."]
[null,null,{"$f":"IF(L9=\"L6N01b\",\"Hard Drivers Bays disponibili n° 12 - NVMe Bays disponibili n° 4\",IF(F29=1,\"Hard Drivers Bays disponibili n° 24\",\"Hard Drivers Bays disponibili n° 16\"))","v":"Hard Drivers Bays disponibili n° 16"},null,"Usati","Disponibili"]
[null,null,null,"HDD/SDD",{"$f":"F39+F41+F43+F49+F51+F45+F47","v":2},{"$f":"IF(L9=\"L6N01b\",(12-E36),IF(F29=1,(24-E36),(16-E36)))","v":14}]
[null,null,null,{"$f":"IF(L9=\"L6N01b\",\"NVMe\",\"\")","v":""},{"$f":"IF(L9=\"L6N01b\",F53+F55,\"\")","v":""},{"$f":"IF(L9=\"L6N01b\",(4-E37),\"\")","v":""}]
[null,null,{"$f":"IF(M9=0,\"!!!ATTENZIONE!!! I dischi NVMe possono essere acquistati solo insieme al server. Non sono presenti per gli Acquisti Successivi.\",\"\")","v":""}]
[null,null,{"$f":"ConfigurationTS3L6!A65","v":"HPE 300GB SAS 12G Enterprise 10K SFF (2.5in) SC"},null,{"$f":"IF($M$9=1,VLOOKUP(C39,TS3L6_HDD,15,FALSE),VLOOKUP(C39,TS3L6_HDD,13,FALSE))","v":"TS3L6-HDD300GB"},null,null,null,null,{"$f":"VLOOKUP($C39,TS3L6_HDD,10,FALSE)*F39","v":0},{"$f":"VLOOKUP($C39,TS3L6_HDD,11,FALSE)","v":0},{"$f":"IF($M$9=1,VLOOKUP(C39,TS3L6_ALL,14,FALSE),VLOOKUP(C39,TS3L6_ALL,12,FALSE))","v":"L6N12"}]
[]
[null,null,{"$f":"ConfigurationTS3L6!A66","v":"HPE 1.2TB SAS 12G Enterprise 10K SFF (2.5in) SC"},null,{"$f":"IF($M$9=1,VLOOKUP(C41,TS3L6_HDD,15,FALSE),VLOOKUP(C41,TS3L6_HDD,13,FALSE))","v":"TS3L6-HDD1TB"},null,null,null,null,{"$f":"VLOOKUP($C41,TS3L6_HDD,10,FALSE)*F41","v":0},{"$f":"VLOOKUP($C41,TS3L6_HDD,11,FALSE)","v":0},{"$f":"IF($M$9=1,VLOOKUP(C41,TS3L6_ALL,14,FALSE),VLOOKUP(C41,TS3L6_ALL,12,FALSE))","v":"L6N11"}]
[]
[null,null,{"$f":"ConfigurationTS3L6!A67","v":"HPE 1.8TB SAS 12G Enterprise 10K SFF (2.5in) SC"},null,{"$f":"IF($M$9=1,VLOOKUP(C43,TS3L6_HDD,15,FALSE),VLOOKUP(C43,TS3L6_HDD,13,FALSE))","v":"TS3L6-HDD2TB"},null,null,null,null,{"$f":"VLOOKUP($C43,TS3L6_HDD,10,FALSE)*F43","v":0},{"$f":"VLOOKUP($C43,TS3L6_HDD,11,FALSE)","v":0},{"$f":"IF($M$9=1,VLOOKUP(C43,TS3L6_ALL,14,FALSE),VLOOKUP(C43,TS3L6_ALL,12,FALSE))","v":"L6N10"}]
[]
[null,null,{"$f":"ConfigurationTS3L6!A68","v":"HPE 960GB SAS 12G Read Intensive SFF (2.5in) SC"},null,{"$f":"IF($M$9=1,VLOOKUP(C45,TS3L6_HDD,15,FALSE),VLOOKUP(C45,TS3L6_HDD,13,FALSE))","v":"TS3L6-RI800GB"},null,null,null,null,{"$f":"VLOOKUP($C45,TS3L6_HDD,10,FALSE)*F45","v":0},{"$f":"VLOOKUP($C45,TS3L6_HDD,11,FALSE)","v":0},{"$f":"IF($M$9=1,VLOOKUP(C45,TS3L6_ALL,14,FALSE),VLOOKUP(C45,TS3L6_ALL,12,FALSE))","v":"L6N15"}]
[]
[null,null,{"$f":"ConfigurationTS3L6!A69","v":"HPE 1.92TB SAS 12G Read Intensive SFF (2.5in) SC"},null,{"$f":"IF($M$9=1,VLOOKUP(C47,TS3L6_HDD,15,FALSE),VLOOKUP(C47,TS3L6_HDD,13,FALSE))","v":"TS3L6-RI1600GB"},null,null,null,null,{"$f":"VLOOKUP($C47,TS3L6_HDD,10,FALSE)*F47","v":0},{"$f":"VLOOKUP($C47,TS3L6_HDD,11,FALSE)","v":0},{"$f":"IF($M$9=1,VLOOKUP(C47,TS3L6_ALL,14,FALSE),VLOOKUP(C47,TS3L6_ALL,12,FALSE))","v":"L6N13"}]
[]
[null,null,{"$f":"ConfigurationTS3L6!A71","v":"HPE 800GB SAS 12G Mixed Use SFF (2.5in) SC"},null,{"$f":"IF($M$9=1,VLOOKUP(C49,TS3L6_HDD,15,FALSE),VLOOKUP(C49,TS3L6_HDD,13,FALSE))","v":"TS3L6-MU800GB"},2,null,null,null,{"$f":"IF(F49>2,VLOOKUP($C49,TS3L6_HDD,10,FALSE)*(F49-2),0)","v":0},{"$f":"VLOOKUP($C49,TS3L6_HDD,11,FALSE)*F49","v":0},{"$f":"IF($M$9=1,VLOOKUP(C49,TS3L6_ALL,14,FALSE),VLOOKUP(C49,TS3L6_ALL,12,FALSE))","v":"L6N16"}]
[]
[null,null,{"$f":"ConfigurationTS3L6!A72","v":"HPE 1.6TB SAS 12G Mixed Use SFF (2.5in) SC"},null,{"$f":"IF($M$9=1,VLOOKUP(C51,TS3L6_HDD,15,FALSE),VLOOKUP(C51,TS3L6_HDD,13,FALSE))","v":"TS3L6-MU1600GB"},null,null,null,null,{"$f":"VLOOKUP($C51,TS3L6_HDD,10,FALSE)*F51","v":0},{"$f":"VLOOKUP($C51,TS3L6_HDD,11,FALSE)","v":0},{"$f":"IF($M$9=1,VLOOKUP(C51,TS3L6_ALL,14,FALSE),VLOOKUP(C51,TS3L6_ALL,12,FALSE))","v":"L6N14"}]
[]
[null,null,{"$f":"IF($L$9=\"L6N01b\",ConfigurationTS3L6!A73,\"\")","v":""},null,{"$f":"IF($M$9=1,VLOOKUP(C53,TS3L6_HDD,15,FALSE),VLOOKUP(C53,TS3L6_HDD,13,FALSE))","v":""},null,null,null,null,{"$f":"IF($L$9=\"L6N01b\",VLOOKUP($C53,TS3L6_HDD,10,FALSE)*F53,0)","v":0},{"$f":"VLOOKUP($C53,TS3L6_HDD,11,FALSE)*F53","v":0},{"$f":"IF($M$9=1,VLOOKUP(C53,TS3L6_ALL,14,FALSE),VLOOKUP(C53,TS3L6_ALL,12,FALSE))","v":""}]
[]
[null,null,{"$f":"IF($L$9=\"L6N01b\",ConfigurationTS3L6!A74,\"\")","v":""},null,{"$f":"IF($M$9=1,VLOOKUP(C55,TS3L6_HDD,15,FALSE),VLOOKUP(C55,TS3L6_HDD,13,FALSE))","v":""},null,null,null,null,{"$f":"IF($L$9=\"L6N01b\",VLOOKUP($C55,TS3L6_HDD,10,FALSE)*F55,0)","v":0},{"$f":"VLOOKUP($C55,TS3L6_HDD,11,FALSE)*F55","v":0},{"$f":"IF($M$9=1,VLOOKUP(C55,TS3L6_ALL,14,FALSE),VLOOKUP(C55,TS3L6_ALL,12,FALSE))","v":""}]
[]
[null,null,"Power Supply"]
[null,null,"Dual, Hot-plug, Redundant Power Supply (1+1), 1600W"]
[]
[null,null,"HPE OneView Advanced (with HPE iLO Advanced)",{"$f":"HYPERLINK(\"https://convenzioni.converge.it/docs/ts3_datasheet/ilo-spec-sheet.pdf\",\"i\")","v":"i"}]
[null,null,"None",null,{"$f":"IF($M$9=1,VLOOKUP(C61,TS3L6_ALL,15,FALSE),VLOOKUP(C61,TS3L6_ALL,13,FALSE))","v":""},{"$f":"VLOOKUP($C61,TS3L6_ALL,7,FALSE)","v":""},null,null,null,{"$f":"VLOOKUP($C61,TS3L6_ALL,10,FALSE)","v":0},{"$f":"VLOOKUP($C61,TS3L6_ALL,11,FALSE)","v":0},{"$f":"IF($M$9=1,VLOOKUP(C61,TS3L6_ALL,14,FALSE),VLOOKUP(C61,TS3L6_ALL,12,FALSE))","v":""}]
[]
[null,null,"Micro SD (USB Flash Drive)"]
[null,null,"None",null,{"$f":"IF($M$9=1,VLOOKUP(C64,TS3L6_ALL,15,FALSE),VLOOKUP(C64,TS3L6_ALL,13,FALSE))","v":""},{"$f":"VLOOKUP($C64,TS3L6_ALL,7,FALSE)","v":""},null,null,null,{"$f":"VLOOKUP($C64,TS3L6_ALL,10,FALSE)","v":0},{"$f":"VLOOKUP($C64,TS3L6_ALL,11,FALSE)","v":0},{"$f":"IF($M$9=1,VLOOKUP(C64,TS3L6_ALL,14,FALSE),VLOOKUP(C64,TS3L6_ALL,12,FALSE))","v":""}]
[]
[null,null,"Network Cards"]
[null,null,"HPE Ethernet 1Gb 4-port FLR-T BCM5719 Adapter"]
[]
[]
[]
[null,null,"PCI Slot 1 Processor 1 x8 PCIe Gen3"]
[null,null,"",null,{"$f":"IF($M$9=1,VLOOKUP(C72,TS3L6_ALL,15,FALSE),VLOOKUP(C72,TS3L6_ALL,13,FALSE))","v":""},{"$f":"VLOOKUP($C72,TS3L6_ALL,7,FALSE)","v":""},null,null,null,{"$f":"VLOOKUP($C72,TS3L6_ALL,10,FALSE)","v":0},{"$f":"VLOOKUP($C72,TS3L6_ALL,11,FALSE)","v":0},{"$f":"IF($M$9=1,VLOOKUP(C72,TS3L6_ALL,14,FALSE),VLOOKUP(C72,TS3L6_ALL,12,FALSE))","v":""}]
[]
[null,null,{"$f":"IF($L$9=\"L6N01b\",\"PCI Slot 2 Processor 1 x8 PCIe Gen3\",\"PCI Slot 2 Processor 1 x16 PCIe Gen3 ----------GPU Slot----------\")","v":"PCI Slot 2 Processor 1 x16 PCIe Gen3 ----------GPU Slot----------"}]
[null,null,"",null,{"$f":"IF($M$9=1,VLOOKUP(C75,TS3L6_ALL,15,FALSE),VLOOKUP(C75,TS3L6_ALL,13,FALSE))","v":""},{"$f":"VLOOKUP($C75,TS3L6_ALL,7,FALSE)","v":""},null,null,null,{"$f":"VLOOKUP($C75,TS3L6_ALL,10,FALSE)","v":0},{"$f":"VLOOKUP($C75,TS3L6_ALL,11,FALSE)","v":0},{"$f":"IF($M$9=1,VLOOKUP(C75,TS3L6_ALL,14,FALSE),VLOOKUP(C75,TS3L6_ALL,12,FALSE))","v":""}]
[]
[null,null,"PCI Slot 3 Processor 1 x8 PCIe Gen3"]
[null,null,"",null,{"$f":"IF($M$9=1,VLOOKUP(C78,TS3L6_ALL,15,FALSE),VLOOKUP(C78,TS3L6_ALL,13,FALSE))","v":""},{"$f":"VLOOKUP($C78,TS3L6_ALL,7,FALSE)","v":""},null,null,null,{"$f":"VLOOKUP($C78,TS3L6_ALL,10,FALSE)","v":0},{"$f":"VLOOKUP($C78,TS3L6_ALL,11,FALSE)","v":0},{"$f":"IF($M$9=1,VLOOKUP(C78,TS3L6_ALL,14,FALSE),VLOOKUP(C78,TS3L6_ALL,12,FALSE))","v":""}]
[]
[null,null,"PCI Slot 4 Processor 2 x8 PCIe Gen3"]
[null,null,"",null,{"$f":"IF($M$9=1,VLOOKUP(C81,TS3L6_ALL,15,FALSE),VLOOKUP(C81,TS3L6_ALL,13,FALSE))","v":""},{"$f":"VLOOKUP($C81,TS3L6_ALL,7,FALSE)","v":""},null,null,null,{"$f":"VLOOKUP($C81,TS3L6_ALL,10,FALSE)","v":0},{"$f":"VLOOKUP($C81,TS3L6_ALL,11,FALSE)","v":0},{"$f":"IF($M$9=1,VLOOKUP(C81,TS3L6_ALL,14,FALSE),VLOOKUP(C81,TS3L6_ALL,12,FALSE))","v":""}]
[]
[null,null,{"$f":"IF($L$9=\"L6N01b\",\"PCI Slot 5 Processor 2 x8 PCIe Gen3\",\"PCI Slot 5 Processor 2 x16 PCIe Gen3 ----------GPU Slot----------\")","v":"PCI Slot 5 Processor 2 x16 PCIe Gen3 ----------GPU Slot----------"}]
[null,null,"",null,{"$f":"IF($M$9=1,VLOOKUP(C84,TS3L6_ALL,15,FALSE),VLOOKUP(C84,TS3L6_ALL,13,FALSE))","v":""},{"$f":"VLOOKUP($C84,TS3L6_ALL,7,FALSE)","v":""},null,null,null,{"$f":"VLOOKUP($C84,TS3L6_ALL,10,FALSE)","v":0},{"$f":"VLOOKUP($C84,TS3L6_ALL,11,FALSE)","v":0},{"$f":"IF($M$9=1,VLOOKUP(C84,TS3L6_ALL,14,FALSE),VLOOKUP(C84,TS3L6_ALL,12,FALSE))","v":""}]
[]
[null,null,"PCI Slot 6 Processor 2 x8 PCIe Gen3"]
[null,null,"",null,{"$f":"IF($M$9=1,VLOOKUP(C87,TS3L6_ALL,15,FALSE),VLOOKUP(C87,TS3L6_ALL,13,FALSE))","v":""},{"$f":"VLOOKUP($C87,TS3L6_ALL,7,FALSE)","v":""},null,null,null,{"$f":"VLOOKUP($C87,TS3L6_ALL,10,FALSE)","v":0},{"$f":"VLOOKUP($C87,TS3L6_ALL,11,FALSE)","v":0},{"$f":"IF($M$9=1,VLOOKUP(C87,TS3L6_ALL,14,FALSE),VLOOKUP(C87,TS3L6_ALL,12,FALSE))","v":""}]
[]
[null,null,"PCI Slot 7 Processor 2 x8 PCIe Gen3"]
[null,null,"",null,{"$f":"VLOOKUP($C90,TS3L6_ALL,13,FALSE)","v":""},{"$f":"VLOOKUP($C90,TS3L6_ALL,7,FALSE)","v":""},null,{"$f":"IF(M90=\"Errore\",\"ERRORE nella selezione del PCI Slot\",IFERROR(O91,\"ERRORE nella selezione del PCI Slot\"))","v":0},null,{"$f":"VLOOKUP($C90,TS3L6_ALL,10,FALSE)","v":0},{"$f":"VLOOKUP($C90,TS3L6_ALL,11,FALSE)","v":0},{"$f":"VLOOKUP($C90,TS3L6_ALL,12,FALSE)","v":""}]
[]
[null,null,"PCI Slot 8 Processor 2 x16 PCIe Gen3"]
[null,null,"",null,{"$f":"VLOOKUP($C93,TS3L6_ALL,13,FALSE)","v":""},{"$f":"VLOOKUP($C93,TS3L6_ALL,7,FALSE)","v":""},null,{"$f":"IFERROR(O94,\"ERRORE nella selezione del PCI Slot\")","v":0},null,{"$f":"VLOOKUP($C93,TS3L6_ALL,10,FALSE)","v":0},{"$f":"VLOOKUP($C93,TS3L6_ALL,11,FALSE)","v":0},{"$f":"VLOOKUP($C93,TS3L6_ALL,12,FALSE)","v":""}]
[]
[null,null,"M.2 - Solid State Drives"]
[null,null,"None",null,{"$f":"IF($M$9=1,VLOOKUP(C96,TS3L6_ALL,15,FALSE),VLOOKUP(C96,TS3L6_ALL,13,FALSE))","v":""},{"$f":"VLOOKUP($C96,TS3L6_ALL,7,FALSE)","v":""},null,null,null,{"$f":"VLOOKUP($C96,TS3L6_ALL,10,FALSE)","v":0},{"$f":"VLOOKUP($C96,TS3L6_ALL,11,FALSE)","v":0},{"$f":"IF($M$9=1,VLOOKUP(C96,TS3L6_ALL,14,FALSE),VLOOKUP(C96,TS3L6_ALL,12,FALSE))","v":""}]
[]
[null,null,"Cables for Intel Omni-Path Adapter"]
[null,null,"HPE 3M 100Gb QSFP28 Omni-Path Optical Power Class 2 Cable",null,{"$f":"IF(K99>0,IF($M$9=1,VLOOKUP(C99,TS3L6_ALL,15,FALSE),VLOOKUP(C99,TS3L6_ALL,13,FALSE)),\"\")","v":""},null,null,null,null,0,{"$f":"IF(F99>0,VLOOKUP($C99,TS3L6_ALL,11,FALSE)*F99,0)","v":0},{"$f":"IF(F99>0,IF($M$9=1,VLOOKUP(C99,TS3L6_ALL,14,FALSE),VLOOKUP(C99,TS3L6_ALL,12,FALSE)),\"\")","v":""}]
[null,null,"HPE 5M 100Gb QSFP28 Omni-Path Optical Power Class 2 Cable",null,{"$f":"IF(K100>0,IF($M$9=1,VLOOKUP(C100,TS3L6_ALL,15,FALSE),VLOOKUP(C100,TS3L6_ALL,13,FALSE)),\"\")","v":""},null,null,null,null,0,{"$f":"IF(F100>0,VLOOKUP($C100,TS3L6_ALL,11,FALSE)*F100,0)","v":0},{"$f":"IF(F100>0,IF($M$9=1,VLOOKUP(C100,TS3L6_ALL,14,FALSE),VLOOKUP(C100,TS3L6_ALL,12,FALSE)),\"\")","v":""}]
[null,null,"HPE 7M 100Gb QSFP28 Omni-Path Optical Power Class 2 Cable",null,{"$f":"IF(K101>0,IF($M$9=1,VLOOKUP(C101,TS3L6_ALL,15,FALSE),VLOOKUP(C101,TS3L6_ALL,13,FALSE)),\"\")","v":""},null,null,null,null,0,{"$f":"IF(F101>0,VLOOKUP($C101,TS3L6_ALL,11,FALSE)*F101,0)","v":0},{"$f":"IF(F101>0,IF($M$9=1,VLOOKUP(C101,TS3L6_ALL,14,FALSE),VLOOKUP(C101,TS3L6_ALL,12,FALSE)),\"\")","v":""}]
[]
[null,null,"Transceiver"]
[null,null,"HPE 10G SFP+ LR Transceiver",null,{"$f":"IF(K104>0,IF($M$9=1,VLOOKUP(C104,TS3L6_ALL,15,FALSE),VLOOKUP(C104,TS3L6_ALL,13,FALSE)),\"\")","v":""},null,null,null,null,0,{"$f":"IF(F104>0,VLOOKUP($C104,TS3L6_ALL,11,FALSE)*F104,0)","v":0},{"$f":"IF(F104>0,IF($M$9=1,VLOOKUP(C104,TS3L6_ALL,14,FALSE),VLOOKUP(C104,TS3L6_ALL,12,FALSE)),\"\")","v":""}]
[null,null,"HPE 10G SFP+ SR Transceiver",null,{"$f":"IF(K105>0,IF($M$9=1,VLOOKUP(C105,TS3L6_ALL,15,FALSE),VLOOKUP(C105,TS3L6_ALL,13,FALSE)),\"\")","v":""},null,null,null,null,0,{"$f":"IF(F105>0,VLOOKUP($C105,TS3L6_ALL,11,FALSE)*F105,0)","v":0},{"$f":"IF(F105>0,IF($M$9=1,VLOOKUP(C105,TS3L6_ALL,14,FALSE),VLOOKUP(C105,TS3L6_ALL,12,FALSE)),\"\")","v":""}]
[]
[null,null,"Cables"]
[null,null,"Cavo DAC HPE 10GB SFP+ SFP+ 3 metri",null,{"$f":"IF(K108>0,IF($M$9=1,VLOOKUP(C108,TS3L6_ALL,15,FALSE),VLOOKUP(C108,TS3L6_ALL,13,FALSE)),\"\")","v":""},null,null,null,null,0,{"$f":"IF(F108>0,VLOOKUP($C108,TS3L6_ALL,11,FALSE)*F108,0)","v":0},{"$f":"IF(F108>0,IF($M$9=1,VLOOKUP(C108,TS3L6_ALL,14,FALSE),VLOOKUP(C108,TS3L6_ALL,12,FALSE)),\"\")","v":""}]
[null,null,"HPE Premier Flex LC/LC OM4 2f 2m Cbl",null,{"$f":"IF(K109>0,IF($M$9=1,VLOOKUP(C109,TS3L6_ALL,15,FALSE),VLOOKUP(C109,TS3L6_ALL,13,FALSE)),\"\")","v":""},null,null,null,null,0,{"$f":"IF(F109>0,VLOOKUP($C109,TS3L6_ALL,11,FALSE)*F109,0)","v":0},{"$f":"IF(F109>0,IF($M$9=1,VLOOKUP(C109,TS3L6_ALL,14,FALSE),VLOOKUP(C109,TS3L6_ALL,12,FALSE)),\"\")","v":""}]
[null,null,"HPE 25Gb SFP28 to SFP28 3m DAC",null,{"$f":"IF(K110>0,IF($M$9=1,VLOOKUP(C110,TS3L6_ALL,15,FALSE),VLOOKUP(C110,TS3L6_ALL,13,FALSE)),\"\")","v":""},null,null,null,null,0,{"$f":"IF(F110>0,VLOOKUP($C110,TS3L6_ALL,11,FALSE)*F110,0)","v":0},{"$f":"IF(F110>0,IF($M$9=1,VLOOKUP(C110,TS3L6_ALL,14,FALSE),VLOOKUP(C110,TS3L6_ALL,12,FALSE)),\"\")","v":""}]
[]
[null,null,null,null,{"$f":"IF(K112>0,VLOOKUP($C112,ConfigurationTS3L6!$A$1:$O$4574,13,FALSE),\"\")","v":""},null,null,null,null,0,{"$f":"IF(F112>0,VLOOKUP($C112,TS3L6_ALL,11,FALSE)*F112,0)","v":0},{"$f":"IF(F112>0,VLOOKUP($C112,TS3L6_ALL,12,FALSE),0)","v":0}]
[]
[null,null,"Cavi RJ45"]
[null,null,"Cavo “patch” di 3 mt RJ45 certificato per gigabit ethernet",null,{"$f":"IF(K115>0,IF($M$9=1,VLOOKUP(C115,TS3L6_ALL,15,FALSE),VLOOKUP(C115,TS3L6_ALL,13,FALSE)),\"\")","v":"TS3L6-RJ453M"},5,null,null,null,0,{"$f":"IF(F115>0,IF($M$9=1,VLOOKUP(C115,TS3L6_ALL,11,FALSE)*(F115),VLOOKUP(C115,TS3L6_ALL,11,FALSE)*(F115)),0)","v":15},{"$f":"IF(F115>0,IF($M$9=1,VLOOKUP(C115,TS3L6_ALL,14,FALSE),VLOOKUP(C115,TS3L6_ALL,12,FALSE)),\"\")","v":"L6N34"}]
[]
[null,null,"Warranty",{"$f":"HYPERLINK(\"https://convenzioni.converge.it/docs/ts3_datasheet/TS3warranty_hpe.pdf\",\"i\")","v":"i"}]
[null,null,"Manutenzione in garanzia (36 mesi)",null,{"$f":"IF($M$9=1,VLOOKUP(C118,TS3L6_ALL,15,FALSE),VLOOKUP(C118,TS3L6_ALL,13,FALSE))","v":""},{"$f":"VLOOKUP($C118,TS3L6_WARRANTY,7,FALSE)","v":""},null,null,null,{"$f":"VLOOKUP($C118,TS3L6_WARRANTY,10,FALSE)","v":0},{"$f":"VLOOKUP($C118,TS3L6_WARRANTY,11,FALSE)","v":0},{"$f":"IF($M$9=1,VLOOKUP(C118,TS3L6_ALL,14,FALSE),VLOOKUP(C118,TS3L6_ALL,12,FALSE))","v":""}]
[]
[null,null,"Hard Disk Retention",{"$f":"HYPERLINK(\"https://convenzioni.converge.it/docs/ts3_datasheet/HPE_HDD_KYHD.pdf\",\"i\")","v":"i"}]
[null,null,"",null,{"$f":"IF($M$9=0,$N$122,$N$121)","v":""},{"$f":"IF(C121=\"\",\"\",1)","v":""},null,null,null,{"$f":"IFERROR(Q121,VLOOKUP(C121,TS3L6_ALL,10,FALSE))","v":0},{"$f":"IFERROR(R121,VLOOKUP(C121,TS3L6_ALL,11,FALSE))","v":0},{"$f":"IF(M9=0,O122,O121)","v":""},null,{"$f":"IFERROR($P$121,VLOOKUP($C$121,TS3L6_ALL,15,FALSE))","v":""},{"$f":"IFERROR($S$121,VLOOKUP($C$121,TS3L6_ALL,14,FALSE))","v":""},{"$f":"IF(F118+F121=2,VLOOKUP(\"Hard Disk Retention (60 mesi)\",TS3L6_ALL,15,FALSE),VLOOKUP(C121,TS3L6_ALL,15,FALSE))","v":{"$error":"#VALUE!"}},{"$f":"IF(F118+F121=2,VLOOKUP(\"Hard Disk Retention (60 mesi)\",TS3L6_ALL,10,FALSE),VLOOKUP(C121,TS3L6_ALL,10,FALSE))","v":{"$error":"#VALUE!"}},{"$f":"IF(F118+F121=2,VLOOKUP(\"Hard Disk Retention (60 mesi)\",TS3L6_ALL,11,FALSE),VLOOKUP(C121,TS3L6_ALL,11,FALSE))","v":{"$error":"#VALUE!"}},{"$f":"IF(F118+F121=2,VLOOKUP(\"Hard Disk Retention (60 mesi)\",TS3L6_ALL,14,FALSE),VLOOKUP(C121,TS3L6_ALL,14,FALSE))","v":{"$error":"#VALUE!"}}]
[null,null,null,null,null,null,null,null,null,null,null,null,null,{"$f":"IFERROR($P$122,VLOOKUP($C$121,TS3L6_ALL,13,FALSE))","v":""},{"$f":"IFERROR($S$122,VLOOKUP($C$121,TS3L6_ALL,12,FALSE))","v":""},{"$f":"IF(F118+F121=2,VLOOKUP(\"Hard Disk Retention (60 mesi)\",TS3L6_ALL,13,FALSE),VLOOKUP(C121,TS3L6_ALL,13,FALSE))","v":{"$error":"#VALUE!"}},{"$f":"IF(F118+F121=2,VLOOKUP(\"Hard Disk Retention (60 mesi)\",TS3L6_ALL,10,FALSE),VLOOKUP(C121,TS3L6_ALL,10,FALSE))","v":{"$error":"#VALUE!"}},{"$f":"IF(F118+F121=2,VLOOKUP(\"Hard Disk Retention (60 mesi)\",TS3L6_ALL,11,FALSE),VLOOKUP(C121,TS3L6_ALL,11,FALSE))","v":{"$error":"#VALUE!"}},{"$f":"IF(F118+F121=2,VLOOKUP(\"Hard Disk Retention (60 mesi)\",TS3L6_ALL,12,FALSE),VLOOKUP(C121,TS3L6_ALL,12,FALSE))","v":{"$error":"#VALUE!"}}]
[null,null,null,null,null,null,null,null,null,null,null,null,null,{"$f":"IFERROR($P$122,VLOOKUP($C$121,TS3L6_ALL,13,FALSE))","v":""},{"$f":"IFERROR($S$122,VLOOKUP($C$121,TS3L6_ALL,12,FALSE))","v":""},{"$f":"IF(F119+F122=2,VLOOKUP(\"Hard Disk Retention (60 mesi)\",TS3L6_ALL,13,FALSE),VLOOKUP(C122,TS3L6_ALL,13,FALSE))","v":{"$error":"#N/A"}},{"$f":"IF(F119+F122=2,VLOOKUP(\"Hard Disk Retention (60 mesi)\",TS3L6_ALL,10,FALSE),VLOOKUP(C122,TS3L6_ALL,10,FALSE))","v":{"$error":"#N/A"}},{"$f":"IF(F119+F122=2,VLOOKUP(\"Hard Disk Retention (60 mesi)\",TS3L6_ALL,11,FALSE),VLOOKUP(C122,TS3L6_ALL,11,FALSE))","v":{"$error":"#N/A"}},{"$f":"IF(F119+F122=2,VLOOKUP(\"Hard Disk Retention (60 mesi)\",TS3L6_ALL,12,FALSE),VLOOKUP(C122,TS3L6_ALL,12,FALSE))","v":{"$error":"#N/A"}}]

{"sheet":"Lotto6_DL560_2","index":1,"n_rows":122,"n_cols":19,"rows_kept":122,"cut":false,"hidden":false,"merged":[[119,3,120,3],[33,7,54,7],[34,2,35,2],[68,1,68,4],[4,0,4,2],[7,3,8,3],[13,3,14,3],[59,3,60,3],[116,3,117,3],[37,2,37,5],[29,1,29,4],[62,3,63,3]]}
[null,null,null,null,"Convenzione",{"$f":"SUM(J9:J122)*F5","v":0}]
[null,null,null,null,0.2,{"$f":"SUM(K9:K122)*F5","v":0}]
[null,null,null,null,"Totale",{"$f":"SUM(F1:F2)","v":0}]
[null,null,null,null,null,null,null,{"$f":"IF($E$12=\"TS3L4-VSAN\",\"vSAN ReadyNode™\",IF($E$12=\"TS3L4-GPUDW\",\"GPU Double-Wide Server Ready\",IF($E$12=\"TS3L4-GPUSW\",\"GPU Single-Wide Server Ready\",\"\")))","v":""}]
["HPE PROLIANT DL560 Gen10    Consulta la Guida alla Convenzione ->",null,null,{"$f":"HYPERLINK(\"https://convenzioni.converge.it/docs/L6GuidaAllaConvenzioneTecnologieServer3.pdf\",\"&\")","v":"&"},"Quantità Server",null,null,{"$f":"Riepilogo!G8","v":"Version 4.5"}]
[]
[]
[null,null,"Base",{"$f":"HYPERLINK(\"https://convenzioni.converge.it/docs/ts3_datasheet/HPE%20ProLiant%20DL560%20Gen10-spec-sheet.pdf\",\"i\")","v":"i"}]
[null,null,"Proliant DL560 Gen10",null,{"$f":"VLOOKUP($C9,TS3L6_ALL,15,FALSE)","v":"TS3L6-SRV"},{"$f":"IF($F$5>0,1,\"\")","v":""},null,null,null,{"$f":"VLOOKUP($C9,TS3L6_ALL,10,FALSE)","v":5912},null,{"$f":"VLOOKUP($C9,TS3L6_ALL,14,FALSE)","v":"L6N01"},{"$f":"IF(L9=\"L6N01\",1,0)","v":1}]
[]
[null,null,"Chassis Configuration"]
[null,null,{"$f":"VLOOKUP($C$9,TS3L6_Chassis,2,FALSE)","v":"Chassis with 16 x 2.5 Hard Drives"}]
[]
[null,null,"Processor",{"$f":"HYPERLINK(\"https://ark.intel.com/content/www/it/it/ark/products/193951/intel-xeon-gold-6252n-processor-35-75m-cache-2-30-ghz.html\",\"i\")","v":"i"}]
[null,null,"2 x Intel Xeon-Gold 6252N (2.3GHz/24-core/150W)"]
[]
[null,null,"Additional Processor"]
[null,null,"No Additional Processor",null,{"$f":"IF($M$9=1,VLOOKUP($C$18,TS3L6_CPU,15,FALSE),VLOOKUP($C$18,TS3L6_CPU,13,FALSE))","v":""},{"$f":"IF(F12=1,VLOOKUP($C$15,TS3L6_CPU,7,FALSE),VLOOKUP($C$18,TS3L6_CPU,7,FALSE))","v":0},null,null,null,{"$f":"IF(F12=1,VLOOKUP($C$15,TS3L6_CPU,10,FALSE),VLOOKUP($C$18,TS3L6_CPU,10,FALSE))","v":0},{"$f":"IF(F12=1,VLOOKUP($C$15,TS3L6_CPU,11,FALSE),VLOOKUP($C$18,TS3L6_CPU,11,FALSE))","v":0},{"$f":"IF($M$9=1,VLOOKUP(C18,TS3L6_ALL,14,FALSE),VLOOKUP(C18,TS3L6_ALL,12,FALSE))","v":""}]
[null,null,null,null,{"$f":"IF(E18=\"TS3L4-CPU8CORE\",\"TS3L4-CPU\",\"\")","v":""},{"$f":"IFERROR(O19,\"\")","v":""},null,null,null,{"$f":"IFERROR(N19,0)","v":0},null,{"$f":"IF(E19=\"TS3L4-CPU\",\"L4N02\",0)","v":0},null,{"$f":"VLOOKUP($L$19,Tabella_prezzi!$A$3:$K$331,4,FALSE)","v":{"$error":"#N/A"}},{"$f":"VLOOKUP($L$19,Tabella_prezzi!$A$3:$K$331,7,FALSE)","v":{"$error":"#N/A"}}]
[null,null,"Memory Capacity"]
[null,null,"128GB (32GB)",null,{"$f":"IF(J21>0,IF(M9=0,\"TS3L6-RAM32N\",\"TS3L6-RAM32\"),\"\")","v":""},{"$f":"IFERROR(O21,4)","v":0},null,null,null,{"$f":"IFERROR(P21,(184*4))","v":0},null,{"$f":"IFERROR(Q21,IF(M9=0,N23,N23))","v":""},"32GB",{"$f":"IF($M$9=1,VLOOKUP($C$21,TS3L6_RAM2CPU,15,FALSE),VLOOKUP($C$21,TS3L6_RAM1CPU,13,FALSE))","v":{"$error":"#N/A"}},{"$f":"IF($F$18=1,VLOOKUP($C$21,TS3L6_RAM2CPU,7,FALSE),VLOOKUP($C$21,TS3L6_RAM1CPU,7,FALSE))","v":0},{"$f":"IF($F$18=1,VLOOKUP($C$21,TS3L6_RAM2CPU,10,FALSE),VLOOKUP($C$21,TS3L6_RAM1CPU,10,FALSE))","v":0},{"$f":"IF(M9=0,IF($F$18=1,VLOOKUP($C$21,TS3L6_RAM2CPU,12,FALSE),VLOOKUP($C$21,TS3L6_RAM1CPU,12,FALSE)),IF($F$18=1,VLOOKUP($C$21,TS3L6_RAM2CPU,14,FALSE),VLOOKUP($C$21,TS3L6_RAM1CPU,14,FALSE)))","v":""}]
[null,null,null,null,{"$f":"IF(J22>0,IF(M9=0,\"TS3L6-RAM64N\",\"TS3L6-RAM64\"),\"\")","v":""},{"$f":"IFERROR(O22,0)","v":0},null,null,null,{"$f":"IFERROR(P22,0)","v":0},null,{"$f":"IFERROR(Q22,IF(M9=0,N24,N24))","v":""},"64GB",{"$f":"IF($M$9=1,VLOOKUP($C$21,TS3L6_RAM2CPU,23,FALSE),VLOOKUP($C$21,TS3L6_RAM1CPU,21,FALSE))","v":{"$error":"#N/A"}},{"$f":"IF($F$18=1,VLOOKUP($C$21,TS3L6_RAM2CPU,24,FALSE),VLOOKUP($C$21,TS3L6_RAM1CPU,24,FALSE))","v":0},{"$f":"IF($F$18=1,VLOOKUP($C$21,TS3L6_RAM2CPU,18,FALSE),VLOOKUP($C$21,TS3L6_RAM1CPU,18,FALSE))","v":0},{"$f":"IF(M9=0,IF($F$18=1,VLOOKUP($C$21,TS3L6_RAM2CPU,20,FALSE),VLOOKUP($C$21,TS3L6_RAM1CPU,20,FALSE)),IF($F$18=1,VLOOKUP($C$21,TS3L6_RAM2CPU,22,FALSE),VLOOKUP($C$21,TS3L6_RAM1CPU,22,FALSE)))","v":""}]
[null,null,null,null,null,null,null,null,null,null,null,null,"32GB",{"$f":"IF(M9=1,\"L6N03\",\"L6N03B\")","v":"L6N03"}]
[null,null,"Operating System"]
[null,null,"No Operating System",null,{"$f":"IF($M$9=1,VLOOKUP($C$25,TS3L6_OS,15,FALSE),VLOOKUP($C$25,TS3L6_OS,13,FALSE))","v":""},{"$f":"VLOOKUP($C$25,TS3L6_OS,7,FALSE)","v":0},null,null,null,{"$f":"VLOOKUP($C$25,TS3L6_OS,10,FALSE)","v":0},{"$f":"VLOOKUP($C$25,TS3L6_OS,11,FALSE)","v":0},{"$f":"IF($M$9=1,VLOOKUP($C25,TS3L6_ALL,14,FALSE),VLOOKUP($C25,TS3L6_ALL,12,FALSE))","v":""}]
[null,null,null,null,{"$f":"IF($M$9=1,VLOOKUP($C$25,TS3L6_OS,25,FALSE),VLOOKUP($C$25,TS3L6_OS,24,FALSE))","v":""},{"$f":"IF(F18=1,VLOOKUP($C$25,TS3L6_OS,16,FALSE),VLOOKUP($C$25,TS3L6_OS,21,FALSE))","v":0},null,null,null,{"$f":"IF(F18=1,VLOOKUP($C$25,TS3L6_OS,19,FALSE),VLOOKUP($C$25,TS3L6_OS,20,FALSE))","v":0},null,{"$f":"IF($M$9=1,VLOOKUP($C25,TS3L6_OS,23,FALSE),VLOOKUP($C25,TS3L6_OS,22,FALSE))","v":0}]
[]
[null,null,"Configurazione opzionale dello chassis"]
[null,null,"Standard",null,{"$f":"IF($M$9=1,VLOOKUP($C$29,TS3L6_ALL,15,FALSE),VLOOKUP($C$29,TS3L6_ALL,13,FALSE))","v":""},{"$f":"VLOOKUP($C$29,TS3L6_ALL,7,FALSE)","v":""},null,null,null,{"$f":"VLOOKUP($C29,TS3L6_ALL,10,FALSE)","v":0},{"$f":"VLOOKUP($C29,TS3L6_ALL,11,FALSE)","v":0},{"$f":"IF($M$9=1,VLOOKUP($C29,TS3L6_ALL,14,FALSE),VLOOKUP($C29,TS3L6_ALL,12,FALSE))","v":""}]
[]
[]
[null,null,"Raid Controller"]
[null,null,"HPE Smart Array P816i-a SR G10",{"$f":"IF($C$33=\"HBA330 12Gbps SAS HBA Controller (NON-RAID)\",\"vSAN HCL\",\"\")","v":""},{"$f":"IF($M$9=1,VLOOKUP($C$33,TS3L6_ALL,15,FALSE),VLOOKUP($C$33,TS3L6_ALL,13,FALSE))","v":""},{"$f":"VLOOKUP($C$33,TS3L6_ALL,7,FALSE)","v":""},null,"Configurazione RAID e/o NOTE",null,{"$f":"VLOOKUP($C33,TS3L6_ALL,10,FALSE)","v":0},{"$f":"VLOOKUP($C33,TS3L6_ALL,11,FALSE)","v":0},{"$f":"IF($M$9=1,VLOOKUP($C33,TS3L6_ALL,14,FALSE),VLOOKUP($C33,TS3L6_ALL,12,FALSE))","v":""}]
[null,null,null,null,null,null,null,"Specificare la configurazione RAID per l'installazione del Sistema Operativo, se richiesto.\ne/o\ninserire eventuali note."]
[null,null,{"$f":"IF(L8=\"L6N01b\",\"Hard Drivers Bays disponibili n° 12 - NVMe Bays disponibili n° 4\",IF(F28=1,\"Hard Drivers Bays disponibili n° 24\",\"Hard Drivers Bays disponibili n° 16\"))","v":"Hard Drivers Bays disponibili n° 16"},null,"Usati","Disponibili"]
[null,null,null,"HDD/SDD",{"$f":"F39+F41+F43+F49+F51+F45+F47","v":2},{"$f":"IF(L8=\"L6N01b\",(12-E36),IF(F29=1,(24-E36),(16-E36)))","v":14}]
[null,null,null,{"$f":"IF(L9=\"L6N01b\",\"NVMe\",\"\")","v":""},{"$f":"IF(L9=\"L6N01b\",F53+F55,\"\")","v":""},{"$f":"IF(L9=\"L6N01b\",(4-E37),\"\")","v":""}]
[null,null,{"$f":"IF(M9=0,\"!!!ATTENZIONE!!! I dischi NVMe possono essere acquistati solo insieme al server. Non sono presenti per gli Acquisti Successivi.\",\"\")","v":""}]
[null,null,{"$f":"ConfigurationTS3L6!A65","v":"HPE 300GB SAS 12G Enterprise 10K SFF (2.5in) SC"},null,{"$f":"IF($M$9=1,VLOOKUP(C39,TS3L6_HDD,15,FALSE),VLOOKUP(C39,TS3L6_HDD,13,FALSE))","v":"TS3L6-HDD300GB"},null,null,null,null,{"$f":"VLOOKUP($C39,TS3L6_HDD,10,FALSE)*F39","v":0},{"$f":"VLOOKUP($C39,TS3L6_HDD,11,FALSE)","v":0},{"$f":"IF($M$9=1,VLOOKUP(C39,TS3L6_ALL,14,FALSE),VLOOKUP(C39,TS3L6_ALL,12,FALSE))","v":"L6N12"}]
[]
[null,null,{"$f":"ConfigurationTS3L6!A66","v":"HPE 1.2TB SAS 12G Enterprise 10K SFF (2.5in) SC"},null,{"$f":"IF($M$9=1,VLOOKUP(C41,TS3L6_HDD,15,FALSE),VLOOKUP(C41,TS3L6_HDD,13,FALSE))","v":"TS3L6-HDD1TB"},null,null,null,null,{"$f":"VLOOKUP($C41,TS3L6_HDD,10,FALSE)*F41","v":0},{"$f":"VLOOKUP($C41,TS3L6_HDD,11,FALSE)","v":0},{"$f":"IF($M$9=1,VLOOKUP(C41,TS3L6_ALL,14,FALSE),VLOOKUP(C41,TS3L6_ALL,12,FALSE))","v":"L6N11"}]
[]
[null,null,{"$f":"ConfigurationTS3L6!A67","v":"HPE 1.8TB SAS 12G Enterprise 10K SFF (2.5in) SC"},null,{"$f":"IF($M$9=1,VLOOKUP(C43,TS3L6_HDD,15,FALSE),VLOOKUP(C43,TS3L6_HDD,13,FALSE))","v":"TS3L6-HDD2TB"},null,null,null,null,{"$f":"VLOOKUP($C43,TS3L6_HDD,10,FALSE)*F43","v":0},{"$f":"VLOOKUP($C43,TS3L6_HDD,11,FALSE)","v":0},{"$f":"IF($M$9=1,VLOOKUP(C43,TS3L6_ALL,14,FALSE),VLOOKUP(C43,TS3L6_ALL,12,FALSE))","v":"L6N10"}]
[]
[null,null,{"$f":"ConfigurationTS3L6!A68","v":"HPE 960GB SAS 12G Read Intensive SFF (2.5in) SC"},null,{"$f":"IF($M$9=1,VLOOKUP(C45,TS3L6_HDD,15,FALSE),VLOOKUP(C45,TS3L6_HDD,13,FALSE))","v":"TS3L6-RI800GB"},null,null,null,null,{"$f":"VLOOKUP($C45,TS3L6_HDD,10,FALSE)*F45","v":0},{"$f":"VLOOKUP($C45,TS3L6_HDD,11,FALSE)","v":0},{"$f":"IF($M$9=1,VLOOKUP(C45,TS3L6_ALL,14,FALSE),VLOOKUP(C45,TS3L6_ALL,12,FALSE))","v":"L6N15"}]
[]
[null,null,{"$f":"ConfigurationTS3L6!A69","v":"HPE 1.92TB SAS 12G Read Intensive SFF (2.5in) SC"},null,{"$f":"IF($M$9=1,VLOOKUP(C47,TS3L6_HDD,15,FALSE),VLOOKUP(C47,TS3L6_HDD,13,FALSE))","v":"TS3L6-RI1600GB"},null,null,null,null,{"$f":"VLOOKUP($C47,TS3L6_HDD,10,FALSE)*F47","v":0},{"$f":"VLOOKUP($C47,TS3L6_HDD,11,FALSE)","v":0},{"$f":"IF($M$9=1,VLOOKUP(C47,TS3L6_ALL,14,FALSE),VLOOKUP(C47,TS3L6_ALL,12,FALSE))","v":"L6N13"}]
[]
[null,null,{"$f":"ConfigurationTS3L6!A71","v":"HPE 800GB SAS 12G Mixed Use SFF (2.5in) SC"},null,{"$f":"IF($M$9=1,VLOOKUP(C49,TS3L6_HDD,15,FALSE),VLOOKUP(C49,TS3L6_HDD,13,FALSE))","v":"TS3L6-MU800GB"},2,null,null,null,{"$f":"IF(F49>2,VLOOKUP($C49,TS3L6_HDD,10,FALSE)*(F49-2),0)","v":0},{"$f":"VLOOKUP($C49,TS3L6_HDD,11,FALSE)*F49","v":0},{"$f":"IF($M$9=1,VLOOKUP(C49,TS3L6_ALL,14,FALSE),VLOOKUP(C49,TS3L6_ALL,12,FALSE))","v":"L6N16"}]
[]
[null,null,{"$f":"ConfigurationTS3L6!A72","v":"HPE 1.6TB SAS 12G Mixed Use SFF (2.5in) SC"},null,{"$f":"IF($M$9=1,VLOOKUP(C51,TS3L6_HDD,15,FALSE),VLOOKUP(C51,TS3L6_HDD,13,FALSE))","v":"TS3L6-MU1600GB"},null,null,null,null,{"$f":"VLOOKUP($C51,TS3L6_HDD,10,FALSE)*F51","v":0},{"$f":"VLOOKUP($C51,TS3L6_HDD,11,FALSE)","v":0},{"$f":"IF($M$9=1,VLOOKUP(C51,TS3L6_ALL,14,FALSE),VLOOKUP(C51,TS3L6_ALL,12,FALSE))","v":"L6N14"}]
[]
[null,null,{"$f":"IF($L$9=\"L6N01b\",ConfigurationTS3L6!A73,\"\")","v":""},null,{"$f":"IF($M$9=1,VLOOKUP(C53,TS3L6_HDD,15,FALSE),VLOOKUP(C53,TS3L6_HDD,13,FALSE))","v":""},null,null,null,null,{"$f":"IF($L$9=\"L6N01b\",VLOOKUP($C53,TS3L6_HDD,10,FALSE)*F53,0)","v":0},{"$f":"VLOOKUP($C53,TS3L6_HDD,11,FALSE)*F53","v":0},{"$f":"IF($M$9=1,VLOOKUP(C53,TS3L6_ALL,14,FALSE),VLOOKUP(C53,TS3L6_ALL,12,FALSE))","v":""}]
[]
[null,null,{"$f":"IF($L$9=\"L6N01b\",ConfigurationTS3L6!A74,\"\")","v":""},null,{"$f":"IF($M$9=1,VLOOKUP(C55,TS3L6_HDD,15,FALSE),VLOOKUP(C55,TS3L6_HDD,13,FALSE))","v":""},null,null,null,null,{"$f":"IF($L$9=\"L6N01b\",VLOOKUP($C55,TS3L6_HDD,10,FALSE)*F55,0)","v":0},{"$f":"VLOOKUP($C55,TS3L6_HDD,11,FALSE)*F55","v":0},{"$f":"IF($M$9=1,VLOOKUP(C55,TS3L6_ALL,14,FALSE),VLOOKUP(C55,TS3L6_ALL,12,FALSE))","v":""}]
[]
[null,null,"Power Supply"]
[null,null,"Dual, Hot-plug, Redundant Power Supply (1+1), 1600W"]
[]
[null,null,"HPE OneView Advanced (with HPE iLO Advanced)",{"$f":"HYPERLINK(\"https://convenzioni.converge.it/docs/ts3_datasheet/ilo-spec-sheet.pdf\",\"i\")","v":"i"}]
[null,null,"None",null,{"$f":"IF($M$9=1,VLOOKUP(C61,TS3L6_ALL,15,FALSE),VLOOKUP(C61,TS3L6_ALL,13,FALSE))","v":""},{"$f":"VLOOKUP($C61,TS3L6_ALL,7,FALSE)","v":""},null,null,null,{"$f":"VLOOKUP($C61,TS3L6_ALL,10,FALSE)","v":0},{"$f":"VLOOKUP($C61,TS3L6_ALL,11,FALSE)","v":0},{"$f":"IF($M$9=1,VLOOKUP(C61,TS3L6_ALL,14,FALSE),VLOOKUP(C61,TS3L6_ALL,12,FALSE))","v":""}]
[]
[null,null,"Micro SD (USB Flash Drive)"]
[null,null,"None",null,{"$f":"IF($M$9=1,VLOOKUP(C64,TS3L6_ALL,15,FALSE),VLOOKUP(C64,TS3L6_ALL,13,FALSE))","v":""},{"$f":"VLOOKUP($C64,TS3L6_ALL,7,FALSE)","v":""},null,null,null,{"$f":"VLOOKUP($C64,TS3L6_ALL,10,FALSE)","v":0},{"$f":"VLOOKUP($C64,TS3L6_ALL,11,FALSE)","v":0},{"$f":"IF($M$9=1,VLOOKUP(C64,TS3L6_ALL,14,FALSE),VLOOKUP(C64,TS3L6_ALL,12,FALSE))","v":""}]
[]
[null,null,"Network Cards"]
[null,null,"HPE Ethernet 1Gb 4-port FLR-T BCM5719 Adapter"]
[]
[]
[]
[null,null,"PCI Slot 1 Processor 1 x8 PCIe Gen3"]
[null,null,"",null,{"$f":"IF($M$9=1,VLOOKUP(C72,TS3L6_ALL,15,FALSE),VLOOKUP(C72,TS3L6_ALL,13,FALSE))","v":""},{"$f":"VLOOKUP($C72,TS3L6_ALL,7,FALSE)","v":""},null,null,null,{"$f":"VLOOKUP($C72,TS3L6_ALL,10,FALSE)","v":0},{"$f":"VLOOKUP($C72,TS3L6_ALL,11,FALSE)","v":0},{"$f":"IF($M$9=1,VLOOKUP(C72,TS3L6_ALL,14,FALSE),VLOOKUP(C72,TS3L6_ALL,12,FALSE))","v":""}]
[]
[null,null,{"$f":"IF($L$9=\"L6N01b\",\"PCI Slot 2 Processor 1 x8 PCIe Gen3\",\"PCI Slot 2 Processor 1 x16 PCIe Gen3 ----------GPU Slot----------\")","v":"PCI Slot 2 Processor 1 x16 PCIe Gen3 ----------GPU Slot----------"}]
[null,null,"",null,{"$f":"IF($M$9=1,VLOOKUP(C75,TS3L6_ALL,15,FALSE),VLOOKUP(C75,TS3L6_ALL,13,FALSE))","v":""},{"$f":"VLOOKUP($C75,TS3L6_ALL,7,FALSE)","v":""},null,null,null,{"$f":"VLOOKUP($C75,TS3L6_ALL,10,FALSE)","v":0},{"$f":"VLOOKUP($C75,TS3L6_ALL,11,FALSE)","v":0},{"$f":"IF($M$9=1,VLOOKUP(C75,TS3L6_ALL,14,FALSE),VLOOKUP(C75,TS3L6_ALL,12,FALSE))","v":""}]
[]
[null,null,"PCI Slot 3 Processor 1 x8 PCIe Gen3"]
[null,null,"",null,{"$f":"IF($M$9=1,VLOOKUP(C78,TS3L6_ALL,15,FALSE),VLOOKUP(C78,TS3L6_ALL,13,FALSE))","v":""},{"$f":"VLOOKUP($C78,TS3L6_ALL,7,FALSE)","v":""},null,null,null,{"$f":"VLOOKUP($C78,TS3L6_ALL,10,FALSE)","v":0},{"$f":"VLOOKUP($C78,TS3L6_ALL,11,FALSE)","v":0},{"$f":"IF($M$9=1,VLOOKUP(C78,TS3L6_ALL,14,FALSE),VLOOKUP(C78,TS3L6_ALL,12,FALSE))","v":""}]
[]
[null,null,"PCI Slot 4 Processor 2 x8 PCIe Gen3"]
[null,null,"",null,{"$f":"IF($M$9=1,VLOOKUP(C81,TS3L6_ALL,15,FALSE),VLOOKUP(C81,TS3L6_ALL,13,FALSE))","v":""},{"$f":"VLOOKUP($C81,TS3L6_ALL,7,FALSE)","v":""},null,null,null,{"$f":"VLOOKUP($C81,TS3L6_ALL,10,FALSE)","v":0},{"$f":"VLOOKUP($C81,TS3L6_ALL,11,FALSE)","v":0},{"$f":"IF($M$9=1,VLOOKUP(C81,TS3L6_ALL,14,FALSE),VLOOKUP(C81,TS3L6_ALL,12,FALSE))","v":""}]
[]
[null,null,{"$f":"IF($L$9=\"L6N01b\",\"PCI Slot 5 Processor 2 x8 PCIe Gen3\",\"PCI Slot 5 Processor 2 x16 PCIe Gen3 ----------GPU Slot----------\")","v":"PCI Slot 5 Processor 2 x16 PCIe Gen3 ----------GPU Slot----------"}]
[null,null,"",null,{"$f":"IF($M$9=1,VLOOKUP(C84,TS3L6_ALL,15,FALSE),VLOOKUP(C84,TS3L6_ALL,13,FALSE))","v":""},{"$f":"VLOOKUP($C84,TS3L6_ALL,7,FALSE)","v":""},null,null,null,{"$f":"VLOOKUP($C84,TS3L6_ALL,10,FALSE)","v":0},{"$f":"VLOOKUP($C84,TS3L6_ALL,11,FALSE)","v":0},{"$f":"IF($M$9=1,VLOOKUP(C84,TS3L6_ALL,14,FALSE),VLOOKUP(C84,TS3L6_ALL,12,FALSE))","v":""}]
[]
[null,null,"PCI Slot 6 Processor 2 x8 PCIe Gen3"]
[null,null,"",null,{"$f":"IF($M$9=1,VLOOKUP(C87,TS3L6_ALL,15,FALSE),VLOOKUP(C87,TS3L6_ALL,13,FALSE))","v":""},{"$f":"VLOOKUP($C87,TS3L6_ALL,7,FALSE)","v":""},null,null,null,{"$f":"VLOOKUP($C87,TS3L6_ALL,10,FALSE)","v":0},{"$f":"VLOOKUP($C87,TS3L6_ALL,11,FALSE)","v":0},{"$f":"IF($M$9=1,VLOOKUP(C87,TS3L6_ALL,14,FALSE),VLOOKUP(C87,TS3L6_ALL,12,FALSE))","v":""}]
[]
[null,null,"PCI Slot 7 Processor 2 x8 PCIe Gen3"]
[null,null,"",null,{"$f":"VLOOKUP($C90,TS3L6_ALL,13,FALSE)","v":""},{"$f":"VLOOKUP($C90,TS3L6_ALL,7,FALSE)","v":""},null,{"$f":"IF(M90=\"Errore\",\"ERRORE nella selezione del PCI Slot\",IFERROR(O91,\"ERRORE nella selezione del PCI Slot\"))","v":0},null,{"$f":"VLOOKUP($C90,TS3L6_ALL,10,FALSE)","v":0},{"$f":"VLOOKUP($C90,TS3L6_ALL,11,FALSE)","v":0},{"$f":"VLOOKUP($C90,TS3L6_ALL,12,FALSE)","v":""}]
[]
[null,null,"PCI Slot 8 Processor 2 x16 PCIe Gen3"]
[null,null,"",null,{"$f":"VLOOKUP($C93,TS3L6_ALL,13,FALSE)","v":""},{"$f":"VLOOKUP($C93,TS3L6_ALL,7,FALSE)","v":""},null,{"$f":"IFERROR(O94,\"ERRORE nella selezione del PCI Slot\")","v":0},null,{"$f":"VLOOKUP($C93,TS3L6_ALL,10,FALSE)","v":0},{"$f":"VLOOKUP($C93,TS3L6_ALL,11,FALSE)","v":0},{"$f":"VLOOKUP($C93,TS3L6_ALL,12,FALSE)","v":""}]
[]
[null,null,"M.2 - Solid State Drives"]
[null,null,"None",null,{"$f":"IF($M$9=1,VLOOKUP(C96,TS3L6_ALL,15,FALSE),VLOOKUP(C96,TS3L6_ALL,13,FALSE))","v":""},{"$f":"VLOOKUP($C96,TS3L6_ALL,7,FALSE)","v":""},null,null,null,{"$f":"VLOOKUP($C96,TS3L6_ALL,10,FALSE)","v":0},{"$f":"VLOOKUP($C96,TS3L6_ALL,11,FALSE)","v":0},{"$f":"IF($M$9=1,VLOOKUP(C96,TS3L6_ALL,14,FALSE),VLOOKUP(C96,TS3L6_ALL,12,FALSE))","v":""}]
[]
[null,null,"Cables for Intel Omni-Path Adapter"]
[null,null,"HPE 3M 100Gb QSFP28 Omni-Path Optical Power Class 2 Cable",null,{"$f":"IF(K99>0,IF($M$9=1,VLOOKUP(C99,TS3L6_ALL,15,FALSE),VLOOKUP(C99,TS3L6_ALL,13,FALSE)),\"\")","v":""},null,null,null,null,0,{"$f":"IF(F99>0,VLOOKUP($C99,TS3L6_ALL,11,FALSE)*F99,0)","v":0},{"$f":"IF(F99>0,IF($M$9=1,VLOOKUP(C99,TS3L6_ALL,14,FALSE),VLOOKUP(C99,TS3L6_ALL,12,FALSE)),\"\")","v":""}]
[null,null,"HPE 5M 100Gb QSFP28 Omni-Path Optical Power Class 2 Cable",null,{"$f":"IF(K100>0,IF($M$9=1,VLOOKUP(C100,TS3L6_ALL,15,FALSE),VLOOKUP(C100,TS3L6_ALL,13,FALSE)),\"\")","v":""},null,null,null,null,0,{"$f":"IF(F100>0,VLOOKUP($C100,TS3L6_ALL,11,FALSE)*F100,0)","v":0},{"$f":"IF(F100>0,IF($M$9=1,VLOOKUP(C100,TS3L6_ALL,14,FALSE),VLOOKUP(C100,TS3L6_ALL,12,FALSE)),\"\")","v":""}]
[null,null,"HPE 7M 100Gb QSFP28 Omni-Path Optical Power Class 2 Cable",null,{"$f":"IF(K101>0,IF($M$9=1,VLOOKUP(C101,TS3L6_ALL,15,FALSE),VLOOKUP(C101,TS3L6_ALL,13,FALSE)),\"\")","v":""},null,null,null,null,0,{"$f":"IF(F101>0,VLOOKUP($C101,TS3L6_ALL,11,FALSE)*F101,0)","v":0},{"$f":"IF(F101>0,IF($M$9=1,VLOOKUP(C101,TS3L6_ALL,14,FALSE),VLOOKUP(C101,TS3L6_ALL,12,FALSE)),\"\")","v":""}]
[]
[null,null,"Transceiver"]
[null,null,"HPE 10G SFP+ LR Transceiver",null,{"$f":"IF(K104>0,IF($M$9=1,VLOOKUP(C104,TS3L6_ALL,15,FALSE),VLOOKUP(C104,TS3L6_ALL,13,FALSE)),\"\")","v":""},null,null,null,null,0,{"$f":"IF(F104>0,VLOOKUP($C104,TS3L6_ALL,11,FALSE)*F104,0)","v":0},{"$f":"IF(F104>0,IF($M$9=1,VLOOKUP(C104,TS3L6_ALL,14,FALSE),VLOOKUP(C104,TS3L6_ALL,12,FALSE)),\"\")","v":""}]
[null,null,"HPE 10G SFP+ SR Transceiver",null,{"$f":"IF(K105>0,IF($M$9=1,VLOOKUP(C105,TS3L6_ALL,15,FALSE),VLOOKUP(C105,TS3L6_ALL,13,FALSE)),\"\")","v":""},null,null,null,null,0,{"$f":"IF(F105>0,VLOOKUP($C105,TS3L6_ALL,11,FALSE)*F105,0)","v":0},{"$f":"IF(F105>0,IF($M$9=1,VLOOKUP(C105,TS3L6_ALL,14,FALSE),VLOOKUP(C105,TS3L6_ALL,12,FALSE)),\"\")","v":""}]
[]
[null,null,"Cables"]
[null,null,"Cavo DAC HPE 10GB SFP+ SFP+ 3 metri",null,{"$f":"IF(K108>0,IF($M$9=1,VLOOKUP(C108,TS3L6_ALL,15,FALSE),VLOOKUP(C108,TS3L6_ALL,13,FALSE)),\"\")","v":""},null,null,null,null,0,{"$f":"IF(F108>0,VLOOKUP($C108,TS3L6_ALL,11,FALSE)*F108,0)","v":0},{"$f":"IF(F108>0,IF($M$9=1,VLOOKUP(C108,TS3L6_ALL,14,FALSE),VLOOKUP(C108,TS3L6_ALL,12,FALSE)),\"\")","v":""}]
[null,null,"HPE Premier Flex LC/LC OM4 2f 2m Cbl",null,{"$f":"IF(K109>0,IF($M$9=1,VLOOKUP(C109,TS3L6_ALL,15,FALSE),VLOOKUP(C109,TS3L6_ALL,13,FALSE)),\"\")","v":""},null,null,null,null,0,{"$f":"IF(F109>0,VLOOKUP($C109,TS3L6_ALL,11,FALSE)*F109,0)","v":0},{"$f":"IF(F109>0,IF($M$9=1,VLOOKUP(C109,TS3L6_ALL,14,FALSE),VLOOKUP(C109,TS3L6_ALL,12,FALSE)),\"\")","v":""}]
[null,null,"HPE 25Gb SFP28 to SFP28 3m DAC",null,{"$f":"IF(K110>0,IF($M$9=1,VLOOKUP(C110,TS3L6_ALL,15,FALSE),VLOOKUP(C110,TS3L6_ALL,13,FALSE)),\"\")","v":""},null,null,null,null,0,{"$f":"IF(F110>0,VLOOKUP($C110,TS3L6_ALL,11,FALSE)*F110,0)","v":0},{"$f":"IF(F110>0,IF($M$9=1,VLOOKUP(C110,TS3L6_ALL,14,FALSE),VLOOKUP(C110,TS3L6_ALL,12,FALSE)),\"\")","v":""}]
[]
[null,null,null,null,{"$f":"IF(K112>0,VLOOKUP($C112,ConfigurationTS3L6!$A$1:$O$4574,13,FALSE),\"\")","v":""},null,null,null,null,0,{"$f":"IF(F112>0,VLOOKUP($C112,TS3L6_ALL,11,FALSE)*F112,0)","v":0},{"$f":"IF(F112>0,VLOOKUP($C112,TS3L6_ALL,12,FALSE),0)","v":0}]
[]
[null,null,"Cavi RJ45"]
[null,null,"Cavo “patch” di 3 mt RJ45 certificato per gigabit ethernet",null,{"$f":"IF(K115>0,IF($M$9=1,VLOOKUP(C115,TS3L6_ALL,15,FALSE),VLOOKUP(C115,TS3L6_ALL,13,FALSE)),\"\")","v":"TS3L6-RJ453M"},5,null,null,null,0,{"$f":"IF(F115>0,IF($M$9=1,VLOOKUP(C115,TS3L6_ALL,11,FALSE)*(F115),VLOOKUP(C115,TS3L6_ALL,11,FALSE)*(F115)),0)","v":15},{"$f":"IF(F115>0,IF($M$9=1,VLOOKUP(C115,TS3L6_ALL,14,FALSE),VLOOKUP(C115,TS3L6_ALL,12,FALSE)),\"\")","v":"L6N34"}]
[]
[null,null,"Warranty",{"$f":"HYPERLINK(\"https://convenzioni.converge.it/docs/ts3_datasheet/TS3warranty_hpe.pdf\",\"i\")","v":"i"}]
[null,null,"Manutenzione in garanzia (36 mesi)",null,{"$f":"IF($M$9=1,VLOOKUP(C118,TS3L6_ALL,15,FALSE),VLOOKUP(C118,TS3L6_ALL,13,FALSE))","v":""},{"$f":"VLOOKUP($C118,TS3L6_WARRANTY,7,FALSE)","v":""},null,null,null,{"$f":"VLOOKUP($C118,TS3L6_WARRANTY,10,FALSE)","v":0},{"$f":"VLOOKUP($C118,TS3L6_WARRANTY,11,FALSE)","v":0},{"$f":"IF($M$9=1,VLOOKUP(C118,TS3L6_ALL,14,FALSE),VLOOKUP(C118,TS3L6_ALL,12,FALSE))","v":""}]
[]
[null,null,"Hard Disk Retention",{"$f":"HYPERLINK(\"https://convenzioni.converge.it/docs/ts3_datasheet/HPE_HDD_KYHD.pdf\",\"i\")","v":"i"}]
[null,null,"",null,{"$f":"IF($M$9=0,$N$122,$N$121)","v":""},{"$f":"IF(C121=\"\",\"\",1)","v":""},null,null,null,{"$f":"IFERROR(Q121,VLOOKUP(C121,TS3L6_ALL,10,FALSE))","v":0},{"$f":"IFERROR(R121,VLOOKUP(C121,TS3L6_ALL,11,FALSE))","v":0},{"$f":"IF(M9=0,O122,O121)","v":""},null,{"$f":"IFERROR($P$121,VLOOKUP($C$121,TS3L6_ALL,15,FALSE))","v":""},{"$f":"IFERROR($S$121,VLOOKUP($C$121,TS3L6_ALL,14,FALSE))","v":""},{"$f":"IF(F118+F121=2,VLOOKUP(\"Hard Disk Retention (60 mesi)\",TS3L6_ALL,15,FALSE),VLOOKUP(C121,TS3L6_ALL,15,FALSE))","v":{"$error":"#VALUE!"}},{"$f":"IF(F118+F121=2,VLOOKUP(\"Hard Disk Retention (60 mesi)\",TS3L6_ALL,10,FALSE),VLOOKUP(C121,TS3L6_ALL,10,FALSE))","v":{"$error":"#VALUE!"}},{"$f":"IF(F118+F121=2,VLOOKUP(\"Hard Disk Retention (60 mesi)\",TS3L6_ALL,11,FALSE),VLOOKUP(C121,TS3L6_ALL,11,FALSE))","v":{"$error":"#VALUE!"}},{"$f":"IF(F118+F121=2,VLOOKUP(\"Hard Disk Retention (60 mesi)\",TS3L6_ALL,14,FALSE),VLOOKUP(C121,TS3L6_ALL,14,FALSE))","v":{"$error":"#VALUE!"}}]
[null,null,null,null,null,null,null,null,null,null,null,null,null,{"$f":"IFERROR($P$122,VLOOKUP($C$121,TS3L6_ALL,13,FALSE))","v":""},{"$f":"IFERROR($S$122,VLOOKUP($C$121,TS3L6_ALL,12,FALSE))","v":""},{"$f":"IF(F118+F121=2,VLOOKUP(\"Hard Disk Retention (60 mesi)\",TS3L6_ALL,13,FALSE),VLOOKUP(C121,TS3L6_ALL,13,FALSE))","v":{"$error":"#VALUE!"}},{"$f":"IF(F118+F121=2,VLOOKUP(\"Hard Disk Retention (60 mesi)\",TS3L6_ALL,10,FALSE),VLOOKUP(C121,TS3L6_ALL,10,FALSE))","v":{"$error":"#VALUE!"}},{"$f":"IF(F118+F121=2,VLOOKUP(\"Hard Disk Retention (60 mesi)\",TS3L6_ALL,11,FALSE),VLOOKUP(C121,TS3L6_ALL,11,FALSE))","v":{"$error":"#VALUE!"}},{"$f":"IF(F118+F121=2,VLOOKUP(\"Hard Disk Retention (60 mesi)\",TS3L6_ALL,12,FALSE),VLOOKUP(C121,TS3L6_ALL,12,FALSE))","v":{"$error":"#VALUE!"}}]

{"sheet":"Lotto6_DL560_3","index":2,"n_rows":122,"n_cols":19,"rows_kept":122,"cut":false,"hidden":false,"merged":[[68,1,68,4],[116,3,117,3],[119,3,120,3],[4,0,4,2],[7,3,8,3],[13,3,14,3],[29,1,29,4],[33,7,54,7],[34,2,35,2],[37,2,37,5],[59,3,60,3],[62,3,63,3]]}
[null,null,null,null,"Convenzione",{"$f":"SUM(J9:J121)*F5","v":0}]
[null,null,null,null,0.2,{"$f":"SUM(K9:K121)*F5","v":0}]
[null,null,null,null,"Totale",{"$f":"SUM(F1:F2)","v":0}]
[null,null,null,null,null,null,null,{"$f":"IF($E$12=\"TS3L4-VSAN\",\"vSAN ReadyNode™\",IF($E$12=\"TS3L4-GPUDW\",\"GPU Double-Wide Server Ready\",IF($E$12=\"TS3L4-GPUSW\",\"GPU Single-Wide Server Ready\",\"\")))","v":""}]
["HPE PROLIANT DL560 Gen10    Consulta la Guida alla Convenzione ->",null,null,{"$f":"HYPERLINK(\"https://convenzioni.converge.it/docs/L6GuidaAllaConvenzioneTecnologieServer3.pdf\",\"&\")","v":"&"},"Quantità Server",null,null,{"$f":"Riepilogo!G8","v":"Version 4.5"}]
[]
[]
[null,null,"Base",{"$f":"HYPERLINK(\"https://convenzioni.converge.it/docs/ts3_datasheet/HPE%20ProLiant%20DL560%20Gen10-spec-sheet.pdf\",\"i\")","v":"i"}]
[null,null,"Proliant DL560 Gen10",null,{"$f":"VLOOKUP($C9,TS3L6_ALL,15,FALSE)","v":"TS3L6-SRV"},{"$f":"IF($F$5>0,1,\"\")","v":""},null,null,null,{"$f":"VLOOKUP($C9,TS3L6_ALL,10,FALSE)","v":5912},null,{"$f":"VLOOKUP($C9,TS3L6_ALL,14,FALSE)","v":"L6N01"},{"$f":"IF(L9=\"L6N01\",1,0)","v":1}]
[]
[null,null,"Chassis Configuration"]
[null,null,{"$f":"VLOOKUP($C$9,TS3L6_Chassis,2,FALSE)","v":"Chassis with 16 x 2.5 Hard Drives"}]
[]
[null,null,"Processor",{"$f":"HYPERLINK(\"https://ark.intel.com/content/www/it/it/ark/products/193951/intel-xeon-gold-6252n-processor-35-75m-cache-2-30-ghz.html\",\"i\")","v":"i"}]
[null,null,"2 x Intel Xeon-Gold 6252N (2.3GHz/24-core/150W)"]
[]
[null,null,"Additional Processor"]
[null,null,"No Additional Processor",null,{"$f":"IF($M$9=1,VLOOKUP($C$18,TS3L6_CPU,15,FALSE),VLOOKUP($C$18,TS3L6_CPU,13,FALSE))","v":""},{"$f":"IF(F12=1,VLOOKUP($C$15,TS3L6_CPU,7,FALSE),VLOOKUP($C$18,TS3L6_CPU,7,FALSE))","v":0},null,null,null,{"$f":"IF(F12=1,VLOOKUP($C$15,TS3L6_CPU,10,FALSE),VLOOKUP($C$18,TS3L6_CPU,10,FALSE))","v":0},{"$f":"IF(F12=1,VLOOKUP($C$15,TS3L6_CPU,11,FALSE),VLOOKUP($C$18,TS3L6_CPU,11,FALSE))","v":0},{"$f":"IF($M$9=1,VLOOKUP(C18,TS3L6_ALL,14,FALSE),VLOOKUP(C18,TS3L6_ALL,12,FALSE))","v":""}]
[null,null,null,null,{"$f":"IF(E18=\"TS3L4-CPU8CORE\",\"TS3L4-CPU\",\"\")","v":""},{"$f":"IFERROR(O19,\"\")","v":""},null,null,null,{"$f":"IFERROR(N19,0)","v":0},null,{"$f":"IF(E19=\"TS3L4-CPU\",\"L4N02\",0)","v":0},null,{"$f":"VLOOKUP($L$19,Tabella_prezzi!$A$3:$K$331,4,FALSE)","v":{"$error":"#N/A"}},{"$f":"VLOOKUP($L$19,Tabella_prezzi!$A$3:$K$331,7,FALSE)","v":{"$error":"#N/A"}}]
[null,null,"Memory Capacity"]
[null,null,"128GB (32GB)",null,{"$f":"IF(J21>0,IF(M9=0,\"TS3L6-RAM32N\",\"TS3L6-RAM32\"),\"\")","v":""},{"$f":"IFERROR(O21,4)","v":0},null,null,null,{"$f":"IFERROR(P21,(184*4))","v":0},null,{"$f":"IFERROR(Q21,IF(M9=0,N23,N23))","v":""},"32GB",{"$f":"IF($M$9=1,VLOOKUP($C$21,TS3L6_RAM2CPU,15,FALSE),VLOOKUP($C$21,TS3L6_RAM1CPU,13,FALSE))","v":{"$error":"#N/A"}},{"$f":"IF($F$18=1,VLOOKUP($C$21,TS3L6_RAM2CPU,7,FALSE),VLOOKUP($C$21,TS3L6_RAM1CPU,7,FALSE))","v":0},{"$f":"IF($F$18=1,VLOOKUP($C$21,TS3L6_RAM2CPU,10,FALSE),VLOOKUP($C$21,TS3L6_RAM1CPU,10,FALSE))","v":0},{"$f":"IF(M9=0,IF($F$18=1,VLOOKUP($C$21,TS3L6_RAM2CPU,12,FALSE),VLOOKUP($C$21,TS3L6_RAM1CPU,12,FALSE)),IF($F$18=1,VLOOKUP($C$21,TS3L6_RAM2CPU,14,FALSE),VLOOKUP($C$21,TS3L6_RAM1CPU,14,FALSE)))","v":""}]
[null,null,null,null,{"$f":"IF(J22>0,IF(M9=0,\"TS3L6-RAM64N\",\"TS3L6-RAM64\"),\"\")","v":""},{"$f":"IFERROR(O22,0)","v":0},null,null,null,{"$f":"IFERROR(P22,0)","v":0},null,{"$f":"IFERROR(Q22,IF(M9=0,N24,N24))","v":""},"64GB",{"$f":"IF($M$9=1,VLOOKUP($C$21,TS3L6_RAM2CPU,23,FALSE),VLOOKUP($C$21,TS3L6_RAM1CPU,21,FALSE))","v":{"$error":"#N/A"}},{"$f":"IF($F$18=1,VLOOKUP($C$21,TS3L6_RAM2CPU,24,FALSE),VLOOKUP($C$21,TS3L6_RAM1CPU,24,FALSE))","v":0},{"$f":"IF($F$18=1,VLOOKUP($C$21,TS3L6_RAM2CPU,18,FALSE),VLOOKUP($C$21,TS3L6_RAM1CPU,18,FALSE))","v":0},{"$f":"IF(M9=0,IF($F$18=1,VLOOKUP($C$21,TS3L6_RAM2CPU,20,FALSE),VLOOKUP($C$21,TS3L6_RAM1CPU,20,FALSE)),IF($F$18=1,VLOOKUP($C$21,TS3L6_RAM2CPU,22,FALSE),VLOOKUP($C$21,TS3L6_RAM1CPU,22,FALSE)))","v":""}]
[null,null,null,null,null,null,null,null,null,null,null,null,"32GB",{"$f":"IF(M9=1,\"L6N03\",\"L6N03B\")","v":"L6N03"}]
[null,null,"Operating System"]
[null,null,"No Operating System",null,{"$f":"IF($M$9=1,VLOOKUP($C$25,TS3L6_OS,15,FALSE),VLOOKUP($C$25,TS3L6_OS,13,FALSE))","v":""},{"$f":"VLOOKUP($C$25,TS3L6_OS,7,FALSE)","v":0},null,null,null,{"$f":"VLOOKUP($C$25,TS3L6_OS,10,FALSE)","v":0},{"$f":"VLOOKUP($C$25,TS3L6_OS,11,FALSE)","v":0},{"$f":"IF($M$9=1,VLOOKUP($C25,TS3L6_ALL,14,FALSE),VLOOKUP($C25,TS3L6_ALL,12,FALSE))","v":""}]
[null,null,null,null,{"$f":"IF($M$9=1,VLOOKUP($C$25,TS3L6_OS,25,FALSE),VLOOKUP($C$25,TS3L6_OS,24,FALSE))","v":""},{"$f":"IF(F18=1,VLOOKUP($C$25,TS3L6_OS,16,FALSE),VLOOKUP($C$25,TS3L6_OS,21,FALSE))","v":0},null,null,null,{"$f":"IF(F18=1,VLOOKUP($C$25,TS3L6_OS,19,FALSE),VLOOKUP($C$25,TS3L6_OS,20,FALSE))","v":0},null,{"$f":"IF($M$9=1,VLOOKUP($C25,TS3L6_OS,23,FALSE),VLOOKUP($C25,TS3L6_OS,22,FALSE))","v":0}]
[]
[null,null,"Configurazione opzionale dello chassis"]
[null,null,"Standard",null,{"$f":"IF($M$9=1,VLOOKUP($C$29,TS3L6_ALL,15,FALSE),VLOOKUP($C$29,TS3L6_ALL,13,FALSE))","v":""},{"$f":"VLOOKUP($C$29,TS3L6_ALL,7,FALSE)","v":""},null,null,null,{"$f":"VLOOKUP($C29,TS3L6_ALL,10,FALSE)","v":0},{"$f":"VLOOKUP($C29,TS3L6_ALL,11,FALSE)","v":0},{"$f":"IF($M$9=1,VLOOKUP($C29,TS3L6_ALL,14,FALSE),VLOOKUP($C29,TS3L6_ALL,12,FALSE))","v":""}]
[]
[]
[null,null,"Raid Controller"]
[null,null,"HPE Smart Array P816i-a SR G10",{"$f":"IF($C$33=\"HBA330 12Gbps SAS HBA Controller (NON-RAID)\",\"vSAN HCL\",\"\")","v":""},{"$f":"IF($M$9=1,VLOOKUP($C$33,TS3L6_ALL,15,FALSE),VLOOKUP($C$33,TS3L6_ALL,13,FALSE))","v":""},{"$f":"VLOOKUP($C$33,TS3L6_ALL,7,FALSE)","v":""},null,"Configurazione RAID e/o NOTE",null,{"$f":"VLOOKUP($C33,TS3L6_ALL,10,FALSE)","v":0},{"$f":"VLOOKUP($C33,TS3L6_ALL,11,FALSE)","v":0},{"$f":"IF($M$9=1,VLOOKUP($C33,TS3L6_ALL,14,FALSE),VLOOKUP($C33,TS3L6_ALL,12,FALSE))","v":""}]
[null,null,null,null,null,null,null,"Specificare la configurazione RAID per l'installazione del Sistema Operativo, se richiesto.\ne/o\ninserire eventuali note."]
[null,null,{"$f":"IF(L8=\"L6N01b\",\"Hard Drivers Bays disponibili n° 12 - NVMe Bays disponibili n° 4\",IF(F28=1,\"Hard Drivers Bays disponibili n° 24\",\"Hard Drivers Bays disponibili n° 16\"))","v":"Hard Drivers Bays disponibili n° 16"},null,"Usati","Disponibili"]
[null,null,null,"HDD/SDD",{"$f":"F39+F41+F43+F49+F51+F45+F47","v":2},{"$f":"IF(L8=\"L6N01b\",(12-E36),IF(F29=1,(24-E36),(16-E36)))","v":14}]
[null,null,null,{"$f":"IF(L9=\"L6N01b\",\"NVMe\",\"\")","v":""},{"$f":"IF(L9=\"L6N01b\",F53+F55,\"\")","v":""},{"$f":"IF(L9=\"L6N01b\",(4-E37),\"\")","v":""}]
[null,null,{"$f":"IF(M9=0,\"!!!ATTENZIONE!!! I dischi NVMe possono essere acquistati solo insieme al server. Non sono presenti per gli Acquisti Successivi.\",\"\")","v":""}]
[null,null,{"$f":"ConfigurationTS3L6!A65","v":"HPE 300GB SAS 12G Enterprise 10K SFF (2.5in) SC"},null,{"$f":"IF($M$9=1,VLOOKUP(C39,TS3L6_HDD,15,FALSE),VLOOKUP(C39,TS3L6_HDD,13,FALSE))","v":"TS3L6-HDD300GB"},null,null,null,null,{"$f":"VLOOKUP($C39,TS3L6_HDD,10,FALSE)*F39","v":0},{"$f":"VLOOKUP($C39,TS3L6_HDD,11,FALSE)","v":0},{"$f":"IF($M$9=1,VLOOKUP(C39,TS3L6_ALL,14,FALSE),VLOOKUP(C39,TS3L6_ALL,12,FALSE))","v":"L6N12"}]
[]
[null,null,{"$f":"ConfigurationTS3L6!A66","v":"HPE 1.2TB SAS 12G Enterprise 10K SFF (2.5in) SC"},null,{"$f":"IF($M$9=1,VLOOKUP(C41,TS3L6_HDD,15,FALSE),VLOOKUP(C41,TS3L6_HDD,13,FALSE))","v":"TS3L6-HDD1TB"},null,null,null,null,{"$f":"VLOOKUP($C41,TS3L6_HDD,10,FALSE)*F41","v":0},{"$f":"VLOOKUP($C41,TS3L6_HDD,11,FALSE)","v":0},{"$f":"IF($M$9=1,VLOOKUP(C41,TS3L6_ALL,14,FALSE),VLOOKUP(C41,TS3L6_ALL,12,FALSE))","v":"L6N11"}]
[]
[null,null,{"$f":"ConfigurationTS3L6!A67","v":"HPE 1.8TB SAS 12G Enterprise 10K SFF (2.5in) SC"},null,{"$f":"IF($M$9=1,VLOOKUP(C43,TS3L6_HDD,15,FALSE),VLOOKUP(C43,TS3L6_HDD,13,FALSE))","v":"TS3L6-HDD2TB"},null,null,null,null,{"$f":"VLOOKUP($C43,TS3L6_HDD,10,FALSE)*F43","v":0},{"$f":"VLOOKUP($C43,TS3L6_HDD,11,FALSE)","v":0},{"$f":"IF($M$9=1,VLOOKUP(C43,TS3L6_ALL,14,FALSE),VLOOKUP(C43,TS3L6_ALL,12,FALSE))","v":"L6N10"}]
[]
[null,null,{"$f":"ConfigurationTS3L6!A68","v":"HPE 960GB SAS 12G Read Intensive SFF (2.5in) SC"},null,{"$f":"IF($M$9=1,VLOOKUP(C45,TS3L6_HDD,15,FALSE),VLOOKUP(C45,TS3L6_HDD,13,FALSE))","v":"TS3L6-RI800GB"},null,null,null,null,{"$f":"VLOOKUP($C45,TS3L6_HDD,10,FALSE)*F45","v":0},{"$f":"VLOOKUP($C45,TS3L6_HDD,11,FALSE)","v":0},{"$f":"IF($M$9=1,VLOOKUP(C45,TS3L6_ALL,14,FALSE),VLOOKUP(C45,TS3L6_ALL,12,FALSE))","v":"L6N15"}]
[]
[null,null,{"$f":"ConfigurationTS3L6!A69","v":"HPE 1.92TB SAS 12G Read Intensive SFF (2.5in) SC"},null,{"$f":"IF($M$9=1,VLOOKUP(C47,TS3L6_HDD,15,FALSE),VLOOKUP(C47,TS3L6_HDD,13,FALSE))","v":"TS3L6-RI1600GB"},null,null,null,null,{"$f":"VLOOKUP($C47,TS3L6_HDD,10,FALSE)*F47","v":0},{"$f":"VLOOKUP($C47,TS3L6_HDD,11,FALSE)","v":0},{"$f":"IF($M$9=1,VLOOKUP(C47,TS3L6_ALL,14,FALSE),VLOOKUP(C47,TS3L6_ALL,12,FALSE))","v":"L6N13"}]
[]
[null,null,{"$f":"ConfigurationTS3L6!A71","v":"HPE 800GB SAS 12G Mixed Use SFF (2.5in) SC"},null,{"$f":"IF($M$9=1,VLOOKUP(C49,TS3L6_HDD,15,FALSE),VLOOKUP(C49,TS3L6_HDD,13,FALSE))","v":"TS3L6-MU800GB"},2,null,null,null,{"$f":"IF(F49>2,VLOOKUP($C49,TS3L6_HDD,10,FALSE)*(F49-2),0)","v":0},{"$f":"VLOOKUP($C49,TS3L6_HDD,11,FALSE)*F49","v":0},{"$f":"IF($M$9=1,VLOOKUP(C49,TS3L6_ALL,14,FALSE),VLOOKUP(C49,TS3L6_ALL,12,FALSE))","v":"L6N16"}]
[]
[null,null,{"$f":"ConfigurationTS3L6!A72","v":"HPE 1.6TB SAS 12G Mixed Use SFF (2.5in) SC"},null,{"$f":"IF($M$9=1,VLOOKUP(C51,TS3L6_HDD,15,FALSE),VLOOKUP(C51,TS3L6_HDD,13,FALSE))","v":"TS3L6-MU1600GB"},null,null,null,null,{"$f":"VLOOKUP($C51,TS3L6_HDD,10,FALSE)*F51","v":0},{"$f":"VLOOKUP($C51,TS3L6_HDD,11,FALSE)","v":0},{"$f":"IF($M$9=1,VLOOKUP(C51,TS3L6_ALL,14,FALSE),VLOOKUP(C51,TS3L6_ALL,12,FALSE))","v":"L6N14"}]
[]
[null,null,{"$f":"IF($L$9=\"L6N01b\",ConfigurationTS3L6!A73,\"\")","v":""},null,{"$f":"IF($M$9=1,VLOOKUP(C53,TS3L6_HDD,15,FALSE),VLOOKUP(C53,TS3L6_HDD,13,FALSE))","v":""},null,null,null,null,{"$f":"IF($L$9=\"L6N01b\",VLOOKUP($C53,TS3L6_HDD,10,FALSE)*F53,0)","v":0},{"$f":"VLOOKUP($C53,TS3L6_HDD,11,FALSE)*F53","v":0},{"$f":"IF($M$9=1,VLOOKUP(C53,TS3L6_ALL,14,FALSE),VLOOKUP(C53,TS3L6_ALL,12,FALSE))","v":""}]
[]
[null,null,{"$f":"IF($L$9=\"L6N01b\",ConfigurationTS3L6!A74,\"\")","v":""},null,{"$f":"IF($M$9=1,VLOOKUP(C55,TS3L6_HDD,15,FALSE),VLOOKUP(C55,TS3L6_HDD,13,FALSE))","v":""},null,null,null,null,{"$f":"IF($L$9=\"L6N01b\",VLOOKUP($C55,TS3L6_HDD,10,FALSE)*F55,0)","v":0},{"$f":"VLOOKUP($C55,TS3L6_HDD,11,FALSE)*F55","v":0},{"$f":"IF($M$9=1,VLOOKUP(C55,TS3L6_ALL,14,FALSE),VLOOKUP(C55,TS3L6_ALL,12,FALSE))","v":""}]
[]
[null,null,"Power Supply"]
[null,null,"Dual, Hot-plug, Redundant Power Supply (1+1), 1600W"]
[]
[null,null,"HPE OneView Advanced (with HPE iLO Advanced)",{"$f":"HYPERLINK(\"https://convenzioni.converge.it/docs/ts3_datasheet/ilo-spec-sheet.pdf\",\"i\")","v":"i"}]
[null,null,"None",null,{"$f":"IF($M$9=1,VLOOKUP(C61,TS3L6_ALL,15,FALSE),VLOOKUP(C61,TS3L6_ALL,13,FALSE))","v":""},{"$f":"VLOOKUP($C61,TS3L6_ALL,7,FALSE)","v":""},null,null,null,{"$f":"VLOOKUP($C61,TS3L6_ALL,10,FALSE)","v":0},{"$f":"VLOOKUP($C61,TS3L6_ALL,11,FALSE)","v":0},{"$f":"IF($M$9=1,VLOOKUP(C61,TS3L6_ALL,14,FALSE),VLOOKUP(C61,TS3L6_ALL,12,FALSE))","v":""}]
[]
[null,null,"Micro SD (USB Flash Drive)"]
[null,null,"None",null,{"$f":"IF($M$9=1,VLOOKUP(C64,TS3L6_ALL,15,FALSE),VLOOKUP(C64,TS3L6_ALL,13,FALSE))","v":""},{"$f":"VLOOKUP($C64,TS3L6_ALL,7,FALSE)","v":""},null,null,null,{"$f":"VLOOKUP($C64,TS3L6_ALL,10,FALSE)","v":0},{"$f":"VLOOKUP($C64,TS3L6_ALL,11,FALSE)","v":0},{"$f":"IF($M$9=1,VLOOKUP(C64,TS3L6_ALL,14,FALSE),VLOOKUP(C64,TS3L6_ALL,12,FALSE))","v":""}]
[]
[null,null,"Network Cards"]
[null,null,"HPE Ethernet 1Gb 4-port FLR-T BCM5719 Adapter"]
[]
[]
[]
[null,null,"PCI Slot 1 Processor 1 x8 PCIe Gen3"]
[null,null,"",null,{"$f":"IF($M$9=1,VLOOKUP(C72,TS3L6_ALL,15,FALSE),VLOOKUP(C72,TS3L6_ALL,13,FALSE))","v":""},{"$f":"VLOOKUP($C72,TS3L6_ALL,7,FALSE)","v":""},null,null,null,{"$f":"VLOOKUP($C72,TS3L6_ALL,10,FALSE)","v":0},{"$f":"VLOOKUP($C72,TS3L6_ALL,11,FALSE)","v":0},{"$f":"IF($M$9=1,VLOOKUP(C72,TS3L6_ALL,14,FALSE),VLOOKUP(C72,TS3L6_ALL,12,FALSE))","v":""}]
[]
[null,null,{"$f":"IF($L$9=\"L6N01b\",\"PCI Slot 2 Processor 1 x8 PCIe Gen3\",\"PCI Slot 2 Processor 1 x16 PCIe Gen3 ----------GPU Slot----------\")","v":"PCI Slot 2 Processor 1 x16 PCIe Gen3 ----------GPU Slot----------"}]
[null,null,"",null,{"$f":"IF($M$9=1,VLOOKUP(C75,TS3L6_ALL,15,FALSE),VLOOKUP(C75,TS3L6_ALL,13,FALSE))","v":""},{"$f":"VLOOKUP($C75,TS3L6_ALL,7,FALSE)","v":""},null,null,null,{"$f":"VLOOKUP($C75,TS3L6_ALL,10,FALSE)","v":0},{"$f":"VLOOKUP($C75,TS3L6_ALL,11,FALSE)","v":0},{"$f":"IF($M$9=1,VLOOKUP(C75,TS3L6_ALL,14,FALSE),VLOOKUP(C75,TS3L6_ALL,12,FALSE))","v":""}]
[]
[null,null,"PCI Slot 3 Processor 1 x8 PCIe Gen3"]
[null,null,"",null,{"$f":"IF($M$9=1,VLOOKUP(C78,TS3L6_ALL,15,FALSE),VLOOKUP(C78,TS3L6_ALL,13,FALSE))","v":""},{"$f":"VLOOKUP($C78,TS3L6_ALL,7,FALSE)","v":""},null,null,null,{"$f":"VLOOKUP($C78,TS3L6_ALL,10,FALSE)","v":0},{"$f":"VLOOKUP($C78,TS3L6_ALL,11,FALSE)","v":0},{"$f":"IF($M$9=1,VLOOKUP(C78,TS3L6_ALL,14,FALSE),VLOOKUP(C78,TS3L6_ALL,12,FALSE))","v":""}]
[]
[null,null,"PCI Slot 4 Processor 2 x8 PCIe Gen3"]
[null,null,"",null,{"$f":"IF($M$9=1,VLOOKUP(C81,TS3L6_ALL,15,FALSE),VLOOKUP(C81,TS3L6_ALL,13,FALSE))","v":""},{"$f":"VLOOKUP($C81,TS3L6_ALL,7,FALSE)","v":""},null,null,null,{"$f":"VLOOKUP($C81,TS3L6_ALL,10,FALSE)","v":0},{"$f":"VLOOKUP($C81,TS3L6_ALL,11,FALSE)","v":0},{"$f":"IF($M$9=1,VLOOKUP(C81,TS3L6_ALL,14,FALSE),VLOOKUP(C81,TS3L6_ALL,12,FALSE))","v":""}]
[]
[null,null,{"$f":"IF($L$9=\"L6N01b\",\"PCI Slot 5 Processor 2 x8 PCIe Gen3\",\"PCI Slot 5 Processor 2 x16 PCIe Gen3 ----------GPU Slot----------\")","v":"PCI Slot 5 Processor 2 x16 PCIe Gen3 ----------GPU Slot----------"}]
[null,null,"",null,{"$f":"IF($M$9=1,VLOOKUP(C84,TS3L6_ALL,15,FALSE),VLOOKUP(C84,TS3L6_ALL,13,FALSE))","v":""},{"$f":"VLOOKUP($C84,TS3L6_ALL,7,FALSE)","v":""},null,null,null,{"$f":"VLOOKUP($C84,TS3L6_ALL,10,FALSE)","v":0},{"$f":"VLOOKUP($C84,TS3L6_ALL,11,FALSE)","v":0},{"$f":"IF($M$9=1,VLOOKUP(C84,TS3L6_ALL,14,FALSE),VLOOKUP(C84,TS3L6_ALL,12,FALSE))","v":""}]
[]
[null,null,"PCI Slot 6 Processor 2 x8 PCIe Gen3"]
[null,null,"",null,{"$f":"IF($M$9=1,VLOOKUP(C87,TS3L6_ALL,15,FALSE),VLOOKUP(C87,TS3L6_ALL,13,FALSE))","v":""},{"$f":"VLOOKUP($C87,TS3L6_ALL,7,FALSE)","v":""},null,null,null,{"$f":"VLOOKUP($C87,TS3L6_ALL,10,FALSE)","v":0},{"$f":"VLOOKUP($C87,TS3L6_ALL,11,FALSE)","v":0},{"$f":"IF($M$9=1,VLOOKUP(C87,TS3L6_ALL,14,FALSE),VLOOKUP(C87,TS3L6_ALL,12,FALSE))","v":""}]
[]
[null,null,"PCI Slot 7 Processor 2 x8 PCIe Gen3"]
[null,null,"",null,{"$f":"VLOOKUP($C90,TS3L6_ALL,13,FALSE)","v":""},{"$f":"VLOOKUP($C90,TS3L6_ALL,7,FALSE)","v":""},null,{"$f":"IF(M90=\"Errore\",\"ERRORE nella selezione del PCI Slot\",IFERROR(O91,\"ERRORE nella selezione del PCI Slot\"))","v":0},null,{"$f":"VLOOKUP($C90,TS3L6_ALL,10,FALSE)","v":0},{"$f":"VLOOKUP($C90,TS3L6_ALL,11,FALSE)","v":0},{"$f":"VLOOKUP($C90,TS3L6_ALL,12,FALSE)","v":""}]
[]
[null,null,"PCI Slot 8 Processor 2 x16 PCIe Gen3"]
[null,null,"",null,{"$f":"VLOOKUP($C93,TS3L6_ALL,13,FALSE)","v":""},{"$f":"VLOOKUP($C93,TS3L6_ALL,7,FALSE)","v":""},null,{"$f":"IFERROR(O94,\"ERRORE nella selezione del PCI Slot\")","v":0},null,{"$f":"VLOOKUP($C93,TS3L6_ALL,10,FALSE)","v":0},{"$f":"VLOOKUP($C93,TS3L6_ALL,11,FALSE)","v":0},{"$f":"VLOOKUP($C93,TS3L6_ALL,12,FALSE)","v":""}]
[]
[null,null,"M.2 - Solid State Drives"]
[null,null,"None",null,{"$f":"IF($M$9=1,VLOOKUP(C96,TS3L6_ALL,15,FALSE),VLOOKUP(C96,TS3L6_ALL,13,FALSE))","v":""},{"$f":"VLOOKUP($C96,TS3L6_ALL,7,FALSE)","v":""},null,null,null,{"$f":"VLOOKUP($C96,TS3L6_ALL,10,FALSE)","v":0},{"$f":"VLOOKUP($C96,TS3L6_ALL,11,FALSE)","v":0},{"$f":"IF($M$9=1,VLOOKUP(C96,TS3L6_ALL,14,FALSE),VLOOKUP(C96,TS3L6_ALL,12,FALSE))","v":""}]
[]
[null,null,"Cables for Intel Omni-Path Adapter"]
[null,null,"HPE 3M 100Gb QSFP28 Omni-Path Optical Power Class 2 Cable",null,{"$f":"IF(K99>0,IF($M$9=1,VLOOKUP(C99,TS3L6_ALL,15,FALSE),VLOOKUP(C99,TS3L6_ALL,13,FALSE)),\"\")","v":""},null,null,null,null,0,{"$f":"IF(F99>0,VLOOKUP($C99,TS3L6_ALL,11,FALSE)*F99,0)","v":0},{"$f":"IF(F99>0,IF($M$9=1,VLOOKUP(C99,TS3L6_ALL,14,FALSE),VLOOKUP(C99,TS3L6_ALL,12,FALSE)),\"\")","v":""}]
[null,null,"HPE 5M 100Gb QSFP28 Omni-Path Optical Power Class 2 Cable",null,{"$f":"IF(K100>0,IF($M$9=1,VLOOKUP(C100,TS3L6_ALL,15,FALSE),VLOOKUP(C100,TS3L6_ALL,13,FALSE)),\"\")","v":""},null,null,null,null,0,{"$f":"IF(F100>0,VLOOKUP($C100,TS3L6_ALL,11,FALSE)*F100,0)","v":0},{"$f":"IF(F100>0,IF($M$9=1,VLOOKUP(C100,TS3L6_ALL,14,FALSE),VLOOKUP(C100,TS3L6_ALL,12,FALSE)),\"\")","v":""}]
[null,null,"HPE 7M 100Gb QSFP28 Omni-Path Optical Power Class 2 Cable",null,{"$f":"IF(K101>0,IF($M$9=1,VLOOKUP(C101,TS3L6_ALL,15,FALSE),VLOOKUP(C101,TS3L6_ALL,13,FALSE)),\"\")","v":""},null,null,null,null,0,{"$f":"IF(F101>0,VLOOKUP($C101,TS3L6_ALL,11,FALSE)*F101,0)","v":0},{"$f":"IF(F101>0,IF($M$9=1,VLOOKUP(C101,TS3L6_ALL,14,FALSE),VLOOKUP(C101,TS3L6_ALL,12,FALSE)),\"\")","v":""}]
[]
[null,null,"Transceiver"]
[null,null,"HPE 10G SFP+ LR Transceiver",null,{"$f":"IF(K104>0,IF($M$9=1,VLOOKUP(C104,TS3L6_ALL,15,FALSE),VLOOKUP(C104,TS3L6_ALL,13,FALSE)),\"\")","v":""},null,null,null,null,0,{"$f":"IF(F104>0,VLOOKUP($C104,TS3L6_ALL,11,FALSE)*F104,0)","v":0},{"$f":"IF(F104>0,IF($M$9=1,VLOOKUP(C104,TS3L6_ALL,14,FALSE),VLOOKUP(C104,TS3L6_ALL,12,FALSE)),\"\")","v":""}]
[null,null,"HPE 10G SFP+ SR Transceiver",null,{"$f":"IF(K105>0,IF($M$9=1,VLOOKUP(C105,TS3L6_ALL,15,FALSE),VLOOKUP(C105,TS3L6_ALL,13,FALSE)),\"\")","v":""},null,null,null,null,0,{"$f":"IF(F105>0,VLOOKUP($C105,TS3L6_ALL,11,FALSE)*F105,0)","v":0},{"$f":"IF(F105>0,IF($M$9=1,VLOOKUP(C105,TS3L6_ALL,14,FALSE),VLOOKUP(C105,TS3L6_ALL,12,FALSE)),\"\")","v":""}]
[]
[null,null,"Cables"]
[null,null,"Cavo DAC HPE 10GB SFP+ SFP+ 3 metri",null,{"$f":"IF(K108>0,IF($M$9=1,VLOOKUP(C108,TS3L6_ALL,15,FALSE),VLOOKUP(C108,TS3L6_ALL,13,FALSE)),\"\")","v":""},null,null,null,null,0,{"$f":"IF(F108>0,VLOOKUP($C108,TS3L6_ALL,11,FALSE)*F108,0)","v":0},{"$f":"IF(F108>0,IF($M$9=1,VLOOKUP(C108,TS3L6_ALL,14,FALSE),VLOOKUP(C108,TS3L6_ALL,12,FALSE)),\"\")","v":""}]
[null,null,"HPE Premier Flex LC/LC OM4 2f 2m Cbl",null,{"$f":"IF(K109>0,IF($M$9=1,VLOOKUP(C109,TS3L6_ALL,15,FALSE),VLOOKUP(C109,TS3L6_ALL,13,FALSE)),\"\")","v":""},null,null,null,null,0,{"$f":"IF(F109>0,VLOOKUP($C109,TS3L6_ALL,11,FALSE)*F109,0)","v":0},{"$f":"IF(F109>0,IF($M$9=1,VLOOKUP(C109,TS3L6_ALL,14,FALSE),VLOOKUP(C109,TS3L6_ALL,12,FALSE)),\"\")","v":""}]
[null,null,"HPE 25Gb SFP28 to SFP28 3m DAC",null,{"$f":"IF(K110>0,IF($M$9=1,VLOOKUP(C110,TS3L6_ALL,15,FALSE),VLOOKUP(C110,TS3L6_ALL,13,FALSE)),\"\")","v":""},null,null,null,null,0,{"$f":"IF(F110>0,VLOOKUP($C110,TS3L6_ALL,11,FALSE)*F110,0)","v":0},{"$f":"IF(F110>0,IF($M$9=1,VLOOKUP(C110,TS3L6_ALL,14,FALSE),VLOOKUP(C110,TS3L6_ALL,12,FALSE)),\"\")","v":""}]
[]
[null,null,null,null,{"$f":"IF(K112>0,VLOOKUP($C112,ConfigurationTS3L6!$A$1:$O$4574,13,FALSE),\"\")","v":""},null,null,null,null,0,{"$f":"IF(F112>0,VLOOKUP($C112,TS3L6_ALL,11,FALSE)*F112,0)","v":0},{"$f":"IF(F112>0,VLOOKUP($C112,TS3L6_ALL,12,FALSE),0)","v":0}]
[]
[null,null,"Cavi RJ45"]
[null,null,"Cavo “patch” di 3 mt RJ45 certificato per gigabit ethernet",null,{"$f":"IF(K115>0,IF($M$9=1,VLOOKUP(C115,TS3L6_ALL,15,FALSE),VLOOKUP(C115,TS3L6_ALL,13,FALSE)),\"\")","v":"TS3L6-RJ453M"},5,null,null,null,0,{"$f":"IF(F115>0,IF($M$9=1,VLOOKUP(C115,TS3L6_ALL,11,FALSE)*(F115),VLOOKUP(C115,TS3L6_ALL,11,FALSE)*(F115)),0)","v":15},{"$f":"IF(F115>0,IF($M$9=1,VLOOKUP(C115,TS3L6_ALL,14,FALSE),VLOOKUP(C115,TS3L6_ALL,12,FALSE)),\"\")","v":"L6N34"}]
[]
[null,null,"Warranty",{"$f":"HYPERLINK(\"https://convenzioni.converge.it/docs/ts3_datasheet/TS3warranty_hpe.pdf\",\"i\")","v":"i"}]
[null,null,"Manutenzione in garanzia (36 mesi)",null,{"$f":"IF($M$9=1,VLOOKUP(C118,TS3L6_ALL,15,FALSE),VLOOKUP(C118,TS3L6_ALL,13,FALSE))","v":""},{"$f":"VLOOKUP($C118,TS3L6_WARRANTY,7,FALSE)","v":""},null,null,null,{"$f":"VLOOKUP($C118,TS3L6_WARRANTY,10,FALSE)","v":0},{"$f":"VLOOKUP($C118,TS3L6_WARRANTY,11,FALSE)","v":0},{"$f":"IF($M$9=1,VLOOKUP(C118,TS3L6_ALL,14,FALSE),VLOOKUP(C118,TS3L6_ALL,12,FALSE))","v":""}]
[]
[null,null,"Hard Disk Retention",{"$f":"HYPERLINK(\"https://convenzioni.converge.it/docs/ts3_datasheet/HPE_HDD_KYHD.pdf\",\"i\")","v":"i"}]
[null,null,"",null,{"$f":"IF($M$9=0,$N$122,$N$121)","v":""},{"$f":"IF(C121=\"\",\"\",1)","v":""},null,null,null,{"$f":"IFERROR(Q121,VLOOKUP(C121,TS3L6_ALL,10,FALSE))","v":0},{"$f":"IFERROR(R121,VLOOKUP(C121,TS3L6_ALL,11,FALSE))","v":0},{"$f":"IF(M9=0,O122,O121)","v":""},null,{"$f":"IFERROR($P$121,VLOOKUP($C$121,TS3L6_ALL,15,FALSE))","v":""},{"$f":"IFERROR($S$121,VLOOKUP($C$121,TS3L6_ALL,14,FALSE))","v":""},{"$f":"IF(F118+F121=2,VLOOKUP(\"Hard Disk Retention (60 mesi)\",TS3L6_ALL,15,FALSE),VLOOKUP(C121,TS3L6_ALL,15,FALSE))","v":{"$error":"#VALUE!"}},{"$f":"IF(F118+F121=2,VLOOKUP(\"Hard Disk Retention (60 mesi)\",TS3L6_ALL,10,FALSE),VLOOKUP(C121,TS3L6_ALL,10,FALSE))","v":{"$error":"#VALUE!"}},{"$f":"IF(F118+F121=2,VLOOKUP(\"Hard Disk Retention (60 mesi)\",TS3L6_ALL,11,FALSE),VLOOKUP(C121,TS3L6_ALL,11,FALSE))","v":{"$error":"#VALUE!"}},{"$f":"IF(F118+F121=2,VLOOKUP(\"Hard Disk Retention (60 mesi)\",TS3L6_ALL,14,FALSE),VLOOKUP(C121,TS3L6_ALL,14,FALSE))","v":{"$error":"#VALUE!"}}]
[null,null,null,null,null,null,null,null,null,null,null,null,null,{"$f":"IFERROR($P$122,VLOOKUP($C$121,TS3L6_ALL,13,FALSE))","v":""},{"$f":"IFERROR($S$122,VLOOKUP($C$121,TS3L6_ALL,12,FALSE))","v":""},{"$f":"IF(F118+F121=2,VLOOKUP(\"Hard Disk Retention (60 mesi)\",TS3L6_ALL,13,FALSE),VLOOKUP(C121,TS3L6_ALL,13,FALSE))","v":{"$error":"#VALUE!"}},{"$f":"IF(F118+F121=2,VLOOKUP(\"Hard Disk Retention (60 mesi)\",TS3L6_ALL,10,FALSE),VLOOKUP(C121,TS3L6_ALL,10,FALSE))","v":{"$error":"#VALUE!"}},{"$f":"IF(F118+F121=2,VLOOKUP(\"Hard Disk Retention (60 mesi)\",TS3L6_ALL,11,FALSE),VLOOKUP(C121,TS3L6_ALL,11,FALSE))","v":{"$error":"#VALUE!"}},{"$f":"IF(F118+F121=2,VLOOKUP(\"Hard Disk Retention (60 mesi)\",TS3L6_ALL,12,FALSE),VLOOKUP(C121,TS3L6_ALL,12,FALSE))","v":{"$error":"#VALUE!"}}]

{"sheet":"Altre_Opzioni","index":3,"n_rows":47,"n_cols":12,"rows_kept":47,"cut":false,"hidden":false,"merged":[[7,3,8,3],[11,3,12,3],[21,3,22,3],[45,3,46,3],[15,3,16,3],[33,3,34,3],[36,3,37,3],[39,3,40,3],[42,3,43,3],[30,3,31,3]]}
[null,null,null,null,"Convenzione",{"$f":"SUM(J9:J140)","v":0}]
[null,null,null,null,0.2,{"$f":"SUM(K9:K140)","v":0}]
[null,null,null,null,"Totale",{"$f":"SUM(F1:F2)","v":0}]
[]
[null,null,"Opzioni"]
[]
[]
[null,null,"Opzione Rack HPE con PDU Monofase",{"$f":"HYPERLINK(\"https://convenzioni.converge.it/docs/ts3_datasheet/RACK_HPE.pdf\",\"i\")","v":"i"}]
[null,null,"Armadio Rack HPE 42U 600x1200, comprensivo di 2 PDU Monofase 7.3kVA con 36 connettori C13 e 12 connettori C19 collegamento spina industriale 32A IEC-60309 3 poli (2P+T)",null,{"$f":"IF(Riepilogo!$P$129>=1,Riepilogo!$K$129,Riepilogo!$K$130)","v":"TS3L6-RACKMONON"},null,null,null,null,{"$f":"VLOOKUP($C9,TS3L6_ALL,10,FALSE)*F9","v":0},{"$f":"VLOOKUP($C9,TS3L6_ALL,11,FALSE)*F9","v":0},{"$f":"VLOOKUP($C9,TS3L6_ALL,12,FALSE)","v":"L6N47b"}]
[]
[]
[null,null,"Opzione Rack HPE con PDU Trifase",{"$f":"HYPERLINK(\"https://convenzioni.converge.it/docs/ts3_datasheet/RACK_HPE.pdf\",\"i\")","v":"i"}]
[null,null,"Armadio Rack HPE 42U 600x1200, comprensivo di 2 PDU Trifase 22kVA con 36 connettori C13 e 12 connettori C19 collegamento spina industriale 32A IEC-60309 5 poli (3P+N+T)",null,{"$f":"IF(Riepilogo!$P$131>=1,Riepilogo!$K$131,Riepilogo!$K$132)","v":"TS3L6-RACK3PHN"},null,null,null,null,{"$f":"VLOOKUP($C13,TS3L6_ALL,10,FALSE)*F13","v":0},{"$f":"VLOOKUP($C13,TS3L6_ALL,11,FALSE)*F13","v":0},{"$f":"VLOOKUP($C13,TS3L6_ALL,12,FALSE)","v":"L6N48b"}]
[]
[]
[null,null,"OpzRack",{"$f":"HYPERLINK(\"https://convenzioni.converge.it/docs/ts3_datasheet/TS3Rack.pdf\",\"i\")","v":"i"}]
[null,null,"Rack 42U con portata 1000 KG e 4 ruote + coppia PDU 12 prese Shuko bipasso ITA",null,{"$f":"IF(Riepilogo!$P$83>=1,Riepilogo!$K$83,Riepilogo!$K$84)","v":"TS3L6-RACKN"},null,null,null,null,{"$f":"VLOOKUP($C17,TS3L6_ALL,10,FALSE)*F17","v":0},{"$f":"VLOOKUP($C17,TS3L6_ALL,11,FALSE)","v":0},{"$f":"VLOOKUP($C17,TS3L6_ALL,12,FALSE)","v":"L6N32b"}]
[]
[null,null,"Enclosure Dischi SAS (12 x 14TB HDD)"]
[null,null,"HPE D3610 Enclosure, 12 x HDD 14TB SAS 7.2K LFF, 5Years 24x7",null,{"$f":"IF(Riepilogo!$P$133>=1,Riepilogo!$K$133,Riepilogo!$K$134)","v":"TS3L6-E15Y247N"},null,null,null,null,{"$f":"VLOOKUP($C20,TS3L6_ALL,10,FALSE)*F20","v":0},{"$f":"VLOOKUP($C20,TS3L6_ALL,11,FALSE)*F20","v":0},{"$f":"VLOOKUP($C20,TS3L6_ALL,12,FALSE)","v":"L6N53b"}]
[]
[null,null,"Prodotti VMware",{"$f":"HYPERLINK(\"https://convenzioni.converge.it/docs/ts3_datasheet/HPE_VMWARE.pdf\",\"i\")","v":"i"}]
[null,null,"VMware vSphere Essentials Plus Kit OEM for 3 hosts (Max 2 processors per host) 3 Years",null,{"$f":"IF(Riepilogo!$P115>=1,Riepilogo!$K115,Riepilogo!$K116)","v":"TS3L6-VS7ESPK3N"},null,null,null,null,{"$f":"VLOOKUP($C23,TS3L6_ALL,10,FALSE)*F23","v":0},{"$f":"VLOOKUP($C23,TS3L6_ALL,11,FALSE)*F23","v":0},{"$f":"VLOOKUP($C23,TS3L6_ALL,12,FALSE)","v":"L6N36b"}]
[null,null,"Upgrade: VMware vSphere  Essentials plus Kit OEM to vSphere Standard Acceleration Kit OEM for 6 processors 3 Years E-LTU",null,{"$f":"IF(Riepilogo!$P117>=1,Riepilogo!$K117,Riepilogo!$K118)","v":"TS3L6-ESPSTDAKN"},null,null,null,null,0,0,"L6N41b"]
[null,null,"VMware vCenter Server Standard OEM for vSphere 3 Years E-LTU",null,{"$f":"IF(Riepilogo!$P119>=1,Riepilogo!$K119,Riepilogo!$K120)","v":"TS3L6-VCS7STDN"},null,null,null,null,0,0,"L6N42b"]
[null,null,"VMware vSphere Enterprise Plus OEM for 1 processor 3 Years E-LTU",null,{"$f":"IF(Riepilogo!$P121>=1,Riepilogo!$K121,Riepilogo!$K122)","v":"TS3L6-VS7EPLN"},null,null,null,null,0,0,"L6N43b"]
[null,null,"VMware vSphere Standard OEM for 1 processor 3 Years E-LTU",null,{"$f":"IF(Riepilogo!$P123>=1,Riepilogo!$K123,Riepilogo!$K124)","v":"TS3L6-VS7STDN"},null,null,null,null,0,0,"L6N44b"]
[null,null,"VMware vSAN Standard OEM for 1 processor 3 Years E-LTU",null,{"$f":"IF(Riepilogo!$P125>=1,Riepilogo!$K125,Riepilogo!$K126)","v":"TS3L6-ST7STDN"},null,null,null,null,0,0,"L6N45b"]
[null,null,"VMware vSAN Advanced OEM for 1 processor 3 Years E-LTU",null,{"$f":"IF(Riepilogo!$P127>=1,Riepilogo!$K127,Riepilogo!$K128)","v":"TS3L6-ST7ADVN"},null,null,null,null,0,0,"L6N46b"]
[]
[null,null,"HPE G2 R8000 UPS",{"$f":"HYPERLINK(\"https://convenzioni.converge.it/docs/ts3_datasheet/HPEG2R8000UPS.pdf\",\"i\")","v":"i"}]
[null,null,"HPE G2 R8000 UPS 230V Outlets (6) C19 (2) IEC 32A/6U Rackmount INTL",null,{"$f":"IF(Riepilogo!$P$150>=1,Riepilogo!$K$150,Riepilogo!$K$151)","v":"TS3L6-UPSR8000N"},null,null,null,null,{"$f":"VLOOKUP($C32,TS3L6_ALL,10,FALSE)*F32","v":0},{"$f":"VLOOKUP($C32,TS3L6_ALL,11,FALSE)*F32","v":0},{"$f":"VLOOKUP($C32,TS3L6_ALL,12,FALSE)","v":"L6N66B"}]
[]
[null,null,"OpzUps (3000VA)",{"$f":"HYPERLINK(\"https://convenzioni.converge.it/docs/ts3_datasheet/RPMM_UPS.pdf\",\"i\")","v":"i"}]
[null,null,"BUNDLE PMEUPS3RTSER Comprensivo di UPS e scheda SNMP + Kit Rack incluso",null,{"$f":"IF(Riepilogo!$P$59>=1,Riepilogo!$K$59,Riepilogo!$K$60)","v":"TS3L6-UPSN"},null,null,null,null,{"$f":"VLOOKUP($C35,TS3L6_ALL,10,FALSE)*F35","v":0},{"$f":"VLOOKUP($C35,TS3L6_ALL,11,FALSE)","v":0},{"$f":"VLOOKUP($C35,TS3L6_ALL,12,FALSE)","v":"L6N20b"}]
[]
[null,null,"OpzGUI",{"$f":"HYPERLINK(\"https://convenzioni.converge.it/docs/ts3_datasheet/KVM_datasheet_ITA.pdf\",\"i\")","v":"i"}]
[null,null,"Unità KVM - monitor 17\", cavo combi PS2 e USB da 1,8mt, tastiera ita, touch pad",null,{"$f":"IF(Riepilogo!$P$61>=1,Riepilogo!$K$61,Riepilogo!$K$62)","v":"TS3L6-GUIN"},null,null,null,null,{"$f":"VLOOKUP($C38,TS3L6_ALL,10,FALSE)*F38","v":0},{"$f":"VLOOKUP($C38,TS3L6_ALL,11,FALSE)","v":0},{"$f":"VLOOKUP($C38,TS3L6_ALL,12,FALSE)","v":"L6N21b"}]
[]
[null,null,"OpzKVM",{"$f":"HYPERLINK(\"https://convenzioni.converge.it/docs/ts3_datasheet/T9816NIP.pdf\",\"i\")","v":"i"}]
[null,null,"Switch 16 porte IP con relativi cavi combi PS/2 e USB inclusi",null,{"$f":"IF(Riepilogo!$P$63>=1,Riepilogo!$K$63,Riepilogo!$K$64)","v":"TS3L6-SWKVMN"},null,null,null,null,{"$f":"VLOOKUP($C41,TS3L6_ALL,10,FALSE)*F41","v":0},{"$f":"VLOOKUP($C41,TS3L6_ALL,11,FALSE)","v":0},{"$f":"VLOOKUP($C41,TS3L6_ALL,12,FALSE)","v":"L6N22b"}]
[]
[null,null,{"$f":"IF(TS3L6_WINSRVALL>0,\"OpzDeviceCal\",\"\")","v":""}]
[null,null,{"$f":"IF(TS3L6_WINSRVALL>0,\"1-pack of Windows Server 2019/2016 Device CALs (STD or DC)\",\"\")","v":""},null,{"$f":"IF(Riepilogo!$P$67>=1,Riepilogo!$K$67,Riepilogo!$K68)","v":"TS3L6-WINDVCALN"},null,null,null,null,{"$f":"VLOOKUP($C44,TS3L6_ALL,10,FALSE)*F44","v":0},{"$f":"VLOOKUP($C44,TS3L6_ALL,11,FALSE)","v":0},{"$f":"VLOOKUP($C44,TS3L6_ALL,12,FALSE)","v":""}]
[]
[null,null,{"$f":"IF(TS3L6_WINSRVALL>0,\"OpzUserCal\",\"\")","v":""}]
[null,null,{"$f":"IF(TS3L6_WINSRVALL>0,\"1-pack of Windows Server 2019/2016 User CALs (STD or DC)\",\"\")","v":""},null,{"$f":"IF(Riepilogo!$P$69>=1,Riepilogo!$K$69,Riepilogo!$K$70)","v":"TS3L6-WINUSCALN"},null,null,null,null,{"$f":"VLOOKUP($C47,TS3L6_ALL,10,FALSE)*F47","v":0},{"$f":"VLOOKUP($C47,TS3L6_ALL,11,FALSE)","v":0},{"$f":"VLOOKUP($C47,TS3L6_ALL,12,FALSE)","v":""}]

{"sheet":"ConfigurationTS3L6","index":4,"n_rows":173,"n_cols":25,"rows_kept":173,"cut":false,"hidden":true,"merged":[]}
[1,2,3,4,5,6,7,8,9,10,11,12,13,14,15,16,17,18,19,20,21,22,23,24,25]
[null,"Module Name","Option ID","Option Name","Option List Price","SKUs","Qty","SKU Customer Kit","Attributo","Valore inserito",null,null,null,"N°","Codice Convenzione"]
["Proliant DL560 Gen10","Chassis with 16 x 2.5 Hard Drives",null,{"$f":"VLOOKUP(N3,Tabella_prezzi!$A$3:$K$138,8,FALSE)","v":"Proliant DL560 Gen10"},null,null,null,{"$f":"VLOOKUP(N3,Tabella_prezzi!$A$3:$K$138,9,FALSE)","v":"L6N01-ServerDL560"},{"$f":"VLOOKUP(N3,Tabella_prezzi!$A$3:$K$138,3,FALSE)","v":"Server rackable quad-processore prest."},{"$f":"VLOOKUP(N3,Tabella_prezzi!$A$3:$K$138,4,FALSE)","v":5912},null,null,null,"L6N01",{"$f":"VLOOKUP(N3,Tabella_prezzi!$A$3:$K$138,6,FALSE)","v":"TS3L6-SRV"}]
["Proliant DL560 Gen10 NVMe Configuration","Chassis with 12 x 2.5 Hard Drives and 4 x 2.5 NVMe",null,{"$f":"VLOOKUP(N4,Tabella_prezzi!$A$3:$K$138,8,FALSE)","v":"Proliant DL560 Gen10 NVMe Configuration"},null,null,null,{"$f":"VLOOKUP(N4,Tabella_prezzi!$A$3:$K$138,9,FALSE)","v":"L6N01b-ServerDL560"},{"$f":"VLOOKUP(N4,Tabella_prezzi!$A$3:$K$138,3,FALSE)","v":"Server rackable quad-processore prest."},{"$f":"VLOOKUP(N4,Tabella_prezzi!$A$3:$K$138,4,FALSE)","v":5912},null,null,null,"L6N01b",{"$f":"VLOOKUP(N4,Tabella_prezzi!$A$3:$K$138,6,FALSE)","v":"TS3L6-SRVNVME"}]
[]
["TS3L6_Chassis"]
["Proliant DL560 Gen10","Chassis with 16 x 2.5 Hard Drives"]
["Proliant DL560 Gen10 NVMe Configuration","Chassis with 12 x 2.5 Hard Drives and 4 x 2.5 NVMe"]
[]
["TS3L6_CPU"]
["No Additional Processor",null,null,null,null,null,0,null,{"$f":"\"\"","v":""},null,null,null,{"$f":"\"\"","v":""},{"$f":"\"\"","v":""},{"$f":"\"\"","v":""}]
["2 x Intel Xeon-Gold 6252N (2.3GHz/24-core/150W)",null,null,{"$f":"VLOOKUP(N12,Tabella_prezzi!$A$3:$K$138,8,FALSE)","v":"Intel Xeon-Gold 6252N (2.3GHz/24-core/150W) Processor Kit for HPE ProLiant DL560 Gen10"},null,null,1,{"$f":"VLOOKUP(N12,Tabella_prezzi!$A$3:$K$138,9,FALSE)","v":"L6N02-OpzCPU"},{"$f":"VLOOKUP(N12,Tabella_prezzi!$A$3:$K$138,3,FALSE)","v":"Kit n. 2 Processori aggiuntivi"},{"$f":"VLOOKUP(N12,Tabella_prezzi!$A$3:$K$138,4,FALSE)","v":2475},null,"L6N02B",{"$f":"VLOOKUP(L12,Tabella_prezzi!$A$3:$K$138,6,FALSE)","v":"TS3L6-CPUN"},"L6N02",{"$f":"VLOOKUP(N12,Tabella_prezzi!$A$3:$K$138,6,FALSE)","v":"TS3L6-CPU"}]
["2 x Intel \"POCHI CORE\"",null,null,{"$f":"VLOOKUP(N13,Tabella_prezzi!$A$3:$K$138,8,FALSE)","v":{"$error":"#N/A"}},null,null,1,{"$f":"VLOOKUP(N13,Tabella_prezzi!$A$3:$K$138,9,FALSE)","v":{"$error":"#N/A"}},{"$f":"VLOOKUP(N13,Tabella_prezzi!$A$3:$K$138,3,FALSE)","v":{"$error":"#N/A"}},null,{"$f":"VLOOKUP(N13,Tabella_prezzi!$A$3:$K$138,4,FALSE)","v":{"$error":"#N/A"}},"L4N48B",{"$f":"VLOOKUP(L13,Tabella_prezzi!$A$3:$K$138,6,FALSE)","v":{"$error":"#N/A"}},"L4N48",{"$f":"VLOOKUP(N13,Tabella_prezzi!$A$3:$K$138,6,FALSE)","v":{"$error":"#N/A"}}]
[]
["TS3L6_CPU8core"]
["2 x Intel Xeon-Gold 6252N (2.3GHz/24-core/150W)",null,null,null,null,null,0,null,{"$f":"\"\"","v":""},null,null,{"$f":"\"\"","v":""},{"$f":"\"\"","v":""},{"$f":"\"\"","v":""},{"$f":"\"\"","v":""}]
["2 x Intel \"POCHI CORE\"",null,null,{"$f":"VLOOKUP(N17,Tabella_prezzi!$A$3:$K$138,8,FALSE)","v":{"$error":"#N/A"}},null,null,1,{"$f":"VLOOKUP(N17,Tabella_prezzi!$A$3:$K$138,9,FALSE)","v":{"$error":"#N/A"}},{"$f":"VLOOKUP(N17,Tabella_prezzi!$A$3:$K$138,3,FALSE)","v":{"$error":"#N/A"}},null,{"$f":"VLOOKUP(N17,Tabella_prezzi!$A$3:$K$138,4,FALSE)","v":{"$error":"#N/A"}},"L4N47B",{"$f":"VLOOKUP(L17,Tabella_prezzi!$A$3:$K$138,6,FALSE)","v":{"$error":"#N/A"}},"L4N47",{"$f":"VLOOKUP(N17,Tabella_prezzi!$A$3:$K$138,6,FALSE)","v":{"$error":"#N/A"}}]
[]
["TS3L6_CPU8coreadd"]
["No Additional Processor",null,null,null,null,null,0,null,{"$f":"\"\"","v":""},null,null,{"$f":"\"\"","v":""},{"$f":"\"\"","v":""},{"$f":"\"\"","v":""},{"$f":"\"\"","v":""}]
["2 x Intel \"POCHI CORE\"",null,null,{"$f":"VLOOKUP(N21,Tabella_prezzi!$A$3:$K$138,8,FALSE)","v":{"$error":"#N/A"}},null,null,1,{"$f":"VLOOKUP(N21,Tabella_prezzi!$A$3:$K$138,9,FALSE)","v":{"$error":"#N/A"}},{"$f":"VLOOKUP(N21,Tabella_prezzi!$A$3:$K$138,3,FALSE)","v":{"$error":"#N/A"}},null,{"$f":"VLOOKUP(N21,Tabella_prezzi!$A$3:$K$138,4,FALSE)","v":{"$error":"#N/A"}},"L4N48B",{"$f":"VLOOKUP(L21,Tabella_prezzi!$A$3:$K$138,6,FALSE)","v":{"$error":"#N/A"}},"L4N48",{"$f":"VLOOKUP(N21,Tabella_prezzi!$A$3:$K$138,6,FALSE)","v":{"$error":"#N/A"}}]
[]
[]
["TS3L6_RAM (2CPU)"]
["128GB (32GB)","Memory Capacity",null,"HPE 32GB (1x32GB) Dual Rank x4 DDR4-2933 CAS-21-21-21 Registered Smart Memory Kit",null,null,0,{"$f":"H26","v":"L6N03-OpzRAM32GB"},{"$f":"\"\"","v":""},null,null,{"$f":"\"\"","v":""},{"$f":"\"\"","v":""},{"$f":"\"\"","v":""},{"$f":"\"\"","v":""},{"$f":"\"\"","v":""},null,null,{"$f":"\"\"","v":""},{"$f":"\"\"","v":""},{"$f":"\"\"","v":""},{"$f":"\"\"","v":""},{"$f":"\"\"","v":""},0]
["256GB (32GB)","Memory Capacity",null,"HPE 32GB (1x32GB) Dual Rank x4 DDR4-2933 CAS-21-21-21 Registered Smart Memory Kit",null,null,4,{"$f":"VLOOKUP(N26,Tabella_prezzi!$A$3:$K$138,9,FALSE)","v":"L6N03-OpzRAM32GB"},{"$f":"VLOOKUP(N26,Tabella_prezzi!$A$3:$K$138,3,FALSE)","v":"OpzRAM32GB"},{"$f":"VLOOKUP(N26,Tabella_prezzi!$A$3:$K$138,4,FALSE)*G26","v":736},null,"L6N03B",{"$f":"VLOOKUP(L26,Tabella_prezzi!$A$3:$K$138,6,FALSE)","v":"TS3L6-RAM32N"},"L6N03",{"$f":"VLOOKUP(N26,Tabella_prezzi!$A$3:$K$138,6,FALSE)","v":"TS3L6-RAM32"},{"$f":"\"\"","v":""},null,null,{"$f":"\"\"","v":""},{"$f":"\"\"","v":""},{"$f":"\"\"","v":""},{"$f":"\"\"","v":""},{"$f":"\"\"","v":""},0]
["256GB (64GB)","Memory Capacity",null,{"$f":"VLOOKUP(V27,Tabella_prezzi!$A$3:$K$138,8,FALSE)","v":"HPE 64GB (1x64GB) Dual Rank x4 DDR4-2933 CAS-21-21-21 Registered Smart Memory Kit"},null,null,0,{"$f":"\"\"","v":""},{"$f":"\"\"","v":""},null,null,{"$f":"\"\"","v":""},{"$f":"\"\"","v":""},{"$f":"\"\"","v":""},{"$f":"\"\"","v":""},{"$f":"VLOOKUP(V27,Tabella_prezzi!$A$3:$K$138,9,FALSE)","v":"L6N04-OpzRAM64GB"},{"$f":"VLOOKUP(V27,Tabella_prezzi!$A$3:$K$138,3,FALSE)","v":"OpzRAM64GB"},{"$f":"VLOOKUP(V27,Tabella_prezzi!$A$3:$K$138,4,FALSE)*X27","v":1178},null,"L6N04B",{"$f":"VLOOKUP(T27,Tabella_prezzi!$A$3:$K$138,6,FALSE)","v":"TS3L6-RAM64N"},"L6N04",{"$f":"VLOOKUP(V27,Tabella_prezzi!$A$3:$K$138,6,FALSE)","v":"TS3L6-RAM64"},2]
["384GB (32GB)","Memory Capacity",null,"HPE 32GB (1x32GB) Dual Rank x4 DDR4-2933 CAS-21-21-21 Registered Smart Memory Kit",null,null,8,{"$f":"VLOOKUP(N28,Tabella_prezzi!$A$3:$K$138,9,FALSE)","v":"L6N03-OpzRAM32GB"},{"$f":"VLOOKUP(N28,Tabella_prezzi!$A$3:$K$138,3,FALSE)","v":"OpzRAM32GB"},{"$f":"VLOOKUP(N28,Tabella_prezzi!$A$3:$K$138,4,FALSE)*G28","v":1472},null,"L6N03B",{"$f":"VLOOKUP(L28,Tabella_prezzi!$A$3:$K$138,6,FALSE)","v":"TS3L6-RAM32N"},"L6N03",{"$f":"VLOOKUP(N28,Tabella_prezzi!$A$3:$K$138,6,FALSE)","v":"TS3L6-RAM32"},{"$f":"\"\"","v":""},null,null,{"$f":"\"\"","v":""},{"$f":"\"\"","v":""},{"$f":"\"\"","v":""},{"$f":"\"\"","v":""},{"$f":"\"\"","v":""},0]
["384GB (MIX) ","Memory Capacity",null,{"$f":"VLOOKUP(V29,Tabella_prezzi!$A$3:$K$138,8,FALSE)","v":"HPE 64GB (1x64GB) Dual Rank x4 DDR4-2933 CAS-21-21-21 Registered Smart Memory Kit"},null,null,0,{"$f":"\"\"","v":""},{"$f":"\"\"","v":""},null,null,{"$f":"\"\"","v":""},{"$f":"\"\"","v":""},{"$f":"\"\"","v":""},{"$f":"\"\"","v":""},{"$f":"VLOOKUP(V29,Tabella_prezzi!$A$3:$K$138,9,FALSE)","v":"L6N04-OpzRAM64GB"},{"$f":"VLOOKUP(V29,Tabella_prezzi!$A$3:$K$138,3,FALSE)","v":"OpzRAM64GB"},{"$f":"VLOOKUP(V29,Tabella_prezzi!$A$3:$K$138,4,FALSE)*X29","v":2356},null,"L6N04B",{"$f":"VLOOKUP(T29,Tabella_prezzi!$A$3:$K$138,6,FALSE)","v":"TS3L6-RAM64N"},"L6N04",{"$f":"VLOOKUP(V29,Tabella_prezzi!$A$3:$K$138,6,FALSE)","v":"TS3L6-RAM64"},4]
["512GB (32GB)","Memory Capacity",null,"HPE 32GB (1x32GB) Dual Rank x4 DDR4-2933 CAS-21-21-21 Registered Smart Memory Kit",null,null,12,{"$f":"VLOOKUP(N30,Tabella_prezzi!$A$3:$K$138,9,FALSE)","v":"L6N03-OpzRAM32GB"},{"$f":"VLOOKUP(N30,Tabella_prezzi!$A$3:$K$138,3,FALSE)","v":"OpzRAM32GB"},{"$f":"VLOOKUP(N30,Tabella_prezzi!$A$3:$K$138,4,FALSE)*G30","v":2208},null,"L6N03B",{"$f":"VLOOKUP(L30,Tabella_prezzi!$A$3:$K$138,6,FALSE)","v":"TS3L6-RAM32N"},"L6N03",{"$f":"VLOOKUP(N30,Tabella_prezzi!$A$3:$K$138,6,FALSE)","v":"TS3L6-RAM32"},{"$f":"\"\"","v":""},null,null,{"$f":"\"\"","v":""},{"$f":"\"\"","v":""},{"$f":"\"\"","v":""},{"$f":"\"\"","v":""},{"$f":"\"\"","v":""},0]
["512GB (MIX) ","Memory Capacity",null,{"$f":"VLOOKUP(V31,Tabella_prezzi!$A$3:$K$138,8,FALSE)","v":"HPE 64GB (1x64GB) Dual Rank x4 DDR4-2933 CAS-21-21-21 Registered Smart Memory Kit"},null,null,4,{"$f":"VLOOKUP(N31,Tabella_prezzi!$A$3:$K$138,9,FALSE)","v":"L6N03-OpzRAM32GB"},{"$f":"VLOOKUP(N31,Tabella_prezzi!$A$3:$K$138,3,FALSE)","v":"OpzRAM32GB"},{"$f":"VLOOKUP(N31,Tabella_prezzi!$A$3:$K$138,4,FALSE)*G31","v":736},null,"L6N03B",{"$f":"VLOOKUP(L31,Tabella_prezzi!$A$3:$K$138,6,FALSE)","v":"TS3L6-RAM32N"},"L6N03",{"$f":"VLOOKUP(N31,Tabella_prezzi!$A$3:$K$138,6,FALSE)","v":"TS3L6-RAM32"},{"$f":"VLOOKUP(V31,Tabella_prezzi!$A$3:$K$138,9,FALSE)","v":"L6N04-OpzRAM64GB"},{"$f":"VLOOKUP(V31,Tabella_prezzi!$A$3:$K$138,3,FALSE)","v":"OpzRAM64GB"},{"$f":"VLOOKUP(V31,Tabella_prezzi!$A$3:$K$138,4,FALSE)*X31","v":2356},null,"L6N04B",{"$f":"VLOOKUP(T31,Tabella_prezzi!$A$3:$K$138,6,FALSE)","v":"TS3L6-RAM64N"},"L6N04",{"$f":"VLOOKUP(V31,Tabella_prezzi!$A$3:$K$138,6,FALSE)","v":"TS3L6-RAM64"},4]
["512GB (64GB)","Memory Capacity",null,{"$f":"VLOOKUP(V32,Tabella_prezzi!$A$3:$K$138,8,FALSE)","v":"HPE 64GB (1x64GB) Dual Rank x4 DDR4-2933 CAS-21-21-21 Registered Smart Memory Kit"},null,null,0,{"$f":"\"\"","v":""},{"$f":"\"\"","v":""},null,null,{"$f":"\"\"","v":""},{"$f":"\"\"","v":""},{"$f":"\"\"","v":""},{"$f":"\"\"","v":""},{"$f":"VLOOKUP(V32,Tabella_prezzi!$A$3:$K$138,9,FALSE)","v":"L6N04-OpzRAM64GB"},{"$f":"VLOOKUP(V32,Tabella_prezzi!$A$3:$K$138,3,FALSE)","v":"OpzRAM64GB"},{"$f":"VLOOKUP(V32,Tabella_prezzi!$A$3:$K$138,4,FALSE)*X32","v":3534},null,"L6N04B",{"$f":"VLOOKUP(T32,Tabella_prezzi!$A$3:$K$138,6,FALSE)","v":"TS3L6-RAM64N"},"L6N04",{"$f":"VLOOKUP(V32,Tabella_prezzi!$A$3:$K$138,6,FALSE)","v":"TS3L6-RAM64"},6]
["768GB (32GB)","Memory Capacity",null,"HPE 32GB (1x32GB) Dual Rank x4 DDR4-2933 CAS-21-21-21 Registered Smart Memory Kit",null,null,20,{"$f":"VLOOKUP(N33,Tabella_prezzi!$A$3:$K$138,9,FALSE)","v":"L6N03-OpzRAM32GB"},{"$f":"VLOOKUP(N33,Tabella_prezzi!$A$3:$K$138,3,FALSE)","v":"OpzRAM32GB"},{"$f":"VLOOKUP(N33,Tabella_prezzi!$A$3:$K$138,4,FALSE)*G33","v":3680},null,"L6N03B",{"$f":"VLOOKUP(L33,Tabella_prezzi!$A$3:$K$138,6,FALSE)","v":"TS3L6-RAM32N"},"L6N03",{"$f":"VLOOKUP(N33,Tabella_prezzi!$A$3:$K$138,6,FALSE)","v":"TS3L6-RAM32"},{"$f":"\"\"","v":""},null,null,{"$f":"\"\"","v":""},{"$f":"\"\"","v":""},{"$f":"\"\"","v":""},{"$f":"\"\"","v":""},{"$f":"\"\"","v":""},0]
["768GB (MIX) ","Memory Capacity",null,{"$f":"VLOOKUP(V34,Tabella_prezzi!$A$3:$K$138,8,FALSE)","v":"HPE 64GB (1x64GB) Dual Rank x4 DDR4-2933 CAS-21-21-21 Registered Smart Memory Kit"},null,null,4,{"$f":"VLOOKUP(N34,Tabella_prezzi!$A$3:$K$138,9,FALSE)","v":"L6N03-OpzRAM32GB"},{"$f":"VLOOKUP(N34,Tabella_prezzi!$A$3:$K$138,3,FALSE)","v":"OpzRAM32GB"},{"$f":"VLOOKUP(N34,Tabella_prezzi!$A$3:$K$138,4,FALSE)*G34","v":736},null,"L6N03B",{"$f":"VLOOKUP(L34,Tabella_prezzi!$A$3:$K$138,6,FALSE)","v":"TS3L6-RAM32N"},"L6N03",{"$f":"VLOOKUP(N34,Tabella_prezzi!$A$3:$K$138,6,FALSE)","v":"TS3L6-RAM32"},{"$f":"VLOOKUP(V34,Tabella_prezzi!$A$3:$K$138,9,FALSE)","v":"L6N04-OpzRAM64GB"},{"$f":"VLOOKUP(V34,Tabella_prezzi!$A$3:$K$138,3,FALSE)","v":"OpzRAM64GB"},{"$f":"VLOOKUP(V34,Tabella_prezzi!$A$3:$K$138,4,FALSE)*X34","v":4712},null,"L6N04B",{"$f":"VLOOKUP(T34,Tabella_prezzi!$A$3:$K$138,6,FALSE)","v":"TS3L6-RAM64N"},"L6N04",{"$f":"VLOOKUP(V34,Tabella_prezzi!$A$3:$K$138,6,FALSE)","v":"TS3L6-RAM64"},8]
["768GB (64GB)","Memory Capacity",null,{"$f":"VLOOKUP(V35,Tabella_prezzi!$A$3:$K$138,8,FALSE)","v":"HPE 64GB (1x64GB) Dual Rank x4 DDR4-2933 CAS-21-21-21 Registered Smart Memory Kit"},null,null,0,{"$f":"\"\"","v":""},{"$f":"\"\"","v":""},null,null,{"$f":"\"\"","v":""},{"$f":"\"\"","v":""},{"$f":"\"\"","v":""},{"$f":"\"\"","v":""},{"$f":"VLOOKUP(V35,Tabella_prezzi!$A$3:$K$138,9,FALSE)","v":"L6N04-OpzRAM64GB"},{"$f":"VLOOKUP(V35,Tabella_prezzi!$A$3:$K$138,3,FALSE)","v":"OpzRAM64GB"},{"$f":"VLOOKUP(V35,Tabella_prezzi!$A$3:$K$138,4,FALSE)*X35","v":5890},null,"L6N04B",{"$f":"VLOOKUP(T35,Tabella_prezzi!$A$3:$K$138,6,FALSE)","v":"TS3L6-RAM64N"},"L6N04",{"$f":"VLOOKUP(V35,Tabella_prezzi!$A$3:$K$138,6,FALSE)","v":"TS3L6-RAM64"},10]
["1024GB (MIX) ","Memory Capacity",null,{"$f":"VLOOKUP(V36,Tabella_prezzi!$A$3:$K$138,8,FALSE)","v":"HPE 64GB (1x64GB) Dual Rank x4 DDR4-2933 CAS-21-21-21 Registered Smart Memory Kit"},null,null,12,{"$f":"VLOOKUP(N36,Tabella_prezzi!$A$3:$K$138,9,FALSE)","v":"L6N03-OpzRAM32GB"},{"$f":"VLOOKUP(N36,Tabella_prezzi!$A$3:$K$138,3,FALSE)","v":"OpzRAM32GB"},{"$f":"VLOOKUP(N36,Tabella_prezzi!$A$3:$K$138,4,FALSE)*G36","v":2208},null,"L6N03B",{"$f":"VLOOKUP(L36,Tabella_prezzi!$A$3:$K$138,6,FALSE)","v":"TS3L6-RAM32N"},"L6N03",{"$f":"VLOOKUP(N36,Tabella_prezzi!$A$3:$K$138,6,FALSE)","v":"TS3L6-RAM32"},{"$f":"VLOOKUP(V36,Tabella_prezzi!$A$3:$K$138,9,FALSE)","v":"L6N04-OpzRAM64GB"},{"$f":"VLOOKUP(V36,Tabella_prezzi!$A$3:$K$138,3,FALSE)","v":"OpzRAM64GB"},{"$f":"VLOOKUP(V36,Tabella_prezzi!$A$3:$K$138,4,FALSE)*X36","v":4712},null,"L6N04B",{"$f":"VLOOKUP(T36,Tabella_prezzi!$A$3:$K$138,6,FALSE)","v":"TS3L6-RAM64N"},"L6N04",{"$f":"VLOOKUP(V36,Tabella_prezzi!$A$3:$K$138,6,FALSE)","v":"TS3L6-RAM64"},8]
["1024GB (64GB)","Memory Capacity",null,{"$f":"VLOOKUP(V37,Tabella_prezzi!$A$3:$K$138,8,FALSE)","v":"HPE 64GB (1x64GB) Dual Rank x4 DDR4-2933 CAS-21-21-21 Registered Smart Memory Kit"},null,null,0,{"$f":"\"\"","v":""},{"$f":"\"\"","v":""},null,null,{"$f":"\"\"","v":""},{"$f":"\"\"","v":""},{"$f":"\"\"","v":""},{"$f":"\"\"","v":""},{"$f":"VLOOKUP(V37,Tabella_prezzi!$A$3:$K$138,9,FALSE)","v":"L6N04-OpzRAM64GB"},{"$f":"VLOOKUP(V37,Tabella_prezzi!$A$3:$K$138,3,FALSE)","v":"OpzRAM64GB"},{"$f":"VLOOKUP(V37,Tabella_prezzi!$A$3:$K$138,4,FALSE)*X37","v":8246},null,"L6N04B",{"$f":"VLOOKUP(T37,Tabella_prezzi!$A$3:$K$138,6,FALSE)","v":"TS3L6-RAM64N"},"L6N04",{"$f":"VLOOKUP(V37,Tabella_prezzi!$A$3:$K$138,6,FALSE)","v":"TS3L6-RAM64"},14]
["1536GB (64GB)","Memory Capacity",null,{"$f":"VLOOKUP(V38,Tabella_prezzi!$A$3:$K$138,8,FALSE)","v":"HPE 64GB (1x64GB) Dual Rank x4 DDR4-2933 CAS-21-21-21 Registered Smart Memory Kit"},null,null,0,{"$f":"\"\"","v":""},{"$f":"\"\"","v":""},null,null,{"$f":"\"\"","v":""},{"$f":"\"\"","v":""},{"$f":"\"\"","v":""},{"$f":"\"\"","v":""},{"$f":"VLOOKUP(V38,Tabella_prezzi!$A$3:$K$138,9,FALSE)","v":"L6N04-OpzRAM64GB"},{"$f":"VLOOKUP(V38,Tabella_prezzi!$A$3:$K$138,3,FALSE)","v":"OpzRAM64GB"},{"$f":"VLOOKUP(V38,Tabella_prezzi!$A$3:$K$138,4,FALSE)*X38","v":12958},null,"L6N04B",{"$f":"VLOOKUP(T38,Tabella_prezzi!$A$3:$K$138,6,FALSE)","v":"TS3L6-RAM64N"},"L6N04",{"$f":"VLOOKUP(V38,Tabella_prezzi!$A$3:$K$138,6,FALSE)","v":"TS3L6-RAM64"},22]
[]
["TS3L6_RAM (4CPU)"]
["256GB (32GB)","Memory Capacity",null,{"$f":"VLOOKUP(N41,Tabella_prezzi!$A$3:$K$138,8,FALSE)","v":"HPE 32GB (1x32GB) Dual Rank x4 DDR4-2933 CAS-21-21-21 Registered Smart Memory Kit"},null,null,4,{"$f":"VLOOKUP(N41,Tabella_prezzi!$A$3:$K$138,9,FALSE)","v":"L6N03-OpzRAM32GB"},{"$f":"VLOOKUP(N41,Tabella_prezzi!$A$3:$K$138,3,FALSE)","v":"OpzRAM32GB"},{"$f":"VLOOKUP(N41,Tabella_prezzi!$A$3:$K$138,4,FALSE)*G41","v":736},null,"L6N03B",{"$f":"VLOOKUP(L41,Tabella_prezzi!$A$3:$K$138,6,FALSE)","v":"TS3L6-RAM32N"},"L6N03",{"$f":"VLOOKUP(N41,Tabella_prezzi!$A$3:$K$138,6,FALSE)","v":"TS3L6-RAM32"},{"$f":"\"\"","v":""},null,null,{"$f":"\"\"","v":""},{"$f":"\"\"","v":""},{"$f":"\"\"","v":""},{"$f":"\"\"","v":""},{"$f":"\"\"","v":""},0]
["512GB (32GB)","Memory Capacity",null,{"$f":"VLOOKUP(N42,Tabella_prezzi!$A$3:$K$138,8,FALSE)","v":"HPE 32GB (1x32GB) Dual Rank x4 DDR4-2933 CAS-21-21-21 Registered Smart Memory Kit"},null,null,12,{"$f":"VLOOKUP(N42,Tabella_prezzi!$A$3:$K$138,9,FALSE)","v":"L6N03-OpzRAM32GB"},{"$f":"VLOOKUP(N42,Tabella_prezzi!$A$3:$K$138,3,FALSE)","v":"OpzRAM32GB"},{"$f":"VLOOKUP(N42,Tabella_prezzi!$A$3:$K$138,4,FALSE)*G42","v":2208},null,"L6N03B",{"$f":"VLOOKUP(L42,Tabella_prezzi!$A$3:$K$138,6,FALSE)","v":"TS3L6-RAM32N"},"L6N03",{"$f":"VLOOKUP(N42,Tabella_prezzi!$A$3:$K$138,6,FALSE)","v":"TS3L6-RAM32"},{"$f":"\"\"","v":""},null,null,{"$f":"\"\"","v":""},{"$f":"\"\"","v":""},{"$f":"\"\"","v":""},{"$f":"\"\"","v":""},{"$f":"\"\"","v":""},0]
["512GB (64GB)","Memory Capacity",null,{"$f":"VLOOKUP(V43,Tabella_prezzi!$A$3:$K$138,8,FALSE)","v":"HPE 64GB (1x64GB) Dual Rank x4 DDR4-2933 CAS-21-21-21 Registered Smart Memory Kit"},null,null,0,{"$f":"\"\"","v":""},{"$f":"\"\"","v":""},null,null,{"$f":"\"\"","v":""},{"$f":"\"\"","v":""},{"$f":"\"\"","v":""},{"$f":"\"\"","v":""},{"$f":"VLOOKUP(V43,Tabella_prezzi!$A$3:$K$138,9,FALSE)","v":"L6N04-OpzRAM64GB"},{"$f":"VLOOKUP(V43,Tabella_prezzi!$A$3:$K$138,3,FALSE)","v":"OpzRAM64GB"},{"$f":"VLOOKUP(V43,Tabella_prezzi!$A$3:$K$138,4,FALSE)*X43","v":3534},null,"L6N04B",{"$f":"VLOOKUP(T43,Tabella_prezzi!$A$3:$K$138,6,FALSE)","v":"TS3L6-RAM64N"},"L6N04",{"$f":"VLOOKUP(V43,Tabella_prezzi!$A$3:$K$138,6,FALSE)","v":"TS3L6-RAM64"},6]
["768GB (32GB)","Memory Capacity",null,{"$f":"VLOOKUP(N44,Tabella_prezzi!$A$3:$K$138,8,FALSE)","v":"HPE 32GB (1x32GB) Dual Rank x4 DDR4-2933 CAS-21-21-21 Registered Smart Memory Kit"},null,null,20,{"$f":"VLOOKUP(N44,Tabella_prezzi!$A$3:$K$138,9,FALSE)","v":"L6N03-OpzRAM32GB"},{"$f":"VLOOKUP(N44,Tabella_prezzi!$A$3:$K$138,3,FALSE)","v":"OpzRAM32GB"},{"$f":"VLOOKUP(N44,Tabella_prezzi!$A$3:$K$138,4,FALSE)*G44","v":3680},null,"L6N03B",{"$f":"VLOOKUP(L44,Tabella_prezzi!$A$3:$K$138,6,FALSE)","v":"TS3L6-RAM32N"},"L6N03",{"$f":"VLOOKUP(N44,Tabella_prezzi!$A$3:$K$138,6,FALSE)","v":"TS3L6-RAM32"},{"$f":"\"\"","v":""},null,null,{"$f":"\"\"","v":""},{"$f":"\"\"","v":""},{"$f":"\"\"","v":""},{"$f":"\"\"","v":""},{"$f":"\"\"","v":""},0]
["768GB (MIX) ","Memory Capacity",null,{"$f":"VLOOKUP(N45,Tabella_prezzi!$A$3:$K$138,8,FALSE)","v":"HPE 32GB (1x32GB) Dual Rank x4 DDR4-2933 CAS-21-21-21 Registered Smart Memory Kit"},null,null,4,{"$f":"VLOOKUP(N45,Tabella_prezzi!$A$3:$K$138,9,FALSE)","v":"L6N03-OpzRAM32GB"},{"$f":"VLOOKUP(N45,Tabella_prezzi!$A$3:$K$138,3,FALSE)","v":"OpzRAM32GB"},{"$f":"VLOOKUP(N45,Tabella_prezzi!$A$3:$K$138,4,FALSE)*G45","v":736},null,"L6N03B",{"$f":"VLOOKUP(L45,Tabella_prezzi!$A$3:$K$138,6,FALSE)","v":"TS3L6-RAM32N"},"L6N03",{"$f":"VLOOKUP(N45,Tabella_prezzi!$A$3:$K$138,6,FALSE)","v":"TS3L6-RAM32"},{"$f":"VLOOKUP(V45,Tabella_prezzi!$A$3:$K$138,9,FALSE)","v":"L6N04-OpzRAM64GB"},{"$f":"VLOOKUP(V45,Tabella_prezzi!$A$3:$K$138,3,FALSE)","v":"OpzRAM64GB"},{"$f":"VLOOKUP(V45,Tabella_prezzi!$A$3:$K$138,4,FALSE)*X45","v":4712},null,"L6N04B",{"$f":"VLOOKUP(T45,Tabella_prezzi!$A$3:$K$138,6,FALSE)","v":"TS3L6-RAM64N"},"L6N04",{"$f":"VLOOKUP(V45,Tabella_prezzi!$A$3:$K$138,6,FALSE)","v":"TS3L6-RAM64"},8]
["768GB (64GB)","Memory Capacity",null,{"$f":"VLOOKUP(V46,Tabella_prezzi!$A$3:$K$138,8,FALSE)","v":"HPE 64GB (1x64GB) Dual Rank x4 DDR4-2933 CAS-21-21-21 Registered Smart Memory Kit"},null,null,0,{"$f":"\"\"","v":""},{"$f":"\"\"","v":""},null,null,{"$f":"\"\"","v":""},{"$f":"\"\"","v":""},{"$f":"\"\"","v":""},{"$f":"\"\"","v":""},{"$f":"VLOOKUP(V46,Tabella_prezzi!$A$3:$K$138,9,FALSE)","v":"L6N04-OpzRAM64GB"},{"$f":"VLOOKUP(V46,Tabella_prezzi!$A$3:$K$138,3,FALSE)","v":"OpzRAM64GB"},{"$f":"VLOOKUP(V46,Tabella_prezzi!$A$3:$K$138,4,FALSE)*X46","v":5890},null,"L6N04B",{"$f":"VLOOKUP(T46,Tabella_prezzi!$A$3:$K$138,6,FALSE)","v":"TS3L6-RAM64N"},"L6N04",{"$f":"VLOOKUP(V46,Tabella_prezzi!$A$3:$K$138,6,FALSE)","v":"TS3L6-RAM64"},10]
["1024GB (32GB)","Memory Capacity",null,{"$f":"VLOOKUP(N47,Tabella_prezzi!$A$3:$K$138,8,FALSE)","v":"HPE 32GB (1x32GB) Dual Rank x4 DDR4-2933 CAS-21-21-21 Registered Smart Memory Kit"},null,null,28,{"$f":"VLOOKUP(N47,Tabella_prezzi!$A$3:$K$138,9,FALSE)","v":"L6N03-OpzRAM32GB"},{"$f":"VLOOKUP(N47,Tabella_prezzi!$A$3:$K$138,3,FALSE)","v":"OpzRAM32GB"},{"$f":"VLOOKUP(N47,Tabella_prezzi!$A$3:$K$138,4,FALSE)*G47","v":5152},null,"L6N03B",{"$f":"VLOOKUP(L47,Tabella_prezzi!$A$3:$K$138,6,FALSE)","v":"TS3L6-RAM32N"},"L6N03",{"$f":"VLOOKUP(N47,Tabella_prezzi!$A$3:$K$138,6,FALSE)","v":"TS3L6-RAM32"},{"$f":"\"\"","v":""},null,null,{"$f":"\"\"","v":""},{"$f":"\"\"","v":""},{"$f":"\"\"","v":""},{"$f":"\"\"","v":""},{"$f":"\"\"","v":""},0]
["1024GB (MIX) ","Memory Capacity",null,{"$f":"VLOOKUP(N48,Tabella_prezzi!$A$3:$K$138,8,FALSE)","v":"HPE 32GB (1x32GB) Dual Rank x4 DDR4-2933 CAS-21-21-21 Registered Smart Memory Kit"},null,null,12,{"$f":"VLOOKUP(N48,Tabella_prezzi!$A$3:$K$138,9,FALSE)","v":"L6N03-OpzRAM32GB"},{"$f":"VLOOKUP(N48,Tabella_prezzi!$A$3:$K$138,3,FALSE)","v":"OpzRAM32GB"},{"$f":"VLOOKUP(N48,Tabella_prezzi!$A$3:$K$138,4,FALSE)*G48","v":2208},null,"L6N03B",{"$f":"VLOOKUP(L48,Tabella_prezzi!$A$3:$K$138,6,FALSE)","v":"TS3L6-RAM32N"},"L6N03",{"$f":"VLOOKUP(N48,Tabella_prezzi!$A$3:$K$138,6,FALSE)","v":"TS3L6-RAM32"},{"$f":"VLOOKUP(V48,Tabella_prezzi!$A$3:$K$138,9,FALSE)","v":"L6N04-OpzRAM64GB"},{"$f":"VLOOKUP(V48,Tabella_prezzi!$A$3:$K$138,3,FALSE)","v":"OpzRAM64GB"},{"$f":"VLOOKUP(V48,Tabella_prezzi!$A$3:$K$138,4,FALSE)*X48","v":4712},null,"L6N04B",{"$f":"VLOOKUP(T48,Tabella_prezzi!$A$3:$K$138,6,FALSE)","v":"TS3L6-RAM64N"},"L6N04",{"$f":"VLOOKUP(V48,Tabella_prezzi!$A$3:$K$138,6,FALSE)","v":"TS3L6-RAM64"},8]
["1024GB (64GB)","Memory Capacity",null,{"$f":"VLOOKUP(V49,Tabella_prezzi!$A$3:$K$138,8,FALSE)","v":"HPE 64GB (1x64GB) Dual Rank x4 DDR4-2933 CAS-21-21-21 Registered Smart Memory Kit"},null,null,0,{"$f":"\"\"","v":""},{"$f":"\"\"","v":""},null,null,{"$f":"\"\"","v":""},{"$f":"\"\"","v":""},{"$f":"\"\"","v":""},{"$f":"\"\"","v":""},{"$f":"VLOOKUP(V49,Tabella_prezzi!$A$3:$K$138,9,FALSE)","v":"L6N04-OpzRAM64GB"},{"$f":"VLOOKUP(V49,Tabella_prezzi!$A$3:$K$138,3,FALSE)","v":"OpzRAM64GB"},{"$f":"VLOOKUP(V49,Tabella_prezzi!$A$3:$K$138,4,FALSE)*X49","v":8246},null,"L6N04B",{"$f":"VLOOKUP(T49,Tabella_prezzi!$A$3:$K$138,6,FALSE)","v":"TS3L6-RAM64N"},"L6N04",{"$f":"VLOOKUP(V49,Tabella_prezzi!$A$3:$K$138,6,FALSE)","v":"TS3L6-RAM64"},14]
["1536GB (32GB)","Memory Capacity",null,{"$f":"VLOOKUP(N50,Tabella_prezzi!$A$3:$K$138,8,FALSE)","v":"HPE 32GB (1x32GB) Dual Rank x4 DDR4-2933 CAS-21-21-21 Registered Smart Memory Kit"},null,null,44,{"$f":"VLOOKUP(N50,Tabella_prezzi!$A$3:$K$138,9,FALSE)","v":"L6N03-OpzRAM32GB"},{"$f":"VLOOKUP(N50,Tabella_prezzi!$A$3:$K$138,3,FALSE)","v":"OpzRAM32GB"},{"$f":"VLOOKUP(N50,Tabella_prezzi!$A$3:$K$138,4,FALSE)*G50","v":8096},null,"L6N03B",{"$f":"VLOOKUP(L50,Tabella_prezzi!$A$3:$K$138,6,FALSE)","v":"TS3L6-RAM32N"},"L6N03",{"$f":"VLOOKUP(N50,Tabella_prezzi!$A$3:$K$138,6,FALSE)","v":"TS3L6-RAM32"},{"$f":"\"\"","v":""},null,null,{"$f":"\"\"","v":""},{"$f":"\"\"","v":""},{"$f":"\"\"","v":""},{"$f":"\"\"","v":""},{"$f":"\"\"","v":""},0]
["1536GB (MIX) ","Memory Capacity",null,{"$f":"VLOOKUP(N51,Tabella_prezzi!$A$3:$K$138,8,FALSE)","v":"HPE 32GB (1x32GB) Dual Rank x4 DDR4-2933 CAS-21-21-21 Registered Smart Memory Kit"},null,null,12,{"$f":"VLOOKUP(N51,Tabella_prezzi!$A$3:$K$138,9,FALSE)","v":"L6N03-OpzRAM32GB"},{"$f":"VLOOKUP(N51,Tabella_prezzi!$A$3:$K$138,3,FALSE)","v":"OpzRAM32GB"},{"$f":"VLOOKUP(N51,Tabella_prezzi!$A$3:$K$138,4,FALSE)*G51","v":2208},null,"L6N03B",{"$f":"VLOOKUP(L51,Tabella_prezzi!$A$3:$K$138,6,FALSE)","v":"TS3L6-RAM32N"},"L6N03",{"$f":"VLOOKUP(N51,Tabella_prezzi!$A$3:$K$138,6,FALSE)","v":"TS3L6-RAM32"},{"$f":"VLOOKUP(V51,Tabella_prezzi!$A$3:$K$138,9,FALSE)","v":"L6N04-OpzRAM64GB"},{"$f":"VLOOKUP(V51,Tabella_prezzi!$A$3:$K$138,3,FALSE)","v":"OpzRAM64GB"},{"$f":"VLOOKUP(V51,Tabella_prezzi!$A$3:$K$138,4,FALSE)*X51","v":9424},null,"L6N04B",{"$f":"VLOOKUP(T51,Tabella_prezzi!$A$3:$K$138,6,FALSE)","v":"TS3L6-RAM64N"},"L6N04",{"$f":"VLOOKUP(V51,Tabella_prezzi!$A$3:$K$138,6,FALSE)","v":"TS3L6-RAM64"},16]
["1536GB (64GB)","Memory Capacity",null,{"$f":"VLOOKUP(V52,Tabella_prezzi!$A$3:$K$138,8,FALSE)","v":"HPE 64GB (1x64GB) Dual Rank x4 DDR4-2933 CAS-21-21-21 Registered Smart Memory Kit"},null,null,0,{"$f":"\"\"","v":""},{"$f":"\"\"","v":""},null,null,{"$f":"\"\"","v":""},{"$f":"\"\"","v":""},{"$f":"\"\"","v":""},{"$f":"\"\"","v":""},{"$f":"VLOOKUP(V52,Tabella_prezzi!$A$3:$K$138,9,FALSE)","v":"L6N04-OpzRAM64GB"},{"$f":"VLOOKUP(V52,Tabella_prezzi!$A$3:$K$138,3,FALSE)","v":"OpzRAM64GB"},{"$f":"VLOOKUP(V52,Tabella_prezzi!$A$3:$K$138,4,FALSE)*X52","v":12958},null,"L6N04B",{"$f":"VLOOKUP(T52,Tabella_prezzi!$A$3:$K$138,6,FALSE)","v":"TS3L6-RAM64N"},"L6N04",{"$f":"VLOOKUP(V52,Tabella_prezzi!$A$3:$K$138,6,FALSE)","v":"TS3L6-RAM64"},22]
["2048GB (MIX) ","Memory Capacity",null,{"$f":"VLOOKUP(N53,Tabella_prezzi!$A$3:$K$138,8,FALSE)","v":"HPE 32GB (1x32GB) Dual Rank x4 DDR4-2933 CAS-21-21-21 Registered Smart Memory Kit"},null,null,28,{"$f":"VLOOKUP(N53,Tabella_prezzi!$A$3:$K$138,9,FALSE)","v":"L6N03-OpzRAM32GB"},{"$f":"VLOOKUP(N53,Tabella_prezzi!$A$3:$K$138,3,FALSE)","v":"OpzRAM32GB"},{"$f":"VLOOKUP(N53,Tabella_prezzi!$A$3:$K$138,4,FALSE)*G53","v":5152},null,"L6N03B",{"$f":"VLOOKUP(L53,Tabella_prezzi!$A$3:$K$138,6,FALSE)","v":"TS3L6-RAM32N"},"L6N03",{"$f":"VLOOKUP(N53,Tabella_prezzi!$A$3:$K$138,6,FALSE)","v":"TS3L6-RAM32"},{"$f":"VLOOKUP(V53,Tabella_prezzi!$A$3:$K$138,9,FALSE)","v":"L6N04-OpzRAM64GB"},{"$f":"VLOOKUP(V53,Tabella_prezzi!$A$3:$K$138,3,FALSE)","v":"OpzRAM64GB"},{"$f":"VLOOKUP(V53,Tabella_prezzi!$A$3:$K$138,4,FALSE)*X53","v":9424},null,"L6N04B",{"$f":"VLOOKUP(T53,Tabella_prezzi!$A$3:$K$138,6,FALSE)","v":"TS3L6-RAM64N"},"L6N04",{"$f":"VLOOKUP(V53,Tabella_prezzi!$A$3:$K$138,6,FALSE)","v":"TS3L6-RAM64"},16]
["2048GB (64GB)","Memory Capacity",null,{"$f":"VLOOKUP(V54,Tabella_prezzi!$A$3:$K$138,8,FALSE)","v":"HPE 64GB (1x64GB) Dual Rank x4 DDR4-2933 CAS-21-21-21 Registered Smart Memory Kit"},null,null,0,{"$f":"\"\"","v":""},{"$f":"\"\"","v":""},null,null,{"$f":"\"\"","v":""},{"$f":"\"\"","v":""},{"$f":"\"\"","v":""},{"$f":"\"\"","v":""},{"$f":"VLOOKUP(V54,Tabella_prezzi!$A$3:$K$138,9,FALSE)","v":"L6N04-OpzRAM64GB"},{"$f":"VLOOKUP(V54,Tabella_prezzi!$A$3:$K$138,3,FALSE)","v":"OpzRAM64GB"},{"$f":"VLOOKUP(V54,Tabella_prezzi!$A$3:$K$138,4,FALSE)*X54","v":17670},null,"L6N04B",{"$f":"VLOOKUP(T54,Tabella_prezzi!$A$3:$K$138,6,FALSE)","v":"TS3L6-RAM64N"},"L6N04",{"$f":"VLOOKUP(V54,Tabella_prezzi!$A$3:$K$138,6,FALSE)","v":"TS3L6-RAM64"},30]
["3072GB (64GB)","Memory Capacity",null,{"$f":"VLOOKUP(V55,Tabella_prezzi!$A$3:$K$138,8,FALSE)","v":"HPE 64GB (1x64GB) Dual Rank x4 DDR4-2933 CAS-21-21-21 Registered Smart Memory Kit"},null,null,0,{"$f":"\"\"","v":""},{"$f":"\"\"","v":""},null,null,{"$f":"\"\"","v":""},{"$f":"\"\"","v":""},{"$f":"\"\"","v":""},{"$f":"\"\"","v":""},{"$f":"VLOOKUP(V55,Tabella_prezzi!$A$3:$K$138,9,FALSE)","v":"L6N04-OpzRAM64GB"},{"$f":"VLOOKUP(V55,Tabella_prezzi!$A$3:$K$138,3,FALSE)","v":"OpzRAM64GB"},{"$f":"VLOOKUP(V55,Tabella_prezzi!$A$3:$K$138,4,FALSE)*X55","v":27094},null,"L6N04B",{"$f":"VLOOKUP(T55,Tabella_prezzi!$A$3:$K$138,6,FALSE)","v":"TS3L6-RAM64N"},"L6N04",{"$f":"VLOOKUP(V55,Tabella_prezzi!$A$3:$K$138,6,FALSE)","v":"TS3L6-RAM64"},46]
[]
["TS3L6_OS"]
["No Operating System","Operating System",null,null,null,null,0,null,{"$f":"\"\"","v":""},null,null,{"$f":"\"\"","v":""},{"$f":"\"\"","v":""},{"$f":"\"\"","v":""},{"$f":"\"\"","v":""},0,null,{"$f":"\"\"","v":""},{"$f":"\"\"","v":""},null,0,0,0,{"$f":"\"\"","v":""},{"$f":"\"\"","v":""}]
["[TS3L6-WINSRVSTD] Windows Server® 2019 Standard","Operating System",null,{"$f":"VLOOKUP(N59,Tabella_prezzi!$A$3:$K$138,8,FALSE)","v":"Windows Server 2019,Standard,ROK,16CORE (for Distributor sale only)"},null,null,1,{"$f":"VLOOKUP(N59,Tabella_prezzi!$A$3:$K$138,9,FALSE)","v":"L6N23-OpzWinServSTD"},{"$f":"VLOOKUP(N59,Tabella_prezzi!$A$3:$K$138,3,FALSE)","v":"OpzWinServSTD"},{"$f":"VLOOKUP(N59,Tabella_prezzi!$A$3:$K$138,4,FALSE)","v":557},null,"L6N23B",{"$f":"VLOOKUP(L59,Tabella_prezzi!$A$3:$K$138,6,FALSE)","v":"TS3L6-WINSTDN"},"L6N23",{"$f":"VLOOKUP(N59,Tabella_prezzi!$A$3:$K$138,6,FALSE)","v":"TS3L6-WINSTD"},40,{"$f":"VLOOKUP(W59,Tabella_prezzi!$A$3:$K$138,9,FALSE)","v":"L6N26-OpzWinServSTD2core"},{"$f":"VLOOKUP(W59,Tabella_prezzi!$A$3:$K$138,3,FALSE)","v":"OpzWinServSTD2core"},3800,1520,16,"L6N26B","L6N26",{"$f":"VLOOKUP(V59,Tabella_prezzi!$A$3:$K$138,6,FALSE)","v":"TS3L6-WINSRV2CN"},{"$f":"VLOOKUP(W59,Tabella_prezzi!$A$3:$K$138,6,FALSE)","v":"TS3L6-WINSRV2C"}]
["[TS3L6-WINDC] Windows Server® 2019 DataCenter","Operating System",null,{"$f":"VLOOKUP(N60,Tabella_prezzi!$A$3:$K$138,8,FALSE)","v":"Windows Server 2019,DataCtr,ROK,16CORE (for Distributor sale only)"},null,null,1,{"$f":"VLOOKUP(N60,Tabella_prezzi!$A$3:$K$138,9,FALSE)","v":"L6N27-OpzWinServDC"},{"$f":"VLOOKUP(N60,Tabella_prezzi!$A$3:$K$138,3,FALSE)","v":"OpzWinServDC"},{"$f":"VLOOKUP(N60,Tabella_prezzi!$A$3:$K$138,4,FALSE)","v":2228},null,"L6N27B",{"$f":"VLOOKUP(L60,Tabella_prezzi!$A$3:$K$138,6,FALSE)","v":"TS3L6-WINDCN"},"L6N27",{"$f":"VLOOKUP(N60,Tabella_prezzi!$A$3:$K$138,6,FALSE)","v":"TS3L6-WINDC"},40,{"$f":"VLOOKUP(W60,Tabella_prezzi!$A$3:$K$138,9,FALSE)","v":"L6N28-OpzWinServDC2core"},{"$f":"VLOOKUP(W60,Tabella_prezzi!$A$3:$K$138,3,FALSE)","v":"OpzWinServDC2core"},16480,6592,16,"L6N28B","L6N28",{"$f":"VLOOKUP(V60,Tabella_prezzi!$A$3:$K$138,6,FALSE)","v":"TS3L6-WINDC2CN"},{"$f":"VLOOKUP(W60,Tabella_prezzi!$A$3:$K$138,6,FALSE)","v":"TS3L6-WINDC2C"}]
["[TS3L6-LINUX] Ubuntu 18.04 LTS 64 Bit","Operating System",null,{"$f":"VLOOKUP(N61,Tabella_prezzi!$A$3:$K$138,8,FALSE)","v":"Ubuntu 20.04 LTS 64 Bit"},null,null,1,{"$f":"VLOOKUP(N61,Tabella_prezzi!$A$3:$K$138,9,FALSE)","v":"L6N29-OpzOpenSource"},{"$f":"VLOOKUP(N61,Tabella_prezzi!$A$3:$K$138,3,FALSE)","v":"OpzOpenSource"},{"$f":"VLOOKUP(N61,Tabella_prezzi!$A$3:$K$138,4,FALSE)","v":51},null,"L6N29B",{"$f":"VLOOKUP(L61,Tabella_prezzi!$A$3:$K$138,6,FALSE)","v":"TS3L6-LINUXN"},"L6N29",{"$f":"VLOOKUP(N61,Tabella_prezzi!$A$3:$K$138,6,FALSE)","v":"TS3L6-LINUX"},0,null,{"$f":"\"\"","v":""},{"$f":"\"\"","v":""},null,0,0,0,{"$f":"\"\"","v":""},{"$f":"\"\"","v":""}]
[]
["TS3L6_HDD"]
[{"$f":"\"\"","v":""},null,null,null,null,null,{"$f":"\"\"","v":""},null,{"$f":"\"\"","v":""},null,null,{"$f":"\"\"","v":""},{"$f":"\"\"","v":""},{"$f":"\"\"","v":""},{"$f":"\"\"","v":""}]
["HPE 300GB SAS 12G Enterprise 10K SFF (2.5in) SC","Hard Drives",null,{"$f":"VLOOKUP(N65,Tabella_prezzi!$A$3:$K$138,8,FALSE)","v":"HPE 300GB SAS 12G Enterprise 10K SFF (2.5in) SC 3yr Wty Digitally Signed Firmware HDD"},null,null,1,{"$f":"VLOOKUP(N65,Tabella_prezzi!$A$3:$K$138,9,FALSE)","v":"L6N12-OpzHDD300GB"},{"$f":"VLOOKUP(N65,Tabella_prezzi!$A$3:$K$138,3,FALSE)","v":"OpzHDD300GB"},{"$f":"VLOOKUP(N65,Tabella_prezzi!$A$3:$K$138,4,FALSE)","v":87},null,"L6N12B",{"$f":"VLOOKUP(L65,Tabella_prezzi!$A$3:$K$138,6,FALSE)","v":"TS3L6-HDD300GBN"},"L6N12",{"$f":"VLOOKUP(N65,Tabella_prezzi!$A$3:$K$138,6,FALSE)","v":"TS3L6-HDD300GB"}]
["HPE 1.2TB SAS 12G Enterprise 10K SFF (2.5in) SC","Hard Drives",null,{"$f":"VLOOKUP(N66,Tabella_prezzi!$A$3:$K$138,8,FALSE)","v":"HPE 1.2TB SAS 12G Enterprise 10K SFF (2.5in) SC 3yr Wty Digitally Signed Firmware HDD"},null,null,1,{"$f":"VLOOKUP(N66,Tabella_prezzi!$A$3:$K$138,9,FALSE)","v":"L6N11-OpzHDD1TB"},{"$f":"VLOOKUP(N66,Tabella_prezzi!$A$3:$K$138,3,FALSE)","v":"OpzHDD1TB"},{"$f":"VLOOKUP(N66,Tabella_prezzi!$A$3:$K$138,4,FALSE)","v":136},null,"L6N11B",{"$f":"VLOOKUP(L66,Tabella_prezzi!$A$3:$K$138,6,FALSE)","v":"TS3L6-HDD1TBN"},"L6N11",{"$f":"VLOOKUP(N66,Tabella_prezzi!$A$3:$K$138,6,FALSE)","v":"TS3L6-HDD1TB"}]
["HPE 1.8TB SAS 12G Enterprise 10K SFF (2.5in) SC","Hard Drives",null,{"$f":"VLOOKUP(N67,Tabella_prezzi!$A$3:$K$138,8,FALSE)","v":"HPE 1.8TB SAS 12G Enterprise 10K SFF (2.5in) SC 3yr Wty 512e Digitally Signed Firmware HDD"},null,null,1,{"$f":"VLOOKUP(N67,Tabella_prezzi!$A$3:$K$138,9,FALSE)","v":"L6N10-OpzHDD2TB"},{"$f":"VLOOKUP(N67,Tabella_prezzi!$A$3:$K$138,3,FALSE)","v":"OpzHDD2TB"},{"$f":"VLOOKUP(N67,Tabella_prezzi!$A$3:$K$138,4,FALSE)","v":189},null,"L6N10B",{"$f":"VLOOKUP(L67,Tabella_prezzi!$A$3:$K$138,6,FALSE)","v":"TS3L6-HDD2TBN"},"L6N10",{"$f":"VLOOKUP(N67,Tabella_prezzi!$A$3:$K$138,6,FALSE)","v":"TS3L6-HDD2TB"}]
["HPE 960GB SAS 12G Read Intensive SFF (2.5in) SC","Hard Drives",null,{"$f":"VLOOKUP(N68,Tabella_prezzi!$A$3:$K$138,8,FALSE)","v":"HPE 960GB SAS 12G Read Intensive SFF (2.5in) SC 3yr Wty Value SAS Digitally Signed Firmware SSD"},null,null,1,{"$f":"VLOOKUP(N68,Tabella_prezzi!$A$3:$K$138,9,FALSE)","v":"L6N15-OpzSSD-RI800GB"},{"$f":"VLOOKUP(N68,Tabella_prezzi!$A$3:$K$138,3,FALSE)","v":"OpzSSD-RI800GB"},{"$f":"VLOOKUP(N68,Tabella_prezzi!$A$3:$K$138,4,FALSE)","v":461},null,"L6N15B",{"$f":"VLOOKUP(L68,Tabella_prezzi!$A$3:$K$138,6,FALSE)","v":"TS3L6-RI800GBN"},"L6N15",{"$f":"VLOOKUP(N68,Tabella_prezzi!$A$3:$K$138,6,FALSE)","v":"TS3L6-RI800GB"}]
["HPE 1.92TB SAS 12G Read Intensive SFF (2.5in) SC","Hard Drives",null,{"$f":"VLOOKUP(N69,Tabella_prezzi!$A$3:$K$138,8,FALSE)","v":"HPE 1.92TB SAS 12G Read Intensive SFF (2.5in) SC 3yr Wty Value SAS Digitally Signed Firmware SSD"},null,null,1,{"$f":"VLOOKUP(N69,Tabella_prezzi!$A$3:$K$138,9,FALSE)","v":"L6N13-OpzSSD-RI1,6TB"},{"$f":"VLOOKUP(N69,Tabella_prezzi!$A$3:$K$138,3,FALSE)","v":"OpzSSD-RI1,6TB"},{"$f":"VLOOKUP(N69,Tabella_prezzi!$A$3:$K$138,4,FALSE)","v":714},null,"L6N13B",{"$f":"VLOOKUP(L69,Tabella_prezzi!$A$3:$K$138,6,FALSE)","v":"TS3L6-RI1600GBN"},"L6N13",{"$f":"VLOOKUP(N69,Tabella_prezzi!$A$3:$K$138,6,FALSE)","v":"TS3L6-RI1600GB"}]
["HPE 400GB SAS 12G Mixed Use SFF (2.5in) SC","Hard Drives",null,{"$f":"VLOOKUP(N70,Tabella_prezzi!$A$3:$K$138,8,FALSE)","v":"HPE 400GB SAS 12G Mixed Use SFF (2.5in) SC 3yr Wty Digitally Signed Firmware SSD"},null,null,1,{"$f":"VLOOKUP(N70,Tabella_prezzi!$A$3:$K$138,9,FALSE)","v":"L6N17-OpzSSD-RI400GB"},{"$f":"VLOOKUP(N70,Tabella_prezzi!$A$3:$K$138,3,FALSE)","v":"OpzSSD-RI400GB"},{"$f":"VLOOKUP(N70,Tabella_prezzi!$A$3:$K$138,4,FALSE)","v":397},null,"L6N17B",{"$f":"VLOOKUP(L70,Tabella_prezzi!$A$3:$K$138,6,FALSE)","v":"TS3L6-RI400GBN"},"L6N17",{"$f":"VLOOKUP(N70,Tabella_prezzi!$A$3:$K$138,6,FALSE)","v":"TS3L6-RI400GB"}]
["HPE 800GB SAS 12G Mixed Use SFF (2.5in) SC","Hard Drives",null,{"$f":"VLOOKUP(N71,Tabella_prezzi!$A$3:$K$138,8,FALSE)","v":"HPE 800GB SAS 12G Mixed Use SFF (2.5in) SC 3yr Wty SSD"},null,null,1,{"$f":"VLOOKUP(N71,Tabella_prezzi!$A$3:$K$138,9,FALSE)","v":"L6N16-OpzSSD-MU800GB"},{"$f":"VLOOKUP(N71,Tabella_prezzi!$A$3:$K$138,3,FALSE)","v":"OpzSSD-MU800GB"},{"$f":"VLOOKUP(N71,Tabella_prezzi!$A$3:$K$138,4,FALSE)","v":576},null,"L6N16B",{"$f":"VLOOKUP(L71,Tabella_prezzi!$A$3:$K$138,6,FALSE)","v":"TS3L6-MU800GBN"},"L6N16",{"$f":"VLOOKUP(N71,Tabella_prezzi!$A$3:$K$138,6,FALSE)","v":"TS3L6-MU800GB"}]
["HPE 1.6TB SAS 12G Mixed Use SFF (2.5in) SC","Hard Drives",null,{"$f":"VLOOKUP(N72,Tabella_prezzi!$A$3:$K$138,8,FALSE)","v":"HPE 1.6TB SAS 12G Mixed Use SFF (2.5in) SC 3yr Wty SSD"},null,null,1,{"$f":"VLOOKUP(N72,Tabella_prezzi!$A$3:$K$138,9,FALSE)","v":"L6N14-OpzSSD-MU1,6TB"},{"$f":"VLOOKUP(N72,Tabella_prezzi!$A$3:$K$138,3,FALSE)","v":"OpzSSD-MU1,6TB"},{"$f":"VLOOKUP(N72,Tabella_prezzi!$A$3:$K$138,4,FALSE)","v":878},null,"L6N14B",{"$f":"VLOOKUP(L72,Tabella_prezzi!$A$3:$K$138,6,FALSE)","v":"TS3L6-MU1600GBN"},"L6N14",{"$f":"VLOOKUP(N72,Tabella_prezzi!$A$3:$K$138,6,FALSE)","v":"TS3L6-MU1600GB"}]
["HPE 800GB NVMe x4 Lanes Mixed Use SFF (2.5in) SCN","Hard Drives",null,{"$f":"VLOOKUP(N73,Tabella_prezzi!$A$3:$K$138,8,FALSE)","v":"HPE 800GB NVMe x4 Lanes Mixed Use SFF (2.5in) SCN 3yr Wty Digitally Signed Firmware SSD"},null,null,1,{"$f":"VLOOKUP(N73,Tabella_prezzi!$A$3:$K$138,9,FALSE)","v":0},{"$f":"VLOOKUP(N73,Tabella_prezzi!$A$3:$K$138,3,FALSE)","v":"OpzNVME800GB"},{"$f":"VLOOKUP(N73,Tabella_prezzi!$A$3:$K$138,4,FALSE)","v":1219},null,"L6N19B",{"$f":"VLOOKUP(L73,Tabella_prezzi!$A$3:$K$138,6,FALSE)","v":"TS3L6-NVME800N"},"L6N19",{"$f":"VLOOKUP(N73,Tabella_prezzi!$A$3:$K$138,6,FALSE)","v":"TS3L6-NVME800"}]
["HPE 1.6TB NVMe x4 Lanes Mixed Use SFF (2.5in) SCN","Hard Drives",null,{"$f":"VLOOKUP(N74,Tabella_prezzi!$A$3:$K$138,8,FALSE)","v":"HPE 1.6TB NVMe x4 Lanes Mixed Use SFF (2.5in) SCN 3yr Wty Digitally Signed Firmware SSD"},null,null,1,{"$f":"VLOOKUP(N74,Tabella_prezzi!$A$3:$K$138,9,FALSE)","v":0},{"$f":"VLOOKUP(N74,Tabella_prezzi!$A$3:$K$138,3,FALSE)","v":"OpzNVME1,6TB"},{"$f":"VLOOKUP(N74,Tabella_prezzi!$A$3:$K$138,4,FALSE)","v":1950},null,"L6N18B",{"$f":"VLOOKUP(L74,Tabella_prezzi!$A$3:$K$138,6,FALSE)","v":"TS3L6-NVME1600N"},"L6N18",{"$f":"VLOOKUP(N74,Tabella_prezzi!$A$3:$K$138,6,FALSE)","v":"TS3L6-NVME1600"}]
[]
["Cavo “patch” di 3 mt RJ45 certificato per gigabit ethernet",null,null,{"$f":"VLOOKUP(N76,Tabella_prezzi!$A$3:$K$138,8,FALSE)","v":"Cavo “patch” di 3 mt RJ45 certificato per gigabit ethernet"},null,null,{"$f":"\"\"","v":""},{"$f":"VLOOKUP(N76,Tabella_prezzi!$A$3:$K$138,9,FALSE)","v":"TS3-OpzA20RJ45"},{"$f":"VLOOKUP(N76,Tabella_prezzi!$A$3:$K$138,3,FALSE)","v":"OpzRJ45 3m"},null,{"$f":"VLOOKUP(N76,Tabella_prezzi!$A$3:$K$138,4,FALSE)","v":3},"L6N34B",{"$f":"VLOOKUP(L76,Tabella_prezzi!$A$3:$K$138,6,FALSE)","v":"TS3L6-RJ453MN"},"L6N34",{"$f":"VLOOKUP(N76,Tabella_prezzi!$A$3:$K$138,6,FALSE)","v":"TS3L6-RJ453M"}]
[]
[]
["TS3L6_WARRANTY"]
["Manutenzione in garanzia (36 mesi)",null,null,"RESTRICTED:ProSupport One Data Center and Next Business Day Onsite Service Volume Low, 39 Month(s)",null,null,{"$f":"\"\"","v":""},null,{"$f":"\"\"","v":""},null,null,{"$f":"\"\"","v":""},{"$f":"\"\"","v":""},{"$f":"\"\"","v":""},{"$f":"\"\"","v":""}]
["[TS3L6-5Y] Manutenzione in garanzia (60 mesi)",null,null,{"$f":"VLOOKUP(N81,Tabella_prezzi!$A$3:$K$138,8,FALSE)","v":"Estensione della manutenzione in garanzia per ulteriori 24 mesi"},null,null,1,{"$f":"VLOOKUP(N81,Tabella_prezzi!$A$3:$K$333,9,FALSE)","v":"L6N31-OpzEstensione24"},{"$f":"VLOOKUP(N81,Tabella_prezzi!$A$3:$K$333,3,FALSE)","v":"OpzEstensione24"},{"$f":"VLOOKUP(N81,Tabella_prezzi!$A$3:$K$333,4,FALSE)","v":558},null,"L6N31B",{"$f":"VLOOKUP(L81,Tabella_prezzi!$A$3:$K$138,6,FALSE)","v":"TS3L6-5YN"},"L6N31",{"$f":"VLOOKUP(N81,Tabella_prezzi!$A$3:$K$138,6,FALSE)","v":"TS3L6-5Y"}]
[]
["TS3L6_ILO"]
["None",null,null,null,null,null,{"$f":"\"\"","v":""},null,{"$f":"\"\"","v":""},null,null,{"$f":"\"\"","v":""},{"$f":"\"\"","v":""},{"$f":"\"\"","v":""},{"$f":"\"\"","v":""}]
["[TS3L6-OV3YILO] HPE OneView Advanced with iLO Advanced",null,null,{"$f":"VLOOKUP(N85,Tabella_prezzi!$A$3:$K$138,8,FALSE)","v":"HPE OV 3yr 24x7 Supp Phys 1 Svr Lic"},null,null,1,{"$f":"VLOOKUP(N85,Tabella_prezzi!$A$3:$K$333,9,FALSE)","v":"TS3-OpzA20ILO"},{"$f":"VLOOKUP(N85,Tabella_prezzi!$A$3:$K$333,3,FALSE)","v":0},null,{"$f":"VLOOKUP(N85,Tabella_prezzi!$A$3:$K$333,4,FALSE)","v":480},"L6N35B",{"$f":"VLOOKUP(L85,Tabella_prezzi!$A$3:$K$138,6,FALSE)","v":"TS3L6-OV3YILON"},"L6N35",{"$f":"VLOOKUP(N85,Tabella_prezzi!$A$3:$K$138,6,FALSE)","v":"TS3L6-OV3YILO"}]
[]
["TS3L6_USB32"]
["None",null,null,null,null,null,{"$f":"\"\"","v":""},null,{"$f":"\"\"","v":""},null,null,{"$f":"\"\"","v":""},{"$f":"\"\"","v":""},{"$f":"\"\"","v":""},{"$f":"\"\"","v":""}]
["[TS3L6-DUAL32GB] HPE 32GB Dual microSD RAID 1 USB Boot Drive",null,null,{"$f":"VLOOKUP(N89,Tabella_prezzi!$A$3:$K$138,8,FALSE)","v":"HPE 32GB Dual microSD RAID 1 USB Boot Drive"},null,null,1,{"$f":"VLOOKUP(N89,Tabella_prezzi!$A$3:$K$333,9,FALSE)","v":"TS3-OpzA20D32GB"},{"$f":"VLOOKUP(N89,Tabella_prezzi!$A$3:$K$333,3,FALSE)","v":0},null,{"$f":"VLOOKUP(N89,Tabella_prezzi!$A$3:$K$333,4,FALSE)","v":250},"L6N50B",{"$f":"VLOOKUP(L89,Tabella_prezzi!$A$3:$K$138,6,FALSE)","v":"TS3L6-DUAL32GBN"},"L6N50",{"$f":"VLOOKUP(N89,Tabella_prezzi!$A$3:$K$138,6,FALSE)","v":"TS3L6-DUAL32GB"}]
[]
["TS3L6_KYHDD"]
[{"$f":"\"\"","v":""},null,null,null,null,null,{"$f":"\"\"","v":""},null,{"$f":"\"\"","v":""},null,null,{"$f":"\"\"","v":""},{"$f":"\"\"","v":""},{"$f":"\"\"","v":""},{"$f":"\"\"","v":""}]
["Hard Disk Retention",null,null,{"$f":"VLOOKUP(N93,Tabella_prezzi!$A$3:$K$138,8,FALSE)","v":"Hard Disk Retention 36m"},null,null,1,{"$f":"VLOOKUP(N93,Tabella_prezzi!$A$3:$K$333,9,FALSE)","v":"L6N30-OpzHDDRetention"},{"$f":"VLOOKUP(N93,Tabella_prezzi!$A$3:$K$333,3,FALSE)","v":"OpzHDDRetention"},{"$f":"VLOOKUP(N93,Tabella_prezzi!$A$3:$K$333,4,FALSE)","v":446},null,"L6N30B",{"$f":"VLOOKUP(L93,Tabella_prezzi!$A$3:$K$138,6,FALSE)","v":"TS3L6-HDRTNN"},"L6N30",{"$f":"VLOOKUP(N93,Tabella_prezzi!$A$3:$K$138,6,FALSE)","v":"TS3L6-HDRTN"}]
["Hard Disk Retention (60 mesi)",null,null,{"$f":"VLOOKUP(N94,Tabella_prezzi!$A$3:$K$138,8,FALSE)","v":"Hard Disk Retention 60m"},null,null,1,{"$f":"VLOOKUP(N94,Tabella_prezzi!$A$3:$K$333,9,FALSE)","v":"L6N33-OpzHDDRetention60"},{"$f":"VLOOKUP(N94,Tabella_prezzi!$A$3:$K$333,3,FALSE)","v":"OpzHDDRetention"},{"$f":"VLOOKUP(N94,Tabella_prezzi!$A$3:$K$333,4,FALSE)","v":743},null,"L6N33B",{"$f":"VLOOKUP(L94,Tabella_prezzi!$A$3:$K$138,6,FALSE)","v":"TS3L6-HDRTN60N"},"L6N33",{"$f":"VLOOKUP(N94,Tabella_prezzi!$A$3:$K$138,6,FALSE)","v":"TS3L6-HDRTN60"}]
[]
["HPE DL5x0 Gen10 12Gb SAS Expander Card Kit with Cables",null,null,null,null,null,{"$f":"\"\"","v":""},null,null,0,0,null,"TS3L6-SASBAY1N",null,"TS3L6-SASBAY1"]
[]
["TS3L6_PCI_A"]
[{"$f":"\"\"","v":""},null,null,null,null,null,{"$f":"\"\"","v":""},null,{"$f":"\"\"","v":""},null,null,{"$f":"\"\"","v":""},{"$f":"\"\"","v":""},{"$f":"\"\"","v":""},{"$f":"\"\"","v":""}]
["[TS3L6-LAN1] HPE Ethernet 1Gb 2-port 332T Adapter",null,null,{"$f":"VLOOKUP(N100,Tabella_prezzi!$A$3:$K$138,8,FALSE)","v":"HPE Ethernet 1Gb 2-port 332T Adapter"},null,null,1,{"$f":"VLOOKUP(N100,Tabella_prezzi!$A$3:$K$138,9,FALSE)","v":"L6N05-OpzGigabit"},{"$f":"VLOOKUP(N100,Tabella_prezzi!$A$3:$K$138,3,FALSE)","v":"OpzGigabit"},{"$f":"VLOOKUP(N100,Tabella_prezzi!$A$3:$K$138,4,FALSE)","v":25},null,"L6N05B",{"$f":"VLOOKUP(L100,Tabella_prezzi!$A$3:$K$138,6,FALSE)","v":"TS3L6-LAN1N"},"L6N05",{"$f":"VLOOKUP(N100,Tabella_prezzi!$A$3:$K$138,6,FALSE)","v":"TS3L6-LAN1"}]
["[TS3L6-LAN10] HPE Ethernet 10Gb 2-port 548SFP+ Adapter",null,null,{"$f":"VLOOKUP(N101,Tabella_prezzi!$A$3:$K$138,8,FALSE)","v":"HPE Ethernet 10Gb 2-port 548SFP+ Adapter"},null,null,1,{"$f":"VLOOKUP(N101,Tabella_prezzi!$A$3:$K$138,9,FALSE)","v":"L6N06-OpzGigabit10Gbps"},{"$f":"VLOOKUP(N101,Tabella_prezzi!$A$3:$K$138,3,FALSE)","v":"OpzGigabit10Gbps"},{"$f":"VLOOKUP(N101,Tabella_prezzi!$A$3:$K$138,4,FALSE)","v":218},null,"L6N06B",{"$f":"VLOOKUP(L101,Tabella_prezzi!$A$3:$K$138,6,FALSE)","v":"TS3L6-LAN10N"},"L6N06",{"$f":"VLOOKUP(N101,Tabella_prezzi!$A$3:$K$138,6,FALSE)","v":"TS3L6-LAN10"}]
["[TS3L6-LAN25] HPE Ethernet 10/25Gb 2-port 640SFP28 Adapter",null,null,{"$f":"VLOOKUP(N102,Tabella_prezzi!$A$3:$K$138,8,FALSE)","v":"HPE Ethernet 10/25Gb 2-port 640SFP28 Adapter"},null,null,1,{"$f":"VLOOKUP(N102,Tabella_prezzi!$A$3:$K$138,9,FALSE)","v":"L6N07-OpzGigabit25Gbps"},{"$f":"VLOOKUP(N102,Tabella_prezzi!$A$3:$K$138,3,FALSE)","v":"OpzGigabit25Gbps"},{"$f":"VLOOKUP(N102,Tabella_prezzi!$A$3:$K$138,4,FALSE)","v":669},null,"L6N07B",{"$f":"VLOOKUP(L102,Tabella_prezzi!$A$3:$K$138,6,FALSE)","v":"TS3L6-LAN25N"},"L6N07",{"$f":"VLOOKUP(N102,Tabella_prezzi!$A$3:$K$138,6,FALSE)","v":"TS3L6-LAN25"}]
["[TS3L6-CNA10] HPE StoreFabric CN1300R 10/25Gb Dual Port Converged Network Adapter",null,null,{"$f":"VLOOKUP(N103,Tabella_prezzi!$A$3:$K$138,8,FALSE)","v":"HPE StoreFabric CN1300R 10/25Gb Dual Port Converged Network Adapter"},null,null,1,{"$f":"VLOOKUP(N103,Tabella_prezzi!$A$3:$K$138,9,FALSE)","v":"L6N08-OpzCNA10Gbps"},{"$f":"VLOOKUP(N103,Tabella_prezzi!$A$3:$K$138,3,FALSE)","v":"OpzGigabit10Gbps CNA"},{"$f":"VLOOKUP(N103,Tabella_prezzi!$A$3:$K$138,4,FALSE)","v":402},null,"L6N08B",{"$f":"VLOOKUP(L103,Tabella_prezzi!$A$3:$K$138,6,FALSE)","v":"TS3L6-CNA10N"},"L6N08",{"$f":"VLOOKUP(N103,Tabella_prezzi!$A$3:$K$138,6,FALSE)","v":"TS3L6-CNA10"}]
["[TS3L6-FC16] HPE StoreFabric SN1100Q 16Gb Dual Port Fibre Channel Host Bus Adapter",null,null,{"$f":"VLOOKUP(N104,Tabella_prezzi!$A$3:$K$138,8,FALSE)","v":"HPE StoreFabric SN1100Q 16Gb Dual Port Fibre Channel Host Bus Adapter"},null,null,1,{"$f":"VLOOKUP(N104,Tabella_prezzi!$A$3:$K$138,9,FALSE)","v":"L6N09-OpzFibreChannel"},{"$f":"VLOOKUP(N104,Tabella_prezzi!$A$3:$K$138,3,FALSE)","v":"OpzFibreChannel"},{"$f":"VLOOKUP(N104,Tabella_prezzi!$A$3:$K$138,4,FALSE)","v":325},null,"L6N09B",{"$f":"VLOOKUP(L104,Tabella_prezzi!$A$3:$K$138,6,FALSE)","v":"TS3L6-FC16N"},"L6N09",{"$f":"VLOOKUP(N104,Tabella_prezzi!$A$3:$K$138,6,FALSE)","v":"TS3L6-FC16"}]
["-=-=-=-=-=-=-=-=-=-=-=-=-=-=-=-=-20%-=-=-=-=-=-=-=-=-=-=-=-=-=-=-=-=-"]
["[TS3L6-CTRL-P] HPE Smart Array Controller PCIe per Software Defined Storage",null,null,{"$f":"VLOOKUP(N106,Tabella_prezzi!$A$3:$K$138,8,FALSE)","v":"HPE Smart Array Controller PCIe per Software Defined Storage"},null,null,1,{"$f":"VLOOKUP(N106,Tabella_prezzi!$A$3:$K$138,9,FALSE)","v":"TS3-OpzA20CTRLP"},{"$f":"VLOOKUP(N106,Tabella_prezzi!$A$3:$K$138,3,FALSE)","v":0},null,{"$f":"VLOOKUP(N106,Tabella_prezzi!$A$3:$K$138,4,FALSE)","v":196},"L6N57B",{"$f":"VLOOKUP(L106,Tabella_prezzi!$A$3:$K$138,6,FALSE)","v":"TS3L6-CTRL-PN"},"L6N57",{"$f":"VLOOKUP(N106,Tabella_prezzi!$A$3:$K$138,6,FALSE)","v":"TS3L6-CTRL-P"}]
["[TS3L6-CTRL-E] HPE Smart Array Controller PCIe per Disk Enclosure esterno",null,null,{"$f":"VLOOKUP(N107,Tabella_prezzi!$A$3:$K$138,8,FALSE)","v":"HPE Smart Array Controller PCIe per Disk Enclosure esterno"},null,null,1,{"$f":"VLOOKUP(N107,Tabella_prezzi!$A$3:$K$138,9,FALSE)","v":"TS3-OpzA20CTRLE"},{"$f":"VLOOKUP(N107,Tabella_prezzi!$A$3:$K$138,3,FALSE)","v":0},null,{"$f":"VLOOKUP(N107,Tabella_prezzi!$A$3:$K$138,4,FALSE)","v":235},"L6N52B",{"$f":"VLOOKUP(L107,Tabella_prezzi!$A$3:$K$138,6,FALSE)","v":"TS3L6-CTRL-EN"},"L6N52",{"$f":"VLOOKUP(N107,Tabella_prezzi!$A$3:$K$138,6,FALSE)","v":"TS3L6-CTRL-E"}]
["[TS3L6-CTRL-OS] HPE Controller PCIe OS Boot Device Raid1 2x480GB NVMe M.2 SSD",null,null,{"$f":"VLOOKUP(N108,Tabella_prezzi!$A$3:$K$138,8,FALSE)","v":"HPE Controller PCIe OS Boot Device Raid1 2x480GB NVMe M.2 SSD"},null,null,1,{"$f":"VLOOKUP(N108,Tabella_prezzi!$A$3:$K$138,9,FALSE)","v":"TS3-OpzA20CTRLOS"},{"$f":"VLOOKUP(N108,Tabella_prezzi!$A$3:$K$138,3,FALSE)","v":0},null,{"$f":"VLOOKUP(N108,Tabella_prezzi!$A$3:$K$138,4,FALSE)","v":484},"L6N51B",{"$f":"VLOOKUP(L108,Tabella_prezzi!$A$3:$K$138,6,FALSE)","v":"TS3L6-CTRL-OSN"},"L6N51",{"$f":"VLOOKUP(N108,Tabella_prezzi!$A$3:$K$138,6,FALSE)","v":"TS3L6-CTRL-OS"}]
["[TS3L6-LAN10T] HPE Ethernet 10Gb 2-port BASE-T BCM57416 Adapter",null,null,{"$f":"VLOOKUP(N109,Tabella_prezzi!$A$3:$K$138,8,FALSE)","v":"HPE Ethernet 10Gb 2-port BASE-T BCM57416 Adapter"},null,null,1,{"$f":"VLOOKUP(N109,Tabella_prezzi!$A$3:$K$138,9,FALSE)","v":"TS3-OpzA2010GBT"},{"$f":"VLOOKUP(N109,Tabella_prezzi!$A$3:$K$138,3,FALSE)","v":0},null,{"$f":"VLOOKUP(N109,Tabella_prezzi!$A$3:$K$138,4,FALSE)","v":298},"L6N64B",{"$f":"VLOOKUP(L109,Tabella_prezzi!$A$3:$K$301,6,FALSE)","v":"TS3L6-LAN10T"},"L6N64",{"$f":"VLOOKUP(N109,Tabella_prezzi!$A$3:$K$138,6,FALSE)","v":"TS3L6-LAN10T"}]
["[TS3L6-X710SFP] HPE Ethernet 10Gb 2-port SFP+ X710-DA2 Adapter",null,null,{"$f":"VLOOKUP(N110,Tabella_prezzi!$A$3:$K$138,8,FALSE)","v":"HPE Ethernet 10Gb 2-port SFP+ X710-DA2 Adapter"},null,null,1,{"$f":"VLOOKUP(N110,Tabella_prezzi!$A$3:$K$138,9,FALSE)","v":"TS3-OpzX710SFP"},{"$f":"VLOOKUP(N110,Tabella_prezzi!$A$3:$K$138,3,FALSE)","v":0},null,{"$f":"VLOOKUP(N110,Tabella_prezzi!$A$3:$K$138,4,FALSE)","v":380},"L6N63B",{"$f":"VLOOKUP(L110,Tabella_prezzi!$A$3:$K$301,6,FALSE)","v":"TS3L6-X710SFPN"},"L6N63",{"$f":"VLOOKUP(N110,Tabella_prezzi!$A$3:$K$138,6,FALSE)","v":"TS3L6-X710SFP"}]
["[TS3L6-OP101] HPE 100Gb 1-port OP101 QSFP28 x16 PCIe Gen3 Intel Omni-Path Architecture",null,null,{"$f":"VLOOKUP(N111,Tabella_prezzi!$A$3:$K$138,8,FALSE)","v":"HPE 100Gb 1-port OP101 QSFP28 x16 PCIe Gen3 with Intel Omni-Path Architecture Adapter"},null,null,1,{"$f":"VLOOKUP(N111,Tabella_prezzi!$A$3:$K$138,9,FALSE)","v":"TS3-OpzA20OP101"},{"$f":"VLOOKUP(N111,Tabella_prezzi!$A$3:$K$138,3,FALSE)","v":0},null,{"$f":"VLOOKUP(N111,Tabella_prezzi!$A$3:$K$138,4,FALSE)","v":498},"L6N37B",{"$f":"VLOOKUP(L111,Tabella_prezzi!$A$3:$K$138,6,FALSE)","v":"TS3L6-OP101N"},"L6N37",{"$f":"VLOOKUP(N111,Tabella_prezzi!$A$3:$K$138,6,FALSE)","v":"TS3L6-OP101"}]
[]
["TS3L6_PCI_B GPU"]
[{"$f":"\"\"","v":""},null,null,null,null,null,{"$f":"\"\"","v":""},null,{"$f":"\"\"","v":""},null,null,{"$f":"\"\"","v":""},{"$f":"\"\"","v":""},{"$f":"\"\"","v":""},{"$f":"\"\"","v":""}]
["[TS3L6-LAN1] HPE Ethernet 1Gb 2-port 332T Adapter",null,null,{"$f":"VLOOKUP(N115,Tabella_prezzi!$A$3:$K$138,8,FALSE)","v":"HPE Ethernet 1Gb 2-port 332T Adapter"},null,null,1,{"$f":"VLOOKUP(N115,Tabella_prezzi!$A$3:$K$138,9,FALSE)","v":"L6N05-OpzGigabit"},{"$f":"VLOOKUP(N115,Tabella_prezzi!$A$3:$K$138,3,FALSE)","v":"OpzGigabit"},{"$f":"VLOOKUP(N115,Tabella_prezzi!$A$3:$K$138,4,FALSE)","v":25},null,"L6N05B",{"$f":"VLOOKUP(L115,Tabella_prezzi!$A$3:$K$138,6,FALSE)","v":"TS3L6-LAN1N"},"L6N05",{"$f":"VLOOKUP(N115,Tabella_prezzi!$A$3:$K$138,6,FALSE)","v":"TS3L6-LAN1"}]
["[TS3L6-LAN10] HPE Ethernet 10Gb 2-port 548SFP+ Adapter",null,null,{"$f":"VLOOKUP(N116,Tabella_prezzi!$A$3:$K$138,8,FALSE)","v":"HPE Ethernet 10Gb 2-port 548SFP+ Adapter"},null,null,1,{"$f":"VLOOKUP(N116,Tabella_prezzi!$A$3:$K$138,9,FALSE)","v":"L6N06-OpzGigabit10Gbps"},{"$f":"VLOOKUP(N116,Tabella_prezzi!$A$3:$K$138,3,FALSE)","v":"OpzGigabit10Gbps"},{"$f":"VLOOKUP(N116,Tabella_prezzi!$A$3:$K$138,4,FALSE)","v":218},null,"L6N06B",{"$f":"VLOOKUP(L116,Tabella_prezzi!$A$3:$K$138,6,FALSE)","v":"TS3L6-LAN10N"},"L6N06",{"$f":"VLOOKUP(N116,Tabella_prezzi!$A$3:$K$138,6,FALSE)","v":"TS3L6-LAN10"}]
["[TS3L6-LAN25] HPE Ethernet 10/25Gb 2-port 640SFP28 Adapter",null,null,{"$f":"VLOOKUP(N117,Tabella_prezzi!$A$3:$K$138,8,FALSE)","v":"HPE Ethernet 10/25Gb 2-port 640SFP28 Adapter"},null,null,1,{"$f":"VLOOKUP(N117,Tabella_prezzi!$A$3:$K$138,9,FALSE)","v":"L6N07-OpzGigabit25Gbps"},{"$f":"VLOOKUP(N117,Tabella_prezzi!$A$3:$K$138,3,FALSE)","v":"OpzGigabit25Gbps"},{"$f":"VLOOKUP(N117,Tabella_prezzi!$A$3:$K$138,4,FALSE)","v":669},null,"L6N07B",{"$f":"VLOOKUP(L117,Tabella_prezzi!$A$3:$K$138,6,FALSE)","v":"TS3L6-LAN25N"},"L6N07",{"$f":"VLOOKUP(N117,Tabella_prezzi!$A$3:$K$138,6,FALSE)","v":"TS3L6-LAN25"}]
["[TS3L6-CNA10] HPE StoreFabric CN1300R 10/25Gb Dual Port Converged Network Adapter",null,null,{"$f":"VLOOKUP(N118,Tabella_prezzi!$A$3:$K$138,8,FALSE)","v":"HPE StoreFabric CN1300R 10/25Gb Dual Port Converged Network Adapter"},null,null,1,{"$f":"VLOOKUP(N118,Tabella_prezzi!$A$3:$K$138,9,FALSE)","v":"L6N08-OpzCNA10Gbps"},{"$f":"VLOOKUP(N118,Tabella_prezzi!$A$3:$K$138,3,FALSE)","v":"OpzGigabit10Gbps CNA"},{"$f":"VLOOKUP(N118,Tabella_prezzi!$A$3:$K$138,4,FALSE)","v":402},null,"L6N08B",{"$f":"VLOOKUP(L118,Tabella_prezzi!$A$3:$K$138,6,FALSE)","v":"TS3L6-CNA10N"},"L6N08",{"$f":"VLOOKUP(N118,Tabella_prezzi!$A$3:$K$138,6,FALSE)","v":"TS3L6-CNA10"}]
["[TS3L6-FC16] HPE StoreFabric SN1100Q 16Gb Dual Port Fibre Channel Host Bus Adapter",null,null,{"$f":"VLOOKUP(N119,Tabella_prezzi!$A$3:$K$138,8,FALSE)","v":"HPE StoreFabric SN1100Q 16Gb Dual Port Fibre Channel Host Bus Adapter"},null,null,1,{"$f":"VLOOKUP(N119,Tabella_prezzi!$A$3:$K$138,9,FALSE)","v":"L6N09-OpzFibreChannel"},{"$f":"VLOOKUP(N119,Tabella_prezzi!$A$3:$K$138,3,FALSE)","v":"OpzFibreChannel"},{"$f":"VLOOKUP(N119,Tabella_prezzi!$A$3:$K$138,4,FALSE)","v":325},null,"L6N09B",{"$f":"VLOOKUP(L119,Tabella_prezzi!$A$3:$K$138,6,FALSE)","v":"TS3L6-FC16N"},"L6N09",{"$f":"VLOOKUP(N119,Tabella_prezzi!$A$3:$K$138,6,FALSE)","v":"TS3L6-FC16"}]
["-=-=-=-=-=-=-=-=-=-=-=-=-=-=-=-=-20%-=-=-=-=-=-=-=-=-=-=-=-=-=-=-=-=-"]
["[TS3L6-CTRL-P] HPE Smart Array Controller PCIe per Software Defined Storage",null,null,{"$f":"VLOOKUP(N121,Tabella_prezzi!$A$3:$K$138,8,FALSE)","v":"HPE Smart Array Controller PCIe per Software Defined Storage"},null,null,1,{"$f":"VLOOKUP(N121,Tabella_prezzi!$A$3:$K$138,9,FALSE)","v":"TS3-OpzA20CTRLP"},{"$f":"VLOOKUP(N121,Tabella_prezzi!$A$3:$K$138,3,FALSE)","v":0},null,{"$f":"VLOOKUP(N121,Tabella_prezzi!$A$3:$K$138,4,FALSE)","v":196},"L6N57B",{"$f":"VLOOKUP(L121,Tabella_prezzi!$A$3:$K$138,6,FALSE)","v":"TS3L6-CTRL-PN"},"L6N57",{"$f":"VLOOKUP(N121,Tabella_prezzi!$A$3:$K$138,6,FALSE)","v":"TS3L6-CTRL-P"}]
["[TS3L6-CTRL-E] HPE Smart Array Controller PCIe per Disk Enclosure esterno",null,null,{"$f":"VLOOKUP(N122,Tabella_prezzi!$A$3:$K$138,8,FALSE)","v":"HPE Smart Array Controller PCIe per Disk Enclosure esterno"},null,null,1,{"$f":"VLOOKUP(N122,Tabella_prezzi!$A$3:$K$138,9,FALSE)","v":"TS3-OpzA20CTRLE"},{"$f":"VLOOKUP(N122,Tabella_prezzi!$A$3:$K$138,3,FALSE)","v":0},null,{"$f":"VLOOKUP(N122,Tabella_prezzi!$A$3:$K$138,4,FALSE)","v":235},"L6N52B",{"$f":"VLOOKUP(L122,Tabella_prezzi!$A$3:$K$138,6,FALSE)","v":"TS3L6-CTRL-EN"},"L6N52",{"$f":"VLOOKUP(N122,Tabella_prezzi!$A$3:$K$138,6,FALSE)","v":"TS3L6-CTRL-E"}]
["[TS3L6-CTRL-OS] HPE Controller PCIe OS Boot Device Raid1 2x480GB NVMe M.2 SSD",null,null,{"$f":"VLOOKUP(N123,Tabella_prezzi!$A$3:$K$138,8,FALSE)","v":"HPE Controller PCIe OS Boot Device Raid1 2x480GB NVMe M.2 SSD"},null,null,1,{"$f":"VLOOKUP(N123,Tabella_prezzi!$A$3:$K$138,9,FALSE)","v":"TS3-OpzA20CTRLOS"},{"$f":"VLOOKUP(N123,Tabella_prezzi!$A$3:$K$138,3,FALSE)","v":0},null,{"$f":"VLOOKUP(N123,Tabella_prezzi!$A$3:$K$138,4,FALSE)","v":484},"L6N51B",{"$f":"VLOOKUP(L123,Tabella_prezzi!$A$3:$K$138,6,FALSE)","v":"TS3L6-CTRL-OSN"},"L6N51",{"$f":"VLOOKUP(N123,Tabella_prezzi!$A$3:$K$138,6,FALSE)","v":"TS3L6-CTRL-OS"}]
["[TS3L6-LAN10T] HPE Ethernet 10Gb 2-port BASE-T BCM57416 Adapter",null,null,{"$f":"VLOOKUP(N124,Tabella_prezzi!$A$3:$K$138,8,FALSE)","v":"HPE Ethernet 10Gb 2-port BASE-T BCM57416 Adapter"},null,null,1,{"$f":"VLOOKUP(N124,Tabella_prezzi!$A$3:$K$138,9,FALSE)","v":"TS3-OpzA2010GBT"},{"$f":"VLOOKUP(N124,Tabella_prezzi!$A$3:$K$138,3,FALSE)","v":0},null,{"$f":"VLOOKUP(N124,Tabella_prezzi!$A$3:$K$138,4,FALSE)","v":298},"L6N64B",{"$f":"VLOOKUP(L124,Tabella_prezzi!$A$3:$K$301,6,FALSE)","v":"TS3L6-LAN10T"},"L6N64",{"$f":"VLOOKUP(N124,Tabella_prezzi!$A$3:$K$138,6,FALSE)","v":"TS3L6-LAN10T"}]
["[TS3L6-X710SFP] HPE Ethernet 10Gb 2-port SFP+ X710-DA2 Adapter",null,null,"HPE Ethernet 10Gb 2-port SFP+ X710-DA2 Adapter",null,null,1,{"$f":"VLOOKUP(N125,Tabella_prezzi!$A$3:$K$138,9,FALSE)","v":"TS3-OpzX710SFP"},{"$f":"VLOOKUP(N125,Tabella_prezzi!$A$3:$K$138,3,FALSE)","v":0},null,{"$f":"VLOOKUP(N125,Tabella_prezzi!$A$3:$K$138,4,FALSE)","v":380},"L6N63B",{"$f":"VLOOKUP(L125,Tabella_prezzi!$A$3:$K$301,6,FALSE)","v":"TS3L6-X710SFPN"},"L6N63",{"$f":"VLOOKUP(N125,Tabella_prezzi!$A$3:$K$138,6,FALSE)","v":"TS3L6-X710SFP"}]
["[TS3L6-TESLAT4] HPE NVIDIA Tesla T4 16GB Module",null,null,{"$f":"VLOOKUP(N126,Tabella_prezzi!$A$3:$K$138,8,FALSE)","v":"HPE NVIDIA Tesla T4 16GB Module"},null,null,1,{"$f":"VLOOKUP(N126,Tabella_prezzi!$A$3:$K$138,9,FALSE)","v":"TS3-OpzA20HPET4"},{"$f":"VLOOKUP(N126,Tabella_prezzi!$A$3:$K$138,3,FALSE)","v":0},null,{"$f":"VLOOKUP(N126,Tabella_prezzi!$A$3:$K$138,4,FALSE)","v":2542},"L6N54B",{"$f":"VLOOKUP(L126,Tabella_prezzi!$A$3:$K$138,6,FALSE)","v":"TS3L6-TESLAT4N"},"L6N54",{"$f":"VLOOKUP(N126,Tabella_prezzi!$A$3:$K$138,6,FALSE)","v":"TS3L6-TESLAT4"}]
["[TS3L6-OP101] HPE 100Gb 1-port OP101 QSFP28 x16 PCIe Gen3 Intel Omni-Path Architecture",null,null,{"$f":"VLOOKUP(N127,Tabella_prezzi!$A$3:$K$138,8,FALSE)","v":"HPE 100Gb 1-port OP101 QSFP28 x16 PCIe Gen3 with Intel Omni-Path Architecture Adapter"},null,null,1,{"$f":"VLOOKUP(N127,Tabella_prezzi!$A$3:$K$138,9,FALSE)","v":"TS3-OpzA20OP101"},{"$f":"VLOOKUP(N127,Tabella_prezzi!$A$3:$K$138,3,FALSE)","v":0},null,{"$f":"VLOOKUP(N127,Tabella_prezzi!$A$3:$K$138,4,FALSE)","v":498},"L6N37B",{"$f":"VLOOKUP(L127,Tabella_prezzi!$A$3:$K$138,6,FALSE)","v":"TS3L6-OP101N"},"L6N37",{"$f":"VLOOKUP(N127,Tabella_prezzi!$A$3:$K$138,6,FALSE)","v":"TS3L6-OP101"}]
["[TS3L6-P2200] NVIDIA Quadro P2200 GPU Module for HPE",null,null,{"$f":"VLOOKUP(N128,Tabella_prezzi!$A$3:$K$138,8,FALSE)","v":"NVIDIA Quadro P2200 GPU Module for HPE"},null,null,1,{"$f":"VLOOKUP(N128,Tabella_prezzi!$A$3:$K$138,9,FALSE)","v":"TS3-OpzA20P2200"},{"$f":"VLOOKUP(N128,Tabella_prezzi!$A$3:$K$138,3,FALSE)","v":0},null,{"$f":"VLOOKUP(N128,Tabella_prezzi!$A$3:$K$138,4,FALSE)","v":590},"L6N55B",{"$f":"VLOOKUP(L128,Tabella_prezzi!$A$3:$K$138,6,FALSE)","v":"TS3L6-P2200N"},"L6N55",{"$f":"VLOOKUP(N128,Tabella_prezzi!$A$3:$K$138,6,FALSE)","v":"TS3L6-P2200"}]
[{"$f":"CONCATENATE(\"[\",C129,\"] \",D129)","v":"[] "}]
["OmniPath Cable"]
["HPE 3M 100Gb QSFP28 Omni-Path Optical Power Class 2 Cable",null,null,{"$f":"VLOOKUP(N131,Tabella_prezzi!$A$3:$K$138,8,FALSE)","v":"HPE 3M 100Gb QSFP28 Omni-Path Optical Power Class 2 Cable"},null,null,1,{"$f":"VLOOKUP(N131,Tabella_prezzi!$A$3:$K$138,9,FALSE)","v":"TS3-OpzA20O3M"},{"$f":"VLOOKUP(N131,Tabella_prezzi!$A$3:$K$138,3,FALSE)","v":0},null,{"$f":"VLOOKUP(N131,Tabella_prezzi!$A$3:$K$138,4,FALSE)","v":445},"L6N38B",{"$f":"VLOOKUP(L131,Tabella_prezzi!$A$3:$K$138,6,FALSE)","v":"TS3L6-DACAOCM3N"},"L6N38",{"$f":"VLOOKUP(N131,Tabella_prezzi!$A$3:$K$138,6,FALSE)","v":"TS3L6-DACAOCM3"}]
["HPE 5M 100Gb QSFP28 Omni-Path Optical Power Class 2 Cable",null,null,{"$f":"VLOOKUP(N132,Tabella_prezzi!$A$3:$K$138,8,FALSE)","v":"HPE 5M 100Gb QSFP28 Omni-Path Optical Power Class 2 Cable"},null,null,1,{"$f":"VLOOKUP(N132,Tabella_prezzi!$A$3:$K$138,9,FALSE)","v":"TS3-OpzA20O5M"},{"$f":"VLOOKUP(N132,Tabella_prezzi!$A$3:$K$138,3,FALSE)","v":0},null,{"$f":"VLOOKUP(N132,Tabella_prezzi!$A$3:$K$138,4,FALSE)","v":495},"L6N39B",{"$f":"VLOOKUP(L132,Tabella_prezzi!$A$3:$K$138,6,FALSE)","v":"TS3L6-DACAOCM5N"},"L6N39",{"$f":"VLOOKUP(N132,Tabella_prezzi!$A$3:$K$138,6,FALSE)","v":"TS3L6-DACAOCM5"}]
["HPE 7M 100Gb QSFP28 Omni-Path Optical Power Class 2 Cable",null,null,{"$f":"VLOOKUP(N133,Tabella_prezzi!$A$3:$K$138,8,FALSE)","v":"HPE 7M 100Gb QSFP28 Omni-Path Optical Power Class 2 Cable"},null,null,1,{"$f":"VLOOKUP(N133,Tabella_prezzi!$A$3:$K$138,9,FALSE)","v":"TS3-OpzA20O7M"},{"$f":"VLOOKUP(N133,Tabella_prezzi!$A$3:$K$138,3,FALSE)","v":0},null,{"$f":"VLOOKUP(N133,Tabella_prezzi!$A$3:$K$138,4,FALSE)","v":545},"L6N40B",{"$f":"VLOOKUP(L133,Tabella_prezzi!$A$3:$K$138,6,FALSE)","v":"TS3L6-DACAOCM7N"},"L6N40",{"$f":"VLOOKUP(N133,Tabella_prezzi!$A$3:$K$138,6,FALSE)","v":"TS3L6-DACAOCM7"}]
[]
["HD_BAY"]
["Standard",null,null,null,null,null,{"$f":"\"\"","v":""},null,{"$f":"\"\"","v":""},null,0,{"$f":"\"\"","v":""},{"$f":"\"\"","v":""},{"$f":"\"\"","v":""},{"$f":"\"\"","v":""}]
["[TS3L6-SASBAY1] HPE DL560 Gen10 8SFF HDD Bay1 Kit",null,null,{"$f":"VLOOKUP(N137,Tabella_prezzi!$A$3:$K$138,8,FALSE)","v":"Kit per ulteriori 8 HDD (HPE DL560 Gen10 8SFF HDD Bay1) comprensivo di SAS Expander"},null,null,1,{"$f":"VLOOKUP(N137,Tabella_prezzi!$A$3:$K$138,9,FALSE)","v":"TS3-OpzA20HBAY1"},{"$f":"VLOOKUP(N137,Tabella_prezzi!$A$3:$K$138,3,FALSE)","v":0},null,{"$f":"VLOOKUP(N137,Tabella_prezzi!$A$3:$K$138,4,FALSE)","v":800},"L6N49B",{"$f":"VLOOKUP(L137,Tabella_prezzi!$A$3:$K$138,6,FALSE)","v":"TS3L6-SASBAY1N"},"L6N49",{"$f":"VLOOKUP(N137,Tabella_prezzi!$A$3:$K$138,6,FALSE)","v":"TS3L6-SASBAY1"}]
[]
["BUNDLE PMEUPS3RTSER Comprensivo di UPS e scheda SNMP + Kit Rack incluso",null,null,{"$f":"VLOOKUP(N139,Tabella_prezzi!$A$3:$K$138,8,FALSE)","v":"BUNDLE PMEUPS3RTSER Comprensivo di UPS e scheda SNMP"},null,null,1,{"$f":"VLOOKUP(N139,Tabella_prezzi!$A$3:$K$138,9,FALSE)","v":"L6N20-OpzUps"},{"$f":"VLOOKUP(N139,Tabella_prezzi!$A$3:$K$138,3,FALSE)","v":"OpzUps (3000VA)"},{"$f":"VLOOKUP(N139,Tabella_prezzi!$A$3:$K$138,4,FALSE)","v":312},null,"L6N20b",{"$f":"VLOOKUP(L139,Tabella_prezzi!$A$3:$K$138,6,FALSE)","v":"TS3L6-UPSN"},"L6N20",{"$f":"VLOOKUP(N139,Tabella_prezzi!$A$3:$K$138,6,FALSE)","v":"TS3L6-UPS"}]
["Unità KVM - monitor 17\", cavo combi PS2 e USB da 1,8mt, tastiera ita, touch pad",null,null,{"$f":"VLOOKUP(N140,Tabella_prezzi!$A$3:$K$138,8,FALSE)","v":"Unità KVM - monitor 17\", cavo combi PS/2&USB da 1,8mt, tastiera italiana, touch pad"},null,null,1,{"$f":"VLOOKUP(N140,Tabella_prezzi!$A$3:$K$138,9,FALSE)","v":"L6N21-OpzGUI"},{"$f":"VLOOKUP(N140,Tabella_prezzi!$A$3:$K$138,3,FALSE)","v":"OpzGUI"},{"$f":"VLOOKUP(N140,Tabella_prezzi!$A$3:$K$138,4,FALSE)","v":443},null,"L6N21b",{"$f":"VLOOKUP(L140,Tabella_prezzi!$A$3:$K$138,6,FALSE)","v":"TS3L6-GUIN"},"L6N21",{"$f":"VLOOKUP(N140,Tabella_prezzi!$A$3:$K$138,6,FALSE)","v":"TS3L6-GUI"}]
["Switch 16 porte IP con relativi cavi combi PS/2 e USB inclusi",null,null,{"$f":"VLOOKUP(N141,Tabella_prezzi!$A$3:$K$138,8,FALSE)","v":"Switch 16 porte IP con relativi cavi combi PS/2&USB inclusi"},null,null,1,{"$f":"VLOOKUP(N141,Tabella_prezzi!$A$3:$K$138,9,FALSE)","v":"L6N22-OpzKVM"},{"$f":"VLOOKUP(N141,Tabella_prezzi!$A$3:$K$138,3,FALSE)","v":"OpzKVM"},{"$f":"VLOOKUP(N141,Tabella_prezzi!$A$3:$K$138,4,FALSE)","v":511},null,"L6N22b",{"$f":"VLOOKUP(L141,Tabella_prezzi!$A$3:$K$138,6,FALSE)","v":"TS3L6-SWKVMN"},"L6N22",{"$f":"VLOOKUP(N141,Tabella_prezzi!$A$3:$K$138,6,FALSE)","v":"TS3L6-SWKVM"}]
["1-pack of Windows Server 2019/2016 Device CALs (STD or DC)",null,null,{"$f":"VLOOKUP(N142,Tabella_prezzi!$A$3:$K$138,8,FALSE)","v":"1-pack of Windows Server 2019/2016 Device CALs (STD or DC) Cus Kit"},null,null,1,{"$f":"VLOOKUP(N142,Tabella_prezzi!$A$3:$K$138,9,FALSE)","v":"L6N24-OpzDeviceCal"},{"$f":"VLOOKUP(N142,Tabella_prezzi!$A$3:$K$138,3,FALSE)","v":"OpzDeviceCal"},{"$f":"VLOOKUP(N142,Tabella_prezzi!$A$3:$K$138,4,FALSE)","v":21},null,"L6N24b",{"$f":"VLOOKUP(L142,Tabella_prezzi!$A$3:$K$138,6,FALSE)","v":"TS3L6-WINDVCALN"},"L6N24",{"$f":"VLOOKUP(N142,Tabella_prezzi!$A$3:$K$138,6,FALSE)","v":"TS3L6-WINDVCAL"}]
["1-pack of Windows Server 2019/2016 User CALs (STD or DC)",null,null,{"$f":"VLOOKUP(N143,Tabella_prezzi!$A$3:$K$138,8,FALSE)","v":"1-pack of Windows Server 2019/2016 User CALs (STD or DC) Cus Kit"},null,null,1,{"$f":"VLOOKUP(N143,Tabella_prezzi!$A$3:$K$138,9,FALSE)","v":"L6N25-OpzUserCal"},{"$f":"VLOOKUP(N143,Tabella_prezzi!$A$3:$K$138,3,FALSE)","v":"OpzUserCal"},{"$f":"VLOOKUP(N143,Tabella_prezzi!$A$3:$K$138,4,FALSE)","v":21},null,"L6N25b",{"$f":"VLOOKUP(L143,Tabella_prezzi!$A$3:$K$138,6,FALSE)","v":"TS3L6-WINUSCALN"},"L6N25",{"$f":"VLOOKUP(N143,Tabella_prezzi!$A$3:$K$138,6,FALSE)","v":"TS3L6-WINUSCAL"}]
["Rack 42U con portata 1000 KG e 4 ruote + coppia PDU 12 prese Shuko bipasso ITA",null,null,{"$f":"VLOOKUP(N144,Tabella_prezzi!$A$3:$K$138,8,FALSE)","v":"Armadio Rack 42U"},null,null,1,{"$f":"VLOOKUP(N144,Tabella_prezzi!$A$3:$K$138,9,FALSE)","v":"L6N32-OpzRack"},{"$f":"VLOOKUP(N144,Tabella_prezzi!$A$3:$K$138,3,FALSE)","v":"OpzRack"},{"$f":"VLOOKUP(N144,Tabella_prezzi!$A$3:$K$138,4,FALSE)","v":511},null,"L6N32b",{"$f":"VLOOKUP(L144,Tabella_prezzi!$A$3:$K$138,6,FALSE)","v":"TS3L6-RACKN"},"L6N32",{"$f":"VLOOKUP(N144,Tabella_prezzi!$A$3:$K$138,6,FALSE)","v":"TS3L6-RACK"}]
["VMware vSphere Essentials Plus Kit OEM for 3 hosts (Max 2 processors per host) 3 Years",null,null,{"$f":"VLOOKUP(N145,Tabella_prezzi!$A$3:$K$138,8,FALSE)","v":"VMware vSphere Essentials Plus Kit OEM for 3 hosts (Max 2 processors per host) 3 Years"},null,null,1,{"$f":"VLOOKUP(N145,Tabella_prezzi!$A$3:$K$138,9,FALSE)","v":"TS3-OpzA20ESPK3"},{"$f":"VLOOKUP(N145,Tabella_prezzi!$A$3:$K$138,3,FALSE)","v":0},null,{"$f":"VLOOKUP(N145,Tabella_prezzi!$A$3:$K$138,4,FALSE)","v":5620},"L6N36b",{"$f":"VLOOKUP(L145,Tabella_prezzi!$A$3:$K$138,6,FALSE)","v":"TS3L6-VS7ESPK3N"},"L6N36",{"$f":"VLOOKUP(N145,Tabella_prezzi!$A$3:$K$138,6,FALSE)","v":"TS3L6-VS7ESPK3"}]
["Upgrade: VMware vSphere  Essentials plus Kit OEM to vSphere Standard Acceleration Kit OEM for 6 processors 3 Years E-LTU",null,null,{"$f":"VLOOKUP(N146,Tabella_prezzi!$A$3:$K$138,8,FALSE)","v":"Upgrade: VMware vSphere  Essentials plus Kit OEM to vSphere Standard Acceleration Kit OEM for 6 processors 3 Years E-LTU"},null,null,1,{"$f":"VLOOKUP(N146,Tabella_prezzi!$A$3:$K$138,9,FALSE)","v":"TS3-OpzA20HVMW1"},{"$f":"VLOOKUP(N146,Tabella_prezzi!$A$3:$K$138,3,FALSE)","v":0},null,{"$f":"VLOOKUP(N146,Tabella_prezzi!$A$3:$K$138,4,FALSE)","v":14628},"L6N41b",{"$f":"VLOOKUP(L146,Tabella_prezzi!$A$3:$K$138,6,FALSE)","v":"TS3L6-ESPSTDAKN"},"L6N41",{"$f":"VLOOKUP(N146,Tabella_prezzi!$A$3:$K$138,6,FALSE)","v":"TS3L6-ESPSTDAK"}]
["VMware vCenter Server Standard OEM for vSphere 3 Years E-LTU",null,null,{"$f":"VLOOKUP(N147,Tabella_prezzi!$A$3:$K$138,8,FALSE)","v":"VMware vCenter Server Standard OEM for vSphere 3 Years E-LTU"},null,null,1,{"$f":"VLOOKUP(N147,Tabella_prezzi!$A$3:$K$138,9,FALSE)","v":"TS3-OpzA20HVMW2"},{"$f":"VLOOKUP(N147,Tabella_prezzi!$A$3:$K$138,3,FALSE)","v":0},null,{"$f":"VLOOKUP(N147,Tabella_prezzi!$A$3:$K$138,4,FALSE)","v":8372},"L6N42b",{"$f":"VLOOKUP(L147,Tabella_prezzi!$A$3:$K$138,6,FALSE)","v":"TS3L6-VCS7STDN"},"L6N42",{"$f":"VLOOKUP(N147,Tabella_prezzi!$A$3:$K$138,6,FALSE)","v":"TS3L6-VCS7STD"}]
["VMware vSphere Enterprise Plus OEM for 1 processor 3 Years E-LTU",null,null,{"$f":"VLOOKUP(N148,Tabella_prezzi!$A$3:$K$138,8,FALSE)","v":"VMware vSphere Enterprise Plus OEM for 1 processor 3 Years E-LTU"},null,null,1,{"$f":"VLOOKUP(N148,Tabella_prezzi!$A$3:$K$138,9,FALSE)","v":"TS3-OpzA20HVMW3"},{"$f":"VLOOKUP(N148,Tabella_prezzi!$A$3:$K$138,3,FALSE)","v":0},null,{"$f":"VLOOKUP(N148,Tabella_prezzi!$A$3:$K$138,4,FALSE)","v":4872},"L6N43b",{"$f":"VLOOKUP(L148,Tabella_prezzi!$A$3:$K$138,6,FALSE)","v":"TS3L6-VS7EPLN"},"L6N43",{"$f":"VLOOKUP(N148,Tabella_prezzi!$A$3:$K$138,6,FALSE)","v":"TS3L6-VS7EPL"}]
["VMware vSphere Standard OEM for 1 processor 3 Years E-LTU",null,null,{"$f":"VLOOKUP(N149,Tabella_prezzi!$A$3:$K$138,8,FALSE)","v":"VMware vSphere Standard OEM for 1 processor 3 Years E-LTU"},null,null,1,{"$f":"VLOOKUP(N149,Tabella_prezzi!$A$3:$K$138,9,FALSE)","v":"TS3-OpzA20HVMW4"},{"$f":"VLOOKUP(N149,Tabella_prezzi!$A$3:$K$138,3,FALSE)","v":0},null,{"$f":"VLOOKUP(N149,Tabella_prezzi!$A$3:$K$138,4,FALSE)","v":1558},"L6N44b",{"$f":"VLOOKUP(L149,Tabella_prezzi!$A$3:$K$138,6,FALSE)","v":"TS3L6-VS7STDN"},"L6N44",{"$f":"VLOOKUP(N149,Tabella_prezzi!$A$3:$K$138,6,FALSE)","v":"TS3L6-VS7STD"}]
["VMware vSAN Standard OEM for 1 processor 3 Years E-LTU",null,null,{"$f":"VLOOKUP(N150,Tabella_prezzi!$A$3:$K$138,8,FALSE)","v":"VMware vSAN Standard OEM for 1 processor 3 Years E-LTU"},null,null,1,{"$f":"VLOOKUP(N150,Tabella_prezzi!$A$3:$K$138,9,FALSE)","v":"TS3-OpzA20HVMW5"},{"$f":"VLOOKUP(N150,Tabella_prezzi!$A$3:$K$138,3,FALSE)","v":0},null,{"$f":"VLOOKUP(N150,Tabella_prezzi!$A$3:$K$138,4,FALSE)","v":3478},"L6N45b",{"$f":"VLOOKUP(L150,Tabella_prezzi!$A$3:$K$138,6,FALSE)","v":"TS3L6-ST7STDN"},"L6N45",{"$f":"VLOOKUP(N150,Tabella_prezzi!$A$3:$K$138,6,FALSE)","v":"TS3L6-ST7STD"}]
["VMware vSAN Advanced OEM for 1 processor 3 Years E-LTU",null,null,{"$f":"VLOOKUP(N151,Tabella_prezzi!$A$3:$K$138,8,FALSE)","v":"VMware vSAN Advanced OEM for 1 processor 3 Years E-LTU"},null,null,1,{"$f":"VLOOKUP(N151,Tabella_prezzi!$A$3:$K$138,9,FALSE)","v":"TS3-OpzA20HVMW6"},{"$f":"VLOOKUP(N151,Tabella_prezzi!$A$3:$K$138,3,FALSE)","v":0},null,{"$f":"VLOOKUP(N151,Tabella_prezzi!$A$3:$K$138,4,FALSE)","v":5579},"L6N46b",{"$f":"VLOOKUP(L151,Tabella_prezzi!$A$3:$K$138,6,FALSE)","v":"TS3L6-ST7ADVN"},"L6N46",{"$f":"VLOOKUP(N151,Tabella_prezzi!$A$3:$K$138,6,FALSE)","v":"TS3L6-ST7ADV"}]
["Armadio Rack HPE 42U 600x1200, comprensivo di 2 PDU Monofase 7.3kVA con 36 connettori C13 e 12 connettori C19 collegamento spina industriale 32A IEC-60309 3 poli (2P+T)",null,null,{"$f":"VLOOKUP(N152,Tabella_prezzi!$A$3:$K$138,8,FALSE)","v":"Armadio Rack HPE 42U 600x1200, comprensivo di 2 PDU Monofase 7.3kVA con 36 connettori C13 e 12 connettori C19 collegamento spina industriale 32A IEC-60309 3 poli (2P+T)"},null,null,1,{"$f":"VLOOKUP(N152,Tabella_prezzi!$A$3:$K$138,9,FALSE)","v":"TS3-OpzA20RMONO"},{"$f":"VLOOKUP(N152,Tabella_prezzi!$A$3:$K$138,3,FALSE)","v":0},null,{"$f":"VLOOKUP(N152,Tabella_prezzi!$A$3:$K$138,4,FALSE)","v":2200},"L6N47b",{"$f":"VLOOKUP(L152,Tabella_prezzi!$A$3:$K$138,6,FALSE)","v":"TS3L6-RACKMONON"},"L6N47",{"$f":"VLOOKUP(N152,Tabella_prezzi!$A$3:$K$138,6,FALSE)","v":"TS3L6-RACKMONO"}]
["Armadio Rack HPE 42U 600x1200, comprensivo di 2 PDU Trifase 22kVA con 36 connettori C13 e 12 connettori C19 collegamento spina industriale 32A IEC-60309 5 poli (3P+N+T)",null,null,{"$f":"VLOOKUP(N153,Tabella_prezzi!$A$3:$K$138,8,FALSE)","v":"Armadio Rack HPE 42U 600x1200, comprensivo di 2 PDU Trifase 22kVA con 36 connettori C13 e 12 connettori C19 collegamento spina industriale 32A IEC-60309 5 poli (3P+N+T)"},null,null,1,{"$f":"VLOOKUP(N153,Tabella_prezzi!$A$3:$K$138,9,FALSE)","v":"TS3-OpzA20R3PH"},{"$f":"VLOOKUP(N153,Tabella_prezzi!$A$3:$K$138,3,FALSE)","v":0},null,{"$f":"VLOOKUP(N153,Tabella_prezzi!$A$3:$K$138,4,FALSE)","v":2539},"L6N48b",{"$f":"VLOOKUP(L153,Tabella_prezzi!$A$3:$K$138,6,FALSE)","v":"TS3L6-RACK3PHN"},"L6N48",{"$f":"VLOOKUP(N153,Tabella_prezzi!$A$3:$K$138,6,FALSE)","v":"TS3L6-RACK3PH"}]
["HPE D3610 Enclosure, 12 x HDD 14TB SAS 7.2K LFF, 5Years 24x7",null,null,{"$f":"VLOOKUP(N154,Tabella_prezzi!$A$3:$K$138,8,FALSE)","v":"HPE D3610 Enclosure, 12 x HDD 14TB SAS 7.2K LFF, 5Years 24x7"},null,null,1,{"$f":"VLOOKUP(N154,Tabella_prezzi!$A$3:$K$138,9,FALSE)","v":"TS3-OpzA20E1524"},{"$f":"VLOOKUP(N154,Tabella_prezzi!$A$3:$K$138,3,FALSE)","v":0},null,{"$f":"VLOOKUP(N154,Tabella_prezzi!$A$3:$K$138,4,FALSE)","v":15770},"L6N53b",{"$f":"VLOOKUP(L154,Tabella_prezzi!$A$3:$K$138,6,FALSE)","v":"TS3L6-E15Y247N"},"L6N53",{"$f":"VLOOKUP(N154,Tabella_prezzi!$A$3:$K$138,6,FALSE)","v":"TS3L6-E15Y247"}]
["Cavo DAC HPE 10GB SFP+ SFP+ 3 metri",null,null,"Cavo DAC HPE 10GB SFP+ SFP+ 3 metri",null,null,1,"TS3-OpzX240M3",{"$f":"VLOOKUP(N155,Tabella_prezzi!$A$3:$K$138,3,FALSE)","v":0},null,{"$f":"VLOOKUP(N155,Tabella_prezzi!$A$3:$K$138,4,FALSE)","v":114},"L6N58B",{"$f":"VLOOKUP(L155,Tabella_prezzi!$A$3:$K$138,6,FALSE)","v":"TS3L6-DAC10GB3MN"},"L6N58",{"$f":"VLOOKUP(N155,Tabella_prezzi!$A$3:$K$138,6,FALSE)","v":"TS3L6-DAC10GB3M"}]
["HPE Premier Flex LC/LC OM4 2f 2m Cbl",null,null,"HPE Premier Flex LC/LC OM4 2f 2m Cbl",null,null,1,"TS3-OpzOM4M2",{"$f":"VLOOKUP(N156,Tabella_prezzi!$A$3:$K$138,3,FALSE)","v":0},null,{"$f":"VLOOKUP(N156,Tabella_prezzi!$A$3:$K$138,4,FALSE)","v":72},"L6N59B",{"$f":"VLOOKUP(L156,Tabella_prezzi!$A$3:$K$138,6,FALSE)","v":"TS3L6-OM4M2N"},"L6N59",{"$f":"VLOOKUP(N156,Tabella_prezzi!$A$3:$K$138,6,FALSE)","v":"TS3L6-OM4M2"}]
["HPE 25Gb SFP28 to SFP28 3m DAC",null,null,"HPE 25Gb SFP28 to SFP28 3m DAC",null,null,1,"TS3-Opz25GBM3",{"$f":"VLOOKUP(N157,Tabella_prezzi!$A$3:$K$138,3,FALSE)","v":0},null,{"$f":"VLOOKUP(N157,Tabella_prezzi!$A$3:$K$138,4,FALSE)","v":149},"L6N60B",{"$f":"VLOOKUP(L157,Tabella_prezzi!$A$3:$K$138,6,FALSE)","v":"TS3L6-DAC25GBM3N"},"L6N60",{"$f":"VLOOKUP(N157,Tabella_prezzi!$A$3:$K$138,6,FALSE)","v":"TS3L6-DAC25GBM3"}]
["HPE 10G SFP+ LR Transceiver",null,null,"HPE 10G SFP+ LR Transceiver",null,null,1,"TS3-Opz10OTLR",{"$f":"VLOOKUP(N158,Tabella_prezzi!$A$3:$K$138,3,FALSE)","v":0},null,{"$f":"VLOOKUP(N158,Tabella_prezzi!$A$3:$K$138,4,FALSE)","v":512},"L6N61B",{"$f":"VLOOKUP(L158,Tabella_prezzi!$A$3:$K$138,6,FALSE)","v":"TS3L6-10OTLRN"},"L6N61",{"$f":"VLOOKUP(N158,Tabella_prezzi!$A$3:$K$138,6,FALSE)","v":"TS3L6-10OTLR"}]
["HPE 10G SFP+ SR Transceiver",null,null,"HPE 10G SFP+ SR Transceiver",null,null,1,"TS3-Opz10OTSR",{"$f":"VLOOKUP(N159,Tabella_prezzi!$A$3:$K$138,3,FALSE)","v":0},null,{"$f":"VLOOKUP(N159,Tabella_prezzi!$A$3:$K$138,4,FALSE)","v":230},"L6N62B",{"$f":"VLOOKUP(L159,Tabella_prezzi!$A$3:$K$308,6,FALSE)","v":"TS3L6-10OTSRN"},"L6N62",{"$f":"VLOOKUP(N159,Tabella_prezzi!$A$3:$K$138,6,FALSE)","v":"TS3L6-10OTSR"}]
[]
[]
["HPE G2 R8000 UPS 230V Outlets (6) C19 (2) IEC 32A/6U Rackmount INTL",null,null,"HPE G2 R8000 UPS 230V Outlets (6) C19 (2) IEC 32A/6U Rackmount INTL",null,null,1,"TS3L6-UPSR8000",{"$f":"VLOOKUP(N162,Tabella_prezzi!$A$3:$K$180,3,FALSE)","v":0},null,{"$f":"VLOOKUP(N162,Tabella_prezzi!$A$3:$K$180,4,FALSE)","v":3200},"L6N66B",{"$f":"VLOOKUP(L162,Tabella_prezzi!$A$3:$K$308,6,FALSE)","v":"TS3L6-UPSR8000N"},"L6N66",{"$f":"VLOOKUP(N162,Tabella_prezzi!$A$3:$K$180,6,FALSE)","v":"TS3L6-UPSR8000"}]
[]
[]
[]
["HPE Smart Array P816i-a SR G10",null,null,null,null,null,{"$f":"\"\"","v":""},null,{"$f":"\"\"","v":""},null,0,{"$f":"\"\"","v":""},{"$f":"\"\"","v":""},{"$f":"\"\"","v":""},{"$f":"\"\"","v":""}]
["HPE Smart Array Controller SDS",null,null,{"$f":"VLOOKUP(N167,Tabella_prezzi!$A$3:$K$138,8,FALSE)","v":"HPE Smart Array Controller per Software Defined Storage in sostituzione del Controller in configurazione BASE"},null,null,1,{"$f":"VLOOKUP(N167,Tabella_prezzi!$A$3:$K$138,9,FALSE)","v":"TS3-OpzA20CTRLA"},{"$f":"VLOOKUP(N167,Tabella_prezzi!$A$3:$K$138,3,FALSE)","v":0},null,{"$f":"VLOOKUP(N167,Tabella_prezzi!$A$3:$K$138,4,FALSE)","v":124},"L6N56B",{"$f":"VLOOKUP(L167,Tabella_prezzi!$A$3:$K$308,6,FALSE)","v":"TS3L6-CTRL-AN"},"L6N56",{"$f":"VLOOKUP(N167,Tabella_prezzi!$A$3:$K$138,6,FALSE)","v":"TS3L6-CTRL-A"}]
[]
[]
[]
[]
["None",null,null,null,null,null,{"$f":"\"\"","v":""},null,{"$f":"\"\"","v":""},null,0,{"$f":"\"\"","v":""},{"$f":"\"\"","v":""},{"$f":"\"\"","v":""},{"$f":"\"\"","v":""}]
["HPE 480GB SATA RI M.2",null,null,{"$f":"VLOOKUP(N173,Tabella_prezzi!$A$3:$K$138,8,FALSE)","v":"HPE 480GB SATA RI M.2 2280 5300P SSD"},null,null,1,{"$f":"VLOOKUP(N173,Tabella_prezzi!$A$3:$K$138,9,FALSE)","v":"TS3-OpzM2480GB"},{"$f":"VLOOKUP(N173,Tabella_prezzi!$A$3:$K$138,3,FALSE)","v":0},null,{"$f":"VLOOKUP(N173,Tabella_prezzi!$A$3:$K$138,4,FALSE)","v":292},"L6N65B",{"$f":"VLOOKUP(L173,Tabella_prezzi!$A$3:$K$308,6,FALSE)","v":"TS3L6-M2480GBN"},"L6N65",{"$f":"VLOOKUP(N173,Tabella_prezzi!$A$3:$K$138,6,FALSE)","v":"TS3L6-M2480GB"}]

{"sheet":"Tabella_prezzi","index":5,"n_rows":177,"n_cols":11,"rows_kept":177,"cut":false,"hidden":true,"merged":[[95,5,96,5],[95,10,96,10],[95,0,96,0],[95,1,96,1],[95,2,96,2],[95,3,96,3],[95,4,96,4],[80,5,81,5],[82,0,83,0],[82,1,83,1],[82,2,83,2],[82,3,83,3],[82,4,83,4],[82,5,83,5],[80,0,81,0],[80,1,81,1],[80,2,81,2],[80,3,81,3],[80,4,81,4],[73,5,74,5],[78,0,79,0],[78,1,79,1],[78,2,79,2],[78,3,79,3],[78,4,79,4],[78,5,79,5],[73,0,74,0],[73,1,74,1],[73,2,74,2],[73,3,74,3],[73,4,74,4],[25,10,26,10],[3,4,4,4],[8,4,9,4],[10,4,11,4],[12,4,13,4],[25,4,26,4],[3,5,4,5],[8,5,9,5],[10,5,11,5],[12,5,13,5],[25,5,26,5],[3,1,4,1],[8,1,9,1],[10,1,11,1],[12,1,13,1],[25,1,26,1],[3,3,4,3],[8,3,9,3],[10,3,11,3],[12,3,13,3],[25,3,26,3],[3,2,4,2],[8,2,9,2],[10,2,11,2],[12,2,13,2],[25,2,26,2],[3,0,4,0],[8,0,9,0],[10,0,11,0],[12,0,13,0],[25,0,26,0]]}
[]
["N°",null,"Attributo","Valore inserito","N°","Codice Convenzione","Qty:","Description:","Manufacturer Part","Sku Number:","Brand"]
["L6N01",1,"Server rackable quad-processore prest.",5912,"L6N01","TS3L6-SRV",1,"Proliant DL560 Gen10","L6N01-ServerDL560","-","HPE"]
["L6N02",2,"Kit n. 2 Processori aggiuntivi",2475,"L6N02","TS3L6-CPU",2,"Intel Xeon-Gold 6252N (2.3GHz/24-core/150W) Processor Kit for HPE ProLiant DL560 Gen10","L6N02-OpzCPU","P02960-B21","HPE"]
[null,null,null,null,null,null,1,"HPE DL5x0 Gen10 CPU Version 2 Mezzanine Board Kit",null,"P07991-B21","HPE"]
["L6N03",3,"OpzRAM32GB",184,"L6N03","TS3L6-RAM32",1,"HPE 32GB (1x32GB) Dual Rank x4 DDR4-2933 CAS-21-21-21 Registered Smart Memory Kit","L6N03-OpzRAM32GB","P00924-B21","HPE"]
["L6N04",4,"OpzRAM64GB",589,"L6N04","TS3L6-RAM64",1,"HPE 64GB (1x64GB) Dual Rank x4 DDR4-2933 CAS-21-21-21 Registered Smart Memory Kit","L6N04-OpzRAM64GB","P00930-B21","HPE"]
["L6N05",5,"OpzGigabit",25,"L6N05","TS3L6-LAN1",1,"HPE Ethernet 1Gb 2-port 332T Adapter","L6N05-OpzGigabit","615732-B21","HPE"]
["L6N06",6,"OpzGigabit10Gbps",218,"L6N06","TS3L6-LAN10",1,"HPE Ethernet 10Gb 2-port 548SFP+ Adapter","L6N06-OpzGigabit10Gbps","P11338-B21","HPE"]
[null,null,null,null,null,null,2,"HPE BladeSystem c-Class 10Gb SFP+ SR Transceiver",null,"455883-B21","HPE"]
["L6N07",7,"OpzGigabit25Gbps",669,"L6N07","TS3L6-LAN25",1,"HPE Ethernet 10/25Gb 2-port 640SFP28 Adapter","L6N07-OpzGigabit25Gbps","817753-B21","HPE"]
[null,null,null,null,null,null,2,"HPE 25Gb SFP28 SR 100m Transceiver",null,"845398-B21","HPE"]
["L6N08",8,"OpzGigabit10Gbps CNA",402,"L6N08","TS3L6-CNA10",1,"HPE StoreFabric CN1300R 10/25Gb Dual Port Converged Network Adapter","L6N08-OpzCNA10Gbps","Q0F09A","HPE"]
[null,null,null,null,null,null,2,"HPE BladeSystem c-Class 10Gb SFP+ SR Transceiver",null,"455883-B21","HPE"]
["L6N09",9,"OpzFibreChannel",325,"L6N09","TS3L6-FC16",1,"HPE StoreFabric SN1100Q 16Gb Dual Port Fibre Channel Host Bus Adapter","L6N09-OpzFibreChannel","P9D94A","HPE"]
["L6N10",10,"OpzHDD2TB",189,"L6N10","TS3L6-HDD2TB",1,"HPE 1.8TB SAS 12G Enterprise 10K SFF (2.5in) SC 3yr Wty 512e Digitally Signed Firmware HDD","L6N10-OpzHDD2TB","872481-B21","HPE"]
["L6N11",11,"OpzHDD1TB",136,"L6N11","TS3L6-HDD1TB",1,"HPE 1.2TB SAS 12G Enterprise 10K SFF (2.5in) SC 3yr Wty Digitally Signed Firmware HDD","L6N11-OpzHDD1TB","872479-B21","HPE"]
["L6N12",12,"OpzHDD300GB",87,"L6N12","TS3L6-HDD300GB",1,"HPE 300GB SAS 12G Enterprise 10K SFF (2.5in) SC 3yr Wty Digitally Signed Firmware HDD","L6N12-OpzHDD300GB","872475-B21","HPE"]
["L6N13",13,"OpzSSD-RI1,6TB",714,"L6N13","TS3L6-RI1600GB",1,"HPE 1.92TB SAS 12G Read Intensive SFF (2.5in) SC 3yr Wty Value SAS Digitally Signed Firmware SSD","L6N13-OpzSSD-RI1,6TB","P10442-B21","HPE"]
["L6N14",14,"OpzSSD-MU1,6TB",878,"L6N14","TS3L6-MU1600GB",1,"HPE 1.6TB SAS 12G Mixed Use SFF (2.5in) SC 3yr Wty SSD","L6N14-OpzSSD-MU1,6TB","P19915-B21","HPE"]
["L6N15",15,"OpzSSD-RI800GB",461,"L6N15","TS3L6-RI800GB",1,"HPE 960GB SAS 12G Read Intensive SFF (2.5in) SC 3yr Wty Value SAS Digitally Signed Firmware SSD","L6N15-OpzSSD-RI800GB","P10440-B21","HPE"]
["L6N16",16,"OpzSSD-MU800GB",576,"L6N16","TS3L6-MU800GB",1,"HPE 800GB SAS 12G Mixed Use SFF (2.5in) SC 3yr Wty SSD","L6N16-OpzSSD-MU800GB","P19913-B21","HPE"]
["L6N17",17,"OpzSSD-RI400GB",397,"L6N17","TS3L6-RI400GB",1,"HPE 400GB SAS 12G Mixed Use SFF (2.5in) SC 3yr Wty Digitally Signed Firmware SSD","L6N17-OpzSSD-RI400GB","P09088-B21","HPE"]
["L6N18",18,"OpzNVME1,6TB",1950,"L6N18","TS3L6-NVME1600",1,"HPE 1.6TB NVMe x4 Lanes Mixed Use SFF (2.5in) SCN 3yr Wty Digitally Signed Firmware SSD",null,"P13670-B21","HPE"]
["L6N19",19,"OpzNVME800GB",1219,"L6N19","TS3L6-NVME800",1,"HPE 800GB NVMe x4 Lanes Mixed Use SFF (2.5in) SCN 3yr Wty Digitally Signed Firmware SSD",null,"P13668-B21","HPE"]
["L6N20",20,"OpzUps (3000VA)",312,"L6N20","TS3L6-UPS",1,"BUNDLE PMEUPS3RTSER Comprensivo di UPS e scheda SNMP","L6N20-OpzUps","RPMM9/3K","PowerMe"]
[null,null,null,null,null,null,1,"KIT RACK incluso nella fornitura",null,null,"DELL"]
["L6N21",21,"OpzGUI",443,"L6N21","TS3L6-GUI",1,"Unità KVM - monitor 17\", cavo combi PS/2&USB da 1,8mt, tastiera italiana, touch pad","L6N21-OpzGUI","F9857N","Tecnosteel"]
["L6N22",22,"OpzKVM",511,"L6N22","TS3L6-SWKVM",1,"Switch 16 porte IP con relativi cavi combi PS/2&USB inclusi","L6N22-OpzKVM","T9816NIP","Tecnosteel"]
["L6N23",23,"OpzWinServSTD",557,"L6N23","TS3L6-WINSTD",1,"Windows Server 2019,Standard,ROK,16CORE (for Distributor sale only)","L6N23-OpzWinServSTD","P11058-B21","HPE"]
["L6N24",24,"OpzDeviceCal",21,"L6N24","TS3L6-WINDVCAL",1,"1-pack of Windows Server 2019/2016 Device CALs (STD or DC) Cus Kit","L6N24-OpzDeviceCal","P11076-A21","HPE"]
["L6N25",25,"OpzUserCal",21,"L6N25","TS3L6-WINUSCAL",1,"1-pack of Windows Server 2019/2016 User CALs (STD or DC) Cus Kit","L6N25-OpzUserCal","P11075-A21","HPE"]
["L6N26",26,"OpzWinServSTD2core",95,"L6N26","TS3L6-WINSRV2C",1,"MS2019 Standard Ed, Additional License, 2 CORE,NO MEDIA/KEY, Customer Kit","L6N26-OpzWinServSTD2core","P11066-A21","HPE"]
["L6N27",27,"OpzWinServDC",2228,"L6N27","TS3L6-WINDC",1,"Windows Server 2019,DataCtr,ROK,16CORE (for Distributor sale only)","L6N27-OpzWinServDC","P11061-B21","HPE"]
["L6N28",28,"OpzWinServDC2core",412,"L6N28","TS3L6-WINDC2C",1,"MS2019 Datacenter Ed, Additional License, 2 CORE,NO MEDIA/KEY, Customer Kit","L6N28-OpzWinServDC2core","P11069-A21","HPE"]
["L6N29",29,"OpzOpenSource",51,"L6N29","TS3L6-LINUX",1,"Ubuntu 20.04 LTS 64 Bit","L6N29-OpzOpenSource",null,"HPE"]
["L6N30",30,"OpzHDDRetention",446,"L6N30","TS3L6-HDRTN",1,"Hard Disk Retention 36m","L6N30-OpzHDDRetention",null,"HPE"]
["L6N31",31,"OpzEstensione24",558,"L6N31","TS3L6-5Y",1,"Estensione della manutenzione in garanzia per ulteriori 24 mesi","L6N31-OpzEstensione24",null,"HPE"]
["L6N32",32,"OpzRack",511,"L6N32","TS3L6-RACK",1,"Armadio Rack 42U","L6N32-OpzRack","P6142NCONSIP","Tecnosteel"]
["L6N33",33,"OpzHDDRetention",743,"L6N33","TS3L6-HDRTN60",1,"Hard Disk Retention 60m","L6N33-OpzHDDRetention60"]
["L6N34",34,"OpzRJ45 3m",3,"L6N34","TS3L6-RJ453M",1,"Cavo “patch” di 3 mt RJ45 certificato per gigabit ethernet","TS3-OpzA20RJ45","CAVORJ45"]
["L6N35",35,null,480,"L6N35","TS3L6-OV3YILO",1,"HPE OV 3yr 24x7 Supp Phys 1 Svr Lic","TS3-OpzA20ILO"]
["L6N36",36,null,5620,"L6N36","TS3L6-VS7ESPK3",1,"VMware vSphere Essentials Plus Kit OEM for 3 hosts (Max 2 processors per host) 3 Years","TS3-OpzA20ESPK3"]
["L6N37",37,null,498,"L6N37","TS3L6-OP101",1,"HPE 100Gb 1-port OP101 QSFP28 x16 PCIe Gen3 with Intel Omni-Path Architecture Adapter","TS3-OpzA20OP101"]
["L6N38",38,null,445,"L6N38","TS3L6-DACAOCM3",1,"HPE 3M 100Gb QSFP28 Omni-Path Optical Power Class 2 Cable","TS3-OpzA20O3M"]
["L6N39",39,null,495,"L6N39","TS3L6-DACAOCM5",1,"HPE 5M 100Gb QSFP28 Omni-Path Optical Power Class 2 Cable","TS3-OpzA20O5M"]
["L6N40",40,null,545,"L6N40","TS3L6-DACAOCM7",1,"HPE 7M 100Gb QSFP28 Omni-Path Optical Power Class 2 Cable","TS3-OpzA20O7M"]
["L6N41",41,null,14628,"L6N41","TS3L6-ESPSTDAK",1,"Upgrade: VMware vSphere  Essentials plus Kit OEM to vSphere Standard Acceleration Kit OEM for 6 processors 3 Years E-LTU","TS3-OpzA20HVMW1"]
["L6N42",42,null,8372,"L6N42","TS3L6-VCS7STD",1,"VMware vCenter Server Standard OEM for vSphere 3 Years E-LTU","TS3-OpzA20HVMW2"]
["L6N43",43,null,4872,"L6N43","TS3L6-VS7EPL",1,"VMware vSphere Enterprise Plus OEM for 1 processor 3 Years E-LTU","TS3-OpzA20HVMW3"]
["L6N44",44,null,1558,"L6N44","TS3L6-VS7STD",1,"VMware vSphere Standard OEM for 1 processor 3 Years E-LTU","TS3-OpzA20HVMW4"]
["L6N45",45,null,3478,"L6N45","TS3L6-ST7STD",1,"VMware vSAN Standard OEM for 1 processor 3 Years E-LTU","TS3-OpzA20HVMW5"]
["L6N46",46,null,5579,"L6N46","TS3L6-ST7ADV",1,"VMware vSAN Advanced OEM for 1 processor 3 Years E-LTU","TS3-OpzA20HVMW6"]
["L6N47",47,null,2200,"L6N47","TS3L6-RACKMONO",1,"Armadio Rack HPE 42U 600x1200, comprensivo di 2 PDU Monofase 7.3kVA con 36 connettori C13 e 12 connettori C19 collegamento spina industriale 32A IEC-60309 3 poli (2P+T)","TS3-OpzA20RMONO"]
["L6N48",48,null,2539,"L6N48","TS3L6-RACK3PH",1,"Armadio Rack HPE 42U 600x1200, comprensivo di 2 PDU Trifase 22kVA con 36 connettori C13 e 12 connettori C19 collegamento spina industriale 32A IEC-60309 5 poli (3P+N+T)","TS3-OpzA20R3PH"]
["L6N49",49,null,800,"L6N49","TS3L6-SASBAY1",1,"Kit per ulteriori 8 HDD (HPE DL560 Gen10 8SFF HDD Bay1) comprensivo di SAS Expander","TS3-OpzA20HBAY1"]
["L6N50",50,null,250,"L6N50","TS3L6-DUAL32GB",1,"HPE 32GB Dual microSD RAID 1 USB Boot Drive","TS3-OpzA20D32GB"]
["L6N51",51,null,484,"L6N51","TS3L6-CTRL-OS",1,"HPE Controller PCIe OS Boot Device Raid1 2x480GB NVMe M.2 SSD","TS3-OpzA20CTRLOS"]
["L6N52",52,null,235,"L6N52","TS3L6-CTRL-E",1,"HPE Smart Array Controller PCIe per Disk Enclosure esterno","TS3-OpzA20CTRLE"]
["L6N53",53,null,15770,"L6N53","TS3L6-E15Y247",1,"HPE D3610 Enclosure, 12 x HDD 14TB SAS 7.2K LFF, 5Years 24x7","TS3-OpzA20E1524"]
["L6N54",54,null,2542,"L6N54","TS3L6-TESLAT4",1,"HPE NVIDIA Tesla T4 16GB Module","TS3-OpzA20HPET4"]
["L6N55",55,null,590,"L6N55","TS3L6-P2200",1,"NVIDIA Quadro P2200 GPU Module for HPE","TS3-OpzA20P2200"]
["L6N56",56,null,124,"L6N56","TS3L6-CTRL-A",1,"HPE Smart Array Controller per Software Defined Storage in sostituzione del Controller in configurazione BASE","TS3-OpzA20CTRLA"]
["L6N57",57,null,196,"L6N57","TS3L6-CTRL-P",1,"HPE Smart Array Controller PCIe per Software Defined Storage","TS3-OpzA20CTRLP"]
["L6N58",58,null,114,"L6N58","TS3L6-DAC10GB3M",1,"Cavo DAC HPE 10GB SFP+ SFP+ 3 metri","TS3-OpzA20DAC10M3"]
["L6N59",59,null,72,"L6N59","TS3L6-OM4M2",1,"HPE Premier Flex LC/LC OM4 2f 2m Cbl","TS3-OpzOM4M2"]
["L6N60",60,null,149,"L6N60","TS3L6-DAC25GBM3",1,"HPE 25Gb SFP28 to SFP28 3m DAC","TS3-Opz25GBM3","844477-B21"]
["L6N61",61,null,512,"L6N61","TS3L6-10OTLR",1,"HPE 10G SFP+ LR Transceiver","TS3-Opz10OTLR"]
["L6N62",62,null,230,"L6N62","TS3L6-10OTSR",1,"HPE 10G SFP+ SR Transceiver","TS3-Opz10OTSR"]
["L6N63",63,null,380,"L6N63","TS3L6-X710SFP",1,"HPE Ethernet 10Gb 2-port SFP+ X710-DA2 Adapter","TS3-OpzX710SFP"]
["L6N64",64,null,298,"L6N64","TS3L6-LAN10T",1,"HPE Ethernet 10Gb 2-port BASE-T BCM57416 Adapter","TS3-OpzA2010GBT"]
["L6N65",65,null,292,"L6N65","TS3L6-M2480GB",1,"HPE 480GB SATA RI M.2 2280 5300P SSD","TS3-OpzM2480GB","P19890-B21","HPE"]
["L6N01b",1,"Server rackable quad-processore prest.",5912,"L6N01b","TS3L6-SRVNVME",1,"Proliant DL560 Gen10 NVMe Configuration","L6N01b-ServerDL560","-","HPE"]
["L6N02B",2,"Kit n. 2 Processori aggiuntivi",2475,"L6N02B","TS3L6-CPUN",2,"Intel Xeon-Gold 6252N (2.3GHz/24-core/150W) Processor Kit for HPE ProLiant DL560 Gen10","L6N02-OpzCPU","P02960-B21","HPE"]
[null,null,null,null,null,null,1,"HPE DL5x0 Gen10 CPU Version 2 Mezzanine Board Kit",null,"P07991-B21","HPE"]
["L6N03B",3,"OpzRAM32GB",184,"L6N03B","TS3L6-RAM32N",1,"HPE 32GB (1x32GB) Dual Rank x4 DDR4-2933 CAS-21-21-21 Registered Smart Memory Kit","L6N03-OpzRAM32GB","P00924-B21","HPE"]
["L6N04B",4,"OpzRAM64GB",589,"L6N04B","TS3L6-RAM64N",1,"HPE 64GB (1x64GB) Dual Rank x4 DDR4-2933 CAS-21-21-21 Registered Smart Memory Kit","L6N04-OpzRAM64GB","P00930-B21","HPE"]
["L6N05B",5,"OpzGigabit",25,"L6N05B","TS3L6-LAN1N",1,"HPE Ethernet 1Gb 2-port 332T Adapter","L6N05-OpzGigabit","615732-B21","HPE"]
["L6N06B",6,"OpzGigabit10Gbps",218,"L6N06B","TS3L6-LAN10N",1,"HPE Ethernet 10Gb 2-port 548SFP+ Adapter","L6N06-OpzGigabit10Gbps","P11338-B21","HPE"]
[null,null,null,null,null,null,2,"HPE BladeSystem c-Class 10Gb SFP+ SR Transceiver",null,"455883-B21","HPE"]
["L6N07B",7,"OpzGigabit25Gbps",669,"L6N07B","TS3L6-LAN25N",1,"HPE Ethernet 10/25Gb 2-port 640SFP28 Adapter","L6N07-OpzGigabit25Gbps","817753-B21","HPE"]
[null,null,null,null,null,null,2,"HPE 25Gb SFP28 SR 100m Transceiver",null,"845398-B21","HPE"]
["L6N08B",8,"OpzGigabit10Gbps CNA",402,"L6N08B","TS3L6-CNA10N",1,"HPE StoreFabric CN1300R 10/25Gb Dual Port Converged Network Adapter","L6N08-OpzCNA10Gbps","Q0F09A","HPE"]
[null,null,null,null,null,null,2,"HPE BladeSystem c-Class 10Gb SFP+ SR Transceiver",null,"455883-B21","HPE"]
["L6N09B",9,"OpzFibreChannel",325,"L6N09B","TS3L6-FC16N",1,"HPE StoreFabric SN1100Q 16Gb Dual Port Fibre Channel Host Bus Adapter","L6N09-OpzFibreChannel","P9D94A","HPE"]
["L6N10B",10,"OpzHDD2TB",189,"L6N10B","TS3L6-HDD2TBN",1,"HPE 1.8TB SAS 12G Enterprise 10K SFF (2.5in) SC 3yr Wty 512e Digitally Signed Firmware HDD","L6N10-OpzHDD2TB","872481-B21","HPE"]
["L6N11B",11,"OpzHDD1TB",136,"L6N11B","TS3L6-HDD1TBN",1,"HPE 1.2TB SAS 12G Enterprise 10K SFF (2.5in) SC 3yr Wty Digitally Signed Firmware HDD","L6N11-OpzHDD1TB","872479-B21","HPE"]
["L6N12B",12,"OpzHDD300GB",87,"L6N12B","TS3L6-HDD300GBN",1,"HPE 300GB SAS 12G Enterprise 10K SFF (2.5in) SC 3yr Wty Digitally Signed Firmware HDD","L6N12-OpzHDD300GB","872475-B21","HPE"]
["L6N13B",13,"OpzSSD-RI1,6TB",714,"L6N13B","TS3L6-RI1600GBN",1,"HPE 1.92TB SAS 12G Read Intensive SFF (2.5in) SC 3yr Wty Value SAS Digitally Signed Firmware SSD","L6N13-OpzSSD-RI1,6TB","P10442-B21","HPE"]
["L6N14B",14,"OpzSSD-MU1,6TB",878,"L6N14B","TS3L6-MU1600GBN",1,"HPE 1.6TB SAS 12G Mixed Use SFF (2.5in) SC 3yr Wty SSD","L6N14-OpzSSD-MU1,6TB","P19915-B21","HPE"]
["L6N15B",15,"OpzSSD-RI800GB",461,"L6N15B","TS3L6-RI800GBN",1,"HPE 960GB SAS 12G Read Intensive SFF (2.5in) SC 3yr Wty Value SAS Digitally Signed Firmware SSD","L6N15-OpzSSD-RI800GB","P10440-B21","HPE"]
["L6N16B",16,"OpzSSD-MU800GB",576,"L6N16B","TS3L6-MU800GBN",1,"HPE 800GB SAS 12G Mixed Use SFF (2.5in) SC 3yr Wty SSD","L6N16-OpzSSD-MU800GB","P19913-B21","HPE"]
["L6N17B",17,"OpzSSD-RI400GB",397,"L6N17B","TS3L6-RI400GBN",1,"HPE 400GB SAS 12G Mixed Use SFF (2.5in) SC 3yr Wty Digitally Signed Firmware SSD","L6N17-OpzSSD-RI400GB","P09088-B21","HPE"]
["L6N18B",18,"OpzNVME1,6TB",1950,"L6N18B","TS3L6-NVME1600N",1,"HPE 1.6TB NVMe x4 Lanes Mixed Use SFF (2.5in) SCN 3yr Wty Digitally Signed Firmware SSD","L6N18-OpzNVME1,6TB","P13670-B21","HPE"]
["L6N19B",19,"OpzNVME800GB",1219,"L6N19B","TS3L6-NVME800N",1,"HPE 800GB NVMe x4 Lanes Mixed Use SFF (2.5in) SCN 3yr Wty Digitally Signed Firmware SSD","L6N19-OpzNVME800GB","P13668-B21","HPE"]
["L6N20B",20,"OpzUps (3000VA)",312,"L6N20B","TS3L6-UPSN",1,"BUNDLE PMEUPS3RTSER Comprensivo di UPS e scheda SNMP","L6N20-OpzUps","RPMM9/3K","PowerMe"]
[null,null,null,null,null,null,1,"KIT RACK incluso nella fornitura",null,null,"DELL"]
["L6N21B",21,"OpzGUI",443,"L6N21B","TS3L6-GUIN",1,"Unità KVM - monitor 17\", cavo combi PS/2&USB da 1,8mt, tastiera italiana, touch pad","L6N21-OpzGUI","F9857N","Tecnosteel"]
["L6N22B",22,"OpzKVM",511,"L6N22B","TS3L6-SWKVMN",1,"Switch 16 porte IP con relativi cavi combi PS/2&USB inclusi","L6N22-OpzKVM","T9816NIP","Tecnosteel"]
["L6N23B",23,"OpzWinServSTD",557,"L6N23B","TS3L6-WINSTDN",1,"Windows Server 2019,Standard,ROK,16CORE (for Distributor sale only)","L6N23-OpzWinServSTD","P11058-B21","HPE"]
["L6N24B",24,"OpzDeviceCal",21,"L6N24B","TS3L6-WINDVCALN",1,"1-pack of Windows Server 2019/2016 Device CALs (STD or DC) Cus Kit","L6N24-OpzDeviceCal","P11076-A21","HPE"]
["L6N25B",25,"OpzUserCal",21,"L6N25B","TS3L6-WINUSCALN",1,"1-pack of Windows Server 2019/2016 User CALs (STD or DC) Cus Kit","L6N25-OpzUserCal","P11075-A21","HPE"]
["L6N26B",26,"OpzWinServSTD2core",95,"L6N26B","TS3L6-WINSRV2CN",1,"MS2019 Standard Ed, Additional License, 2 CORE,NO MEDIA/KEY, Customer Kit","L6N26-OpzWinServSTD2core","P11066-A21","HPE"]
["L6N27B",27,"OpzWinServDC",2228,"L6N27B","TS3L6-WINDCN",1,"Windows Server 2019,DataCtr,ROK,16CORE (for Distributor sale only)","L6N27-OpzWinServDC","P11061-B21","HPE"]
["L6N28B",28,"OpzWinServDC2core",412,"L6N28B","TS3L6-WINDC2CN",1,"MS2019 Datacenter Ed, Additional License, 2 CORE,NO MEDIA/KEY, Customer Kit","L6N28-OpzWinServDC2core","P11069-A21","HPE"]
["L6N29B",29,"OpzOpenSource",51,"L6N29B","TS3L6-LINUXN",1,"Ubuntu 20.04 LTS 64 Bit","L6N29-OpzOpenSource",null,"HPE"]
["L6N30B",30,"OpzHDDRetention",446,"L6N30B","TS3L6-HDRTNN",1,"Hard Disk Retention 36m","L6N30-OpzHDDRetention",null,"HPE"]
["L6N31B",31,"OpzEstensione24",558,"L6N31B","TS3L6-5YN",1,"Estensione della manutenzione in garanzia per ulteriori 24 mesi","L6N31-OpzEstensione24",null,"HPE"]
["L6N32B",32,"OpzRack",511,"L6N32B","TS3L6-RACKN",1,"Armadio Rack 42U","L6N32-OpzRack","P6142NCONSIP","Tecnosteel"]
["L6N33B",33,"OpzHDDRetention",743,"L6N33B","TS3L6-HDRTN60N",1,"Hard Disk Retention 60m","L6N33-OpzHDDRetention60"]
["L6N34B",34,"OpzRJ45 3m",3,"L6N34B","TS3L6-RJ453MN",1,"Cavo “patch” di 3 mt RJ45 certificato per gigabit ethernet","TS3-OpzA20RJ45","CAVORJ45"]
["L6N35B",35,null,480,"L6N35B","TS3L6-OV3YILON",1,"HPE OV 3yr 24x7 Supp Phys 1 Svr Lic","TS3-OpzA20ILO"]
["L6N36B",36,null,5620,"L6N36B","TS3L6-VS7ESPK3N",1,"VMware vSphere Essentials Plus Kit OEM for 3 hosts (Max 2 processors per host) 3 Years","TS3-OpzA20ESPK3"]
["L6N37B",37,null,498,"L6N37B","TS3L6-OP101N",1,"HPE 100Gb 1-port OP101 QSFP28 x16 PCIe Gen3 with Intel Omni-Path Architecture Adapter","TS3-OpzA20OP101"]
["L6N38B",38,null,445,"L6N38B","TS3L6-DACAOCM3N",1,"HPE 3M 100Gb QSFP28 Omni-Path Optical Power Class 2 Cable","TS3-OpzA20O3M"]
["L6N39B",39,null,495,"L6N39B","TS3L6-DACAOCM5N",1,"HPE 5M 100Gb QSFP28 Omni-Path Optical Power Class 2 Cable","TS3-OpzA20O5M"]
["L6N40B",40,null,545,"L6N40B","TS3L6-DACAOCM7N",1,"HPE 7M 100Gb QSFP28 Omni-Path Optical Power Class 2 Cable","TS3-OpzA20O7M"]
["L6N41B",41,null,14628,"L6N41B","TS3L6-ESPSTDAKN",1,"Upgrade: VMware vSphere  Essentials plus Kit OEM to vSphere Standard Acceleration Kit OEM for 6 processors 3 Years E-LTU","TS3-OpzA20HVMW1"]
["L6N42B",42,null,8372,"L6N42B","TS3L6-VCS7STDN",1,"VMware vCenter Server Standard OEM for vSphere 3 Years E-LTU","TS3-OpzA20HVMW2"]
["L6N43B",43,null,4872,"L6N43B","TS3L6-VS7EPLN",1,"VMware vSphere Enterprise Plus OEM for 1 processor 3 Years E-LTU","TS3-OpzA20HVMW3"]
["L6N44B",44,null,1558,"L6N44B","TS3L6-VS7STDN",1,"VMware vSphere Standard OEM for 1 processor 3 Years E-LTU","TS3-OpzA20HVMW4"]
["L6N45B",45,null,3478,"L6N45B","TS3L6-ST7STDN",1,"VMware vSAN Standard OEM for 1 processor 3 Years E-LTU","TS3-OpzA20HVMW5"]
["L6N46B",46,null,5579,"L6N46B","TS3L6-ST7ADVN",1,"VMware vSAN Advanced OEM for 1 processor 3 Years E-LTU","TS3-OpzA20HVMW6"]
["L6N47B",47,null,2200,"L6N47B","TS3L6-RACKMONON",1,"Armadio Rack HPE 42U 600x1200, comprensivo di 2 PDU Monofase 7.3kVA con 36 connettori C13 e 12 connettori C19 collegamento spina industriale 32A IEC-60309 3 poli (2P+T)","TS3-OpzA20RMONO"]
["L6N48B",48,null,2539,"L6N48B","TS3L6-RACK3PHN",1,"Armadio Rack HPE 42U 600x1200, comprensivo di 2 PDU Trifase 22kVA con 36 connettori C13 e 12 connettori C19 collegamento spina industriale 32A IEC-60309 5 poli (3P+N+T)","TS3-OpzA20R3PH"]
["L6N49B",49,null,800,"L6N49B","TS3L6-SASBAY1N",1,"Kit per ulteriori 8 HDD (HPE DL560 Gen10 8SFF HDD Bay1) comprensivo di SAS Expander","TS3-OpzA20HBAY1"]
["L6N50B",50,null,250,"L6N50B","TS3L6-DUAL32GBN",1,"HPE 32GB Dual microSD RAID 1 USB Boot Drive","TS3-OpzA20D32GB"]
["L6N51B",51,null,484,"L6N51B","TS3L6-CTRL-OSN",1,"HPE Controller PCIe OS Boot Device Raid1 2x480GB NVMe M.2 SSD","TS3-OpzA20CTRLOS"]
["L6N52B",52,null,235,"L6N52B","TS3L6-CTRL-EN",1,"HPE Smart Array Controller PCIe per Disk Enclosure esterno","TS3-OpzA20CTRLE"]
["L6N53B",53,null,15770,"L6N53B","TS3L6-E15Y247N",1,"HPE D3610 Enclosure, 12 x HDD 14TB SAS 7.2K LFF, 5Years 24x7","TS3-OpzA20E1524"]
["L6N54B",54,null,2542,"L6N54B","TS3L6-TESLAT4N",1,"HPE NVIDIA Tesla T4 16GB Module","TS3-OpzA20HPET4"]
["L6N55B",55,null,590,"L6N55B","TS3L6-P2200N",1,"NVIDIA Quadro P2200 GPU Module for HPE","TS3-OpzA20P2200"]
["L6N56B",56,null,124,"L6N56B","TS3L6-CTRL-AN",1,"HPE Smart Array Controller per Software Defined Storage in sostituzione del Controller in configurazione BASE","TS3-OpzA20CTRLA"]
["L6N57B",57,null,196,"L6N57B","TS3L6-CTRL-PN",1,"HPE Smart Array Controller PCIe per Software Defined Storage","TS3-OpzA20CTRLP"]
["L6N58B",58,null,114,"L6N58B","TS3L6-DAC10GB3MN",1,"Cavo DAC HPE 10GB SFP+ SFP+ 3 metri","TS3-OpzA20DAC10M3"]
["L6N59B",59,null,72,"L6N59B","TS3L6-OM4M2N",1,"HPE Premier Flex LC/LC OM4 2f 2m Cbl","TS3-OpzOM4M2"]
["L6N60B",60,null,149,"L6N60B","TS3L6-DAC25GBM3N",1,"HPE 25Gb SFP28 to SFP28 3m DAC","TS3-Opz25GBM3","844477-B21"]
["L6N61B",61,null,512,"L6N61B","TS3L6-10OTLRN",1,"HPE 10G SFP+ LR Transceiver","TS3-Opz10OTLR"]
["L6N62B",62,null,230,"L6N62B","TS3L6-10OTSRN",1,"HPE 10G SFP+ SR Transceiver","TS3-Opz10OTSR"]
["L6N63B",63,null,380,"L6N63B","TS3L6-X710SFPN",1,"HPE Ethernet 10Gb 2-port SFP+ X710-DA2 Adapter","TS3-OpzX710SFP","727055-B21"]
["L6N64B",64,null,298,"L6N64B","TS3L6-LAN10T",1,"HPE Ethernet 10Gb 2-port BASE-T BCM57416 Adapter","TS3-OpzA2010GBT","867707-B21"]
["L6N65B",65,null,292,"L6N65B","TS3L6-M2480GBN",1,"HPE 480GB SATA RI M.2 2280 5300P SSD","TS3-OpzM2480GB","P19890-B21","HPE"]
["L6N66",66,null,3200,"L6N66","TS3L6-UPSR8000",1,"HPE G2 R8000 UPS 230V Outlets (6) C19 (2) IEC 32A/6U Rackmount INTL","TS3-OpzA20UPSR8000",null,"HPE"]
["L6N66B",67,null,3200,"L6N66B","TS3L6-UPSR8000N",1,"HPE G2 R8000 UPS 230V Outlets (6) C19 (2) IEC 32A/6U Rackmount INTL","TS3-OpzA20UPSR8000",null,"HPE"]
["L6N68",68,null,null,"L6N68"]
["L6N69",69,null,null,"L6N69"]
["L6N70",70,null,null,"L6N70"]
["L6N71",71,null,null,"L6N71"]
["L6N72",72,null,null,"L6N72"]
["L6N73",73,null,null,"L6N73"]
["L6N74",74,null,null,"L6N74"]
["L6N75",75,null,null,"L6N75"]
["L6N76",76,null,null,"L6N76"]
["L6N77",77,null,null,"L6N77"]
["L6N78",78,null,null,"L6N78"]
["L6N79",79,null,null,"L6N79"]
["L6N80",80,null,null,"L6N80"]
["L6N81",81,null,null,"L6N81"]
["L6N82",82,null,null,"L6N82"]
["L6N83",83,null,null,"L6N83"]
["L6N84",84,null,null,"L6N84"]
["L6N85",85,null,null,"L6N85"]
["L6N86",86,null,null,"L6N86"]
["L6N87",87,null,null,"L6N87"]
["L6N88",88,null,null,"L6N88"]
["L6N89",89,null,null,"L6N89"]
["L6N90",90,null,null,"L6N90"]
["L6N91",91,null,null,"L6N91"]
["L6N92",92,null,null,"L6N92"]
["L6N93",93,null,null,"L6N93"]
["L6N94",94,null,null,"L6N94"]
["L6N95",95,null,null,"L6N95"]
["L6N96",96,null,null,"L6N96"]
["L6N97",97,null,null,"L6N97"]
["L6N98",98,null,null,"L6N98"]
["L6N99",99,null,null,"L6N99"]
["L6N100",100,null,null,"L6N100"]

{"sheet":"Riepilogo","index":6,"n_rows":157,"n_cols":28,"rows_kept":157,"cut":false,"hidden":false,"merged":[[155,1,155,5],[152,4,152,5],[152,1,152,2],[151,1,151,5],[154,1,154,5],[153,1,153,3],[153,4,153,5],[86,1,86,6],[20,1,20,6],[17,4,17,6],[1,3,1,6],[15,1,15,2],[10,3,10,6],[15,3,15,6],[12,4,12,6],[1,1,1,2],[3,1,3,2],[5,1,5,2],[7,1,7,2],[10,1,10,2]]}
[null,null,null,null,null,null,null,null,null,1]
[null,"Ente:",null,null,null,null,null,null,null,1,null,"ente",{"$f":"IF(D2>0,0,1)","v":1}]
[null,null,null,null,null,null,null,null,null,1]
[null,"Ordine N.",null,null,{"$f":"M7","v":"ERRORE DI MANCATA COMPILAZIONE DATI NECESSARI PER L'ORDINATIVO"},null,null,null,null,1,null,"N°ordine",{"$f":"IF(D4>0,0,1)","v":1}]
[null,null,null,null,{"$f":"M8","v":""},null,null,null,null,1]
[null,"Data",null,null,{"$f":"M9","v":""},null,null,null,null,1,null,"data",{"$f":"IF(D6>0,0,1)","v":1}]
[null,null,null,null,{"$f":"M10","v":""},null,null,null,null,1,null,"ERRORE1",{"$f":"IF(M2+M4+M6+M11+M13+M16+M18+O18+O13,\"ERRORE DI MANCATA COMPILAZIONE DATI NECESSARI PER L'ORDINATIVO\",\"\")","v":"ERRORE DI MANCATA COMPILAZIONE DATI NECESSARI PER L'ORDINATIVO"},{"$f":"IF(M7=\"\",0,1)","v":1}]
[null,"Totale IVA incl.",null,{"$f":"G156","v":0},{"$f":"IF(Q11=0,\"CONFIGURATORE OK\", \"\")","v":""},null,"Version 4.5",null,null,1,null,"Warning2",{"$f":"IF(G153>D153,\"!!! ATTENZIONE !!! L'IMPORTO 20% SUPERA IL VALORE MASSIMO CONSENTITO\",\"\")","v":""},{"$f":"IF(M8=\"\",0,1)","v":0}]
[null,null,null,null,null,null,null,null,null,1,null,"ERRORE3",{"$f":"\"\"","v":""},{"$f":"IF(M9=\"\",0,1)","v":0}]
[null,null,null,null,null,null,null,null,null,1,null,"Waning4",{"$f":"IF(N10>0,\"!!! ATTENZIONE !!! COMPLETARE IL CAMPO NOTE NELLE CONFIGURAZIONI\",\"\")","v":""},{"$f":"IF(M22>0,O10,0)+IF(N22>0,P10,0)+IF(O22>0,Q10,0)","v":0},{"$f":"IF(Lotto6_DL560_1!$H$34=\"Specificare la configurazione RAID per l'installazione del Sistema Operativo, se richiesto.\ne/o\ninserire eventuali note.\",1,0)","v":1},{"$f":"IF(Lotto6_DL560_2!$H$36=\"Specificare la configurazione RAID per l'installazione del Sistema Operativo, se richiesto.\ne/o\ninserire eventuali note.\",1,0)","v":0},{"$f":"IF(Lotto6_DL560_3!$H$31=\"Specificare la configurazione RAID per l'installazione del Sistema Operativo, se richiesto.\ne/o\ninserire eventuali note.\",1,0)","v":0}]
[null,"Referente Consegna",null,null,null,null,null,null,null,1,null,"ref1",{"$f":"IF(D11>0,0,1)","v":1},null,"Verifica Errori",null,{"$f":"N7+N9","v":1}]
[null,null,null,null,null,null,null,null,null,1]
[null,"Telefono",null,"email",null,null,null,null,null,1,null,"tel1",{"$f":"IF(C13>0,0,1)","v":1},"mail1",{"$f":"IF(E13>0,0,1)","v":1}]
[null,null,null,null,null,null,null,null,null,1]
[null,null,null,null,null,null,null,null,null,1]
[null,"Referente Installazione",null,null,null,null,null,null,null,1,null,"ref2",{"$f":"IF(D16>0,0,1)","v":1}]
[null,null,null,null,null,null,null,null,null,1]
[null,"Telefono",null,"email",null,null,null,null,null,1,null,"tel2",{"$f":"IF(C18>0,0,1)","v":1},"mail2",{"$f":"IF(E18>0,0,1)","v":1}]
[null,null,null,null,null,null,null,null,null,1]
[null,null,null,null,null,null,null,null,null,1,null,null,"Server1","Server2","Server3","Totale"]
[null,"TECNOLOGIE SERVER 3 LOTTO 6 - LISTA ARTICOLI IN CONVENZIONE -",null,null,null,null,null,null,null,{"$f":"IF($G$152>0,1,0)","v":0}]
[null,"Quantità","Codice Articolo Produttore","Codice Articolo Convenzione","Descrizione","Costo unitario","Costo complessivo",null,null,{"$f":"IF($G$152>0,1,0)","v":0},"Codice Convenzione","N°",{"$f":"Lotto6_DL560_1!F5","v":0},{"$f":"Lotto6_DL560_2!F5","v":0},{"$f":"Lotto6_DL560_3!F5","v":0},null,"Qty_1","Qty_2","Qty_3"]
[null,{"$f":"IF(P23>0,P23,\"\")","v":""},{"$f":"IF(B23=\"\",\"\",VLOOKUP(L23,Tabella_prezzi!$A$3:$K$138,9,FALSE))","v":""},{"$f":"IF(B23=\"\",\"\",VLOOKUP(L23,Tabella_prezzi!$A$3:$K$138,6,FALSE))","v":""},{"$f":"IF(B23=\"\",\"\",VLOOKUP(L23,Tabella_prezzi!$A$3:$K$138,8,FALSE))","v":""},{"$f":"IF(B23=\"\",\"\",VLOOKUP(L23,Tabella_prezzi!$A$3:$K$138,4,FALSE))","v":""},{"$f":"IF(C23=\"\",\"\",F23*B23)","v":""},null,null,{"$f":"IF(B23=\"\",0,1)","v":0},{"$f":"VLOOKUP(L23,Tabella_prezzi!A2:K138,6,FALSE)","v":"TS3L6-SRV"},"L6N01",{"$f":"COUNTIF(TS3L6_L6N_1,L23)*$M$22","v":0},{"$f":"COUNTIF(TS3L6_L6N_2,L23)*$N$22","v":0},{"$f":"COUNTIF(TS3L6_L6N_3,L23)*$O$22","v":0},{"$f":"SUM(M23:O23)","v":0},null,null,null,{"$f":"Lotto6_DL560_1!L9","v":"L6N01"},{"$f":"Lotto6_DL560_1!F9","v":""},{"$f":"Lotto6_DL560_2!L9","v":"L6N01"},{"$f":"Lotto6_DL560_2!F9","v":""},{"$f":"Lotto6_DL560_3!L9","v":"L6N01"},{"$f":"Lotto6_DL560_3!F9","v":""},null,{"$f":"ISODD(J23)","v":false},"server"]
[null,{"$f":"IF(P24>0,P24,\"\")","v":""},{"$f":"IF(B24=\"\",\"\",VLOOKUP(L24,Tabella_prezzi!$A$3:$K$138,9,FALSE))","v":""},{"$f":"IF(B24=\"\",\"\",VLOOKUP(L24,Tabella_prezzi!$A$3:$K$138,6,FALSE))","v":""},{"$f":"IF(B24=\"\",\"\",VLOOKUP(L24,Tabella_prezzi!$A$3:$K$138,8,FALSE))","v":""},{"$f":"IF(B24=\"\",\"\",VLOOKUP(L24,Tabella_prezzi!$A$3:$K$138,4,FALSE))","v":""},{"$f":"IF(C24=\"\",\"\",F24*B24)","v":""},null,null,{"$f":"IF(B24=\"\",0,1)","v":0},{"$f":"VLOOKUP(L24,Tabella_prezzi!A3:K139,6,FALSE)","v":"TS3L6-SRVNVME"},"L6N01b",{"$f":"COUNTIF(TS3L6_L6N_1,L24)*$M$22","v":0},{"$f":"COUNTIF(TS3L6_L6N_2,L24)*$N$22","v":0},{"$f":"COUNTIF(TS3L6_L6N_3,L24)*$O$22","v":0},{"$f":"SUM(M24:O24)","v":0},null,null,null,{"$f":"Lotto6_DL560_1!L10","v":0},{"$f":"Lotto6_DL560_1!F10","v":0},{"$f":"Lotto6_DL560_2!L10","v":0},{"$f":"Lotto6_DL560_2!F10","v":0},{"$f":"Lotto6_DL560_3!L10","v":0},{"$f":"Lotto6_DL560_3!F10","v":0},null,{"$f":"ISODD(J24)","v":false},"server"]
[null,{"$f":"IF(P25>0,P25,\"\")","v":""},{"$f":"IF(B25=\"\",\"\",VLOOKUP(L25,Tabella_prezzi!$A$3:$K$138,9,FALSE))","v":""},{"$f":"IF(B25=\"\",\"\",VLOOKUP(L25,Tabella_prezzi!$A$3:$K$138,6,FALSE))","v":""},{"$f":"IF(B25=\"\",\"\",VLOOKUP(L25,Tabella_prezzi!$A$3:$K$138,8,FALSE))","v":""},{"$f":"IF(B25=\"\",\"\",VLOOKUP(L25,Tabella_prezzi!$A$3:$K$138,4,FALSE))","v":""},{"$f":"IF(C25=\"\",\"\",F25*B25)","v":""},null,null,0,{"$f":"VLOOKUP(L25,Tabella_prezzi!A3:K139,6,FALSE)","v":"TS3L6-CPU"},"L6N02",{"$f":"COUNTIF(TS3L6_L6N_1,L25)*$M$22","v":0},{"$f":"COUNTIF(TS3L6_L6N_2,L25)*$N$22","v":0},{"$f":"COUNTIF(TS3L6_L6N_3,L25)*$O$22","v":0},0,null,null,null,{"$f":"Lotto6_DL560_1!L18","v":""},{"$f":"Lotto6_DL560_1!F18","v":0},{"$f":"Lotto6_DL560_2!L20","v":0},{"$f":"Lotto6_DL560_2!F20","v":0},{"$f":"Lotto6_DL560_3!L20","v":0},{"$f":"Lotto6_DL560_3!F20","v":0},null,{"$f":"ISODD(SUM($J$23:J25))","v":false},"Cpu"]
[null,{"$f":"IF(P26>0,P26,\"\")","v":""},{"$f":"IF(B26=\"\",\"\",VLOOKUP(L26,Tabella_prezzi!$A$3:$K$138,9,FALSE))","v":""},{"$f":"IF(B26=\"\",\"\",VLOOKUP(L26,Tabella_prezzi!$A$3:$K$138,6,FALSE))","v":""},{"$f":"IF(B26=\"\",\"\",VLOOKUP(L26,Tabella_prezzi!$A$3:$K$138,8,FALSE))","v":""},{"$f":"IF(B26=\"\",\"\",VLOOKUP(L26,Tabella_prezzi!$A$3:$K$138,4,FALSE))","v":""},{"$f":"IF(C26=\"\",\"\",F26*B26)","v":""},null,null,0,{"$f":"VLOOKUP(L26,Tabella_prezzi!A4:K140,6,FALSE)","v":"TS3L6-CPUN"},"L6N02b",{"$f":"COUNTIF(TS3L6_L6N_1,L26)*$M$22","v":0},{"$f":"COUNTIF(TS3L6_L6N_2,L26)*$N$22","v":0},{"$f":"COUNTIF(TS3L6_L6N_3,L26)*$O$22","v":0},{"$f":"SUM(M26:O26)","v":0},null,null,null,null,null,null,null,null,null,null,{"$f":"ISODD(SUM($J$23:J26))","v":false}]
[null,{"$f":"IF(P27>0,P27,\"\")","v":""},{"$f":"IF(B27=\"\",\"\",VLOOKUP(L27,Tabella_prezzi!$A$3:$K$138,9,FALSE))","v":""},{"$f":"IF(B27=\"\",\"\",VLOOKUP(L27,Tabella_prezzi!$A$3:$K$138,6,FALSE))","v":""},{"$f":"IF(B27=\"\",\"\",VLOOKUP(L27,Tabella_prezzi!$A$3:$K$138,8,FALSE))","v":""},{"$f":"IF(B27=\"\",\"\",VLOOKUP(L27,Tabella_prezzi!$A$3:$K$138,4,FALSE))","v":""},{"$f":"IF(C27=\"\",\"\",F27*B27)","v":""},null,null,0,{"$f":"VLOOKUP(L27,Tabella_prezzi!A3:K140,6,FALSE)","v":"TS3L6-RAM32"},"L6N03",{"$f":"COUNTIF(TS3L6_L6N_1,L27)*$M$22*Q27","v":0},{"$f":"COUNTIF(TS3L6_L6N_2,L27)*$N$22*R27","v":0},{"$f":"COUNTIF(TS3L6_L6N_3,L27)*$O$22*S27","v":0},0,{"$f":"Lotto6_DL560_1!$F$21","v":0},{"$f":"Lotto6_DL560_2!$F$21","v":0},{"$f":"Lotto6_DL560_3!$F$21","v":0},{"$f":"Lotto6_DL560_1!L21","v":""},{"$f":"Lotto6_DL560_1!F21","v":0},{"$f":"Lotto6_DL560_2!L24","v":0},{"$f":"Lotto6_DL560_2!F24","v":0},{"$f":"Lotto6_DL560_3!L24","v":0},{"$f":"Lotto6_DL560_3!F24","v":0},null,{"$f":"ISODD(SUM($J$23:J27))","v":false},"ram"]
[null,{"$f":"IF(P28>0,P28,\"\")","v":""},{"$f":"IF(B28=\"\",\"\",VLOOKUP(L28,Tabella_prezzi!$A$3:$K$138,9,FALSE))","v":""},{"$f":"IF(B28=\"\",\"\",VLOOKUP(L28,Tabella_prezzi!$A$3:$K$138,6,FALSE))","v":""},{"$f":"IF(B28=\"\",\"\",VLOOKUP(L28,Tabella_prezzi!$A$3:$K$138,8,FALSE))","v":""},{"$f":"IF(B28=\"\",\"\",VLOOKUP(L28,Tabella_prezzi!$A$3:$K$138,4,FALSE))","v":""},{"$f":"IF(C28=\"\",\"\",F28*B28)","v":""},null,null,{"$f":"IF(B28=\"\",0,1)","v":0},{"$f":"VLOOKUP(L28,Tabella_prezzi!A4:K141,6,FALSE)","v":"TS3L6-RAM32N"},"L6N03b",{"$f":"COUNTIF(TS3L6_L6N_1,L28)*$M$22*Q28","v":0},{"$f":"COUNTIF(TS3L6_L6N_2,L28)*$N$22*R28","v":0},{"$f":"COUNTIF(TS3L6_L6N_3,L28)*$O$22*S28","v":0},{"$f":"SUM(M28:O28)","v":0},{"$f":"Lotto6_DL560_1!$F$21","v":0},{"$f":"Lotto6_DL560_2!$F$21","v":0},{"$f":"Lotto6_DL560_3!$F$21","v":0},{"$f":"Lotto6_DL560_1!L22","v":""},{"$f":"Lotto6_DL560_1!F22","v":0},{"$f":"Lotto6_DL560_2!L25","v":""},{"$f":"Lotto6_DL560_2!F25","v":0},{"$f":"Lotto6_DL560_3!L25","v":""},{"$f":"Lotto6_DL560_3!F25","v":0},null,{"$f":"ISODD(SUM($J$23:J28))","v":false}]
[null,"",{"$f":"IF(B29=\"\",\"\",VLOOKUP(L29,Tabella_prezzi!$A$3:$K$138,9,FALSE))","v":""},{"$f":"IF(B29=\"\",\"\",VLOOKUP(L29,Tabella_prezzi!$A$3:$K$138,6,FALSE))","v":""},{"$f":"IF(B29=\"\",\"\",VLOOKUP(L29,Tabella_prezzi!$A$3:$K$138,8,FALSE))","v":""},{"$f":"IF(B29=\"\",\"\",VLOOKUP(L29,Tabella_prezzi!$A$3:$K$138,4,FALSE))","v":""},"",null,null,0,{"$f":"VLOOKUP(L29,Tabella_prezzi!A3:K141,6,FALSE)","v":"TS3L6-RAM64"},"L6N04",{"$f":"COUNTIF(TS3L6_L6N_1,L29)*$M$22*Q29","v":0},{"$f":"COUNTIF(TS3L6_L6N_2,L29)*$N$22*R29","v":0},{"$f":"COUNTIF(TS3L6_L6N_3,L29)*$O$22*S29","v":0},0,{"$f":"Lotto6_DL560_1!$F$22","v":0},{"$f":"Lotto6_DL560_2!$F$22","v":0},{"$f":"Lotto6_DL560_3!$F$22","v":0},{"$f":"Lotto6_DL560_1!L25","v":""},{"$f":"Lotto6_DL560_1!F25","v":0},{"$f":"Lotto6_DL560_2!L32","v":0},{"$f":"Lotto6_DL560_2!F32","v":0},{"$f":"Lotto6_DL560_3!L27","v":0},{"$f":"Lotto6_DL560_3!F27","v":0},null,{"$f":"ISODD(SUM($J$23:J29))","v":false},"ram"]
[null,{"$f":"IF(P30>0,P30,\"\")","v":""},{"$f":"IF(B30=\"\",\"\",VLOOKUP(L30,Tabella_prezzi!$A$3:$K$138,9,FALSE))","v":""},{"$f":"IF(B30=\"\",\"\",VLOOKUP(L30,Tabella_prezzi!$A$3:$K$138,6,FALSE))","v":""},{"$f":"IF(B30=\"\",\"\",VLOOKUP(L30,Tabella_prezzi!$A$3:$K$138,8,FALSE))","v":""},{"$f":"IF(B30=\"\",\"\",VLOOKUP(L30,Tabella_prezzi!$A$3:$K$138,4,FALSE))","v":""},{"$f":"IF(C30=\"\",\"\",F30*B30)","v":""},null,null,0,{"$f":"VLOOKUP(L30,Tabella_prezzi!A4:K142,6,FALSE)","v":"TS3L6-RAM64N"},"L6N04b",{"$f":"COUNTIF(TS3L6_L6N_1,L30)*$M$22*Q30","v":0},{"$f":"COUNTIF(TS3L6_L6N_2,L30)*$N$22*R30","v":0},{"$f":"COUNTIF(TS3L6_L6N_3,L30)*$O$22*S30","v":0},{"$f":"SUM(M30:O30)","v":0},{"$f":"Lotto6_DL560_1!$F$22","v":0},{"$f":"Lotto6_DL560_2!$F$22","v":0},{"$f":"Lotto6_DL560_3!$F$22","v":0},null,null,null,null,null,null,null,{"$f":"ISODD(SUM($J$23:J30))","v":false}]
[null,"",{"$f":"IF(B31=\"\",\"\",VLOOKUP(L31,Tabella_prezzi!$A$3:$K$138,9,FALSE))","v":""},{"$f":"IF(B31=\"\",\"\",VLOOKUP(L31,Tabella_prezzi!$A$3:$K$138,6,FALSE))","v":""},{"$f":"IF(B31=\"\",\"\",VLOOKUP(L31,Tabella_prezzi!$A$3:$K$138,8,FALSE))","v":""},{"$f":"IF(B31=\"\",\"\",VLOOKUP(L31,Tabella_prezzi!$A$3:$K$138,4,FALSE))","v":""},"",null,null,0,{"$f":"VLOOKUP(L31,Tabella_prezzi!A3:K142,6,FALSE)","v":"TS3L6-LAN1"},"L6N05",{"$f":"COUNTIF(TS3L6_L6N_1,L31)*$M$22","v":0},{"$f":"COUNTIF(TS3L6_L6N_2,L31)*$N$22","v":0},{"$f":"COUNTIF(TS3L6_L6N_3,L31)*$O$22","v":0},0,null,null,null,{"$f":"Lotto6_DL560_1!L39","v":"L6N12"},{"$f":"Lotto6_DL560_1!F39","v":0},{"$f":"Lotto6_DL560_2!L39","v":"L6N12"},{"$f":"Lotto6_DL560_2!F40","v":0},{"$f":"Lotto6_DL560_3!L35","v":0},{"$f":"Lotto6_DL560_3!F35","v":"Disponibili"},null,{"$f":"ISODD(SUM($J$23:J31))","v":false},"Sist Op"]
[null,"",{"$f":"IF(B32=\"\",\"\",VLOOKUP(L32,Tabella_prezzi!$A$3:$K$138,9,FALSE))","v":""},{"$f":"IF(B32=\"\",\"\",VLOOKUP(L32,Tabella_prezzi!$A$3:$K$138,6,FALSE))","v":""},{"$f":"IF(B32=\"\",\"\",VLOOKUP(L32,Tabella_prezzi!$A$3:$K$138,8,FALSE))","v":""},{"$f":"IF(B32=\"\",\"\",VLOOKUP(L32,Tabella_prezzi!$A$3:$K$138,4,FALSE))","v":""},"",null,null,0,{"$f":"VLOOKUP(L32,Tabella_prezzi!A3:K143,6,FALSE)","v":"TS3L6-LAN1N"},"L6N05b",0,0,0,0,null,null,null,{"$f":"Lotto6_DL560_1!L41","v":"L6N11"},{"$f":"Lotto6_DL560_1!F41","v":0},{"$f":"Lotto6_DL560_2!L42","v":0},{"$f":"Lotto6_DL560_2!F42","v":0},{"$f":"Lotto6_DL560_3!L37","v":0},{"$f":"Lotto6_DL560_3!F37","v":""},null,{"$f":"ISODD(SUM($J$23:J32))","v":false},"hd2tb"]
[null,"",{"$f":"IF(B33=\"\",\"\",VLOOKUP(L33,Tabella_prezzi!$A$3:$K$138,9,FALSE))","v":""},{"$f":"IF(B33=\"\",\"\",VLOOKUP(L33,Tabella_prezzi!$A$3:$K$138,6,FALSE))","v":""},{"$f":"IF(B33=\"\",\"\",VLOOKUP(L33,Tabella_prezzi!$A$3:$K$138,8,FALSE))","v":""},{"$f":"IF(B33=\"\",\"\",VLOOKUP(L33,Tabella_prezzi!$A$3:$K$138,4,FALSE))","v":""},"",null,null,0,{"$f":"VLOOKUP(L33,Tabella_prezzi!A3:K144,6,FALSE)","v":"TS3L6-LAN10"},"L6N06",0,0,0,0,null,null,null,{"$f":"Lotto6_DL560_1!L43","v":"L6N10"},{"$f":"Lotto6_DL560_1!F43","v":0},{"$f":"Lotto6_DL560_2!L44","v":0},{"$f":"Lotto6_DL560_2!F44","v":0},{"$f":"Lotto6_DL560_3!L39","v":"L6N12"},{"$f":"Lotto6_DL560_3!F39","v":0},null,{"$f":"ISODD(SUM($J$23:J33))","v":false},"hd1tb"]
[null,"",{"$f":"IF(B34=\"\",\"\",VLOOKUP(L34,Tabella_prezzi!$A$3:$K$138,9,FALSE))","v":""},{"$f":"IF(B34=\"\",\"\",VLOOKUP(L34,Tabella_prezzi!$A$3:$K$138,6,FALSE))","v":""},{"$f":"IF(B34=\"\",\"\",VLOOKUP(L34,Tabella_prezzi!$A$3:$K$138,8,FALSE))","v":""},{"$f":"IF(B34=\"\",\"\",VLOOKUP(L34,Tabella_prezzi!$A$3:$K$138,4,FALSE))","v":""},"",null,null,0,{"$f":"VLOOKUP(L34,Tabella_prezzi!A3:K145,6,FALSE)","v":"TS3L6-LAN10N"},"L6N06b",0,0,0,0,null,null,null,{"$f":"Lotto6_DL560_1!#REF!","v":{"$error":"#REF!"}},{"$f":"Lotto6_DL560_1!#REF!","v":{"$error":"#REF!"}},{"$f":"Lotto6_DL560_2!L46","v":0},{"$f":"Lotto6_DL560_2!F46","v":0},{"$f":"Lotto6_DL560_3!L41","v":"L6N11"},{"$f":"Lotto6_DL560_3!F41","v":0},null,{"$f":"ISODD(SUM($J$23:J34))","v":false},"hd300gb"]
[null,"",{"$f":"IF(B35=\"\",\"\",VLOOKUP(L35,Tabella_prezzi!$A$3:$K$138,9,FALSE))","v":""},{"$f":"IF(B35=\"\",\"\",VLOOKUP(L35,Tabella_prezzi!$A$3:$K$138,6,FALSE))","v":""},{"$f":"IF(B35=\"\",\"\",VLOOKUP(L35,Tabella_prezzi!$A$3:$K$138,8,FALSE))","v":""},{"$f":"IF(B35=\"\",\"\",VLOOKUP(L35,Tabella_prezzi!$A$3:$K$138,4,FALSE))","v":""},"",null,null,0,{"$f":"VLOOKUP(L35,Tabella_prezzi!A3:K146,6,FALSE)","v":"TS3L6-LAN25"},"L6N07",0,0,0,0,null,null,null,{"$f":"Lotto6_DL560_1!#REF!","v":{"$error":"#REF!"}},{"$f":"Lotto6_DL560_1!#REF!","v":{"$error":"#REF!"}},{"$f":"Lotto6_DL560_2!L48","v":0},{"$f":"Lotto6_DL560_2!F48","v":0},{"$f":"Lotto6_DL560_3!L43","v":"L6N10"},{"$f":"Lotto6_DL560_3!F43","v":0},null,{"$f":"ISODD(SUM($J$23:J35))","v":false},"ssd960GB"]
[null,"",{"$f":"IF(B36=\"\",\"\",VLOOKUP(L36,Tabella_prezzi!$A$3:$K$138,9,FALSE))","v":""},{"$f":"IF(B36=\"\",\"\",VLOOKUP(L36,Tabella_prezzi!$A$3:$K$138,6,FALSE))","v":""},{"$f":"IF(B36=\"\",\"\",VLOOKUP(L36,Tabella_prezzi!$A$3:$K$138,8,FALSE))","v":""},{"$f":"IF(B36=\"\",\"\",VLOOKUP(L36,Tabella_prezzi!$A$3:$K$138,4,FALSE))","v":""},"",null,null,0,{"$f":"VLOOKUP(L36,Tabella_prezzi!A3:K147,6,FALSE)","v":"TS3L6-LAN25N"},"L6N07b",0,0,0,0,null,null,null,{"$f":"Lotto6_DL560_1!L72","v":""},{"$f":"Lotto6_DL560_1!F72","v":""},{"$f":"Lotto6_DL560_2!L57","v":0},{"$f":"Lotto6_DL560_2!F57","v":0},{"$f":"Lotto6_DL560_3!L52","v":0},{"$f":"Lotto6_DL560_3!F52","v":0},null,{"$f":"ISODD(SUM($J$23:J36))","v":false},"ssd480GB"]
[null,"",{"$f":"IF(B37=\"\",\"\",VLOOKUP(L37,Tabella_prezzi!$A$3:$K$138,9,FALSE))","v":""},{"$f":"IF(B37=\"\",\"\",VLOOKUP(L37,Tabella_prezzi!$A$3:$K$138,6,FALSE))","v":""},{"$f":"IF(B37=\"\",\"\",VLOOKUP(L37,Tabella_prezzi!$A$3:$K$138,8,FALSE))","v":""},{"$f":"IF(B37=\"\",\"\",VLOOKUP(L37,Tabella_prezzi!$A$3:$K$138,4,FALSE))","v":""},"",null,null,0,{"$f":"VLOOKUP(L37,Tabella_prezzi!A3:K148,6,FALSE)","v":"TS3L6-CNA10"},"L6N08",0,0,0,0,null,null,null,{"$f":"Lotto6_DL560_1!L75","v":""},{"$f":"Lotto6_DL560_1!F75","v":""},{"$f":"Lotto6_DL560_2!L60","v":0},{"$f":"Lotto6_DL560_2!F60","v":0},{"$f":"Lotto6_DL560_3!L55","v":""},{"$f":"Lotto6_DL560_3!F55","v":0},null,{"$f":"ISODD(SUM($J$23:J37))","v":false},"pci1"]
[null,"",{"$f":"IF(B38=\"\",\"\",VLOOKUP(L38,Tabella_prezzi!$A$3:$K$138,9,FALSE))","v":""},{"$f":"IF(B38=\"\",\"\",VLOOKUP(L38,Tabella_prezzi!$A$3:$K$138,6,FALSE))","v":""},{"$f":"IF(B38=\"\",\"\",VLOOKUP(L38,Tabella_prezzi!$A$3:$K$138,8,FALSE))","v":""},{"$f":"IF(B38=\"\",\"\",VLOOKUP(L38,Tabella_prezzi!$A$3:$K$138,4,FALSE))","v":""},"",null,null,0,{"$f":"VLOOKUP(L38,Tabella_prezzi!A3:K149,6,FALSE)","v":"TS3L6-CNA10N"},"L6N08b",0,0,0,0,null,null,null,{"$f":"Lotto6_DL560_1!L78","v":""},{"$f":"Lotto6_DL560_1!F78","v":""},{"$f":"Lotto6_DL560_2!L66","v":0},{"$f":"Lotto6_DL560_2!F66","v":0},{"$f":"Lotto6_DL560_3!L58","v":0},{"$f":"Lotto6_DL560_3!F58","v":0},null,{"$f":"ISODD(SUM($J$23:J38))","v":false},"pci2"]
[null,"",{"$f":"IF(B39=\"\",\"\",VLOOKUP(L39,Tabella_prezzi!$A$3:$K$138,9,FALSE))","v":""},{"$f":"IF(B39=\"\",\"\",VLOOKUP(L39,Tabella_prezzi!$A$3:$K$138,6,FALSE))","v":""},{"$f":"IF(B39=\"\",\"\",VLOOKUP(L39,Tabella_prezzi!$A$3:$K$138,8,FALSE))","v":""},{"$f":"IF(B39=\"\",\"\",VLOOKUP(L39,Tabella_prezzi!$A$3:$K$138,4,FALSE))","v":""},"",null,null,0,{"$f":"VLOOKUP(L39,Tabella_prezzi!A3:K150,6,FALSE)","v":"TS3L6-FC16"},"L6N09",0,0,0,0,null,null,null,{"$f":"Lotto6_DL560_1!L81","v":""},{"$f":"Lotto6_DL560_1!F81","v":""},{"$f":"Lotto6_DL560_2!L69","v":0},{"$f":"Lotto6_DL560_2!F69","v":0},{"$f":"Lotto6_DL560_3!L61","v":""},{"$f":"Lotto6_DL560_3!F61","v":""},null,{"$f":"ISODD(SUM($J$23:J39))","v":false},"pci3"]
[null,"",{"$f":"IF(B40=\"\",\"\",VLOOKUP(L40,Tabella_prezzi!$A$3:$K$138,9,FALSE))","v":""},{"$f":"IF(B40=\"\",\"\",VLOOKUP(L40,Tabella_prezzi!$A$3:$K$138,6,FALSE))","v":""},{"$f":"IF(B40=\"\",\"\",VLOOKUP(L40,Tabella_prezzi!$A$3:$K$138,8,FALSE))","v":""},{"$f":"IF(B40=\"\",\"\",VLOOKUP(L40,Tabella_prezzi!$A$3:$K$138,4,FALSE))","v":""},"",null,null,0,{"$f":"VLOOKUP(L40,Tabella_prezzi!A3:K151,6,FALSE)","v":"TS3L6-FC16N"},"L6N09b",0,0,0,0,null,null,null,{"$f":"Lotto6_DL560_1!L84","v":""},{"$f":"Lotto6_DL560_1!F84","v":""},{"$f":"Lotto6_DL560_2!L72","v":""},{"$f":"Lotto6_DL560_2!F72","v":""},{"$f":"Lotto6_DL560_3!L64","v":""},{"$f":"Lotto6_DL560_3!F64","v":""},null,{"$f":"ISODD(SUM($J$23:J40))","v":false},"pci4"]
[null,"",{"$f":"IF(B41=\"\",\"\",VLOOKUP(L41,Tabella_prezzi!$A$3:$K$138,9,FALSE))","v":""},{"$f":"IF(B41=\"\",\"\",VLOOKUP(L41,Tabella_prezzi!$A$3:$K$138,6,FALSE))","v":""},{"$f":"IF(B41=\"\",\"\",VLOOKUP(L41,Tabella_prezzi!$A$3:$K$138,8,FALSE))","v":""},{"$f":"IF(B41=\"\",\"\",VLOOKUP(L41,Tabella_prezzi!$A$3:$K$138,4,FALSE))","v":""},"",null,null,0,{"$f":"VLOOKUP(L41,Tabella_prezzi!A3:K152,6,FALSE)","v":"TS3L6-HDD2TB"},"L6N10",{"$f":"COUNTIF(TS3L6_L6N_1,L41)*$M$22*Q41","v":0},{"$f":"COUNTIF(TS3L6_L6N_2,L41)*$N$22*R41","v":0},{"$f":"COUNTIF(TS3L6_L6N_3,L41)*$O$22*S41","v":0},0,{"$f":"Lotto6_DL560_1!$F$43","v":0},{"$f":"Lotto6_DL560_2!$F$43","v":0},{"$f":"Lotto6_DL560_3!$F$43","v":0},{"$f":"Lotto6_DL560_1!L87","v":""},{"$f":"Lotto6_DL560_1!F87","v":""},{"$f":"Lotto6_DL560_2!L75","v":""},{"$f":"Lotto6_DL560_2!F75","v":""},{"$f":"Lotto6_DL560_3!L67","v":0},{"$f":"Lotto6_DL560_3!F67","v":0},null,{"$f":"ISODD(SUM($J$23:J41))","v":false},"pci5"]
[null,"",{"$f":"IF(B42=\"\",\"\",VLOOKUP(L42,Tabella_prezzi!$A$3:$K$138,9,FALSE))","v":""},{"$f":"IF(B42=\"\",\"\",VLOOKUP(L42,Tabella_prezzi!$A$3:$K$138,6,FALSE))","v":""},{"$f":"IF(B42=\"\",\"\",VLOOKUP(L42,Tabella_prezzi!$A$3:$K$138,8,FALSE))","v":""},{"$f":"IF(B42=\"\",\"\",VLOOKUP(L42,Tabella_prezzi!$A$3:$K$138,4,FALSE))","v":""},"",null,null,0,{"$f":"VLOOKUP(L42,Tabella_prezzi!A4:K153,6,FALSE)","v":"TS3L6-HDD2TBN"},"L6N10b",{"$f":"COUNTIF(TS3L6_L6N_1,L42)*$M$22*Q42","v":0},{"$f":"COUNTIF(TS3L6_L6N_2,L42)*$N$22*R42","v":0},{"$f":"COUNTIF(TS3L6_L6N_3,L42)*$O$22*S42","v":0},{"$f":"SUM(M42:O42)","v":0},{"$f":"Lotto6_DL560_1!$F$43","v":0},{"$f":"Lotto6_DL560_2!$F$43","v":0},{"$f":"Lotto6_DL560_3!$F$43","v":0},null,null,null,null,null,null,null,{"$f":"ISODD(SUM($J$23:J42))","v":false}]
[null,"",{"$f":"IF(B43=\"\",\"\",VLOOKUP(L43,Tabella_prezzi!$A$3:$K$138,9,FALSE))","v":""},{"$f":"IF(B43=\"\",\"\",VLOOKUP(L43,Tabella_prezzi!$A$3:$K$138,6,FALSE))","v":""},{"$f":"IF(B43=\"\",\"\",VLOOKUP(L43,Tabella_prezzi!$A$3:$K$138,8,FALSE))","v":""},{"$f":"IF(B43=\"\",\"\",VLOOKUP(L43,Tabella_prezzi!$A$3:$K$138,4,FALSE))","v":""},"",null,null,0,{"$f":"VLOOKUP(L43,Tabella_prezzi!A3:K153,6,FALSE)","v":"TS3L6-HDD1TB"},"L6N11",0,0,0,0,{"$f":"Lotto6_DL560_1!$F$41","v":0},{"$f":"Lotto6_DL560_2!$F$41","v":0},{"$f":"Lotto6_DL560_3!$F$41","v":0},{"$f":"Lotto6_DL560_1!L90","v":""},{"$f":"Lotto6_DL560_1!F90","v":""},{"$f":"Lotto6_DL560_2!L78","v":""},{"$f":"Lotto6_DL560_2!F78","v":""},{"$f":"Lotto6_DL560_3!L70","v":0},{"$f":"Lotto6_DL560_3!F70","v":0},null,{"$f":"ISODD(SUM($J$23:J43))","v":false},"pci6"]
[null,"",{"$f":"IF(B44=\"\",\"\",VLOOKUP(L44,Tabella_prezzi!$A$3:$K$138,9,FALSE))","v":""},{"$f":"IF(B44=\"\",\"\",VLOOKUP(L44,Tabella_prezzi!$A$3:$K$138,6,FALSE))","v":""},{"$f":"IF(B44=\"\",\"\",VLOOKUP(L44,Tabella_prezzi!$A$3:$K$138,8,FALSE))","v":""},{"$f":"IF(B44=\"\",\"\",VLOOKUP(L44,Tabella_prezzi!$A$3:$K$138,4,FALSE))","v":""},"",null,null,0,{"$f":"VLOOKUP(L44,Tabella_prezzi!A4:K154,6,FALSE)","v":"TS3L6-HDD1TBN"},"L6N11b",{"$f":"COUNTIF(TS3L6_L6N_1,L44)*$M$22*Q44","v":0},{"$f":"COUNTIF(TS3L6_L6N_2,L44)*$N$22*R44","v":0},{"$f":"COUNTIF(TS3L6_L6N_3,L44)*$O$22*S44","v":0},{"$f":"SUM(M44:O44)","v":0},{"$f":"Lotto6_DL560_1!$F$41","v":0},{"$f":"Lotto6_DL560_2!$F$41","v":0},{"$f":"Lotto6_DL560_3!$F$41","v":0},null,null,null,null,null,null,null,{"$f":"ISODD(SUM($J$23:J44))","v":false}]
[null,"",{"$f":"IF(B45=\"\",\"\",VLOOKUP(L45,Tabella_prezzi!$A$3:$K$138,9,FALSE))","v":""},{"$f":"IF(B45=\"\",\"\",VLOOKUP(L45,Tabella_prezzi!$A$3:$K$138,6,FALSE))","v":""},{"$f":"IF(B45=\"\",\"\",VLOOKUP(L45,Tabella_prezzi!$A$3:$K$138,8,FALSE))","v":""},{"$f":"IF(B45=\"\",\"\",VLOOKUP(L45,Tabella_prezzi!$A$3:$K$138,4,FALSE))","v":""},"",null,null,0,{"$f":"VLOOKUP(L45,Tabella_prezzi!A3:K154,6,FALSE)","v":"TS3L6-HDD300GB"},"L6N12",0,0,0,0,{"$f":"Lotto6_DL560_1!$F$39","v":0},{"$f":"Lotto6_DL560_2!$F$39","v":0},{"$f":"Lotto6_DL560_3!$F$39","v":0},{"$f":"Lotto6_DL560_1!L93","v":""},{"$f":"Lotto6_DL560_1!F93","v":""},{"$f":"Lotto6_DL560_2!L81","v":""},{"$f":"Lotto6_DL560_2!F81","v":""},{"$f":"Lotto6_DL560_3!L73","v":0},{"$f":"Lotto6_DL560_3!F73","v":0},null,{"$f":"ISODD(SUM($J$23:J45))","v":false},"pci7"]
[null,"",{"$f":"IF(B46=\"\",\"\",VLOOKUP(L46,Tabella_prezzi!$A$3:$K$138,9,FALSE))","v":""},{"$f":"IF(B46=\"\",\"\",VLOOKUP(L46,Tabella_prezzi!$A$3:$K$138,6,FALSE))","v":""},{"$f":"IF(B46=\"\",\"\",VLOOKUP(L46,Tabella_prezzi!$A$3:$K$138,8,FALSE))","v":""},{"$f":"IF(B46=\"\",\"\",VLOOKUP(L46,Tabella_prezzi!$A$3:$K$138,4,FALSE))","v":""},"",null,null,0,{"$f":"VLOOKUP(L46,Tabella_prezzi!A6:K156,6,FALSE)","v":"TS3L6-HDD300GBN"},"L6N12b",{"$f":"COUNTIF(TS3L6_L6N_1,L46)*$M$22*Q46","v":0},{"$f":"COUNTIF(TS3L6_L6N_2,L46)*$N$22*R46","v":0},{"$f":"COUNTIF(TS3L6_L6N_3,L46)*$O$22*S46","v":0},{"$f":"SUM(M46:O46)","v":0},{"$f":"Lotto6_DL560_1!$F$39","v":0},{"$f":"Lotto6_DL560_2!$F$39","v":0},{"$f":"Lotto6_DL560_3!$F$39","v":0},null,null,null,null,null,null,null,{"$f":"ISODD(SUM($J$23:J46))","v":false}]
[null,"",{"$f":"IF(B47=\"\",\"\",VLOOKUP(L47,Tabella_prezzi!$A$3:$K$138,9,FALSE))","v":""},{"$f":"IF(B47=\"\",\"\",VLOOKUP(L47,Tabella_prezzi!$A$3:$K$138,6,FALSE))","v":""},{"$f":"IF(B47=\"\",\"\",VLOOKUP(L47,Tabella_prezzi!$A$3:$K$138,8,FALSE))","v":""},{"$f":"IF(B47=\"\",\"\",VLOOKUP(L47,Tabella_prezzi!$A$3:$K$138,4,FALSE))","v":""},"",null,null,0,{"$f":"VLOOKUP(L47,Tabella_prezzi!A3:K155,6,FALSE)","v":"TS3L6-RI1600GB"},"L6N13",0,0,0,0,{"$f":"Lotto6_DL560_1!$F$47","v":0},{"$f":"Lotto6_DL560_2!$F$47","v":0},{"$f":"Lotto6_DL560_3!$F$47","v":0},{"$f":"Lotto6_DL560_1!L26","v":0},{"$f":"Lotto6_DL560_1!F26","v":0},{"$f":"Lotto6_DL560_2!L33","v":""},{"$f":"Lotto6_DL560_2!F33","v":""},{"$f":"Lotto6_DL560_3!L28","v":0},{"$f":"Lotto6_DL560_3!F28","v":0},null,{"$f":"ISODD(SUM($J$23:J47))","v":false},"pci8"]
[null,"",{"$f":"IF(B48=\"\",\"\",VLOOKUP(L48,Tabella_prezzi!$A$3:$K$138,9,FALSE))","v":""},{"$f":"IF(B48=\"\",\"\",VLOOKUP(L48,Tabella_prezzi!$A$3:$K$138,6,FALSE))","v":""},{"$f":"IF(B48=\"\",\"\",VLOOKUP(L48,Tabella_prezzi!$A$3:$K$138,8,FALSE))","v":""},{"$f":"IF(B48=\"\",\"\",VLOOKUP(L48,Tabella_prezzi!$A$3:$K$138,4,FALSE))","v":""},"",null,null,0,{"$f":"VLOOKUP(L48,Tabella_prezzi!A8:K158,6,FALSE)","v":"TS3L6-RI1600GBN"},"L6N13b",{"$f":"COUNTIF(TS3L6_L6N_1,L48)*$M$22*Q48","v":0},{"$f":"COUNTIF(TS3L6_L6N_2,L48)*$N$22*R48","v":0},{"$f":"COUNTIF(TS3L6_L6N_3,L48)*$O$22*S48","v":0},{"$f":"SUM(M48:O48)","v":0},{"$f":"Lotto6_DL560_1!$F$47","v":0},{"$f":"Lotto6_DL560_2!$F$47","v":0},{"$f":"Lotto6_DL560_3!$F$47","v":0},null,null,null,null,null,null,null,{"$f":"ISODD(SUM($J$23:J48))","v":false}]
[null,"",{"$f":"IF(B49=\"\",\"\",VLOOKUP(L49,Tabella_prezzi!$A$3:$K$138,9,FALSE))","v":""},{"$f":"IF(B49=\"\",\"\",VLOOKUP(L49,Tabella_prezzi!$A$3:$K$138,6,FALSE))","v":""},{"$f":"IF(B49=\"\",\"\",VLOOKUP(L49,Tabella_prezzi!$A$3:$K$138,8,FALSE))","v":""},{"$f":"IF(B49=\"\",\"\",VLOOKUP(L49,Tabella_prezzi!$A$3:$K$138,4,FALSE))","v":""},"",null,null,0,{"$f":"VLOOKUP(L49,Tabella_prezzi!A3:K156,6,FALSE)","v":"TS3L6-MU1600GB"},"L6N14",0,0,0,0,{"$f":"Lotto6_DL560_1!$F$51","v":0},{"$f":"Lotto6_DL560_2!$F$51","v":0},{"$f":"Lotto6_DL560_3!$F$51","v":0},null,null,null,null,null,null,null,{"$f":"ISODD(SUM($J$23:J49))","v":false},"win2core"]
[null,"",{"$f":"IF(B50=\"\",\"\",VLOOKUP(L50,Tabella_prezzi!$A$3:$K$138,9,FALSE))","v":""},{"$f":"IF(B50=\"\",\"\",VLOOKUP(L50,Tabella_prezzi!$A$3:$K$138,6,FALSE))","v":""},{"$f":"IF(B50=\"\",\"\",VLOOKUP(L50,Tabella_prezzi!$A$3:$K$138,8,FALSE))","v":""},{"$f":"IF(B50=\"\",\"\",VLOOKUP(L50,Tabella_prezzi!$A$3:$K$138,4,FALSE))","v":""},"",null,null,0,{"$f":"VLOOKUP(L50,Tabella_prezzi!A10:K160,6,FALSE)","v":"TS3L6-MU1600GBN"},"L6N14b",{"$f":"COUNTIF(TS3L6_L6N_1,L50)*$M$22*Q50","v":0},{"$f":"COUNTIF(TS3L6_L6N_2,L50)*$N$22*R50","v":0},{"$f":"COUNTIF(TS3L6_L6N_3,L50)*$O$22*S50","v":0},{"$f":"SUM(M50:O50)","v":0},{"$f":"Lotto6_DL560_1!$F$51","v":0},{"$f":"Lotto6_DL560_2!$F$51","v":0},{"$f":"Lotto6_DL560_3!$F$51","v":0},null,null,null,null,null,null,null,{"$f":"ISODD(SUM($J$23:J50))","v":false}]
[null,"",{"$f":"IF(B51=\"\",\"\",VLOOKUP(L51,Tabella_prezzi!$A$3:$K$138,9,FALSE))","v":""},{"$f":"IF(B51=\"\",\"\",VLOOKUP(L51,Tabella_prezzi!$A$3:$K$138,6,FALSE))","v":""},{"$f":"IF(B51=\"\",\"\",VLOOKUP(L51,Tabella_prezzi!$A$3:$K$138,8,FALSE))","v":""},{"$f":"IF(B51=\"\",\"\",VLOOKUP(L51,Tabella_prezzi!$A$3:$K$138,4,FALSE))","v":""},"",null,null,0,{"$f":"VLOOKUP(L51,Tabella_prezzi!A3:K157,6,FALSE)","v":"TS3L6-RI800GB"},"L6N15",0,0,0,0,{"$f":"Lotto6_DL560_1!$F$45","v":0},{"$f":"Lotto6_DL560_2!$F$45","v":0},{"$f":"Lotto6_DL560_3!$F$45","v":0},null,null,null,null,null,null,null,{"$f":"ISODD(SUM($J$23:J51))","v":false}]
[null,"",{"$f":"IF(B52=\"\",\"\",VLOOKUP(L52,Tabella_prezzi!$A$3:$K$138,9,FALSE))","v":""},{"$f":"IF(B52=\"\",\"\",VLOOKUP(L52,Tabella_prezzi!$A$3:$K$138,6,FALSE))","v":""},{"$f":"IF(B52=\"\",\"\",VLOOKUP(L52,Tabella_prezzi!$A$3:$K$138,8,FALSE))","v":""},{"$f":"IF(B52=\"\",\"\",VLOOKUP(L52,Tabella_prezzi!$A$3:$K$138,4,FALSE))","v":""},"",null,null,0,{"$f":"VLOOKUP(L52,Tabella_prezzi!A12:K162,6,FALSE)","v":"TS3L6-RI800GBN"},"L6N15b",{"$f":"COUNTIF(TS3L6_L6N_1,L52)*$M$22*Q52","v":0},{"$f":"COUNTIF(TS3L6_L6N_2,L52)*$N$22*R52","v":0},{"$f":"COUNTIF(TS3L6_L6N_3,L52)*$O$22*S52","v":0},{"$f":"SUM(M52:O52)","v":0},{"$f":"Lotto6_DL560_1!$F$45","v":0},{"$f":"Lotto6_DL560_2!$F$45","v":0},{"$f":"Lotto6_DL560_3!$F$45","v":0},null,null,null,null,null,null,null,{"$f":"ISODD(SUM($J$23:J52))","v":false}]
[null,"",{"$f":"IF(B53=\"\",\"\",VLOOKUP(L53,Tabella_prezzi!$A$3:$K$138,9,FALSE))","v":""},{"$f":"IF(B53=\"\",\"\",VLOOKUP(L53,Tabella_prezzi!$A$3:$K$138,6,FALSE))","v":""},{"$f":"IF(B53=\"\",\"\",VLOOKUP(L53,Tabella_prezzi!$A$3:$K$138,8,FALSE))","v":""},{"$f":"IF(B53=\"\",\"\",VLOOKUP(L53,Tabella_prezzi!$A$3:$K$138,4,FALSE))","v":""},"",null,null,0,{"$f":"VLOOKUP(L53,Tabella_prezzi!A3:K158,6,FALSE)","v":"TS3L6-MU800GB"},"L6N16",0,0,0,0,{"$f":"Lotto6_DL560_1!$F$49-2","v":0},{"$f":"Lotto6_DL560_2!$F$49-2","v":0},{"$f":"Lotto6_DL560_3!$F$49-2","v":0},{"$f":"COUNTIF(TS3L6_L6N_1,L53)","v":1},null,null,null,null,null,null,{"$f":"ISODD(SUM($J$23:J53))","v":false}]
[null,"",{"$f":"IF(B54=\"\",\"\",VLOOKUP(L54,Tabella_prezzi!$A$3:$K$138,9,FALSE))","v":""},{"$f":"IF(B54=\"\",\"\",VLOOKUP(L54,Tabella_prezzi!$A$3:$K$138,6,FALSE))","v":""},{"$f":"IF(B54=\"\",\"\",VLOOKUP(L54,Tabella_prezzi!$A$3:$K$138,8,FALSE))","v":""},{"$f":"IF(B54=\"\",\"\",VLOOKUP(L54,Tabella_prezzi!$A$3:$K$138,4,FALSE))","v":""},"",null,null,0,{"$f":"VLOOKUP(L54,Tabella_prezzi!A14:K164,6,FALSE)","v":"TS3L6-MU800GBN"},"L6N16b",{"$f":"COUNTIF(TS3L6_L6N_1,L54)*$M$22*Q54","v":0},{"$f":"COUNTIF(TS3L6_L6N_2,L54)*$N$22*R54","v":0},{"$f":"COUNTIF(TS3L6_L6N_3,L54)*$O$22*S54","v":0},{"$f":"SUM(M54:O54)","v":0},{"$f":"Lotto6_DL560_1!$F$49-2","v":0},{"$f":"Lotto6_DL560_2!$F$49-2","v":0},{"$f":"Lotto6_DL560_3!$F$49-2","v":0},{"$f":"COUNTIF(TS3L6_L6N_1,L54)","v":0},null,null,null,null,null,null,{"$f":"ISODD(SUM($J$23:J54))","v":false}]
[null,"",{"$f":"IF(B55=\"\",\"\",VLOOKUP(L55,Tabella_prezzi!$A$3:$K$138,9,FALSE))","v":""},{"$f":"IF(B55=\"\",\"\",VLOOKUP(L55,Tabella_prezzi!$A$3:$K$138,6,FALSE))","v":""},{"$f":"IF(B55=\"\",\"\",VLOOKUP(L55,Tabella_prezzi!$A$3:$K$138,8,FALSE))","v":""},{"$f":"IF(B55=\"\",\"\",VLOOKUP(L55,Tabella_prezzi!$A$3:$K$138,4,FALSE))","v":""},"",null,null,0,{"$f":"VLOOKUP(L55,Tabella_prezzi!A3:K159,6,FALSE)","v":"TS3L6-RI400GB"},"L6N17",0,{"$f":"COUNTIF(TS3L6_L6N_2,L55)*$N$22*R55","v":0},{"$f":"COUNTIF(TS3L6_L6N_3,L55)*$O$22*S55","v":0},0,null,null,null,null,null,null,null,null,null,null,{"$f":"ISODD(SUM($J$23:J55))","v":false}]
[null,"",{"$f":"IF(B56=\"\",\"\",VLOOKUP(L56,Tabella_prezzi!$A$3:$K$138,9,FALSE))","v":""},{"$f":"IF(B56=\"\",\"\",VLOOKUP(L56,Tabella_prezzi!$A$3:$K$138,6,FALSE))","v":""},{"$f":"IF(B56=\"\",\"\",VLOOKUP(L56,Tabella_prezzi!$A$3:$K$138,8,FALSE))","v":""},{"$f":"IF(B56=\"\",\"\",VLOOKUP(L56,Tabella_prezzi!$A$3:$K$138,4,FALSE))","v":""},"",null,null,0,{"$f":"VLOOKUP(L56,Tabella_prezzi!A16:K166,6,FALSE)","v":"TS3L6-RI400GBN"},"L6N17b",{"$f":"COUNTIF(TS3L6_L6N_1,L56)*$M$22*Q56","v":0},{"$f":"COUNTIF(TS3L6_L6N_2,L56)*$N$22*R56","v":0},{"$f":"COUNTIF(TS3L6_L6N_3,L56)*$O$22*S56","v":0},0,null,null,null,null,null,null,null,null,null,null,{"$f":"ISODD(SUM($J$23:J56))","v":false}]
[null,"",{"$f":"IF(B57=\"\",\"\",VLOOKUP(L57,Tabella_prezzi!$A$3:$K$138,9,FALSE))","v":""},{"$f":"IF(B57=\"\",\"\",VLOOKUP(L57,Tabella_prezzi!$A$3:$K$138,6,FALSE))","v":""},{"$f":"IF(B57=\"\",\"\",VLOOKUP(L57,Tabella_prezzi!$A$3:$K$138,8,FALSE))","v":""},{"$f":"IF(B57=\"\",\"\",VLOOKUP(L57,Tabella_prezzi!$A$3:$K$138,4,FALSE))","v":""},"",null,null,0,{"$f":"VLOOKUP(L57,Tabella_prezzi!A17:K167,6,FALSE)","v":"TS3L6-NVME1600N"},"L6N18b",{"$f":"COUNTIF(TS3L6_L6N_1,L57)*$M$22*Q57","v":0},{"$f":"COUNTIF(TS3L6_L6N_2,L57)*$N$22*R57","v":0},{"$f":"COUNTIF(TS3L6_L6N_3,L57)*$O$22*S57","v":0},0,{"$f":"Lotto6_DL560_1!$F$55","v":0},{"$f":"Lotto6_DL560_2!$F$55","v":0},{"$f":"Lotto6_DL560_3!$F$55","v":0},{"$f":"COUNTIF(TS3L6_L6N_2,L57)","v":0},null,null,null,null,null,null,{"$f":"ISODD(SUM($J$23:J57))","v":false}]
[null,"",{"$f":"IF(B58=\"\",\"\",VLOOKUP(L58,Tabella_prezzi!$A$3:$K$138,9,FALSE))","v":""},{"$f":"IF(B58=\"\",\"\",VLOOKUP(L58,Tabella_prezzi!$A$3:$K$138,6,FALSE))","v":""},{"$f":"IF(B58=\"\",\"\",VLOOKUP(L58,Tabella_prezzi!$A$3:$K$138,8,FALSE))","v":""},{"$f":"IF(B58=\"\",\"\",VLOOKUP(L58,Tabella_prezzi!$A$3:$K$138,4,FALSE))","v":""},"",null,null,0,{"$f":"VLOOKUP(L58,Tabella_prezzi!A18:K168,6,FALSE)","v":"TS3L6-NVME800N"},"L6N19b",{"$f":"COUNTIF(TS3L6_L6N_1,L58)*$M$22*Q58","v":0},{"$f":"COUNTIF(TS3L6_L6N_2,L58)*$N$22*R58","v":0},{"$f":"COUNTIF(TS3L6_L6N_3,L58)*$O$22*S58","v":0},0,{"$f":"Lotto6_DL560_1!$F$53","v":0},{"$f":"Lotto6_DL560_2!$F$53","v":0},{"$f":"Lotto6_DL560_3!$F$53","v":0},{"$f":"COUNTIF(TS3L6_L6N_2,L58)","v":0},null,null,null,null,null,null,{"$f":"ISODD(SUM($J$23:J58))","v":false}]
[null,"",{"$f":"IF(B59=\"\",\"\",VLOOKUP(L59,Tabella_prezzi!$A$3:$K$138,9,FALSE))","v":""},{"$f":"IF(B59=\"\",\"\",VLOOKUP(L59,Tabella_prezzi!$A$3:$K$138,6,FALSE))","v":""},{"$f":"IF(B59=\"\",\"\",VLOOKUP(L59,Tabella_prezzi!$A$3:$K$138,8,FALSE))","v":""},{"$f":"IF(B59=\"\",\"\",VLOOKUP(L59,Tabella_prezzi!$A$3:$K$138,4,FALSE))","v":""},"",null,null,0,{"$f":"VLOOKUP(L59,Tabella_prezzi!A3:K161,6,FALSE)","v":"TS3L6-UPS"},"L6N20",{"$f":"IF($P$23>=1,Altre_Opzioni!$F$35,0)","v":0},null,null,0,null,null,null,null,null,null,null,null,null,null,{"$f":"ISODD(SUM($J$23:J59))","v":false}]
[null,"",{"$f":"IF(B60=\"\",\"\",VLOOKUP(L60,Tabella_prezzi!$A$3:$K$138,9,FALSE))","v":""},{"$f":"IF(B60=\"\",\"\",VLOOKUP(L60,Tabella_prezzi!$A$3:$K$138,6,FALSE))","v":""},{"$f":"IF(B60=\"\",\"\",VLOOKUP(L60,Tabella_prezzi!$A$3:$K$138,8,FALSE))","v":""},{"$f":"IF(B60=\"\",\"\",VLOOKUP(L60,Tabella_prezzi!$A$3:$K$138,4,FALSE))","v":""},"",null,null,0,{"$f":"VLOOKUP(L60,Tabella_prezzi!A20:K170,6,FALSE)","v":"TS3L6-UPSN"},"L6N20b",{"$f":"IF($P$24>=1,Altre_Opzioni!$F$35,0)","v":0},null,null,{"$f":"IF(P59>=1,0,Altre_Opzioni!$F$35)","v":0},null,null,null,null,null,null,null,null,null,null,{"$f":"ISODD(SUM($J$23:J60))","v":false}]
[null,"",{"$f":"IF(B61=\"\",\"\",VLOOKUP(L61,Tabella_prezzi!$A$3:$K$138,9,FALSE))","v":""},{"$f":"IF(B61=\"\",\"\",VLOOKUP(L61,Tabella_prezzi!$A$3:$K$138,6,FALSE))","v":""},{"$f":"IF(B61=\"\",\"\",VLOOKUP(L61,Tabella_prezzi!$A$3:$K$138,8,FALSE))","v":""},{"$f":"IF(B61=\"\",\"\",VLOOKUP(L61,Tabella_prezzi!$A$3:$K$138,4,FALSE))","v":""},"",null,null,0,{"$f":"VLOOKUP(L61,Tabella_prezzi!A3:K162,6,FALSE)","v":"TS3L6-GUI"},"L6N21",{"$f":"IF($P$23>=1,Altre_Opzioni!$F$38,0)","v":0},null,null,{"$f":"SUM(M61:O61)","v":0},null,null,null,null,null,null,null,null,null,null,{"$f":"ISODD(SUM($J$23:J61))","v":false}]
[null,"",{"$f":"IF(B62=\"\",\"\",VLOOKUP(L62,Tabella_prezzi!$A$3:$K$138,9,FALSE))","v":""},{"$f":"IF(B62=\"\",\"\",VLOOKUP(L62,Tabella_prezzi!$A$3:$K$138,6,FALSE))","v":""},{"$f":"IF(B62=\"\",\"\",VLOOKUP(L62,Tabella_prezzi!$A$3:$K$138,8,FALSE))","v":""},{"$f":"IF(B62=\"\",\"\",VLOOKUP(L62,Tabella_prezzi!$A$3:$K$138,4,FALSE))","v":""},"",null,null,0,{"$f":"VLOOKUP(L62,Tabella_prezzi!A22:K172,6,FALSE)","v":"TS3L6-GUIN"},"L6N21b",{"$f":"IF($P$24>=1,Altre_Opzioni!$F$38,0)","v":0},null,null,{"$f":"IF(P61>=1,0,Altre_Opzioni!$F$38)","v":0},null,null,null,null,null,null,null,null,null,null,{"$f":"ISODD(SUM($J$23:J62))","v":false}]
[null,"",{"$f":"IF(B63=\"\",\"\",VLOOKUP(L63,Tabella_prezzi!$A$3:$K$138,9,FALSE))","v":""},{"$f":"IF(B63=\"\",\"\",VLOOKUP(L63,Tabella_prezzi!$A$3:$K$138,6,FALSE))","v":""},{"$f":"IF(B63=\"\",\"\",VLOOKUP(L63,Tabella_prezzi!$A$3:$K$138,8,FALSE))","v":""},{"$f":"IF(B63=\"\",\"\",VLOOKUP(L63,Tabella_prezzi!$A$3:$K$138,4,FALSE))","v":""},"",null,null,0,{"$f":"VLOOKUP(L63,Tabella_prezzi!A3:K163,6,FALSE)","v":"TS3L6-SWKVM"},"L6N22",{"$f":"IF($P$23>=1,Altre_Opzioni!$F$41,0)","v":0},null,null,{"$f":"SUM(M63:O63)","v":0},null,null,null,null,null,null,null,null,null,null,{"$f":"ISODD(SUM($J$23:J63))","v":false}]
[null,"",{"$f":"IF(B64=\"\",\"\",VLOOKUP(L64,Tabella_prezzi!$A$3:$K$138,9,FALSE))","v":""},{"$f":"IF(B64=\"\",\"\",VLOOKUP(L64,Tabella_prezzi!$A$3:$K$138,6,FALSE))","v":""},{"$f":"IF(B64=\"\",\"\",VLOOKUP(L64,Tabella_prezzi!$A$3:$K$138,8,FALSE))","v":""},{"$f":"IF(B64=\"\",\"\",VLOOKUP(L64,Tabella_prezzi!$A$3:$K$138,4,FALSE))","v":""},"",null,null,0,{"$f":"VLOOKUP(L64,Tabella_prezzi!A24:K174,6,FALSE)","v":"TS3L6-SWKVMN"},"L6N22b",{"$f":"IF($P$24>=1,Altre_Opzioni!$F$41,0)","v":0},null,null,{"$f":"IF(P63>=1,0,Altre_Opzioni!$F$41)","v":0},null,null,null,null,null,null,null,null,null,null,{"$f":"ISODD(SUM($J$23:J64))","v":false}]
[null,"",{"$f":"IF(B65=\"\",\"\",VLOOKUP(L65,Tabella_prezzi!$A$3:$K$138,9,FALSE))","v":""},{"$f":"IF(B65=\"\",\"\",VLOOKUP(L65,Tabella_prezzi!$A$3:$K$138,6,FALSE))","v":""},{"$f":"IF(B65=\"\",\"\",VLOOKUP(L65,Tabella_prezzi!$A$3:$K$138,8,FALSE))","v":""},{"$f":"IF(B65=\"\",\"\",VLOOKUP(L65,Tabella_prezzi!$A$3:$K$138,4,FALSE))","v":""},"",null,null,0,{"$f":"VLOOKUP(L65,Tabella_prezzi!A3:K164,6,FALSE)","v":"TS3L6-WINSTD"},"L6N23",{"$f":"COUNTIF(TS3L6_L6N_1,L65)*$M$22","v":0},{"$f":"COUNTIF(TS3L6_L6N_2,L65)*$N$22","v":0},{"$f":"COUNTIF(TS3L6_L6N_3,L65)*$O$22","v":0},0,null,null,null,null,null,null,null,null,null,null,{"$f":"ISODD(SUM($J$23:J65))","v":false}]
[null,"",{"$f":"IF(B66=\"\",\"\",VLOOKUP(L66,Tabella_prezzi!$A$3:$K$138,9,FALSE))","v":""},{"$f":"IF(B66=\"\",\"\",VLOOKUP(L66,Tabella_prezzi!$A$3:$K$138,6,FALSE))","v":""},{"$f":"IF(B66=\"\",\"\",VLOOKUP(L66,Tabella_prezzi!$A$3:$K$138,8,FALSE))","v":""},{"$f":"IF(B66=\"\",\"\",VLOOKUP(L66,Tabella_prezzi!$A$3:$K$138,4,FALSE))","v":""},"",null,null,0,{"$f":"VLOOKUP(L66,Tabella_prezzi!A26:K176,6,FALSE)","v":"TS3L6-WINSTDN"},"L6N23b",{"$f":"COUNTIF(TS3L6_L6N_1,L66)*$M$22","v":0},{"$f":"COUNTIF(TS3L6_L6N_2,L66)*$N$22","v":0},{"$f":"COUNTIF(TS3L6_L6N_3,L66)*$O$22","v":0},{"$f":"SUM(M66:O66)","v":0},null,null,null,null,null,null,null,null,null,null,{"$f":"ISODD(SUM($J$23:J66))","v":false}]
[null,"",{"$f":"IF(B67=\"\",\"\",VLOOKUP(L67,Tabella_prezzi!$A$3:$K$138,9,FALSE))","v":""},{"$f":"IF(B67=\"\",\"\",VLOOKUP(L67,Tabella_prezzi!$A$3:$K$138,6,FALSE))","v":""},{"$f":"IF(B67=\"\",\"\",VLOOKUP(L67,Tabella_prezzi!$A$3:$K$138,8,FALSE))","v":""},{"$f":"IF(B67=\"\",\"\",VLOOKUP(L67,Tabella_prezzi!$A$3:$K$138,4,FALSE))","v":""},"",null,null,0,{"$f":"VLOOKUP(L67,Tabella_prezzi!A27:K177,6,FALSE)","v":"TS3L6-WINDVCAL"},"L6N24",{"$f":"IF($P$23>=1,Altre_Opzioni!$F$44,0)","v":0},null,null,{"$f":"SUM(M67:O67)","v":0},null,null,null,null,null,null,null,null,null,null,{"$f":"ISODD(SUM($J$23:J67))","v":false}]
[null,"",{"$f":"IF(B68=\"\",\"\",VLOOKUP(L68,Tabella_prezzi!$A$3:$K$138,9,FALSE))","v":""},{"$f":"IF(B68=\"\",\"\",VLOOKUP(L68,Tabella_prezzi!$A$3:$K$138,6,FALSE))","v":""},{"$f":"IF(B68=\"\",\"\",VLOOKUP(L68,Tabella_prezzi!$A$3:$K$138,8,FALSE))","v":""},{"$f":"IF(B68=\"\",\"\",VLOOKUP(L68,Tabella_prezzi!$A$3:$K$138,4,FALSE))","v":""},"",null,null,0,{"$f":"VLOOKUP(L68,Tabella_prezzi!A28:K178,6,FALSE)","v":"TS3L6-WINDVCALN"},"L6N24b",{"$f":"IF($P$24>=1,Altre_Opzioni!$F$44,0)","v":0},null,null,{"$f":"IF(P67>=1,0,Altre_Opzioni!$F$44)","v":0},null,null,null,null,null,null,null,null,null,null,{"$f":"ISODD(SUM($J$23:J68))","v":false}]
[null,"",{"$f":"IF(B69=\"\",\"\",VLOOKUP(L69,Tabella_prezzi!$A$3:$K$138,9,FALSE))","v":""},{"$f":"IF(B69=\"\",\"\",VLOOKUP(L69,Tabella_prezzi!$A$3:$K$138,6,FALSE))","v":""},{"$f":"IF(B69=\"\",\"\",VLOOKUP(L69,Tabella_prezzi!$A$3:$K$138,8,FALSE))","v":""},{"$f":"IF(B69=\"\",\"\",VLOOKUP(L69,Tabella_prezzi!$A$3:$K$138,4,FALSE))","v":""},"",null,null,0,{"$f":"VLOOKUP(L69,Tabella_prezzi!A29:K179,6,FALSE)","v":"TS3L6-WINUSCAL"},"L6N25",{"$f":"IF($P$23>=1,Altre_Opzioni!$F$47,0)","v":0},null,null,{"$f":"SUM(M69:O69)","v":0},null,null,null,null,null,null,null,null,null,null,{"$f":"ISODD(SUM($J$23:J69))","v":false}]
[null,"",{"$f":"IF(B70=\"\",\"\",VLOOKUP(L70,Tabella_prezzi!$A$3:$K$138,9,FALSE))","v":""},{"$f":"IF(B70=\"\",\"\",VLOOKUP(L70,Tabella_prezzi!$A$3:$K$138,6,FALSE))","v":""},{"$f":"IF(B70=\"\",\"\",VLOOKUP(L70,Tabella_prezzi!$A$3:$K$138,8,FALSE))","v":""},{"$f":"IF(B70=\"\",\"\",VLOOKUP(L70,Tabella_prezzi!$A$3:$K$138,4,FALSE))","v":""},"",null,null,0,{"$f":"VLOOKUP(L70,Tabella_prezzi!A30:K180,6,FALSE)","v":"TS3L6-WINUSCALN"},"L6N25b",{"$f":"IF($P$24>=1,Altre_Opzioni!$F$47,0)","v":0},null,null,{"$f":"IF(P69>=1,0,Altre_Opzioni!$F$47)","v":0},null,null,null,null,null,null,null,null,null,null,{"$f":"ISODD(SUM($J$23:J70))","v":false}]
[null,"",{"$f":"IF(B71=\"\",\"\",VLOOKUP(L71,Tabella_prezzi!$A$3:$K$138,9,FALSE))","v":""},{"$f":"IF(B71=\"\",\"\",VLOOKUP(L71,Tabella_prezzi!$A$3:$K$138,6,FALSE))","v":""},{"$f":"IF(B71=\"\",\"\",VLOOKUP(L71,Tabella_prezzi!$A$3:$K$138,8,FALSE))","v":""},{"$f":"IF(B71=\"\",\"\",VLOOKUP(L71,Tabella_prezzi!$A$3:$K$138,4,FALSE))","v":""},"",null,null,0,{"$f":"VLOOKUP(L71,Tabella_prezzi!A3:K165,6,FALSE)","v":"TS3L6-WINSRV2C"},"L6N26",{"$f":"COUNTIF(TS3L6_L6N_1,L71)*$M$22*Q71","v":0},{"$f":"COUNTIF(TS3L6_L6N_2,L71)*$N$22*R71","v":0},{"$f":"COUNTIF(TS3L6_L6N_3,L71)*$O$22*S71","v":0},0,{"$f":"Lotto6_DL560_1!$F$26","v":0},{"$f":"Lotto6_DL560_2!$F$26","v":0},{"$f":"Lotto6_DL560_3!$F$26","v":0},null,null,null,null,null,null,null,{"$f":"ISODD(SUM($J$23:J71))","v":false}]
[null,"",{"$f":"IF(B72=\"\",\"\",VLOOKUP(L72,Tabella_prezzi!$A$3:$K$138,9,FALSE))","v":""},{"$f":"IF(B72=\"\",\"\",VLOOKUP(L72,Tabella_prezzi!$A$3:$K$138,6,FALSE))","v":""},{"$f":"IF(B72=\"\",\"\",VLOOKUP(L72,Tabella_prezzi!$A$3:$K$138,8,FALSE))","v":""},{"$f":"IF(B72=\"\",\"\",VLOOKUP(L72,Tabella_prezzi!$A$3:$K$138,4,FALSE))","v":""},"",null,null,0,{"$f":"VLOOKUP(L72,Tabella_prezzi!A28:K178,6,FALSE)","v":"TS3L6-WINSRV2CN"},"L6N26b",{"$f":"COUNTIF(TS3L6_L6N_1,L72)*$M$22*Q72","v":0},{"$f":"COUNTIF(TS3L6_L6N_2,L72)*$N$22*R72","v":0},{"$f":"COUNTIF(TS3L6_L6N_3,L72)*$O$22*S72","v":0},{"$f":"SUM(M72:O72)","v":0},{"$f":"Lotto6_DL560_1!$F$26","v":0},{"$f":"Lotto6_DL560_2!$F$26","v":0},{"$f":"Lotto6_DL560_3!$F$26","v":0},null,null,null,null,null,null,null,{"$f":"ISODD(SUM($J$23:J72))","v":false}]
[null,"",{"$f":"IF(B73=\"\",\"\",VLOOKUP(L73,Tabella_prezzi!$A$3:$K$138,9,FALSE))","v":""},{"$f":"IF(B73=\"\",\"\",VLOOKUP(L73,Tabella_prezzi!$A$3:$K$138,6,FALSE))","v":""},{"$f":"IF(B73=\"\",\"\",VLOOKUP(L73,Tabella_prezzi!$A$3:$K$138,8,FALSE))","v":""},{"$f":"IF(B73=\"\",\"\",VLOOKUP(L73,Tabella_prezzi!$A$3:$K$138,4,FALSE))","v":""},"",null,null,0,{"$f":"VLOOKUP(L73,Tabella_prezzi!A3:K187,6,FALSE)","v":"TS3L6-WINDC"},"L6N27",{"$f":"COUNTIF(TS3L6_L6N_1,L73)*$M$22","v":0},{"$f":"COUNTIF(TS3L6_L6N_2,L73)*$N$22","v":0},{"$f":"COUNTIF(TS3L6_L6N_3,L73)*$O$22","v":0},{"$f":"SUM(M73:O73)","v":0},null,null,null,null,null,null,null,null,null,null,{"$f":"ISODD(SUM($J$23:J73))","v":false}]
[null,"",{"$f":"IF(B74=\"\",\"\",VLOOKUP(L74,Tabella_prezzi!$A$3:$K$138,9,FALSE))","v":""},{"$f":"IF(B74=\"\",\"\",VLOOKUP(L74,Tabella_prezzi!$A$3:$K$138,6,FALSE))","v":""},{"$f":"IF(B74=\"\",\"\",VLOOKUP(L74,Tabella_prezzi!$A$3:$K$138,8,FALSE))","v":""},{"$f":"IF(B74=\"\",\"\",VLOOKUP(L74,Tabella_prezzi!$A$3:$K$138,4,FALSE))","v":""},"",null,null,0,{"$f":"VLOOKUP(L74,Tabella_prezzi!A30:K180,6,FALSE)","v":"TS3L6-WINDCN"},"L6N27b",{"$f":"COUNTIF(TS3L6_L6N_1,L74)*$M$22","v":0},{"$f":"COUNTIF(TS3L6_L6N_2,L74)*$N$22","v":0},{"$f":"COUNTIF(TS3L6_L6N_3,L74)*$O$22","v":0},{"$f":"SUM(M74:O74)","v":0},null,null,null,null,null,{"$f":"P65+P66+P73+P74","v":0},null,null,null,null,{"$f":"ISODD(SUM($J$23:J74))","v":false}]
[null,"",{"$f":"IF(B75=\"\",\"\",VLOOKUP(L75,Tabella_prezzi!$A$3:$K$138,9,FALSE))","v":""},{"$f":"IF(B75=\"\",\"\",VLOOKUP(L75,Tabella_prezzi!$A$3:$K$138,6,FALSE))","v":""},{"$f":"IF(B75=\"\",\"\",VLOOKUP(L75,Tabella_prezzi!$A$3:$K$138,8,FALSE))","v":""},{"$f":"IF(B75=\"\",\"\",VLOOKUP(L75,Tabella_prezzi!$A$3:$K$138,4,FALSE))","v":""},"",null,null,0,{"$f":"VLOOKUP(L75,Tabella_prezzi!A3:K188,6,FALSE)","v":"TS3L6-WINDC2C"},"L6N28",{"$f":"COUNTIF(TS3L6_L6N_1,L75)*$M$22*Q75","v":0},{"$f":"COUNTIF(TS3L6_L6N_2,L75)*$N$22*R75","v":0},{"$f":"COUNTIF(TS3L6_L6N_3,L75)*$O$22*S75","v":0},{"$f":"SUM(M75:O75)","v":0},{"$f":"Lotto6_DL560_1!$F$26","v":0},{"$f":"Lotto6_DL560_2!$F$26","v":0},{"$f":"Lotto6_DL560_3!$F$26","v":0},null,null,null,null,null,null,null,{"$f":"ISODD(SUM($J$23:J75))","v":false}]
[null,"",{"$f":"IF(B76=\"\",\"\",VLOOKUP(L76,Tabella_prezzi!$A$3:$K$138,9,FALSE))","v":""},{"$f":"IF(B76=\"\",\"\",VLOOKUP(L76,Tabella_prezzi!$A$3:$K$138,6,FALSE))","v":""},{"$f":"IF(B76=\"\",\"\",VLOOKUP(L76,Tabella_prezzi!$A$3:$K$138,8,FALSE))","v":""},{"$f":"IF(B76=\"\",\"\",VLOOKUP(L76,Tabella_prezzi!$A$3:$K$138,4,FALSE))","v":""},"",null,null,0,{"$f":"VLOOKUP(L76,Tabella_prezzi!A32:K182,6,FALSE)","v":"TS3L6-WINDC2CN"},"L6N28b",{"$f":"COUNTIF(TS3L6_L6N_1,L76)*$M$22*Q76","v":0},{"$f":"COUNTIF(TS3L6_L6N_2,L76)*$N$22*R76","v":0},{"$f":"COUNTIF(TS3L6_L6N_3,L76)*$O$22*S76","v":0},{"$f":"SUM(M76:O76)","v":0},{"$f":"Lotto6_DL560_1!$F$26","v":0},{"$f":"Lotto6_DL560_2!$F$26","v":0},{"$f":"Lotto6_DL560_3!$F$26","v":0},null,null,null,null,null,null,null,{"$f":"ISODD(SUM($J$23:J76))","v":false}]
[null,"",{"$f":"IF(B77=\"\",\"\",VLOOKUP(L77,Tabella_prezzi!$A$3:$K$138,9,FALSE))","v":""},{"$f":"IF(B77=\"\",\"\",VLOOKUP(L77,Tabella_prezzi!$A$3:$K$138,6,FALSE))","v":""},{"$f":"IF(B77=\"\",\"\",VLOOKUP(L77,Tabella_prezzi!$A$3:$K$138,8,FALSE))","v":""},{"$f":"IF(B77=\"\",\"\",VLOOKUP(L77,Tabella_prezzi!$A$3:$K$138,4,FALSE))","v":""},"",null,null,0,{"$f":"VLOOKUP(L77,Tabella_prezzi!A3:K168,6,FALSE)","v":"TS3L6-LINUX"},"L6N29",{"$f":"COUNTIF(TS3L6_L6N_1,L77)*$M$22","v":0},{"$f":"COUNTIF(TS3L6_L6N_2,L77)*$N$22","v":0},{"$f":"COUNTIF(TS3L6_L6N_3,L77)*$O$22","v":0},0,null,null,null,null,null,null,null,null,null,null,{"$f":"ISODD(SUM($J$23:J77))","v":false}]
[null,"",{"$f":"IF(B78=\"\",\"\",VLOOKUP(L78,Tabella_prezzi!$A$3:$K$138,9,FALSE))","v":""},{"$f":"IF(B78=\"\",\"\",VLOOKUP(L78,Tabella_prezzi!$A$3:$K$138,6,FALSE))","v":""},{"$f":"IF(B78=\"\",\"\",VLOOKUP(L78,Tabella_prezzi!$A$3:$K$138,8,FALSE))","v":""},{"$f":"IF(B78=\"\",\"\",VLOOKUP(L78,Tabella_prezzi!$A$3:$K$138,4,FALSE))","v":""},"",null,null,0,{"$f":"VLOOKUP(L78,Tabella_prezzi!A38:K188,6,FALSE)","v":"TS3L6-LINUXN"},"L6N29b",{"$f":"COUNTIF(TS3L6_L6N_1,L78)*$M$22","v":0},{"$f":"COUNTIF(TS3L6_L6N_2,L78)*$N$22","v":0},{"$f":"COUNTIF(TS3L6_L6N_3,L78)*$O$22","v":0},{"$f":"SUM(M78:O78)","v":0},null,null,null,null,null,null,null,null,null,null,{"$f":"ISODD(SUM($J$23:J78))","v":false}]
[null,"",{"$f":"IF(B79=\"\",\"\",VLOOKUP(L79,Tabella_prezzi!$A$3:$K$138,9,FALSE))","v":""},{"$f":"IF(B79=\"\",\"\",VLOOKUP(L79,Tabella_prezzi!$A$3:$K$138,6,FALSE))","v":""},{"$f":"IF(B79=\"\",\"\",VLOOKUP(L79,Tabella_prezzi!$A$3:$K$138,8,FALSE))","v":""},{"$f":"IF(B79=\"\",\"\",VLOOKUP(L79,Tabella_prezzi!$A$3:$K$138,4,FALSE))","v":""},"",null,null,0,{"$f":"VLOOKUP(L79,Tabella_prezzi!A3:K169,6,FALSE)","v":"TS3L6-HDRTN"},"L6N30",0,0,0,0,null,null,null,null,null,null,null,null,null,null,{"$f":"ISODD(SUM($J$23:J79))","v":false}]
[null,"",{"$f":"IF(B80=\"\",\"\",VLOOKUP(L80,Tabella_prezzi!$A$3:$K$138,9,FALSE))","v":""},{"$f":"IF(B80=\"\",\"\",VLOOKUP(L80,Tabella_prezzi!$A$3:$K$138,6,FALSE))","v":""},{"$f":"IF(B80=\"\",\"\",VLOOKUP(L80,Tabella_prezzi!$A$3:$K$138,8,FALSE))","v":""},{"$f":"IF(B80=\"\",\"\",VLOOKUP(L80,Tabella_prezzi!$A$3:$K$138,4,FALSE))","v":""},"",null,null,0,{"$f":"VLOOKUP(L80,Tabella_prezzi!A40:K190,6,FALSE)","v":"TS3L6-HDRTNN"},"L6N30b",{"$f":"COUNTIF(TS3L6_L6N_1,L80)*$M$22","v":0},{"$f":"COUNTIF(TS3L6_L6N_2,L80)*$N$22","v":0},{"$f":"COUNTIF(TS3L6_L6N_3,L80)*$O$22","v":0},{"$f":"SUM(M80:O80)","v":0},null,null,null,null,null,null,null,null,null,null,{"$f":"ISODD(SUM($J$23:J80))","v":false}]
[null,"",{"$f":"IF(B81=\"\",\"\",VLOOKUP(L81,Tabella_prezzi!$A$3:$K$138,9,FALSE))","v":""},{"$f":"IF(B81=\"\",\"\",VLOOKUP(L81,Tabella_prezzi!$A$3:$K$138,6,FALSE))","v":""},{"$f":"IF(B81=\"\",\"\",VLOOKUP(L81,Tabella_prezzi!$A$3:$K$138,8,FALSE))","v":""},{"$f":"IF(B81=\"\",\"\",VLOOKUP(L81,Tabella_prezzi!$A$3:$K$138,4,FALSE))","v":""},"",null,null,0,{"$f":"VLOOKUP(L81,Tabella_prezzi!A3:K170,6,FALSE)","v":"TS3L6-5Y"},"L6N31",0,0,0,0,null,null,null,null,null,null,null,null,null,null,{"$f":"ISODD(SUM($J$23:J81))","v":false}]
[null,"",{"$f":"IF(B82=\"\",\"\",VLOOKUP(L82,Tabella_prezzi!$A$3:$K$138,9,FALSE))","v":""},{"$f":"IF(B82=\"\",\"\",VLOOKUP(L82,Tabella_prezzi!$A$3:$K$138,6,FALSE))","v":""},{"$f":"IF(B82=\"\",\"\",VLOOKUP(L82,Tabella_prezzi!$A$3:$K$138,8,FALSE))","v":""},{"$f":"IF(B82=\"\",\"\",VLOOKUP(L82,Tabella_prezzi!$A$3:$K$138,4,FALSE))","v":""},"",null,null,0,{"$f":"VLOOKUP(L82,Tabella_prezzi!A73:K192,6,FALSE)","v":"TS3L6-5YN"},"L6N31b",{"$f":"COUNTIF(TS3L6_L6N_1,L82)*$M$22","v":0},{"$f":"COUNTIF(TS3L6_L6N_2,L82)*$N$22","v":0},{"$f":"COUNTIF(TS3L6_L6N_3,L82)*$O$22","v":0},{"$f":"SUM(M82:O82)","v":0},null,null,null,null,null,null,null,null,null,null,{"$f":"ISODD(SUM($J$23:J82))","v":false}]
[null,"",{"$f":"IF(B83=\"\",\"\",VLOOKUP(L83,Tabella_prezzi!$A$3:$K$138,9,FALSE))","v":""},{"$f":"IF(B83=\"\",\"\",VLOOKUP(L83,Tabella_prezzi!$A$3:$K$138,6,FALSE))","v":""},{"$f":"IF(B83=\"\",\"\",VLOOKUP(L83,Tabella_prezzi!$A$3:$K$138,8,FALSE))","v":""},{"$f":"IF(B83=\"\",\"\",VLOOKUP(L83,Tabella_prezzi!$A$3:$K$138,4,FALSE))","v":""},"",null,null,0,{"$f":"VLOOKUP(L83,Tabella_prezzi!A3:K171,6,FALSE)","v":"TS3L6-RACK"},"L6N32",{"$f":"IF($P$23>=1,Altre_Opzioni!$F$17,0)","v":0},null,null,0,null,null,null,null,null,null,null,null,null,null,{"$f":"ISODD(SUM($J$23:J83))","v":false}]
[null,"",{"$f":"IF(B84=\"\",\"\",VLOOKUP(L84,Tabella_prezzi!$A$3:$K$138,9,FALSE))","v":""},{"$f":"IF(B84=\"\",\"\",VLOOKUP(L84,Tabella_prezzi!$A$3:$K$138,6,FALSE))","v":""},{"$f":"IF(B84=\"\",\"\",VLOOKUP(L84,Tabella_prezzi!$A$3:$K$138,8,FALSE))","v":""},{"$f":"IF(B84=\"\",\"\",VLOOKUP(L84,Tabella_prezzi!$A$3:$K$138,4,FALSE))","v":""},"",null,null,0,{"$f":"VLOOKUP(L84,Tabella_prezzi!A4:K172,6,FALSE)","v":"TS3L6-RACKN"},"L6N32b",{"$f":"IF($P$24>=1,Altre_Opzioni!$F$17,0)","v":0},null,null,{"$f":"IF($P$83>=1,0,Altre_Opzioni!$F$17)","v":0},null,null,null,null,null,null,null,null,null,null,{"$f":"ISODD(SUM($J$23:J84))","v":false}]
[null,"",{"$f":"IF(B85=\"\",\"\",VLOOKUP(L85,Tabella_prezzi!$A$3:$K$138,9,FALSE))","v":""},{"$f":"IF(B85=\"\",\"\",VLOOKUP(L85,Tabella_prezzi!$A$3:$K$138,6,FALSE))","v":""},{"$f":"IF(B85=\"\",\"\",VLOOKUP(L85,Tabella_prezzi!$A$3:$K$138,8,FALSE))","v":""},{"$f":"IF(B85=\"\",\"\",VLOOKUP(L85,Tabella_prezzi!$A$3:$K$138,4,FALSE))","v":""},"",null,null,0,{"$f":"VLOOKUP(L85,Tabella_prezzi!A5:K173,6,FALSE)","v":"TS3L6-HDRTN60"},"L6N33",{"$f":"COUNTIF(TS3L6_L6N_1,L85)*$M$22","v":0},{"$f":"COUNTIF(TS3L6_L6N_2,L85)*$N$22","v":0},{"$f":"COUNTIF(TS3L6_L6N_3,L85)*$O$22","v":0},{"$f":"SUM(M85:O85)","v":0},null,null,null,null,null,null,null,null,null,null,{"$f":"ISODD(SUM($J$23:J85))","v":false}]
[null,{"$f":"IF(P86>0,P86,\"\")","v":""},{"$f":"IF(B86=\"\",\"\",VLOOKUP(L86,Tabella_prezzi!$A$3:$K$138,9,FALSE))","v":""},{"$f":"IF(B86=\"\",\"\",VLOOKUP(L86,Tabella_prezzi!$A$3:$K$138,6,FALSE))","v":""},{"$f":"IF(B86=\"\",\"\",VLOOKUP(L86,Tabella_prezzi!$A$3:$K$138,8,FALSE))","v":""},{"$f":"IF(B86=\"\",\"\",VLOOKUP(L86,Tabella_prezzi!$A$3:$K$138,4,FALSE))","v":""},{"$f":"IF(C86=\"\",\"\",F86*B86)","v":""},null,null,0,{"$f":"VLOOKUP(L86,Tabella_prezzi!A6:K174,6,FALSE)","v":"TS3L6-HDRTN60N"},"L6N33b",{"$f":"COUNTIF(TS3L6_L6N_1,L86)*$M$22","v":0},{"$f":"COUNTIF(TS3L6_L6N_2,L86)*$N$22","v":0},{"$f":"COUNTIF(TS3L6_L6N_3,L86)*$O$22","v":0},{"$f":"SUM(M86:O86)","v":0},null,null,null,null,null,null,null,null,null,null,{"$f":"ISODD(SUM($J$23:J86))","v":false}]
[null,"TECNOLOGIE SERVER 3 LOTTO 6 - LISTA ULTERIORI ARTICOLI IN CONVENZIONE (20%) -",null,null,null,null,null,null,null,{"$f":"IF($G$153>0,1,0)","v":0},null,null,null,null,null,null,null,null,null,{"$f":"Lotto6_DL560_1!O121","v":""},{"$f":"Lotto6_DL560_1!F121","v":""},{"$f":"Lotto6_DL560_2!L99","v":""},{"$f":"Lotto6_DL560_2!F99","v":0},{"$f":"Lotto6_DL560_3!L91","v":0},{"$f":"Lotto6_DL560_3!F91","v":0},null,{"$f":"ISODD(SUM($J$23:J87))","v":false},"retention"]
[null,"Quantità","Codice Articolo Produttore","Codice Articolo Convenzione","Descrizione","Costo unitario","Costo complessivo",null,null,{"$f":"IF($G$153>0,1,0)","v":0},null,null,null,null,null,null,null,null,null,{"$f":"Lotto6_DL560_1!L118","v":""},{"$f":"Lotto6_DL560_1!F118","v":""},{"$f":"Lotto6_DL560_2!L96","v":""},{"$f":"Lotto6_DL560_2!F96","v":""},{"$f":"Lotto6_DL560_3!L88","v":0},{"$f":"Lotto6_DL560_3!F88","v":0},null,{"$f":"ISODD(SUM($J$23:J88))","v":false},"warranty"]
[null,{"$f":"IF(P89>0,P89,\"\")","v":""},{"$f":"IF(B89=\"\",\"\",VLOOKUP(L89,Tabella_prezzi!$A$3:$K$138,9,FALSE))","v":""},{"$f":"IF(B89=\"\",\"\",VLOOKUP(L89,Tabella_prezzi!$A$3:$K$138,6,FALSE))","v":""},{"$f":"IF(B89=\"\",\"\",VLOOKUP(L89,Tabella_prezzi!$A$3:$K$138,8,FALSE))","v":""},{"$f":"IF(B89=\"\",\"\",VLOOKUP(L89,Tabella_prezzi!$A$3:$K$138,4,FALSE))","v":""},{"$f":"IF(C89=\"\",\"\",F89*B89)","v":""},null,null,{"$f":"IF(B89=\"\",0,1)","v":0},{"$f":"VLOOKUP(L89,Tabella_prezzi!A3:K190,6,FALSE)","v":"TS3L6-RJ453M"},"L6N34",{"$f":"COUNTIF(TS3L6_L6N_1,L89)*$M$22*Q89","v":0},{"$f":"COUNTIF(TS3L6_L6N_2,L89)*$N$22*R89","v":0},{"$f":"COUNTIF(TS3L6_L6N_3,L89)*$O$22*S89","v":0},{"$f":"SUM(M89:O89)","v":0},{"$f":"Lotto6_DL560_1!$F$115","v":5},{"$f":"Lotto6_DL560_2!$F$115","v":5},{"$f":"Lotto6_DL560_3!$F$115","v":5},null,null,null,null,null,null,null,{"$f":"ISODD(SUM($J$23:J89))","v":false}]
[null,"",{"$f":"IF(B90=\"\",\"\",VLOOKUP(L90,Tabella_prezzi!$A$3:$K$138,9,FALSE))","v":""},{"$f":"IF(B90=\"\",\"\",VLOOKUP(L90,Tabella_prezzi!$A$3:$K$138,6,FALSE))","v":""},{"$f":"IF(B90=\"\",\"\",VLOOKUP(L90,Tabella_prezzi!$A$3:$K$138,8,FALSE))","v":""},{"$f":"IF(B90=\"\",\"\",VLOOKUP(L90,Tabella_prezzi!$A$3:$K$138,4,FALSE))","v":""},"",null,null,{"$f":"IF(B90=\"\",0,1)","v":0},{"$f":"VLOOKUP(L90,Tabella_prezzi!A3:K158,6,FALSE)","v":"TS3L6-RJ453MN"},"L6N34b",{"$f":"COUNTIF(TS3L6_L6N_1,L90)*$M$22*Q90","v":0},{"$f":"COUNTIF(TS3L6_L6N_2,L90)*$N$22*R90","v":0},{"$f":"COUNTIF(TS3L6_L6N_3,L90)*$O$22*S90","v":0},{"$f":"SUM(M90:O90)","v":0},{"$f":"Lotto6_DL560_1!$F$115","v":5},{"$f":"Lotto6_DL560_2!$F$115","v":5},{"$f":"Lotto6_DL560_3!$F$115","v":5},{"$f":"Lotto6_DL560_1!#REF!","v":{"$error":"#REF!"}},{"$f":"Lotto6_DL560_1!#REF!","v":{"$error":"#REF!"}},{"$f":"Lotto6_DL560_2!L108","v":""},{"$f":"Lotto6_DL560_2!F108","v":0},{"$f":"Lotto6_DL560_3!L95","v":0},{"$f":"Lotto6_DL560_3!F95","v":0},null,{"$f":"ISODD(SUM($J$23:J90))","v":false},"ups"]
[null,"",{"$f":"IF(B91=\"\",\"\",VLOOKUP(L91,Tabella_prezzi!$A$3:$K$138,9,FALSE))","v":""},{"$f":"IF(B91=\"\",\"\",VLOOKUP(L91,Tabella_prezzi!$A$3:$K$138,6,FALSE))","v":""},{"$f":"IF(B91=\"\",\"\",VLOOKUP(L91,Tabella_prezzi!$A$3:$K$138,8,FALSE))","v":""},{"$f":"IF(B91=\"\",\"\",VLOOKUP(L91,Tabella_prezzi!$A$3:$K$138,4,FALSE))","v":""},{"$f":"IF(C91=\"\",\"\",F91*B91)","v":""},null,null,{"$f":"IF(B91=\"\",0,1)","v":0},{"$f":"VLOOKUP(L91,Tabella_prezzi!A3:K159,6,FALSE)","v":"TS3L6-OV3YILO"},"L6N35",{"$f":"COUNTIF(TS3L6_L6N_1,L91)*$M$22","v":0},{"$f":"COUNTIF(TS3L6_L6N_2,L91)*$N$22","v":0},{"$f":"COUNTIF(TS3L6_L6N_3,L91)*$O$22","v":0},0,null,null,null,{"$f":"Lotto6_DL560_1!#REF!","v":{"$error":"#REF!"}},{"$f":"Lotto6_DL560_1!#REF!","v":{"$error":"#REF!"}},{"$f":"Lotto6_DL560_2!L111","v":0},{"$f":"Lotto6_DL560_2!F111","v":0},{"$f":"Lotto6_DL560_3!L98","v":0},{"$f":"Lotto6_DL560_3!F98","v":0},null,{"$f":"ISODD(SUM($J$23:J91))","v":false},"gui"]
[null,"",{"$f":"IF(B92=\"\",\"\",VLOOKUP(L92,Tabella_prezzi!$A$3:$K$138,9,FALSE))","v":""},{"$f":"IF(B92=\"\",\"\",VLOOKUP(L92,Tabella_prezzi!$A$3:$K$138,6,FALSE))","v":""},{"$f":"IF(B92=\"\",\"\",VLOOKUP(L92,Tabella_prezzi!$A$3:$K$138,8,FALSE))","v":""},{"$f":"IF(B92=\"\",\"\",VLOOKUP(L92,Tabella_prezzi!$A$3:$K$138,4,FALSE))","v":""},"",null,null,0,{"$f":"VLOOKUP(L92,Tabella_prezzi!A3:K160,6,FALSE)","v":"TS3L6-OP101"},"L6N37",{"$f":"COUNTIF(TS3L6_L6N_1,L92)*$M$22","v":0},0,0,0,null,null,null,{"$f":"Lotto6_DL560_1!#REF!","v":{"$error":"#REF!"}},{"$f":"Lotto6_DL560_1!#REF!","v":{"$error":"#REF!"}},{"$f":"Lotto6_DL560_2!L93","v":""},{"$f":"Lotto6_DL560_2!F93","v":""},{"$f":"Lotto6_DL560_3!L85","v":0},{"$f":"Lotto6_DL560_3!F85","v":0},null,{"$f":"ISODD(SUM($J$23:J92))","v":false}]
[null,"",{"$f":"IF(B93=\"\",\"\",VLOOKUP(L93,Tabella_prezzi!$A$3:$K$138,9,FALSE))","v":""},{"$f":"IF(B93=\"\",\"\",VLOOKUP(L93,Tabella_prezzi!$A$3:$K$138,6,FALSE))","v":""},{"$f":"IF(B93=\"\",\"\",VLOOKUP(L93,Tabella_prezzi!$A$3:$K$138,8,FALSE))","v":""},{"$f":"IF(B93=\"\",\"\",VLOOKUP(L93,Tabella_prezzi!$A$3:$K$138,4,FALSE))","v":""},"",null,null,0,{"$f":"VLOOKUP(L93,Tabella_prezzi!A3:K161,6,FALSE)","v":"TS3L6-DACAOCM3"},"L6N38",{"$f":"COUNTIF(TS3L6_L6N_1,L93)*$M$22*Q93","v":0},{"$f":"COUNTIF(TS3L6_L6N_2,L93)*$N$22*R93","v":0},{"$f":"COUNTIF(TS3L6_L6N_3,L93)*$O$22*S93","v":0},0,{"$f":"Lotto6_DL560_1!$F$99","v":0},{"$f":"Lotto6_DL560_2!$F$99","v":0},{"$f":"Lotto6_DL560_3!$F$99","v":0},{"$f":"Lotto6_DL560_1!L115","v":"L6N34"},{"$f":"Lotto6_DL560_1!F115","v":5},{"$f":"Lotto6_DL560_2!L90","v":""},{"$f":"Lotto6_DL560_2!F90","v":""},{"$f":"Lotto6_DL560_3!L82","v":0},{"$f":"Lotto6_DL560_3!F82","v":0},null,{"$f":"ISODD(SUM($J$23:J93))","v":false}]
[null,"",{"$f":"IF(B94=\"\",\"\",VLOOKUP(L94,Tabella_prezzi!$A$3:$K$138,9,FALSE))","v":""},{"$f":"IF(B94=\"\",\"\",VLOOKUP(L94,Tabella_prezzi!$A$3:$K$138,6,FALSE))","v":""},{"$f":"IF(B94=\"\",\"\",VLOOKUP(L94,Tabella_prezzi!$A$3:$K$138,8,FALSE))","v":""},{"$f":"IF(B94=\"\",\"\",VLOOKUP(L94,Tabella_prezzi!$A$3:$K$138,4,FALSE))","v":""},"",null,null,0,{"$f":"VLOOKUP(L94,Tabella_prezzi!A3:K162,6,FALSE)","v":"TS3L6-DACAOCM5"},"L6N39",{"$f":"COUNTIF(TS3L6_L6N_1,L94)*$M$22*Q94","v":0},{"$f":"COUNTIF(TS3L6_L6N_2,L94)*$N$22*R94","v":0},{"$f":"COUNTIF(TS3L6_L6N_3,L94)*$O$22*S94","v":0},0,{"$f":"Lotto6_DL560_1!$F$100","v":0},{"$f":"Lotto6_DL560_2!$F$100","v":0},{"$f":"Lotto6_DL560_3!$F$100","v":0},{"$f":"Lotto6_DL560_1!L99","v":""},{"$f":"Lotto6_DL560_1!F99","v":0},{"$f":"Lotto6_DL560_2!L87","v":""},{"$f":"Lotto6_DL560_2!F87","v":""},{"$f":"Lotto6_DL560_3!L79","v":0},{"$f":"Lotto6_DL560_3!F79","v":0},null,{"$f":"ISODD(SUM($J$23:J94))","v":false}]
[null,"",{"$f":"IF(B95=\"\",\"\",VLOOKUP(L95,Tabella_prezzi!$A$3:$K$138,9,FALSE))","v":""},{"$f":"IF(B95=\"\",\"\",VLOOKUP(L95,Tabella_prezzi!$A$3:$K$138,6,FALSE))","v":""},{"$f":"IF(B95=\"\",\"\",VLOOKUP(L95,Tabella_prezzi!$A$3:$K$138,8,FALSE))","v":""},{"$f":"IF(B95=\"\",\"\",VLOOKUP(L95,Tabella_prezzi!$A$3:$K$138,4,FALSE))","v":""},"",null,null,0,{"$f":"VLOOKUP(L95,Tabella_prezzi!A3:K163,6,FALSE)","v":"TS3L6-DACAOCM7"},"L6N40",{"$f":"COUNTIF(TS3L6_L6N_1,L95)*$M$22*Q95","v":0},{"$f":"COUNTIF(TS3L6_L6N_2,L95)*$N$22*R95","v":0},{"$f":"COUNTIF(TS3L6_L6N_3,L95)*$O$22*S95","v":0},0,{"$f":"Lotto6_DL560_1!$F$101","v":0},{"$f":"Lotto6_DL560_2!$F$101","v":0},{"$f":"Lotto6_DL560_3!$F$101","v":0},{"$f":"Lotto6_DL560_1!L96","v":""},{"$f":"Lotto6_DL560_1!F96","v":""},{"$f":"Lotto6_DL560_2!L84","v":""},{"$f":"Lotto6_DL560_2!F84","v":""},{"$f":"Lotto6_DL560_3!L76","v":0},{"$f":"Lotto6_DL560_3!F76","v":0},null,{"$f":"ISODD(SUM($J$23:J95))","v":false}]
[null,"",{"$f":"IF(B96=\"\",\"\",VLOOKUP(L96,Tabella_prezzi!$A$3:$K$138,9,FALSE))","v":""},{"$f":"IF(B96=\"\",\"\",VLOOKUP(L96,Tabella_prezzi!$A$3:$K$138,6,FALSE))","v":""},{"$f":"IF(B96=\"\",\"\",VLOOKUP(L96,Tabella_prezzi!$A$3:$K$138,8,FALSE))","v":""},{"$f":"IF(B96=\"\",\"\",VLOOKUP(L96,Tabella_prezzi!$A$3:$K$138,4,FALSE))","v":""},"",null,null,0,{"$f":"VLOOKUP(L96,Tabella_prezzi!A3:K164,6,FALSE)","v":"TS3L6-SASBAY1"},"L6N49",0,0,0,0,null,null,null,{"$f":"Lotto6_DL560_1!L12","v":0},{"$f":"Lotto6_DL560_1!F12","v":0},{"$f":"Lotto6_DL560_2!L11","v":0},{"$f":"Lotto6_DL560_2!F11","v":0},{"$f":"Lotto6_DL560_3!L11","v":0},{"$f":"Lotto6_DL560_3!F11","v":0},null,{"$f":"ISODD(SUM($J$23:J96))","v":false}]
[null,"",{"$f":"IF(B97=\"\",\"\",VLOOKUP(L97,Tabella_prezzi!$A$3:$K$138,9,FALSE))","v":""},{"$f":"IF(B97=\"\",\"\",VLOOKUP(L97,Tabella_prezzi!$A$3:$K$138,6,FALSE))","v":""},{"$f":"IF(B97=\"\",\"\",VLOOKUP(L97,Tabella_prezzi!$A$3:$K$138,8,FALSE))","v":""},{"$f":"IF(B97=\"\",\"\",VLOOKUP(L97,Tabella_prezzi!$A$3:$K$138,4,FALSE))","v":""},"",null,null,0,{"$f":"VLOOKUP(L97,Tabella_prezzi!A3:K165,6,FALSE)","v":"TS3L6-DUAL32GB"},"L6N50",0,0,0,0,null,null,null,null,null,null,null,null,null,null,{"$f":"ISODD(SUM($J$23:J97))","v":false}]
[null,"",{"$f":"IF(B98=\"\",\"\",VLOOKUP(L98,Tabella_prezzi!$A$3:$K$138,9,FALSE))","v":""},{"$f":"IF(B98=\"\",\"\",VLOOKUP(L98,Tabella_prezzi!$A$3:$K$138,6,FALSE))","v":""},{"$f":"IF(B98=\"\",\"\",VLOOKUP(L98,Tabella_prezzi!$A$3:$K$138,8,FALSE))","v":""},{"$f":"IF(B98=\"\",\"\",VLOOKUP(L98,Tabella_prezzi!$A$3:$K$138,4,FALSE))","v":""},"",null,null,0,{"$f":"VLOOKUP(L98,Tabella_prezzi!A3:K166,6,FALSE)","v":"TS3L6-CTRL-OS"},"L6N51",0,0,0,0,null,null,null,null,null,null,null,null,null,null,{"$f":"ISODD(SUM($J$23:J98))","v":false}]
[null,{"$f":"IF(P99>0,P99,\"\")","v":""},{"$f":"IF(B99=\"\",\"\",VLOOKUP(L99,Tabella_prezzi!$A$3:$K$138,9,FALSE))","v":""},{"$f":"IF(B99=\"\",\"\",VLOOKUP(L99,Tabella_prezzi!$A$3:$K$138,6,FALSE))","v":""},{"$f":"IF(B99=\"\",\"\",VLOOKUP(L99,Tabella_prezzi!$A$3:$K$138,8,FALSE))","v":""},{"$f":"IF(B99=\"\",\"\",VLOOKUP(L99,Tabella_prezzi!$A$3:$K$138,4,FALSE))","v":""},{"$f":"IF(C99=\"\",\"\",F99*B99)","v":""},null,null,0,{"$f":"VLOOKUP(L99,Tabella_prezzi!A3:K167,6,FALSE)","v":"TS3L6-CTRL-E"},"L6N52",0,0,0,0,null,null,null,null,null,null,null,null,null,null,{"$f":"ISODD(SUM($J$23:J99))","v":false}]
[null,"",{"$f":"IF(B100=\"\",\"\",VLOOKUP(L100,Tabella_prezzi!$A$3:$K$138,9,FALSE))","v":""},{"$f":"IF(B100=\"\",\"\",VLOOKUP(L100,Tabella_prezzi!$A$3:$K$138,6,FALSE))","v":""},{"$f":"IF(B100=\"\",\"\",VLOOKUP(L100,Tabella_prezzi!$A$3:$K$138,8,FALSE))","v":""},{"$f":"IF(B100=\"\",\"\",VLOOKUP(L100,Tabella_prezzi!$A$3:$K$138,4,FALSE))","v":""},"",null,null,0,{"$f":"VLOOKUP(L100,Tabella_prezzi!A3:K168,6,FALSE)","v":"TS3L6-TESLAT4"},"L6N54",0,0,0,0,null,null,null,null,null,null,null,null,null,null,{"$f":"ISODD(SUM($J$23:J100))","v":false}]
[null,"",{"$f":"IF(B101=\"\",\"\",VLOOKUP(L101,Tabella_prezzi!$A$3:$K$138,9,FALSE))","v":""},{"$f":"IF(B101=\"\",\"\",VLOOKUP(L101,Tabella_prezzi!$A$3:$K$138,6,FALSE))","v":""},{"$f":"IF(B101=\"\",\"\",VLOOKUP(L101,Tabella_prezzi!$A$3:$K$138,8,FALSE))","v":""},{"$f":"IF(B101=\"\",\"\",VLOOKUP(L101,Tabella_prezzi!$A$3:$K$138,4,FALSE))","v":""},"",null,null,0,{"$f":"VLOOKUP(L101,Tabella_prezzi!A3:K169,6,FALSE)","v":"TS3L6-P2200"},"L6N55",0,0,0,0,null,null,null,null,null,null,null,null,null,null,{"$f":"ISODD(SUM($J$23:J101))","v":false}]
[null,"",{"$f":"IF(B102=\"\",\"\",VLOOKUP(L102,Tabella_prezzi!$A$3:$K$138,9,FALSE))","v":""},{"$f":"IF(B102=\"\",\"\",VLOOKUP(L102,Tabella_prezzi!$A$3:$K$138,6,FALSE))","v":""},{"$f":"IF(B102=\"\",\"\",VLOOKUP(L102,Tabella_prezzi!$A$3:$K$138,8,FALSE))","v":""},{"$f":"IF(B102=\"\",\"\",VLOOKUP(L102,Tabella_prezzi!$A$3:$K$138,4,FALSE))","v":""},"",null,null,0,{"$f":"VLOOKUP(L102,Tabella_prezzi!A3:K170,6,FALSE)","v":"TS3L6-CTRL-A"},"L6N56",0,0,0,0,null,null,null,null,null,null,null,null,null,null,{"$f":"ISODD(SUM($J$23:J102))","v":false}]
[null,"",{"$f":"IF(B103=\"\",\"\",VLOOKUP(L103,Tabella_prezzi!$A$3:$K$138,9,FALSE))","v":""},{"$f":"IF(B103=\"\",\"\",VLOOKUP(L103,Tabella_prezzi!$A$3:$K$138,6,FALSE))","v":""},{"$f":"IF(B103=\"\",\"\",VLOOKUP(L103,Tabella_prezzi!$A$3:$K$138,8,FALSE))","v":""},{"$f":"IF(B103=\"\",\"\",VLOOKUP(L103,Tabella_prezzi!$A$3:$K$138,4,FALSE))","v":""},"",null,null,0,{"$f":"VLOOKUP(L103,Tabella_prezzi!A3:K171,6,FALSE)","v":"TS3L6-CTRL-P"},"L6N57",0,0,0,0,null,null,null,null,null,null,null,null,null,null,{"$f":"ISODD(SUM($J$23:J103))","v":false}]
[null,"",{"$f":"IF(B104=\"\",\"\",VLOOKUP(L104,Tabella_prezzi!$A$3:$K$138,9,FALSE))","v":""},{"$f":"IF(B104=\"\",\"\",VLOOKUP(L104,Tabella_prezzi!$A$3:$K$138,6,FALSE))","v":""},{"$f":"IF(B104=\"\",\"\",VLOOKUP(L104,Tabella_prezzi!$A$3:$K$138,8,FALSE))","v":""},{"$f":"IF(B104=\"\",\"\",VLOOKUP(L104,Tabella_prezzi!$A$3:$K$138,4,FALSE))","v":""},"",null,null,0,{"$f":"VLOOKUP(L104,Tabella_prezzi!A3:K172,6,FALSE)","v":"TS3L6-OV3YILON"},"L6N35B",0,0,0,0,null,null,null,null,null,null,null,null,null,null,{"$f":"ISODD(SUM($J$23:J104))","v":false}]
[null,"",{"$f":"IF(B105=\"\",\"\",VLOOKUP(L105,Tabella_prezzi!$A$3:$K$138,9,FALSE))","v":""},{"$f":"IF(B105=\"\",\"\",VLOOKUP(L105,Tabella_prezzi!$A$3:$K$138,6,FALSE))","v":""},{"$f":"IF(B105=\"\",\"\",VLOOKUP(L105,Tabella_prezzi!$A$3:$K$138,8,FALSE))","v":""},{"$f":"IF(B105=\"\",\"\",VLOOKUP(L105,Tabella_prezzi!$A$3:$K$138,4,FALSE))","v":""},"",null,null,0,{"$f":"VLOOKUP(L105,Tabella_prezzi!A3:K173,6,FALSE)","v":"TS3L6-OP101N"},"L6N37B",0,0,0,0,null,null,null,null,null,null,null,null,null,null,{"$f":"ISODD(SUM($J$23:J105))","v":false}]
[null,"",{"$f":"IF(B106=\"\",\"\",VLOOKUP(L106,Tabella_prezzi!$A$3:$K$138,9,FALSE))","v":""},{"$f":"IF(B106=\"\",\"\",VLOOKUP(L106,Tabella_prezzi!$A$3:$K$138,6,FALSE))","v":""},{"$f":"IF(B106=\"\",\"\",VLOOKUP(L106,Tabella_prezzi!$A$3:$K$138,8,FALSE))","v":""},{"$f":"IF(B106=\"\",\"\",VLOOKUP(L106,Tabella_prezzi!$A$3:$K$138,4,FALSE))","v":""},"",null,null,0,{"$f":"VLOOKUP(L106,Tabella_prezzi!A3:K174,6,FALSE)","v":"TS3L6-DACAOCM3N"},"L6N38B",{"$f":"COUNTIF(TS3L6_L6N_1,L106)*$M$22*Q106","v":0},{"$f":"COUNTIF(TS3L6_L6N_2,L106)*$N$22*R106","v":0},{"$f":"COUNTIF(TS3L6_L6N_3,L106)*$O$22*S106","v":0},{"$f":"SUM(M106:O106)","v":0},{"$f":"Lotto6_DL560_1!$F$99","v":0},{"$f":"Lotto6_DL560_2!$F$99","v":0},{"$f":"Lotto6_DL560_3!$F$99","v":0},null,null,null,null,null,null,null,{"$f":"ISODD(SUM($J$23:J106))","v":false}]
[null,"",{"$f":"IF(B107=\"\",\"\",VLOOKUP(L107,Tabella_prezzi!$A$3:$K$138,9,FALSE))","v":""},{"$f":"IF(B107=\"\",\"\",VLOOKUP(L107,Tabella_prezzi!$A$3:$K$138,6,FALSE))","v":""},{"$f":"IF(B107=\"\",\"\",VLOOKUP(L107,Tabella_prezzi!$A$3:$K$138,8,FALSE))","v":""},{"$f":"IF(B107=\"\",\"\",VLOOKUP(L107,Tabella_prezzi!$A$3:$K$138,4,FALSE))","v":""},"",null,null,0,{"$f":"VLOOKUP(L107,Tabella_prezzi!A3:K175,6,FALSE)","v":"TS3L6-DACAOCM5N"},"L6N39B",{"$f":"COUNTIF(TS3L6_L6N_1,L107)*$M$22*Q107","v":0},{"$f":"COUNTIF(TS3L6_L6N_2,L107)*$N$22*R107","v":0},{"$f":"COUNTIF(TS3L6_L6N_3,L107)*$O$22*S107","v":0},0,{"$f":"Lotto6_DL560_1!$F$100","v":0},{"$f":"Lotto6_DL560_2!$F$100","v":0},{"$f":"Lotto6_DL560_3!$F$100","v":0},null,null,null,null,null,null,null,{"$f":"ISODD(SUM($J$23:J107))","v":false}]
[null,"",{"$f":"IF(B108=\"\",\"\",VLOOKUP(L108,Tabella_prezzi!$A$3:$K$138,9,FALSE))","v":""},{"$f":"IF(B108=\"\",\"\",VLOOKUP(L108,Tabella_prezzi!$A$3:$K$138,6,FALSE))","v":""},{"$f":"IF(B108=\"\",\"\",VLOOKUP(L108,Tabella_prezzi!$A$3:$K$138,8,FALSE))","v":""},{"$f":"IF(B108=\"\",\"\",VLOOKUP(L108,Tabella_prezzi!$A$3:$K$138,4,FALSE))","v":""},"",null,null,0,{"$f":"VLOOKUP(L108,Tabella_prezzi!A3:K176,6,FALSE)","v":"TS3L6-DACAOCM7N"},"L6N40B",{"$f":"COUNTIF(TS3L6_L6N_1,L108)*$M$22*Q108","v":0},{"$f":"COUNTIF(TS3L6_L6N_2,L108)*$N$22*R108","v":0},{"$f":"COUNTIF(TS3L6_L6N_3,L108)*$O$22*S108","v":0},0,{"$f":"Lotto6_DL560_1!$F$101","v":0},{"$f":"Lotto6_DL560_2!$F$101","v":0},{"$f":"Lotto6_DL560_3!$F$101","v":0},null,null,null,null,null,null,null,{"$f":"ISODD(SUM($J$23:J108))","v":false}]
[null,"",{"$f":"IF(B109=\"\",\"\",VLOOKUP(L109,Tabella_prezzi!$A$3:$K$138,9,FALSE))","v":""},{"$f":"IF(B109=\"\",\"\",VLOOKUP(L109,Tabella_prezzi!$A$3:$K$138,6,FALSE))","v":""},{"$f":"IF(B109=\"\",\"\",VLOOKUP(L109,Tabella_prezzi!$A$3:$K$138,8,FALSE))","v":""},{"$f":"IF(B109=\"\",\"\",VLOOKUP(L109,Tabella_prezzi!$A$3:$K$138,4,FALSE))","v":""},"",null,null,0,{"$f":"VLOOKUP(L109,Tabella_prezzi!A3:K177,6,FALSE)","v":"TS3L6-SASBAY1N"},"L6N49B",0,0,0,0,null,null,null,null,null,null,null,null,null,null,{"$f":"ISODD(SUM($J$23:J109))","v":false}]
[null,"",{"$f":"IF(B110=\"\",\"\",VLOOKUP(L110,Tabella_prezzi!$A$3:$K$138,9,FALSE))","v":""},{"$f":"IF(B110=\"\",\"\",VLOOKUP(L110,Tabella_prezzi!$A$3:$K$138,6,FALSE))","v":""},{"$f":"IF(B110=\"\",\"\",VLOOKUP(L110,Tabella_prezzi!$A$3:$K$138,8,FALSE))","v":""},{"$f":"IF(B110=\"\",\"\",VLOOKUP(L110,Tabella_prezzi!$A$3:$K$138,4,FALSE))","v":""},"",null,null,0,{"$f":"VLOOKUP(L110,Tabella_prezzi!A3:K178,6,FALSE)","v":"TS3L6-DUAL32GBN"},"L6N50B",{"$f":"COUNTIF(TS3L6_L6N_1,L110)*$M$22","v":0},{"$f":"COUNTIF(TS3L6_L6N_2,L110)*$N$22","v":0},{"$f":"COUNTIF(TS3L6_L6N_3,L110)*$O$22","v":0},{"$f":"SUM(M110:O110)","v":0},null,null,null,null,null,null,null,null,null,null,{"$f":"ISODD(SUM($J$23:J110))","v":false}]
[null,"",{"$f":"IF(B111=\"\",\"\",VLOOKUP(L111,Tabella_prezzi!$A$3:$K$138,9,FALSE))","v":""},{"$f":"IF(B111=\"\",\"\",VLOOKUP(L111,Tabella_prezzi!$A$3:$K$138,6,FALSE))","v":""},{"$f":"IF(B111=\"\",\"\",VLOOKUP(L111,Tabella_prezzi!$A$3:$K$138,8,FALSE))","v":""},{"$f":"IF(B111=\"\",\"\",VLOOKUP(L111,Tabella_prezzi!$A$3:$K$138,4,FALSE))","v":""},"",null,null,0,{"$f":"VLOOKUP(L111,Tabella_prezzi!A3:K179,6,FALSE)","v":"TS3L6-CTRL-OSN"},"L6N51B",0,0,0,0,null,null,null,null,null,null,null,null,null,null,{"$f":"ISODD(SUM($J$23:J111))","v":false}]
[null,"",{"$f":"IF(B112=\"\",\"\",VLOOKUP(L112,Tabella_prezzi!$A$3:$K$138,9,FALSE))","v":""},{"$f":"IF(B112=\"\",\"\",VLOOKUP(L112,Tabella_prezzi!$A$3:$K$138,6,FALSE))","v":""},{"$f":"IF(B112=\"\",\"\",VLOOKUP(L112,Tabella_prezzi!$A$3:$K$138,8,FALSE))","v":""},{"$f":"IF(B112=\"\",\"\",VLOOKUP(L112,Tabella_prezzi!$A$3:$K$138,4,FALSE))","v":""},"",null,null,0,{"$f":"VLOOKUP(L112,Tabella_prezzi!A3:K180,6,FALSE)","v":"TS3L6-CTRL-EN"},"L6N52B",0,0,0,0,null,null,null,null,null,null,null,null,null,null,{"$f":"ISODD(SUM($J$23:J112))","v":false}]
[null,"",{"$f":"IF(B113=\"\",\"\",VLOOKUP(L113,Tabella_prezzi!$A$3:$K$138,9,FALSE))","v":""},{"$f":"IF(B113=\"\",\"\",VLOOKUP(L113,Tabella_prezzi!$A$3:$K$138,6,FALSE))","v":""},{"$f":"IF(B113=\"\",\"\",VLOOKUP(L113,Tabella_prezzi!$A$3:$K$138,8,FALSE))","v":""},{"$f":"IF(B113=\"\",\"\",VLOOKUP(L113,Tabella_prezzi!$A$3:$K$138,4,FALSE))","v":""},"",null,null,0,{"$f":"VLOOKUP(L113,Tabella_prezzi!A3:K183,6,FALSE)","v":"TS3L6-CTRL-AN"},"L6N56B",0,0,0,0,null,null,null,null,null,null,null,null,null,null,{"$f":"ISODD(SUM($J$23:J113))","v":false}]
[null,"",{"$f":"IF(B114=\"\",\"\",VLOOKUP(L114,Tabella_prezzi!$A$3:$K$138,9,FALSE))","v":""},{"$f":"IF(B114=\"\",\"\",VLOOKUP(L114,Tabella_prezzi!$A$3:$K$138,6,FALSE))","v":""},{"$f":"IF(B114=\"\",\"\",VLOOKUP(L114,Tabella_prezzi!$A$3:$K$138,8,FALSE))","v":""},{"$f":"IF(B114=\"\",\"\",VLOOKUP(L114,Tabella_prezzi!$A$3:$K$138,4,FALSE))","v":""},"",null,null,0,{"$f":"VLOOKUP(L114,Tabella_prezzi!A3:K184,6,FALSE)","v":"TS3L6-CTRL-PN"},"L6N57B",0,0,0,0,null,null,null,null,null,null,null,null,null,null,{"$f":"ISODD(SUM($J$23:J114))","v":false}]
[null,"",{"$f":"IF(B115=\"\",\"\",VLOOKUP(L115,Tabella_prezzi!$A$3:$K$138,9,FALSE))","v":""},{"$f":"IF(B115=\"\",\"\",VLOOKUP(L115,Tabella_prezzi!$A$3:$K$138,6,FALSE))","v":""},{"$f":"IF(B115=\"\",\"\",VLOOKUP(L115,Tabella_prezzi!$A$3:$K$138,8,FALSE))","v":""},{"$f":"IF(B115=\"\",\"\",VLOOKUP(L115,Tabella_prezzi!$A$3:$K$138,4,FALSE))","v":""},"",null,null,0,{"$f":"VLOOKUP(L115,Tabella_prezzi!A3:K185,6,FALSE)","v":"TS3L6-VS7ESPK3"},"L6N36",{"$f":"IF($P$23>=1,Altre_Opzioni!$F$23,0)","v":0},null,null,0,null,null,null,null,null,null,null,null,null,null,{"$f":"ISODD(SUM($J$23:J115))","v":false}]
[null,"",{"$f":"IF(B116=\"\",\"\",VLOOKUP(L116,Tabella_prezzi!$A$3:$K$138,9,FALSE))","v":""},{"$f":"IF(B116=\"\",\"\",VLOOKUP(L116,Tabella_prezzi!$A$3:$K$138,6,FALSE))","v":""},{"$f":"IF(B116=\"\",\"\",VLOOKUP(L116,Tabella_prezzi!$A$3:$K$138,8,FALSE))","v":""},{"$f":"IF(B116=\"\",\"\",VLOOKUP(L116,Tabella_prezzi!$A$3:$K$138,4,FALSE))","v":""},"",null,null,0,{"$f":"VLOOKUP(L116,Tabella_prezzi!A3:K186,6,FALSE)","v":"TS3L6-VS7ESPK3N"},"L6N36B",{"$f":"IF($P$24>=1,Altre_Opzioni!$F$23,0)","v":0},null,null,{"$f":"IF(P115>=1,0,Altre_Opzioni!$F$23)","v":0},null,null,null,null,null,null,null,null,null,null,{"$f":"ISODD(SUM($J$23:J116))","v":false}]
[null,"",{"$f":"IF(B117=\"\",\"\",VLOOKUP(L117,Tabella_prezzi!$A$3:$K$138,9,FALSE))","v":""},{"$f":"IF(B117=\"\",\"\",VLOOKUP(L117,Tabella_prezzi!$A$3:$K$138,6,FALSE))","v":""},{"$f":"IF(B117=\"\",\"\",VLOOKUP(L117,Tabella_prezzi!$A$3:$K$138,8,FALSE))","v":""},{"$f":"IF(B117=\"\",\"\",VLOOKUP(L117,Tabella_prezzi!$A$3:$K$138,4,FALSE))","v":""},"",null,null,{"$f":"IF(B117=\"\",0,1)","v":0},{"$f":"VLOOKUP(L117,Tabella_prezzi!A3:K189,6,FALSE)","v":"TS3L6-ESPSTDAK"},"L6N41",{"$f":"IF($P$23>=1,Altre_Opzioni!$F$24,0)","v":0},null,null,{"$f":"SUM(M117:O117)","v":0},null,null,null,null,null,null,null,null,null,null,{"$f":"ISODD(SUM($J$23:J117))","v":false}]
[null,"",{"$f":"IF(B118=\"\",\"\",VLOOKUP(L118,Tabella_prezzi!$A$3:$K$138,9,FALSE))","v":""},{"$f":"IF(B118=\"\",\"\",VLOOKUP(L118,Tabella_prezzi!$A$3:$K$138,6,FALSE))","v":""},{"$f":"IF(B118=\"\",\"\",VLOOKUP(L118,Tabella_prezzi!$A$3:$K$138,8,FALSE))","v":""},{"$f":"IF(B118=\"\",\"\",VLOOKUP(L118,Tabella_prezzi!$A$3:$K$138,4,FALSE))","v":""},"",null,null,0,{"$f":"VLOOKUP(L118,Tabella_prezzi!A3:K191,6,FALSE)","v":"TS3L6-ESPSTDAKN"},"L6N41B",{"$f":"IF($P$24>=1,Altre_Opzioni!$F$24,0)","v":0},null,null,{"$f":"IF(P117>=1,0,Altre_Opzioni!$F$24)","v":0},null,null,null,null,null,null,null,null,null,null,{"$f":"ISODD(SUM($J$23:J118))","v":false}]
[null,"",{"$f":"IF(B119=\"\",\"\",VLOOKUP(L119,Tabella_prezzi!$A$3:$K$138,9,FALSE))","v":""},{"$f":"IF(B119=\"\",\"\",VLOOKUP(L119,Tabella_prezzi!$A$3:$K$138,6,FALSE))","v":""},{"$f":"IF(B119=\"\",\"\",VLOOKUP(L119,Tabella_prezzi!$A$3:$K$138,8,FALSE))","v":""},{"$f":"IF(B119=\"\",\"\",VLOOKUP(L119,Tabella_prezzi!$A$3:$K$138,4,FALSE))","v":""},"",null,null,0,{"$f":"VLOOKUP(L119,Tabella_prezzi!A3:K192,6,FALSE)","v":"TS3L6-VCS7STD"},"L6N42",{"$f":"IF($P$23>=1,Altre_Opzioni!$F$25,0)","v":0},null,null,{"$f":"SUM(M119:O119)","v":0},null,null,null,null,null,null,null,null,null,null,{"$f":"ISODD(SUM($J$23:J119))","v":false}]
[null,"",{"$f":"IF(B120=\"\",\"\",VLOOKUP(L120,Tabella_prezzi!$A$3:$K$138,9,FALSE))","v":""},{"$f":"IF(B120=\"\",\"\",VLOOKUP(L120,Tabella_prezzi!$A$3:$K$138,6,FALSE))","v":""},{"$f":"IF(B120=\"\",\"\",VLOOKUP(L120,Tabella_prezzi!$A$3:$K$138,8,FALSE))","v":""},{"$f":"IF(B120=\"\",\"\",VLOOKUP(L120,Tabella_prezzi!$A$3:$K$138,4,FALSE))","v":""},"",null,null,0,{"$f":"VLOOKUP(L120,Tabella_prezzi!A3:K193,6,FALSE)","v":"TS3L6-VCS7STDN"},"L6N42B",{"$f":"IF($P$24>=1,Altre_Opzioni!$F$25,0)","v":0},null,null,{"$f":"IF(P119>=1,0,Altre_Opzioni!$F$25)","v":0},null,null,null,null,null,null,null,null,null,null,{"$f":"ISODD(SUM($J$23:J120))","v":false}]
[null,"",{"$f":"IF(B121=\"\",\"\",VLOOKUP(L121,Tabella_prezzi!$A$3:$K$138,9,FALSE))","v":""},{"$f":"IF(B121=\"\",\"\",VLOOKUP(L121,Tabella_prezzi!$A$3:$K$138,6,FALSE))","v":""},{"$f":"IF(B121=\"\",\"\",VLOOKUP(L121,Tabella_prezzi!$A$3:$K$138,8,FALSE))","v":""},{"$f":"IF(B121=\"\",\"\",VLOOKUP(L121,Tabella_prezzi!$A$3:$K$138,4,FALSE))","v":""},"",null,null,0,{"$f":"VLOOKUP(L121,Tabella_prezzi!A3:K194,6,FALSE)","v":"TS3L6-VS7EPL"},"L6N43",{"$f":"IF($P$23>=1,Altre_Opzioni!$F$26,0)","v":0},null,null,{"$f":"SUM(M121:O121)","v":0},null,null,null,null,null,null,null,null,null,null,{"$f":"ISODD(SUM($J$23:J121))","v":false}]
[null,"",{"$f":"IF(B122=\"\",\"\",VLOOKUP(L122,Tabella_prezzi!$A$3:$K$138,9,FALSE))","v":""},{"$f":"IF(B122=\"\",\"\",VLOOKUP(L122,Tabella_prezzi!$A$3:$K$138,6,FALSE))","v":""},{"$f":"IF(B122=\"\",\"\",VLOOKUP(L122,Tabella_prezzi!$A$3:$K$138,8,FALSE))","v":""},{"$f":"IF(B122=\"\",\"\",VLOOKUP(L122,Tabella_prezzi!$A$3:$K$138,4,FALSE))","v":""},"",null,null,0,{"$f":"VLOOKUP(L122,Tabella_prezzi!A3:K195,6,FALSE)","v":"TS3L6-VS7EPLN"},"L6N43B",{"$f":"IF($P$24>=1,Altre_Opzioni!$F$26,0)","v":0},null,null,{"$f":"IF(P121>=1,0,Altre_Opzioni!$F$26)","v":0},null,null,null,null,null,null,null,null,null,null,{"$f":"ISODD(SUM($J$23:J122))","v":false}]
[null,"",{"$f":"IF(B123=\"\",\"\",VLOOKUP(L123,Tabella_prezzi!$A$3:$K$138,9,FALSE))","v":""},{"$f":"IF(B123=\"\",\"\",VLOOKUP(L123,Tabella_prezzi!$A$3:$K$138,6,FALSE))","v":""},{"$f":"IF(B123=\"\",\"\",VLOOKUP(L123,Tabella_prezzi!$A$3:$K$138,8,FALSE))","v":""},{"$f":"IF(B123=\"\",\"\",VLOOKUP(L123,Tabella_prezzi!$A$3:$K$138,4,FALSE))","v":""},"",null,null,0,{"$f":"VLOOKUP(L123,Tabella_prezzi!A3:K196,6,FALSE)","v":"TS3L6-VS7STD"},"L6N44",{"$f":"IF($P$23>=1,Altre_Opzioni!$F$27,0)","v":0},null,null,{"$f":"SUM(M123:O123)","v":0},null,null,null,null,null,null,null,null,null,null,{"$f":"ISODD(SUM($J$23:J123))","v":false}]
[null,"",{"$f":"IF(B124=\"\",\"\",VLOOKUP(L124,Tabella_prezzi!$A$3:$K$138,9,FALSE))","v":""},{"$f":"IF(B124=\"\",\"\",VLOOKUP(L124,Tabella_prezzi!$A$3:$K$138,6,FALSE))","v":""},{"$f":"IF(B124=\"\",\"\",VLOOKUP(L124,Tabella_prezzi!$A$3:$K$138,8,FALSE))","v":""},{"$f":"IF(B124=\"\",\"\",VLOOKUP(L124,Tabella_prezzi!$A$3:$K$138,4,FALSE))","v":""},"",null,null,0,{"$f":"VLOOKUP(L124,Tabella_prezzi!A3:K197,6,FALSE)","v":"TS3L6-VS7STDN"},"L6N44B",{"$f":"IF($P$24>=1,Altre_Opzioni!$F$27,0)","v":0},null,null,{"$f":"IF(P123>=1,0,Altre_Opzioni!$F$27)","v":0},null,null,null,null,null,null,null,null,null,null,{"$f":"ISODD(SUM($J$23:J124))","v":false}]
[null,"",{"$f":"IF(B125=\"\",\"\",VLOOKUP(L125,Tabella_prezzi!$A$3:$K$138,9,FALSE))","v":""},{"$f":"IF(B125=\"\",\"\",VLOOKUP(L125,Tabella_prezzi!$A$3:$K$138,6,FALSE))","v":""},{"$f":"IF(B125=\"\",\"\",VLOOKUP(L125,Tabella_prezzi!$A$3:$K$138,8,FALSE))","v":""},{"$f":"IF(B125=\"\",\"\",VLOOKUP(L125,Tabella_prezzi!$A$3:$K$138,4,FALSE))","v":""},"",null,null,0,{"$f":"VLOOKUP(L125,Tabella_prezzi!A3:K198,6,FALSE)","v":"TS3L6-ST7STD"},"L6N45",{"$f":"IF($P$23>=1,Altre_Opzioni!$F$28,0)","v":0},null,null,{"$f":"SUM(M125:O125)","v":0},null,null,null,null,null,null,null,null,null,null,{"$f":"ISODD(SUM($J$23:J125))","v":false}]
[null,"",{"$f":"IF(B126=\"\",\"\",VLOOKUP(L126,Tabella_prezzi!$A$3:$K$138,9,FALSE))","v":""},{"$f":"IF(B126=\"\",\"\",VLOOKUP(L126,Tabella_prezzi!$A$3:$K$138,6,FALSE))","v":""},{"$f":"IF(B126=\"\",\"\",VLOOKUP(L126,Tabella_prezzi!$A$3:$K$138,8,FALSE))","v":""},{"$f":"IF(B126=\"\",\"\",VLOOKUP(L126,Tabella_prezzi!$A$3:$K$138,4,FALSE))","v":""},"",null,null,0,{"$f":"VLOOKUP(L126,Tabella_prezzi!A3:K199,6,FALSE)","v":"TS3L6-ST7STDN"},"L6N45B",{"$f":"IF($P$24>=1,Altre_Opzioni!$F$28,0)","v":0},null,null,{"$f":"IF(P125>=1,0,Altre_Opzioni!$F$28)","v":0},null,null,null,null,null,null,null,null,null,null,{"$f":"ISODD(SUM($J$23:J126))","v":false}]
[null,"",{"$f":"IF(B127=\"\",\"\",VLOOKUP(L127,Tabella_prezzi!$A$3:$K$138,9,FALSE))","v":""},{"$f":"IF(B127=\"\",\"\",VLOOKUP(L127,Tabella_prezzi!$A$3:$K$138,6,FALSE))","v":""},{"$f":"IF(B127=\"\",\"\",VLOOKUP(L127,Tabella_prezzi!$A$3:$K$138,8,FALSE))","v":""},{"$f":"IF(B127=\"\",\"\",VLOOKUP(L127,Tabella_prezzi!$A$3:$K$138,4,FALSE))","v":""},"",null,null,0,{"$f":"VLOOKUP(L127,Tabella_prezzi!A3:K200,6,FALSE)","v":"TS3L6-ST7ADV"},"L6N46",{"$f":"IF($P$23>=1,Altre_Opzioni!$F$29,0)","v":0},null,null,{"$f":"SUM(M127:O127)","v":0},null,null,null,null,null,null,null,null,null,null,{"$f":"ISODD(SUM($J$23:J127))","v":false}]
[null,"",{"$f":"IF(B128=\"\",\"\",VLOOKUP(L128,Tabella_prezzi!$A$3:$K$138,9,FALSE))","v":""},{"$f":"IF(B128=\"\",\"\",VLOOKUP(L128,Tabella_prezzi!$A$3:$K$138,6,FALSE))","v":""},{"$f":"IF(B128=\"\",\"\",VLOOKUP(L128,Tabella_prezzi!$A$3:$K$138,8,FALSE))","v":""},{"$f":"IF(B128=\"\",\"\",VLOOKUP(L128,Tabella_prezzi!$A$3:$K$138,4,FALSE))","v":""},"",null,null,0,{"$f":"VLOOKUP(L128,Tabella_prezzi!A3:K201,6,FALSE)","v":"TS3L6-ST7ADVN"},"L6N46B",{"$f":"IF($P$24>=1,Altre_Opzioni!$F$29,0)","v":0},null,null,{"$f":"IF(P127>=1,0,Altre_Opzioni!$F$29)","v":0},null,null,null,null,null,null,null,null,null,null,{"$f":"ISODD(SUM($J$23:J128))","v":false}]
[null,"",{"$f":"IF(B129=\"\",\"\",VLOOKUP(L129,Tabella_prezzi!$A$3:$K$138,9,FALSE))","v":""},{"$f":"IF(B129=\"\",\"\",VLOOKUP(L129,Tabella_prezzi!$A$3:$K$138,6,FALSE))","v":""},{"$f":"IF(B129=\"\",\"\",VLOOKUP(L129,Tabella_prezzi!$A$3:$K$138,8,FALSE))","v":""},{"$f":"IF(B129=\"\",\"\",VLOOKUP(L129,Tabella_prezzi!$A$3:$K$138,4,FALSE))","v":""},"",null,null,0,{"$f":"VLOOKUP(L129,Tabella_prezzi!A3:K202,6,FALSE)","v":"TS3L6-RACKMONO"},"L6N47",{"$f":"IF($P$23>=1,Altre_Opzioni!$F$9,0)","v":0},null,null,{"$f":"SUM(M129:O129)","v":0},null,null,null,null,null,null,null,null,null,null,{"$f":"ISODD(SUM($J$23:J129))","v":false}]
[null,"",{"$f":"IF(B130=\"\",\"\",VLOOKUP(L130,Tabella_prezzi!$A$3:$K$138,9,FALSE))","v":""},{"$f":"IF(B130=\"\",\"\",VLOOKUP(L130,Tabella_prezzi!$A$3:$K$138,6,FALSE))","v":""},{"$f":"IF(B130=\"\",\"\",VLOOKUP(L130,Tabella_prezzi!$A$3:$K$138,8,FALSE))","v":""},{"$f":"IF(B130=\"\",\"\",VLOOKUP(L130,Tabella_prezzi!$A$3:$K$138,4,FALSE))","v":""},"",null,null,0,{"$f":"VLOOKUP(L130,Tabella_prezzi!A3:K203,6,FALSE)","v":"TS3L6-RACKMONON"},"L6N47B",{"$f":"IF($P$24>=1,Altre_Opzioni!$F$9,0)","v":0},null,null,{"$f":"IF(P129>=1,0,Altre_Opzioni!$F$9)","v":0},null,null,null,null,null,null,null,null,null,null,{"$f":"ISODD(SUM($J$23:J130))","v":false}]
[null,"",{"$f":"IF(B131=\"\",\"\",VLOOKUP(L131,Tabella_prezzi!$A$3:$K$138,9,FALSE))","v":""},{"$f":"IF(B131=\"\",\"\",VLOOKUP(L131,Tabella_prezzi!$A$3:$K$138,6,FALSE))","v":""},{"$f":"IF(B131=\"\",\"\",VLOOKUP(L131,Tabella_prezzi!$A$3:$K$138,8,FALSE))","v":""},{"$f":"IF(B131=\"\",\"\",VLOOKUP(L131,Tabella_prezzi!$A$3:$K$138,4,FALSE))","v":""},"",null,null,0,{"$f":"VLOOKUP(L131,Tabella_prezzi!A3:K204,6,FALSE)","v":"TS3L6-RACK3PH"},"L6N48",{"$f":"IF($P$23>=1,Altre_Opzioni!$F$13,0)","v":0},null,null,{"$f":"SUM(M131:O131)","v":0},null,null,null,null,null,null,null,null,null,null,{"$f":"ISODD(SUM($J$23:J131))","v":false}]
[null,"",{"$f":"IF(B132=\"\",\"\",VLOOKUP(L132,Tabella_prezzi!$A$3:$K$138,9,FALSE))","v":""},{"$f":"IF(B132=\"\",\"\",VLOOKUP(L132,Tabella_prezzi!$A$3:$K$138,6,FALSE))","v":""},{"$f":"IF(B132=\"\",\"\",VLOOKUP(L132,Tabella_prezzi!$A$3:$K$138,8,FALSE))","v":""},{"$f":"IF(B132=\"\",\"\",VLOOKUP(L132,Tabella_prezzi!$A$3:$K$138,4,FALSE))","v":""},"",null,null,0,{"$f":"VLOOKUP(L132,Tabella_prezzi!A3:K205,6,FALSE)","v":"TS3L6-RACK3PHN"},"L6N48B",{"$f":"IF($P$24>=1,Altre_Opzioni!$F$13,0)","v":0},null,null,{"$f":"IF(P131>=1,0,Altre_Opzioni!$F$13)","v":0},null,null,null,null,null,null,null,null,null,null,{"$f":"ISODD(SUM($J$23:J132))","v":false}]
[null,"",{"$f":"IF(B133=\"\",\"\",VLOOKUP(L133,Tabella_prezzi!$A$3:$K$138,9,FALSE))","v":""},{"$f":"IF(B133=\"\",\"\",VLOOKUP(L133,Tabella_prezzi!$A$3:$K$138,6,FALSE))","v":""},{"$f":"IF(B133=\"\",\"\",VLOOKUP(L133,Tabella_prezzi!$A$3:$K$138,8,FALSE))","v":""},{"$f":"IF(B133=\"\",\"\",VLOOKUP(L133,Tabella_prezzi!$A$3:$K$138,4,FALSE))","v":""},"",null,null,0,{"$f":"VLOOKUP(L133,Tabella_prezzi!A3:K206,6,FALSE)","v":"TS3L6-E15Y247"},"L6N53",{"$f":"IF($P$23>=1,Altre_Opzioni!$F$20,0)","v":0},null,null,{"$f":"SUM(M133:O133)","v":0},null,null,null,null,null,null,null,null,null,null,{"$f":"ISODD(SUM($J$23:J133))","v":false}]
[null,"",{"$f":"IF(B134=\"\",\"\",VLOOKUP(L134,Tabella_prezzi!$A$3:$K$138,9,FALSE))","v":""},{"$f":"IF(B134=\"\",\"\",VLOOKUP(L134,Tabella_prezzi!$A$3:$K$138,6,FALSE))","v":""},{"$f":"IF(B134=\"\",\"\",VLOOKUP(L134,Tabella_prezzi!$A$3:$K$138,8,FALSE))","v":""},{"$f":"IF(B134=\"\",\"\",VLOOKUP(L134,Tabella_prezzi!$A$3:$K$138,4,FALSE))","v":""},"",null,null,0,{"$f":"VLOOKUP(L134,Tabella_prezzi!A3:K207,6,FALSE)","v":"TS3L6-E15Y247N"},"L6N53B",{"$f":"IF($P$24>=1,Altre_Opzioni!$F$20,0)","v":0},null,null,{"$f":"IF(P133>=1,0,Altre_Opzioni!$F$20)","v":0},null,null,null,null,null,null,null,null,null,null,{"$f":"ISODD(SUM($J$23:J134))","v":false}]
[null,{"$f":"IF(P135>0,P135,\"\")","v":""},{"$f":"IF(B135=\"\",\"\",VLOOKUP(L135,Tabella_prezzi!$A$3:$K$301,9,FALSE))","v":""},{"$f":"IF(B135=\"\",\"\",VLOOKUP(L135,Tabella_prezzi!$A$3:$K$301,6,FALSE))","v":""},{"$f":"IF(B135=\"\",\"\",VLOOKUP(L135,Tabella_prezzi!$A$3:$K$301,8,FALSE))","v":""},{"$f":"IF(B135=\"\",\"\",VLOOKUP(L135,Tabella_prezzi!$A$3:$K$301,4,FALSE))","v":""},{"$f":"IF(C135=\"\",\"\",F135*B135)","v":""},null,null,0,{"$f":"VLOOKUP(L135,Tabella_prezzi!A4:K208,6,FALSE)","v":"TS3L6-DAC10GB3MN"},"L6N58B",{"$f":"COUNTIF(TS3L6_L6N_1,L135)*$M$22*Q135","v":0},{"$f":"COUNTIF(TS3L6_L6N_2,L135)*$N$22*R135","v":0},{"$f":"COUNTIF(TS3L6_L6N_3,L135)*$O$22*S135","v":0},{"$f":"SUM(M135:O135)","v":0},{"$f":"Lotto6_DL560_1!$F$108","v":0},{"$f":"Lotto6_DL560_2!$F$108","v":0},{"$f":"Lotto6_DL560_3!$F$108","v":0},null,null,null,null,null,null,null,{"$f":"ISODD(SUM($J$23:J135))","v":false}]
[null,{"$f":"IF(P136>0,P136,\"\")","v":""},{"$f":"IF(B136=\"\",\"\",VLOOKUP(L136,Tabella_prezzi!$A$3:$K$301,9,FALSE))","v":""},{"$f":"IF(B136=\"\",\"\",VLOOKUP(L136,Tabella_prezzi!$A$3:$K$301,6,FALSE))","v":""},{"$f":"IF(B136=\"\",\"\",VLOOKUP(L136,Tabella_prezzi!$A$3:$K$301,8,FALSE))","v":""},{"$f":"IF(B136=\"\",\"\",VLOOKUP(L136,Tabella_prezzi!$A$3:$K$301,4,FALSE))","v":""},{"$f":"IF(C136=\"\",\"\",F136*B136)","v":""},null,null,0,{"$f":"VLOOKUP(L136,Tabella_prezzi!A5:K209,6,FALSE)","v":"TS3L6-DAC10GB3M"},"L6N58",0,0,0,0,{"$f":"Lotto6_DL560_1!$F$108","v":0},{"$f":"Lotto6_DL560_2!$F$108","v":0},{"$f":"Lotto6_DL560_3!$F$108","v":0},null,null,null,null,null,null,null,{"$f":"ISODD(SUM($J$23:J136))","v":false}]
[null,"",{"$f":"IF(B137=\"\",\"\",VLOOKUP(L137,Tabella_prezzi!$A$3:$K$301,9,FALSE))","v":""},{"$f":"IF(B137=\"\",\"\",VLOOKUP(L137,Tabella_prezzi!$A$3:$K$301,6,FALSE))","v":""},{"$f":"IF(B137=\"\",\"\",VLOOKUP(L137,Tabella_prezzi!$A$3:$K$301,8,FALSE))","v":""},{"$f":"IF(B137=\"\",\"\",VLOOKUP(L137,Tabella_prezzi!$A$3:$K$301,4,FALSE))","v":""},"",null,null,0,{"$f":"VLOOKUP(L137,Tabella_prezzi!A6:K210,6,FALSE)","v":"TS3L6-OM4M2N"},"L6N59B",0,0,0,0,{"$f":"Lotto6_DL560_1!$F$109","v":0},{"$f":"Lotto6_DL560_2!$F$109","v":0},{"$f":"Lotto6_DL560_3!$F$109","v":0},null,null,null,null,null,null,null,{"$f":"ISODD(SUM($J$23:J137))","v":false}]
[null,"",{"$f":"IF(B138=\"\",\"\",VLOOKUP(L138,Tabella_prezzi!$A$3:$K$301,9,FALSE))","v":""},{"$f":"IF(B138=\"\",\"\",VLOOKUP(L138,Tabella_prezzi!$A$3:$K$301,6,FALSE))","v":""},{"$f":"IF(B138=\"\",\"\",VLOOKUP(L138,Tabella_prezzi!$A$3:$K$301,8,FALSE))","v":""},{"$f":"IF(B138=\"\",\"\",VLOOKUP(L138,Tabella_prezzi!$A$3:$K$301,4,FALSE))","v":""},"",null,null,0,{"$f":"VLOOKUP(L138,Tabella_prezzi!A7:K211,6,FALSE)","v":"TS3L6-OM4M2"},"L6N59",0,0,0,0,{"$f":"Lotto6_DL560_1!$F$109","v":0},{"$f":"Lotto6_DL560_2!$F$109","v":0},{"$f":"Lotto6_DL560_3!$F$109","v":0},null,null,null,null,null,null,null,{"$f":"ISODD(SUM($J$23:J138))","v":false}]
[null,"",{"$f":"IF(B139=\"\",\"\",VLOOKUP(L139,Tabella_prezzi!$A$3:$K$301,9,FALSE))","v":""},{"$f":"IF(B139=\"\",\"\",VLOOKUP(L139,Tabella_prezzi!$A$3:$K$301,6,FALSE))","v":""},{"$f":"IF(B139=\"\",\"\",VLOOKUP(L139,Tabella_prezzi!$A$3:$K$301,8,FALSE))","v":""},{"$f":"IF(B139=\"\",\"\",VLOOKUP(L139,Tabella_prezzi!$A$3:$K$301,4,FALSE))","v":""},"",null,null,0,{"$f":"VLOOKUP(L139,Tabella_prezzi!A8:K212,6,FALSE)","v":"TS3L6-DAC25GBM3N"},"L6N60B",0,0,0,0,{"$f":"Lotto6_DL560_1!$F$110","v":0},{"$f":"Lotto6_DL560_2!$F$110","v":0},{"$f":"Lotto6_DL560_3!$F$110","v":0},null,null,null,null,null,null,null,{"$f":"ISODD(SUM($J$23:J139))","v":false}]
[null,"",{"$f":"IF(B140=\"\",\"\",VLOOKUP(L140,Tabella_prezzi!$A$3:$K$301,9,FALSE))","v":""},{"$f":"IF(B140=\"\",\"\",VLOOKUP(L140,Tabella_prezzi!$A$3:$K$301,6,FALSE))","v":""},{"$f":"IF(B140=\"\",\"\",VLOOKUP(L140,Tabella_prezzi!$A$3:$K$301,8,FALSE))","v":""},{"$f":"IF(B140=\"\",\"\",VLOOKUP(L140,Tabella_prezzi!$A$3:$K$301,4,FALSE))","v":""},"",null,null,0,{"$f":"VLOOKUP(L140,Tabella_prezzi!A9:K213,6,FALSE)","v":"TS3L6-DAC25GBM3"},"L6N60",0,0,0,0,{"$f":"Lotto6_DL560_1!$F$110","v":0},{"$f":"Lotto6_DL560_2!$F$110","v":0},{"$f":"Lotto6_DL560_3!$F$110","v":0},null,null,null,null,null,null,null,{"$f":"ISODD(SUM($J$23:J140))","v":false}]
[null,"",{"$f":"IF(B141=\"\",\"\",VLOOKUP(L141,Tabella_prezzi!$A$3:$K$301,9,FALSE))","v":""},{"$f":"IF(B141=\"\",\"\",VLOOKUP(L141,Tabella_prezzi!$A$3:$K$301,6,FALSE))","v":""},{"$f":"IF(B141=\"\",\"\",VLOOKUP(L141,Tabella_prezzi!$A$3:$K$301,8,FALSE))","v":""},{"$f":"IF(B141=\"\",\"\",VLOOKUP(L141,Tabella_prezzi!$A$3:$K$301,4,FALSE))","v":""},"",null,null,0,{"$f":"VLOOKUP(L141,Tabella_prezzi!A10:K214,6,FALSE)","v":"TS3L6-10OTLRN"},"L6N61B",0,0,0,0,{"$f":"Lotto6_DL560_1!$F$104","v":0},{"$f":"Lotto6_DL560_2!$F$104","v":0},{"$f":"Lotto6_DL560_3!$F$104","v":0},null,null,null,null,null,null,null,{"$f":"ISODD(SUM($J$23:J141))","v":false}]
[null,"",{"$f":"IF(B142=\"\",\"\",VLOOKUP(L142,Tabella_prezzi!$A$3:$K$301,9,FALSE))","v":""},{"$f":"IF(B142=\"\",\"\",VLOOKUP(L142,Tabella_prezzi!$A$3:$K$301,6,FALSE))","v":""},{"$f":"IF(B142=\"\",\"\",VLOOKUP(L142,Tabella_prezzi!$A$3:$K$301,8,FALSE))","v":""},{"$f":"IF(B142=\"\",\"\",VLOOKUP(L142,Tabella_prezzi!$A$3:$K$301,4,FALSE))","v":""},"",null,null,0,{"$f":"VLOOKUP(L142,Tabella_prezzi!A11:K215,6,FALSE)","v":"TS3L6-10OTLR"},"L6N61",0,0,0,0,{"$f":"Lotto6_DL560_1!$F$104","v":0},{"$f":"Lotto6_DL560_2!$F$104","v":0},{"$f":"Lotto6_DL560_3!$F$104","v":0},null,null,null,null,null,null,null,{"$f":"ISODD(SUM($J$23:J142))","v":false}]
[null,"",{"$f":"IF(B143=\"\",\"\",VLOOKUP(L143,Tabella_prezzi!$A$3:$K$301,9,FALSE))","v":""},{"$f":"IF(B143=\"\",\"\",VLOOKUP(L143,Tabella_prezzi!$A$3:$K$301,6,FALSE))","v":""},{"$f":"IF(B143=\"\",\"\",VLOOKUP(L143,Tabella_prezzi!$A$3:$K$301,8,FALSE))","v":""},{"$f":"IF(B143=\"\",\"\",VLOOKUP(L143,Tabella_prezzi!$A$3:$K$301,4,FALSE))","v":""},"",null,null,0,{"$f":"VLOOKUP(L143,Tabella_prezzi!A12:K216,6,FALSE)","v":"TS3L6-10OTSRN"},"L6N62B",0,0,0,0,{"$f":"Lotto6_DL560_1!$F$105","v":0},{"$f":"Lotto6_DL560_2!$F$105","v":0},{"$f":"Lotto6_DL560_3!$F$105","v":0},null,null,null,null,null,null,null,{"$f":"ISODD(SUM($J$23:J143))","v":false}]
[null,"",{"$f":"IF(B144=\"\",\"\",VLOOKUP(L144,Tabella_prezzi!$A$3:$K$301,9,FALSE))","v":""},{"$f":"IF(B144=\"\",\"\",VLOOKUP(L144,Tabella_prezzi!$A$3:$K$301,6,FALSE))","v":""},{"$f":"IF(B144=\"\",\"\",VLOOKUP(L144,Tabella_prezzi!$A$3:$K$301,8,FALSE))","v":""},{"$f":"IF(B144=\"\",\"\",VLOOKUP(L144,Tabella_prezzi!$A$3:$K$301,4,FALSE))","v":""},"",null,null,0,{"$f":"VLOOKUP(L144,Tabella_prezzi!A13:K217,6,FALSE)","v":"TS3L6-10OTSR"},"L6N62",0,0,0,0,{"$f":"Lotto6_DL560_1!$F$105","v":0},{"$f":"Lotto6_DL560_2!$F$105","v":0},{"$f":"Lotto6_DL560_3!$F$105","v":0},null,null,null,null,null,null,null,{"$f":"ISODD(SUM($J$23:J144))","v":false}]
[null,"",{"$f":"IF(B145=\"\",\"\",VLOOKUP(L145,Tabella_prezzi!$A$3:$K$301,9,FALSE))","v":""},{"$f":"IF(B145=\"\",\"\",VLOOKUP(L145,Tabella_prezzi!$A$3:$K$301,6,FALSE))","v":""},{"$f":"IF(B145=\"\",\"\",VLOOKUP(L145,Tabella_prezzi!$A$3:$K$301,8,FALSE))","v":""},{"$f":"IF(B145=\"\",\"\",VLOOKUP(L145,Tabella_prezzi!$A$3:$K$301,4,FALSE))","v":""},"",null,null,0,{"$f":"VLOOKUP(L145,Tabella_prezzi!A14:K218,6,FALSE)","v":"TS3L6-X710SFPN"},"L6N63B",{"$f":"COUNTIF(TS3L6_L6N_1,L145)*$M$22","v":0},{"$f":"COUNTIF(TS3L6_L6N_2,L145)*$N$22","v":0},{"$f":"COUNTIF(TS3L6_L6N_3,L145)*$O$22","v":0},0,null,null,null,null,null,null,null,null,null,null,{"$f":"ISODD(SUM($J$23:J145))","v":false}]
[null,"",{"$f":"IF(B146=\"\",\"\",VLOOKUP(L146,Tabella_prezzi!$A$3:$K$301,9,FALSE))","v":""},{"$f":"IF(B146=\"\",\"\",VLOOKUP(L146,Tabella_prezzi!$A$3:$K$301,6,FALSE))","v":""},{"$f":"IF(B146=\"\",\"\",VLOOKUP(L146,Tabella_prezzi!$A$3:$K$301,8,FALSE))","v":""},{"$f":"IF(B146=\"\",\"\",VLOOKUP(L146,Tabella_prezzi!$A$3:$K$301,4,FALSE))","v":""},"",null,null,0,{"$f":"VLOOKUP(L146,Tabella_prezzi!A15:K219,6,FALSE)","v":"TS3L6-X710SFP"},"L6N63",{"$f":"COUNTIF(TS3L6_L6N_1,L146)*$M$22","v":0},{"$f":"COUNTIF(TS3L6_L6N_2,L146)*$N$22","v":0},{"$f":"COUNTIF(TS3L6_L6N_3,L146)*$O$22","v":0},{"$f":"SUM(M146:O146)","v":0},null,null,null,null,null,null,null,null,null,null,{"$f":"ISODD(SUM($J$23:J146))","v":false}]
[null,"",{"$f":"IF(B147=\"\",\"\",VLOOKUP(L147,Tabella_prezzi!$A$3:$K$301,9,FALSE))","v":""},{"$f":"IF(B147=\"\",\"\",VLOOKUP(L147,Tabella_prezzi!$A$3:$K$301,6,FALSE))","v":""},{"$f":"IF(B147=\"\",\"\",VLOOKUP(L147,Tabella_prezzi!$A$3:$K$301,8,FALSE))","v":""},{"$f":"IF(B147=\"\",\"\",VLOOKUP(L147,Tabella_prezzi!$A$3:$K$301,4,FALSE))","v":""},"",null,null,0,{"$f":"VLOOKUP(L147,Tabella_prezzi!A16:K220,6,FALSE)","v":"TS3L6-LAN10T"},"L6N64B",0,0,0,0,null,null,null,null,null,null,null,null,null,null,{"$f":"ISODD(SUM($J$23:J147))","v":false}]
[null,"",{"$f":"IF(B148=\"\",\"\",VLOOKUP(L148,Tabella_prezzi!$A$3:$K$301,9,FALSE))","v":""},{"$f":"IF(B148=\"\",\"\",VLOOKUP(L148,Tabella_prezzi!$A$3:$K$301,6,FALSE))","v":""},{"$f":"IF(B148=\"\",\"\",VLOOKUP(L148,Tabella_prezzi!$A$3:$K$301,8,FALSE))","v":""},{"$f":"IF(B148=\"\",\"\",VLOOKUP(L148,Tabella_prezzi!$A$3:$K$301,4,FALSE))","v":""},"",null,null,0,{"$f":"VLOOKUP(L148,Tabella_prezzi!A17:K221,6,FALSE)","v":"TS3L6-LAN10T"},"L6N64",0,0,0,0,null,null,null,null,null,null,null,null,null,null,{"$f":"ISODD(SUM($J$23:J148))","v":false}]
[null,"",{"$f":"IF(B149=\"\",\"\",VLOOKUP(L149,Tabella_prezzi!$A$3:$K$301,9,FALSE))","v":""},{"$f":"IF(B149=\"\",\"\",VLOOKUP(L149,Tabella_prezzi!$A$3:$K$301,6,FALSE))","v":""},{"$f":"IF(B149=\"\",\"\",VLOOKUP(L149,Tabella_prezzi!$A$3:$K$301,8,FALSE))","v":""},{"$f":"IF(B149=\"\",\"\",VLOOKUP(L149,Tabella_prezzi!$A$3:$K$301,4,FALSE))","v":""},"",null,null,0,{"$f":"VLOOKUP(L149,Tabella_prezzi!A4:K209,6,FALSE)","v":"TS3L6-M2480GB"},"L6N65",{"$f":"COUNTIF(TS3L6_L6N_1,L149)*$M$22","v":0},{"$f":"COUNTIF(TS3L6_L6N_2,L149)*$N$22","v":0},{"$f":"COUNTIF(TS3L6_L6N_3,L149)*$O$22","v":0},{"$f":"SUM(M149:O149)","v":0}]
[null,{"$f":"IF(P150>0,P150,\"\")","v":""},{"$f":"IF(B150=\"\",\"\",VLOOKUP(L150,Tabella_prezzi!$A$3:$K$301,9,FALSE))","v":""},{"$f":"IF(B150=\"\",\"\",VLOOKUP(L150,Tabella_prezzi!$A$3:$K$301,6,FALSE))","v":""},{"$f":"IF(B150=\"\",\"\",VLOOKUP(L150,Tabella_prezzi!$A$3:$K$301,8,FALSE))","v":""},{"$f":"IF(B150=\"\",\"\",VLOOKUP(L150,Tabella_prezzi!$A$3:$K$301,4,FALSE))","v":""},{"$f":"IF(C150=\"\",\"\",F150*B150)","v":""},null,null,0,{"$f":"VLOOKUP(L150,Tabella_prezzi!A5:K210,6,FALSE)","v":"TS3L6-UPSR8000"},"L6N66",{"$f":"IF($P$23>=1,Altre_Opzioni!$F$32,0)","v":0},null,null,{"$f":"SUM(M150:O150)","v":0}]
[null,"",{"$f":"IF(B151=\"\",\"\",VLOOKUP(L151,Tabella_prezzi!$A$3:$K$301,9,FALSE))","v":""},{"$f":"IF(B151=\"\",\"\",VLOOKUP(L151,Tabella_prezzi!$A$3:$K$301,6,FALSE))","v":""},{"$f":"IF(B151=\"\",\"\",VLOOKUP(L151,Tabella_prezzi!$A$3:$K$301,8,FALSE))","v":""},{"$f":"IF(B151=\"\",\"\",VLOOKUP(L151,Tabella_prezzi!$A$3:$K$301,4,FALSE))","v":""},"",null,null,0,{"$f":"VLOOKUP(L151,Tabella_prezzi!A6:K211,6,FALSE)","v":"TS3L6-UPSR8000N"},"L6N66B",{"$f":"IF($P$24>=1,Altre_Opzioni!$F$32,0)","v":0},null,null,0]
[null,"Convenzione",null,null,null,null,{"$f":"SUM(G23:G86)","v":0},null,null,{"$f":"IF(G152=0,0,1)","v":0}]
[null,"Valore economico 20% consentito",null,{"$f":"G152/100*20","v":0},"Ulteriori componenti opzionali (20%)",null,{"$f":"SUM(G89:G151)","v":0},null,null,{"$f":"IF(G153=0,0,1)","v":0},null,null,"RTN","RTN60","5Y"]
[null,{"$f":"IF(M154+N154+O154+M155+N155+O155>0,\"Le estensioni di garanzia e/o i servizi di Hard Disk Retention sono inferiori al numero dei server\",\"\")","v":""},null,null,"Totale iva esclusa",null,{"$f":"G153+G152","v":0},null,null,{"$f":"IF(G154=0,0,1)","v":0},"Verifica garanzia",null,{"$f":"IF(B79=\"\",0,IF(B23=B79,0,1))","v":0},{"$f":"IF(B85=\"\",0,IF(B23=B85,0,1))","v":0},{"$f":"IF(B81=\"\",0,IF(B23=B81,0,1))","v":0}]
[null,"I.V.A.",null,null,null,null,{"$f":"G154/100*22","v":0},null,null,{"$f":"IF(G155=0,0,1)","v":0},"Verifica garanzia NVMe",null,{"$f":"IF(B80=\"\",0,IF(B24=B80,0,1))","v":0},{"$f":"IF(B86=\"\",0,IF(B24=B86,0,1))","v":0},{"$f":"IF(B82=\"\",0,IF(B24=B82,0,1))","v":0}]
[null,"TOTALE ORDINE",null,null,null,null,{"$f":"G154+G155","v":0},null,null,{"$f":"IF(G156=0,0,1)","v":0}]
[null,null,null,null,null,null,null,null,null,1]

{"sheet":"Configurazione","index":7,"n_rows":122,"n_cols":24,"rows_kept":122,"cut":false,"hidden":false,"merged":[[115,1,115,8],[117,1,117,3],[117,6,117,8],[100,1,100,2],[101,1,112,2],[100,4,100,5],[101,4,112,5],[100,7,100,8],[101,7,112,8]]}
[null,null,null,null,null,null,null,null,null,null,null,null,null,null,null,null,null,null,null,null,null,1]
[null,{"$f":"Riepilogo!M22","v":0},"Proliant DL560 Gen10 Configurazione 1",null,{"$f":"Riepilogo!N22","v":0},"Proliant DL560 Gen10 Configurazione 2",null,{"$f":"Riepilogo!O22","v":0},"Proliant DL560 Gen10 Configurazione 3",null,null,null,null,null,null,null,null,null,null,null,null,1]
[null,null,{"$f":"IF(B2>0,CONCATENATE(Lotto6_DL560_1!$F$21*32+Lotto6_DL560_1!$F$22*64+128,\"GB \",RIGHT(Lotto6_DL560_1!$C$21,6)),\"\")","v":""},null,null,{"$f":"IF(E2>0,CONCATENATE(Lotto6_DL560_2!$F$21*32+Lotto6_DL560_2!$F$22*64+128,\"GB \",RIGHT(Lotto6_DL560_2!$C$21,6)),\"\")","v":""},null,null,{"$f":"IF(H2>0,CONCATENATE(Lotto6_DL560_3!$F$21*32+Lotto6_DL560_3!$F$22*64+128,\"GB \",RIGHT(Lotto6_DL560_3!$C$21,6)),\"\")","v":""},null,null,null,null,null,null,null,null,null,null,null,null,1]
[null,null,null,null,null,null,null,null,null,null,null,null,null,null,null,null,null,null,null,null,null,{"$f":"IF($U$5+$U$6>0,1,0)","v":0}]
[null,{"$f":"IF(Riepilogo!M23>0,Riepilogo!M23/$B$2,\"\")","v":""},{"$f":"IF(B5=\"\",\"\",Riepilogo!K23)","v":""},null,{"$f":"IF(Riepilogo!N23>0,Riepilogo!N23/$E$2,\"\")","v":""},{"$f":"IF(E5=\"\",\"\",Riepilogo!K23)","v":""},null,{"$f":"IF(Riepilogo!O23>0,Riepilogo!O23/$H$2,\"\")","v":""},{"$f":"IF(H5=\"\",\"\",Riepilogo!K23)","v":""},null,null,{"$f":"IF(B5=\"\",0,B5)","v":0},null,null,{"$f":"IF(E5=\"\",0,E5)","v":0},null,null,{"$f":"IF(H5=\"\",0,H5)","v":0},null,null,{"$f":"SUM(L5:T5)","v":0},{"$f":"IF($U$5+$U$6>0,1,0)","v":0},{"$f":"ISODD(SUM($V$5:V5))","v":false}]
[null,{"$f":"IF(Riepilogo!M24>0,Riepilogo!M24/$B$2,\"\")","v":""},{"$f":"IF(B6=\"\",\"\",Riepilogo!K24)","v":""},null,{"$f":"IF(Riepilogo!N24>0,Riepilogo!N24/$E$2,\"\")","v":""},{"$f":"IF(E6=\"\",\"\",Riepilogo!K24)","v":""},null,{"$f":"IF(Riepilogo!O24>0,Riepilogo!O24/$H$2,\"\")","v":""},{"$f":"IF(H6=\"\",\"\",Riepilogo!K24)","v":""},null,null,{"$f":"IF(B6=\"\",0,B6)","v":0},null,null,{"$f":"IF(E6=\"\",0,E6)","v":0},null,null,{"$f":"IF(H6=\"\",0,H6)","v":0},null,null,{"$f":"SUM(L6:T6)","v":0},{"$f":"IF(U6>0,1,0)","v":0},{"$f":"ISODD(SUM($V$5:V6))","v":false}]
[null,{"$f":"IF(Riepilogo!M25>0,Riepilogo!M25/$B$2,\"\")","v":""},{"$f":"IF(B7=\"\",\"\",Riepilogo!K25)","v":""},null,{"$f":"IF(Riepilogo!N25>0,Riepilogo!N25/$E$2,\"\")","v":""},{"$f":"IF(E7=\"\",\"\",Riepilogo!K25)","v":""},null,{"$f":"IF(Riepilogo!O25>0,Riepilogo!O25/$H$2,\"\")","v":""},{"$f":"IF(H7=\"\",\"\",Riepilogo!K25)","v":""},null,null,{"$f":"IF(B7=\"\",0,B7)","v":0},null,null,{"$f":"IF(E7=\"\",0,E7)","v":0},null,null,{"$f":"IF(H7=\"\",0,H7)","v":0},null,null,{"$f":"SUM(L7:T7)","v":0},0,{"$f":"ISODD(SUM($V$5:V7))","v":false}]
[null,{"$f":"IF(Riepilogo!M26>0,Riepilogo!M26/$B$2,\"\")","v":""},{"$f":"IF(B8=\"\",\"\",Riepilogo!K26)","v":""},null,{"$f":"IF(Riepilogo!N26>0,Riepilogo!N26/$E$2,\"\")","v":""},{"$f":"IF(E8=\"\",\"\",Riepilogo!K26)","v":""},null,{"$f":"IF(Riepilogo!O26>0,Riepilogo!O26/$H$2,\"\")","v":""},{"$f":"IF(H8=\"\",\"\",Riepilogo!K26)","v":""},null,null,0,null,null,0,null,null,0,null,null,0,0,{"$f":"ISODD(SUM($V$5:V8))","v":false}]
[null,{"$f":"IF(Riepilogo!M27>0,Riepilogo!M27/$B$2,\"\")","v":""},{"$f":"IF(B9=\"\",\"\",Riepilogo!K27)","v":""},null,{"$f":"IF(Riepilogo!N27>0,Riepilogo!N27/$E$2,\"\")","v":""},{"$f":"IF(E9=\"\",\"\",Riepilogo!K27)","v":""},null,{"$f":"IF(Riepilogo!O27>0,Riepilogo!O27/$H$2,\"\")","v":""},{"$f":"IF(H9=\"\",\"\",Riepilogo!K27)","v":""},null,null,0,null,null,0,null,null,0,null,null,0,0,{"$f":"ISODD(SUM($V$5:V9))","v":false}]
[null,{"$f":"IF(Riepilogo!M28>0,Riepilogo!M28/$B$2,\"\")","v":""},{"$f":"IF(B10=\"\",\"\",Riepilogo!K28)","v":""},null,{"$f":"IF(Riepilogo!N28>0,Riepilogo!N28/$E$2,\"\")","v":""},{"$f":"IF(E10=\"\",\"\",Riepilogo!K28)","v":""},null,{"$f":"IF(Riepilogo!O28>0,Riepilogo!O28/$H$2,\"\")","v":""},{"$f":"IF(H10=\"\",\"\",Riepilogo!K28)","v":""},null,null,{"$f":"IF(B10=\"\",0,B10)","v":0},null,null,{"$f":"IF(E10=\"\",0,E10)","v":0},null,null,{"$f":"IF(H10=\"\",0,H10)","v":0},null,null,{"$f":"SUM(L10:T10)","v":0},{"$f":"IF(U10>0,1,0)","v":0},{"$f":"ISODD(SUM($V$5:V10))","v":false}]
[null,{"$f":"IF(Riepilogo!M29>0,Riepilogo!M29/$B$2,\"\")","v":""},{"$f":"IF(B11=\"\",\"\",Riepilogo!K29)","v":""},null,{"$f":"IF(Riepilogo!N29>0,Riepilogo!N29/$E$2,\"\")","v":""},{"$f":"IF(E11=\"\",\"\",Riepilogo!K29)","v":""},null,{"$f":"IF(Riepilogo!O29>0,Riepilogo!O29/$H$2,\"\")","v":""},{"$f":"IF(H11=\"\",\"\",Riepilogo!K29)","v":""},null,null,0,null,null,0,null,null,0,null,null,0,0,{"$f":"ISODD(SUM($V$5:V11))","v":false}]
[null,{"$f":"IF(Riepilogo!M30>0,Riepilogo!M30/$B$2,\"\")","v":""},{"$f":"IF(B12=\"\",\"\",Riepilogo!K30)","v":""},null,{"$f":"IF(Riepilogo!N30>0,Riepilogo!N30/$E$2,\"\")","v":""},{"$f":"IF(E12=\"\",\"\",Riepilogo!K30)","v":""},null,{"$f":"IF(Riepilogo!O30>0,Riepilogo!O30/$H$2,\"\")","v":""},{"$f":"IF(H12=\"\",\"\",Riepilogo!K30)","v":""},null,null,0,null,null,0,null,null,0,null,null,0,0,{"$f":"ISODD(SUM($V$5:V12))","v":false}]
[null,{"$f":"IF(Riepilogo!M31>0,Riepilogo!M31/$B$2,\"\")","v":""},{"$f":"IF(B13=\"\",\"\",Riepilogo!K31)","v":""},null,{"$f":"IF(Riepilogo!N31>0,Riepilogo!N31/$E$2,\"\")","v":""},{"$f":"IF(E13=\"\",\"\",Riepilogo!K31)","v":""},null,{"$f":"IF(Riepilogo!O31>0,Riepilogo!O31/$H$2,\"\")","v":""},{"$f":"IF(H13=\"\",\"\",Riepilogo!K31)","v":""},null,null,0,null,null,0,null,null,0,null,null,0,0,{"$f":"ISODD(SUM($V$5:V13))","v":false}]
[null,{"$f":"IF(Riepilogo!M32>0,Riepilogo!M32/$B$2,\"\")","v":""},{"$f":"IF(B14=\"\",\"\",Riepilogo!K32)","v":""},null,{"$f":"IF(Riepilogo!N32>0,Riepilogo!N32/$E$2,\"\")","v":""},{"$f":"IF(E14=\"\",\"\",Riepilogo!K32)","v":""},null,{"$f":"IF(Riepilogo!O32>0,Riepilogo!O32/$H$2,\"\")","v":""},{"$f":"IF(H14=\"\",\"\",Riepilogo!K32)","v":""},null,null,0,null,null,0,null,null,0,null,null,0,0,{"$f":"ISODD(SUM($V$5:V14))","v":false}]
[null,{"$f":"IF(Riepilogo!M33>0,Riepilogo!M33/$B$2,\"\")","v":""},{"$f":"IF(B15=\"\",\"\",Riepilogo!K33)","v":""},null,{"$f":"IF(Riepilogo!N33>0,Riepilogo!N33/$E$2,\"\")","v":""},{"$f":"IF(E15=\"\",\"\",Riepilogo!K33)","v":""},null,{"$f":"IF(Riepilogo!O33>0,Riepilogo!O33/$H$2,\"\")","v":""},{"$f":"IF(H15=\"\",\"\",Riepilogo!K33)","v":""},null,null,0,null,null,0,null,null,0,null,null,0,0,{"$f":"ISODD(SUM($V$5:V15))","v":false}]
[null,{"$f":"IF(Riepilogo!M34>0,Riepilogo!M34/$B$2,\"\")","v":""},{"$f":"IF(B16=\"\",\"\",Riepilogo!K34)","v":""},null,{"$f":"IF(Riepilogo!N34>0,Riepilogo!N34/$E$2,\"\")","v":""},{"$f":"IF(E16=\"\",\"\",Riepilogo!K34)","v":""},null,{"$f":"IF(Riepilogo!O34>0,Riepilogo!O34/$H$2,\"\")","v":""},{"$f":"IF(H16=\"\",\"\",Riepilogo!K34)","v":""},null,null,0,null,null,0,null,null,0,null,null,0,0,{"$f":"ISODD(SUM($V$5:V16))","v":false}]
[null,{"$f":"IF(Riepilogo!M35>0,Riepilogo!M35/$B$2,\"\")","v":""},{"$f":"IF(B17=\"\",\"\",Riepilogo!K35)","v":""},null,{"$f":"IF(Riepilogo!N35>0,Riepilogo!N35/$E$2,\"\")","v":""},{"$f":"IF(E17=\"\",\"\",Riepilogo!K35)","v":""},null,{"$f":"IF(Riepilogo!O35>0,Riepilogo!O35/$H$2,\"\")","v":""},{"$f":"IF(H17=\"\",\"\",Riepilogo!K35)","v":""},null,null,0,null,null,0,null,null,0,null,null,0,0,{"$f":"ISODD(SUM($V$5:V17))","v":false}]
[null,{"$f":"IF(Riepilogo!M36>0,Riepilogo!M36/$B$2,\"\")","v":""},{"$f":"IF(B18=\"\",\"\",Riepilogo!K36)","v":""},null,{"$f":"IF(Riepilogo!N36>0,Riepilogo!N36/$E$2,\"\")","v":""},{"$f":"IF(E18=\"\",\"\",Riepilogo!K36)","v":""},null,{"$f":"IF(Riepilogo!O36>0,Riepilogo!O36/$H$2,\"\")","v":""},{"$f":"IF(H18=\"\",\"\",Riepilogo!K36)","v":""},null,null,0,null,null,0,null,null,0,null,null,0,0,{"$f":"ISODD(SUM($V$5:V18))","v":false}]
[null,{"$f":"IF(Riepilogo!M37>0,Riepilogo!M37/$B$2,\"\")","v":""},{"$f":"IF(B19=\"\",\"\",Riepilogo!K37)","v":""},null,{"$f":"IF(Riepilogo!N37>0,Riepilogo!N37/$E$2,\"\")","v":""},{"$f":"IF(E19=\"\",\"\",Riepilogo!K37)","v":""},null,{"$f":"IF(Riepilogo!O37>0,Riepilogo!O37/$H$2,\"\")","v":""},{"$f":"IF(H19=\"\",\"\",Riepilogo!K37)","v":""},null,null,0,null,null,0,null,null,0,null,null,0,0,{"$f":"ISODD(SUM($V$5:V19))","v":false}]
[null,{"$f":"IF(Riepilogo!M38>0,Riepilogo!M38/$B$2,\"\")","v":""},{"$f":"IF(B20=\"\",\"\",Riepilogo!K38)","v":""},null,{"$f":"IF(Riepilogo!N38>0,Riepilogo!N38/$E$2,\"\")","v":""},{"$f":"IF(E20=\"\",\"\",Riepilogo!K38)","v":""},null,{"$f":"IF(Riepilogo!O38>0,Riepilogo!O38/$H$2,\"\")","v":""},{"$f":"IF(H20=\"\",\"\",Riepilogo!K38)","v":""},null,null,0,null,null,0,null,null,0,null,null,0,0,{"$f":"ISODD(SUM($V$5:V20))","v":false}]
[null,{"$f":"IF(Riepilogo!M39>0,Riepilogo!M39/$B$2,\"\")","v":""},{"$f":"IF(B21=\"\",\"\",Riepilogo!K39)","v":""},null,{"$f":"IF(Riepilogo!N39>0,Riepilogo!N39/$E$2,\"\")","v":""},{"$f":"IF(E21=\"\",\"\",Riepilogo!K39)","v":""},null,{"$f":"IF(Riepilogo!O39>0,Riepilogo!O39/$H$2,\"\")","v":""},{"$f":"IF(H21=\"\",\"\",Riepilogo!K39)","v":""},null,null,0,null,null,0,null,null,0,null,null,0,0,{"$f":"ISODD(SUM($V$5:V21))","v":false}]
[null,{"$f":"IF(Riepilogo!M40>0,Riepilogo!M40/$B$2,\"\")","v":""},{"$f":"IF(B22=\"\",\"\",Riepilogo!K40)","v":""},null,{"$f":"IF(Riepilogo!N40>0,Riepilogo!N40/$E$2,\"\")","v":""},{"$f":"IF(E22=\"\",\"\",Riepilogo!K40)","v":""},null,{"$f":"IF(Riepilogo!O40>0,Riepilogo!O40/$H$2,\"\")","v":""},{"$f":"IF(H22=\"\",\"\",Riepilogo!K40)","v":""},null,null,0,null,null,0,null,null,0,null,null,0,0,{"$f":"ISODD(SUM($V$5:V22))","v":false}]
[null,{"$f":"IF(Riepilogo!M41>0,Riepilogo!M41/$B$2,\"\")","v":""},{"$f":"IF(B23=\"\",\"\",Riepilogo!K41)","v":""},null,{"$f":"IF(Riepilogo!N41>0,Riepilogo!N41/$E$2,\"\")","v":""},{"$f":"IF(E23=\"\",\"\",Riepilogo!K41)","v":""},null,{"$f":"IF(Riepilogo!O41>0,Riepilogo!O41/$H$2,\"\")","v":""},{"$f":"IF(H23=\"\",\"\",Riepilogo!K41)","v":""},null,null,0,null,null,0,null,null,0,null,null,0,0,{"$f":"ISODD(SUM($V$5:V23))","v":false}]
[null,{"$f":"IF(Riepilogo!M42>0,Riepilogo!M42/$B$2,\"\")","v":""},{"$f":"IF(B24=\"\",\"\",Riepilogo!K42)","v":""},null,{"$f":"IF(Riepilogo!N42>0,Riepilogo!N42/$E$2,\"\")","v":""},{"$f":"IF(E24=\"\",\"\",Riepilogo!K42)","v":""},null,{"$f":"IF(Riepilogo!O42>0,Riepilogo!O42/$H$2,\"\")","v":""},{"$f":"IF(H24=\"\",\"\",Riepilogo!K42)","v":""},null,null,0,null,null,0,null,null,0,null,null,0,0,{"$f":"ISODD(SUM($V$5:V24))","v":false}]
[null,{"$f":"IF(Riepilogo!M43>0,Riepilogo!M43/$B$2,\"\")","v":""},{"$f":"IF(B25=\"\",\"\",Riepilogo!K43)","v":""},null,{"$f":"IF(Riepilogo!N43>0,Riepilogo!N43/$E$2,\"\")","v":""},{"$f":"IF(E25=\"\",\"\",Riepilogo!K43)","v":""},null,{"$f":"IF(Riepilogo!O43>0,Riepilogo!O43/$H$2,\"\")","v":""},{"$f":"IF(H25=\"\",\"\",Riepilogo!K43)","v":""},null,null,0,null,null,0,null,null,0,null,null,0,0,{"$f":"ISODD(SUM($V$5:V25))","v":false}]
[null,{"$f":"IF(Riepilogo!M44>0,Riepilogo!M44/$B$2,\"\")","v":""},{"$f":"IF(B26=\"\",\"\",Riepilogo!K44)","v":""},null,{"$f":"IF(Riepilogo!N44>0,Riepilogo!N44/$E$2,\"\")","v":""},{"$f":"IF(E26=\"\",\"\",Riepilogo!K44)","v":""},null,{"$f":"IF(Riepilogo!O44>0,Riepilogo!O44/$H$2,\"\")","v":""},{"$f":"IF(H26=\"\",\"\",Riepilogo!K44)","v":""},null,null,0,null,null,0,null,null,0,null,null,0,0,{"$f":"ISODD(SUM($V$5:V26))","v":false}]
[null,{"$f":"IF(Riepilogo!M45>0,Riepilogo!M45/$B$2,\"\")","v":""},{"$f":"IF(B27=\"\",\"\",Riepilogo!K45)","v":""},null,{"$f":"IF(Riepilogo!N45>0,Riepilogo!N45/$E$2,\"\")","v":""},{"$f":"IF(E27=\"\",\"\",Riepilogo!K45)","v":""},null,{"$f":"IF(Riepilogo!O45>0,Riepilogo!O45/$H$2,\"\")","v":""},{"$f":"IF(H27=\"\",\"\",Riepilogo!K45)","v":""},null,null,0,null,null,0,null,null,0,null,null,0,0,{"$f":"ISODD(SUM($V$5:V27))","v":false}]
[null,{"$f":"IF(Riepilogo!M46>0,Riepilogo!M46/$B$2,\"\")","v":""},{"$f":"IF(B28=\"\",\"\",Riepilogo!K46)","v":""},null,{"$f":"IF(Riepilogo!N46>0,Riepilogo!N46/$E$2,\"\")","v":""},{"$f":"IF(E28=\"\",\"\",Riepilogo!K46)","v":""},null,{"$f":"IF(Riepilogo!O46>0,Riepilogo!O46/$H$2,\"\")","v":""},{"$f":"IF(H28=\"\",\"\",Riepilogo!K46)","v":""},null,null,0,null,null,0,null,null,0,null,null,0,0,{"$f":"ISODD(SUM($V$5:V28))","v":false}]
[null,{"$f":"IF(Riepilogo!M47>0,Riepilogo!M47/$B$2,\"\")","v":""},{"$f":"IF(B29=\"\",\"\",Riepilogo!K47)","v":""},null,{"$f":"IF(Riepilogo!N47>0,Riepilogo!N47/$E$2,\"\")","v":""},{"$f":"IF(E29=\"\",\"\",Riepilogo!K47)","v":""},null,{"$f":"IF(Riepilogo!O47>0,Riepilogo!O47/$H$2,\"\")","v":""},{"$f":"IF(H29=\"\",\"\",Riepilogo!K47)","v":""},null,null,0,null,null,0,null,null,0,null,null,0,0,{"$f":"ISODD(SUM($V$5:V29))","v":false}]
[null,{"$f":"IF(Riepilogo!M48>0,Riepilogo!M48/$B$2,\"\")","v":""},{"$f":"IF(B30=\"\",\"\",Riepilogo!K48)","v":""},null,{"$f":"IF(Riepilogo!N48>0,Riepilogo!N48/$E$2,\"\")","v":""},{"$f":"IF(E30=\"\",\"\",Riepilogo!K48)","v":""},null,{"$f":"IF(Riepilogo!O48>0,Riepilogo!O48/$H$2,\"\")","v":""},{"$f":"IF(H30=\"\",\"\",Riepilogo!K48)","v":""},null,null,0,null,null,0,null,null,0,null,null,0,0,{"$f":"ISODD(SUM($V$5:V30))","v":false}]
[null,{"$f":"IF(Riepilogo!M49>0,Riepilogo!M49/$B$2,\"\")","v":""},{"$f":"IF(B31=\"\",\"\",Riepilogo!K49)","v":""},null,{"$f":"IF(Riepilogo!N49>0,Riepilogo!N49/$E$2,\"\")","v":""},{"$f":"IF(E31=\"\",\"\",Riepilogo!K49)","v":""},null,{"$f":"IF(Riepilogo!O49>0,Riepilogo!O49/$H$2,\"\")","v":""},{"$f":"IF(H31=\"\",\"\",Riepilogo!K49)","v":""},null,null,0,null,null,0,null,null,0,null,null,0,0,{"$f":"ISODD(SUM($V$5:V31))","v":false}]
[null,{"$f":"IF(Riepilogo!M50>0,Riepilogo!M50/$B$2,\"\")","v":""},{"$f":"IF(B32=\"\",\"\",Riepilogo!K50)","v":""},null,{"$f":"IF(Riepilogo!N50>0,Riepilogo!N50/$E$2,\"\")","v":""},{"$f":"IF(E32=\"\",\"\",Riepilogo!K50)","v":""},null,{"$f":"IF(Riepilogo!O50>0,Riepilogo!O50/$H$2,\"\")","v":""},{"$f":"IF(H32=\"\",\"\",Riepilogo!K50)","v":""},null,null,0,null,null,0,null,null,0,null,null,0,0,{"$f":"ISODD(SUM($V$5:V32))","v":false}]
[null,{"$f":"IF(Riepilogo!M51>0,Riepilogo!M51/$B$2,\"\")","v":""},{"$f":"IF(B33=\"\",\"\",Riepilogo!K51)","v":""},null,{"$f":"IF(Riepilogo!N51>0,Riepilogo!N51/$E$2,\"\")","v":""},{"$f":"IF(E33=\"\",\"\",Riepilogo!K51)","v":""},null,{"$f":"IF(Riepilogo!O51>0,Riepilogo!O51/$H$2,\"\")","v":""},{"$f":"IF(H33=\"\",\"\",Riepilogo!K51)","v":""},null,null,0,null,null,0,null,null,0,null,null,0,0,{"$f":"ISODD(SUM($V$5:V33))","v":false}]
[null,{"$f":"IF(Riepilogo!M52>0,Riepilogo!M52/$B$2,\"\")","v":""},{"$f":"IF(B34=\"\",\"\",Riepilogo!K52)","v":""},null,{"$f":"IF(Riepilogo!N52>0,Riepilogo!N52/$E$2,\"\")","v":""},{"$f":"IF(E34=\"\",\"\",Riepilogo!K52)","v":""},null,{"$f":"IF(Riepilogo!O52>0,Riepilogo!O52/$H$2,\"\")","v":""},{"$f":"IF(H34=\"\",\"\",Riepilogo!K52)","v":""},null,null,0,null,null,0,null,null,0,null,null,0,0,{"$f":"ISODD(SUM($V$5:V34))","v":false}]
[null,{"$f":"IF(Riepilogo!M53>0,Riepilogo!M53/$B$2,\"\")","v":""},{"$f":"IF(B35=\"\",\"\",Riepilogo!K53)","v":""},null,{"$f":"IF(Riepilogo!N53>0,Riepilogo!N53/$E$2,\"\")","v":""},{"$f":"IF(E35=\"\",\"\",Riepilogo!K53)","v":""},null,{"$f":"IF(Riepilogo!O53>0,Riepilogo!O53/$H$2,\"\")","v":""},{"$f":"IF(H35=\"\",\"\",Riepilogo!K53)","v":""},null,null,0,null,null,0,null,null,0,null,null,0,0,{"$f":"ISODD(SUM($V$5:V35))","v":false}]
[null,{"$f":"IF(Riepilogo!M54>0,Riepilogo!M54/$B$2,\"\")","v":""},{"$f":"IF(B36=\"\",\"\",Riepilogo!K54)","v":""},null,{"$f":"IF(Riepilogo!N54>0,Riepilogo!N54/$E$2,\"\")","v":""},{"$f":"IF(E36=\"\",\"\",Riepilogo!K54)","v":""},null,{"$f":"IF(Riepilogo!O54>0,Riepilogo!O54/$H$2,\"\")","v":""},{"$f":"IF(H36=\"\",\"\",Riepilogo!K54)","v":""},null,null,0,null,null,0,null,null,0,null,null,0,0,{"$f":"ISODD(SUM($V$5:V36))","v":false}]
[null,{"$f":"IF(Riepilogo!M55>0,Riepilogo!M55/$B$2,\"\")","v":""},{"$f":"IF(B37=\"\",\"\",Riepilogo!K55)","v":""},null,{"$f":"IF(Riepilogo!N55>0,Riepilogo!N55/$E$2,\"\")","v":""},{"$f":"IF(E37=\"\",\"\",Riepilogo!K55)","v":""},null,{"$f":"IF(Riepilogo!O55>0,Riepilogo!O55/$H$2,\"\")","v":""},{"$f":"IF(H37=\"\",\"\",Riepilogo!K55)","v":""},null,null,0,null,null,0,null,null,0,null,null,0,0,{"$f":"ISODD(SUM($V$5:V37))","v":false}]
[null,{"$f":"IF(Riepilogo!M56>0,Riepilogo!M56/$B$2,\"\")","v":""},{"$f":"IF(B38=\"\",\"\",Riepilogo!K56)","v":""},null,{"$f":"IF(Riepilogo!N56>0,Riepilogo!N56/$E$2,\"\")","v":""},{"$f":"IF(E38=\"\",\"\",Riepilogo!K56)","v":""},null,{"$f":"IF(Riepilogo!O56>0,Riepilogo!O56/$H$2,\"\")","v":""},{"$f":"IF(H38=\"\",\"\",Riepilogo!K56)","v":""},null,null,0,null,null,0,null,null,0,null,null,0,0,{"$f":"ISODD(SUM($V$5:V38))","v":false}]
[null,{"$f":"IF(Riepilogo!M57>0,Riepilogo!M57/$B$2,\"\")","v":""},{"$f":"IF(B39=\"\",\"\",Riepilogo!K57)","v":""},null,{"$f":"IF(Riepilogo!N57>0,Riepilogo!N57/$E$2,\"\")","v":""},{"$f":"IF(E39=\"\",\"\",Riepilogo!K57)","v":""},null,{"$f":"IF(Riepilogo!O57>0,Riepilogo!O57/$H$2,\"\")","v":""},{"$f":"IF(H39=\"\",\"\",Riepilogo!K57)","v":""},null,null,0,null,null,0,null,null,0,null,null,0,0,{"$f":"ISODD(SUM($V$5:V39))","v":false}]
[null,{"$f":"IF(Riepilogo!M58>0,Riepilogo!M58/$B$2,\"\")","v":""},{"$f":"IF(B40=\"\",\"\",Riepilogo!K58)","v":""},null,{"$f":"IF(Riepilogo!N58>0,Riepilogo!N58/$E$2,\"\")","v":""},{"$f":"IF(E40=\"\",\"\",Riepilogo!K58)","v":""},null,{"$f":"IF(Riepilogo!O58>0,Riepilogo!O58/$H$2,\"\")","v":""},{"$f":"IF(H40=\"\",\"\",Riepilogo!K58)","v":""},null,null,0,null,null,0,null,null,0,null,null,0,0,{"$f":"ISODD(SUM($V$5:V40))","v":false}]
[null,{"$f":"IF(Riepilogo!M65>0,Riepilogo!M65/$B$2,\"\")","v":""},{"$f":"IF(B41=\"\",\"\",Riepilogo!K65)","v":""},null,{"$f":"IF(Riepilogo!N65>0,Riepilogo!N65/$E$2,\"\")","v":""},{"$f":"IF(E41=\"\",\"\",Riepilogo!K65)","v":""},null,{"$f":"IF(Riepilogo!O65>0,Riepilogo!O65/$H$2,\"\")","v":""},{"$f":"IF(H41=\"\",\"\",Riepilogo!K65)","v":""},null,null,0,null,null,0,null,null,0,null,null,0,0,{"$f":"ISODD(SUM($V$5:V41))","v":false}]
[null,{"$f":"IF(Riepilogo!M66>0,Riepilogo!M66/$B$2,\"\")","v":""},{"$f":"IF(B42=\"\",\"\",Riepilogo!K66)","v":""},null,{"$f":"IF(Riepilogo!N66>0,Riepilogo!N66/$E$2,\"\")","v":""},{"$f":"IF(E42=\"\",\"\",Riepilogo!K66)","v":""},null,{"$f":"IF(Riepilogo!O66>0,Riepilogo!O66/$H$2,\"\")","v":""},{"$f":"IF(H42=\"\",\"\",Riepilogo!K66)","v":""},null,null,0,null,null,0,null,null,0,null,null,0,0,{"$f":"ISODD(SUM($V$5:V42))","v":false}]
[null,{"$f":"IF(Riepilogo!M71>0,Riepilogo!M71/$B$2,\"\")","v":""},{"$f":"IF(B43=\"\",\"\",Riepilogo!K71)","v":""},null,{"$f":"IF(Riepilogo!N71>0,Riepilogo!N71/$E$2,\"\")","v":""},{"$f":"IF(E43=\"\",\"\",Riepilogo!K71)","v":""},null,{"$f":"IF(Riepilogo!O71>0,Riepilogo!O71/$H$2,\"\")","v":""},{"$f":"IF(H43=\"\",\"\",Riepilogo!K71)","v":""},null,null,0,null,null,0,null,null,0,null,null,0,0,{"$f":"ISODD(SUM($V$5:V43))","v":false}]
[null,{"$f":"IF(Riepilogo!M72>0,Riepilogo!M72/$B$2,\"\")","v":""},{"$f":"IF(B44=\"\",\"\",Riepilogo!K72)","v":""},null,{"$f":"IF(Riepilogo!N72>0,Riepilogo!N72/$E$2,\"\")","v":""},{"$f":"IF(E44=\"\",\"\",Riepilogo!K72)","v":""},null,{"$f":"IF(Riepilogo!O72>0,Riepilogo!O72/$H$2,\"\")","v":""},{"$f":"IF(H44=\"\",\"\",Riepilogo!K72)","v":""},null,null,0,null,null,0,null,null,0,null,null,0,0,{"$f":"ISODD(SUM($V$5:V44))","v":false}]
[null,{"$f":"IF(Riepilogo!M73>0,Riepilogo!M73/$B$2,\"\")","v":""},{"$f":"IF(B45=\"\",\"\",Riepilogo!K73)","v":""},null,{"$f":"IF(Riepilogo!N73>0,Riepilogo!N73/$E$2,\"\")","v":""},{"$f":"IF(E45=\"\",\"\",Riepilogo!K73)","v":""},null,{"$f":"IF(Riepilogo!O73>0,Riepilogo!O73/$H$2,\"\")","v":""},{"$f":"IF(H45=\"\",\"\",Riepilogo!K73)","v":""},null,null,0,null,null,0,null,null,0,null,null,0,0,{"$f":"ISODD(SUM($V$5:V45))","v":false}]
[null,{"$f":"IF(Riepilogo!M74>0,Riepilogo!M74/$B$2,\"\")","v":""},{"$f":"IF(B46=\"\",\"\",Riepilogo!K74)","v":""},null,{"$f":"IF(Riepilogo!N74>0,Riepilogo!N74/$E$2,\"\")","v":""},{"$f":"IF(E46=\"\",\"\",Riepilogo!K74)","v":""},null,{"$f":"IF(Riepilogo!O74>0,Riepilogo!O74/$H$2,\"\")","v":""},{"$f":"IF(H46=\"\",\"\",Riepilogo!K74)","v":""},null,null,0,null,null,0,null,null,0,null,null,0,0,{"$f":"ISODD(SUM($V$5:V46))","v":false}]
[null,{"$f":"IF(Riepilogo!M75>0,Riepilogo!M75/$B$2,\"\")","v":""},{"$f":"IF(B47=\"\",\"\",Riepilogo!K75)","v":""},null,{"$f":"IF(Riepilogo!N75>0,Riepilogo!N75/$E$2,\"\")","v":""},{"$f":"IF(E47=\"\",\"\",Riepilogo!K75)","v":""},null,{"$f":"IF(Riepilogo!O75>0,Riepilogo!O75/$H$2,\"\")","v":""},{"$f":"IF(H47=\"\",\"\",Riepilogo!K75)","v":""},null,null,0,null,null,0,null,null,0,null,null,0,0,{"$f":"ISODD(SUM($V$5:V47))","v":false}]
[null,{"$f":"IF(Riepilogo!M76>0,Riepilogo!M76/$B$2,\"\")","v":""},{"$f":"IF(B48=\"\",\"\",Riepilogo!K76)","v":""},null,{"$f":"IF(Riepilogo!N76>0,Riepilogo!N76/$E$2,\"\")","v":""},{"$f":"IF(E48=\"\",\"\",Riepilogo!K76)","v":""},null,{"$f":"IF(Riepilogo!O76>0,Riepilogo!O76/$H$2,\"\")","v":""},{"$f":"IF(H48=\"\",\"\",Riepilogo!K76)","v":""},null,null,0,null,null,0,null,null,0,null,null,0,0,{"$f":"ISODD(SUM($V$5:V48))","v":false}]
[null,{"$f":"IF(Riepilogo!M77>0,Riepilogo!M77/$B$2,\"\")","v":""},{"$f":"IF(B49=\"\",\"\",Riepilogo!K77)","v":""},null,{"$f":"IF(Riepilogo!N77>0,Riepilogo!N77/$E$2,\"\")","v":""},{"$f":"IF(E49=\"\",\"\",Riepilogo!K77)","v":""},null,{"$f":"IF(Riepilogo!O77>0,Riepilogo!O77/$H$2,\"\")","v":""},{"$f":"IF(H49=\"\",\"\",Riepilogo!K77)","v":""},null,null,0,null,null,0,null,null,0,null,null,0,0,{"$f":"ISODD(SUM($V$5:V49))","v":false}]
[null,{"$f":"IF(Riepilogo!M78>0,Riepilogo!M78/$B$2,\"\")","v":""},{"$f":"IF(B50=\"\",\"\",Riepilogo!K78)","v":""},null,{"$f":"IF(Riepilogo!N78>0,Riepilogo!N78/$E$2,\"\")","v":""},{"$f":"IF(E50=\"\",\"\",Riepilogo!K78)","v":""},null,{"$f":"IF(Riepilogo!O78>0,Riepilogo!O78/$H$2,\"\")","v":""},{"$f":"IF(H50=\"\",\"\",Riepilogo!K78)","v":""},null,null,0,null,null,0,null,null,0,null,null,0,0,{"$f":"ISODD(SUM($V$5:V50))","v":false}]
[null,{"$f":"IF(Riepilogo!M79>0,Riepilogo!M79/$B$2,\"\")","v":""},{"$f":"IF(B51=\"\",\"\",Riepilogo!K79)","v":""},null,{"$f":"IF(Riepilogo!N79>0,Riepilogo!N79/$E$2,\"\")","v":""},{"$f":"IF(E51=\"\",\"\",Riepilogo!K79)","v":""},null,{"$f":"IF(Riepilogo!O79>0,Riepilogo!O79/$H$2,\"\")","v":""},{"$f":"IF(H51=\"\",\"\",Riepilogo!K79)","v":""},null,null,0,null,null,0,null,null,0,null,null,0,0,{"$f":"ISODD(SUM($V$5:V51))","v":false}]
[null,{"$f":"IF(Riepilogo!M80>0,Riepilogo!M80/$B$2,\"\")","v":""},{"$f":"IF(B52=\"\",\"\",Riepilogo!K80)","v":""},null,{"$f":"IF(Riepilogo!N80>0,Riepilogo!N80/$E$2,\"\")","v":""},{"$f":"IF(E52=\"\",\"\",Riepilogo!K80)","v":""},null,{"$f":"IF(Riepilogo!O80>0,Riepilogo!O80/$H$2,\"\")","v":""},{"$f":"IF(H52=\"\",\"\",Riepilogo!K80)","v":""},null,null,0,null,null,0,null,null,0,null,null,0,0,{"$f":"ISODD(SUM($V$5:V52))","v":false}]
[null,{"$f":"IF(Riepilogo!M81>0,Riepilogo!M81/$B$2,\"\")","v":""},{"$f":"IF(B53=\"\",\"\",Riepilogo!K81)","v":""},null,{"$f":"IF(Riepilogo!N81>0,Riepilogo!N81/$E$2,\"\")","v":""},{"$f":"IF(E53=\"\",\"\",Riepilogo!K81)","v":""},null,{"$f":"IF(Riepilogo!O81>0,Riepilogo!O81/$H$2,\"\")","v":""},{"$f":"IF(H53=\"\",\"\",Riepilogo!K81)","v":""},null,null,0,null,null,0,null,null,0,null,null,0,0,{"$f":"ISODD(SUM($V$5:V53))","v":false}]
[null,{"$f":"IF(Riepilogo!M82>0,Riepilogo!M82/$B$2,\"\")","v":""},{"$f":"IF(B54=\"\",\"\",Riepilogo!K82)","v":""},null,{"$f":"IF(Riepilogo!N82>0,Riepilogo!N82/$E$2,\"\")","v":""},{"$f":"IF(E54=\"\",\"\",Riepilogo!K82)","v":""},null,{"$f":"IF(Riepilogo!O82>0,Riepilogo!O82/$H$2,\"\")","v":""},{"$f":"IF(H54=\"\",\"\",Riepilogo!K82)","v":""},null,null,0,null,null,0,null,null,0,null,null,0,0,{"$f":"ISODD(SUM($V$5:V54))","v":false}]
[null,{"$f":"IF(Riepilogo!M85>0,Riepilogo!M85/$B$2,\"\")","v":""},{"$f":"IF(B55=\"\",\"\",Riepilogo!K85)","v":""},null,{"$f":"IF(Riepilogo!N85>0,Riepilogo!N85/$E$2,\"\")","v":""},{"$f":"IF(E55=\"\",\"\",Riepilogo!K85)","v":""},null,{"$f":"IF(Riepilogo!O85>0,Riepilogo!O85/$H$2,\"\")","v":""},{"$f":"IF(H55=\"\",\"\",Riepilogo!K85)","v":""},null,null,0,null,null,0,null,null,0,null,null,0,0,{"$f":"ISODD(SUM($V$5:V55))","v":false}]
[null,{"$f":"IF(Riepilogo!M86>0,Riepilogo!M86/$B$2,\"\")","v":""},{"$f":"IF(B56=\"\",\"\",Riepilogo!K86)","v":""},null,{"$f":"IF(Riepilogo!N86>0,Riepilogo!N86/$E$2,\"\")","v":""},{"$f":"IF(E56=\"\",\"\",Riepilogo!K86)","v":""},null,{"$f":"IF(Riepilogo!O86>0,Riepilogo!O86/$H$2,\"\")","v":""},{"$f":"IF(H56=\"\",\"\",Riepilogo!K86)","v":""},null,null,0,null,null,0,null,null,0,null,null,0,0,{"$f":"ISODD(SUM($V$5:V56))","v":false}]
[null,{"$f":"IF(Riepilogo!M87>0,Riepilogo!M87/$B$2,\"\")","v":""},{"$f":"IF(B57=\"\",\"\",Riepilogo!K87)","v":""},null,{"$f":"IF(Riepilogo!N87>0,Riepilogo!N87/$E$2,\"\")","v":""},{"$f":"IF(E57=\"\",\"\",Riepilogo!K87)","v":""},null,{"$f":"IF(Riepilogo!O87>0,Riepilogo!O87/$H$2,\"\")","v":""},{"$f":"IF(H57=\"\",\"\",Riepilogo!K87)","v":""},null,null,0,null,null,0,null,null,0,null,null,0,0,{"$f":"ISODD(SUM($V$5:V57))","v":false}]
[null,{"$f":"IF(Riepilogo!M88>0,Riepilogo!M88/$B$2,\"\")","v":""},{"$f":"IF(B58=\"\",\"\",Riepilogo!K88)","v":""},null,{"$f":"IF(Riepilogo!N88>0,Riepilogo!N88/$E$2,\"\")","v":""},{"$f":"IF(E58=\"\",\"\",Riepilogo!K88)","v":""},null,{"$f":"IF(Riepilogo!O88>0,Riepilogo!O88/$H$2,\"\")","v":""},{"$f":"IF(H58=\"\",\"\",Riepilogo!K88)","v":""},null,null,0,null,null,0,null,null,0,null,null,0,0,{"$f":"ISODD(SUM($V$5:V58))","v":false}]
[null,{"$f":"IF(Riepilogo!M89>0,Riepilogo!M89/$B$2,\"\")","v":""},{"$f":"IF(B59=\"\",\"\",Riepilogo!K89)","v":""},null,{"$f":"IF(Riepilogo!N89>0,Riepilogo!N89/$E$2,\"\")","v":""},{"$f":"IF(E59=\"\",\"\",Riepilogo!K89)","v":""},null,{"$f":"IF(Riepilogo!O89>0,Riepilogo!O89/$H$2,\"\")","v":""},{"$f":"IF(H59=\"\",\"\",Riepilogo!K89)","v":""},null,null,0,null,null,0,null,null,0,null,null,0,0,{"$f":"ISODD(SUM($V$5:V59))","v":false},"Inizio 20%"]
[null,{"$f":"IF(Riepilogo!M90>0,Riepilogo!M90/$B$2,\"\")","v":""},{"$f":"IF(B60=\"\",\"\",Riepilogo!K90)","v":""},null,{"$f":"IF(Riepilogo!N90>0,Riepilogo!N90/$E$2,\"\")","v":""},{"$f":"IF(E60=\"\",\"\",Riepilogo!K90)","v":""},null,{"$f":"IF(Riepilogo!O90>0,Riepilogo!O90/$H$2,\"\")","v":""},{"$f":"IF(H60=\"\",\"\",Riepilogo!K90)","v":""},null,null,{"$f":"IF(B60=\"\",0,B60)","v":0},null,null,{"$f":"IF(E60=\"\",0,E60)","v":0},null,null,{"$f":"IF(H60=\"\",0,H60)","v":0},null,null,{"$f":"SUM(L60:T60)","v":0},{"$f":"IF(U60>0,1,0)","v":0},{"$f":"ISODD(SUM($V$5:V60))","v":false}]
[null,{"$f":"IF(Riepilogo!M91>0,Riepilogo!M91/$B$2,\"\")","v":""},{"$f":"IF(B61=\"\",\"\",Riepilogo!K91)","v":""},null,{"$f":"IF(Riepilogo!N91>0,Riepilogo!N91/$E$2,\"\")","v":""},{"$f":"IF(E61=\"\",\"\",Riepilogo!K91)","v":""},null,{"$f":"IF(Riepilogo!O91>0,Riepilogo!O91/$H$2,\"\")","v":""},{"$f":"IF(H61=\"\",\"\",Riepilogo!K91)","v":""},null,null,0,null,null,0,null,null,0,null,null,0,0,{"$f":"ISODD(SUM($V$5:V61))","v":false}]
[null,{"$f":"IF(Riepilogo!M92>0,Riepilogo!M92/$B$2,\"\")","v":""},{"$f":"IF(B62=\"\",\"\",Riepilogo!K92)","v":""},null,{"$f":"IF(Riepilogo!N92>0,Riepilogo!N92/$E$2,\"\")","v":""},{"$f":"IF(E62=\"\",\"\",Riepilogo!K92)","v":""},null,{"$f":"IF(Riepilogo!O92>0,Riepilogo!O92/$H$2,\"\")","v":""},{"$f":"IF(H62=\"\",\"\",Riepilogo!K92)","v":""},null,null,0,null,null,0,null,null,0,null,null,0,0,{"$f":"ISODD(SUM($V$5:V62))","v":false}]
[null,{"$f":"IF(Riepilogo!M93>0,Riepilogo!M93/$B$2,\"\")","v":""},{"$f":"IF(B63=\"\",\"\",Riepilogo!K93)","v":""},null,{"$f":"IF(Riepilogo!N93>0,Riepilogo!N93/$E$2,\"\")","v":""},{"$f":"IF(E63=\"\",\"\",Riepilogo!K93)","v":""},null,{"$f":"IF(Riepilogo!O93>0,Riepilogo!O93/$H$2,\"\")","v":""},{"$f":"IF(H63=\"\",\"\",Riepilogo!K93)","v":""},null,null,0,null,null,0,null,null,0,null,null,0,0,{"$f":"ISODD(SUM($V$5:V63))","v":false}]
[null,{"$f":"IF(Riepilogo!M94>0,Riepilogo!M94/$B$2,\"\")","v":""},{"$f":"IF(B64=\"\",\"\",Riepilogo!K94)","v":""},null,{"$f":"IF(Riepilogo!N94>0,Riepilogo!N94/$E$2,\"\")","v":""},{"$f":"IF(E64=\"\",\"\",Riepilogo!K94)","v":""},null,{"$f":"IF(Riepilogo!O94>0,Riepilogo!O94/$H$2,\"\")","v":""},{"$f":"IF(H64=\"\",\"\",Riepilogo!K94)","v":""},null,null,0,null,null,0,null,null,0,null,null,0,0,{"$f":"ISODD(SUM($V$5:V64))","v":false}]
[null,{"$f":"IF(Riepilogo!M95>0,Riepilogo!M95/$B$2,\"\")","v":""},{"$f":"IF(B65=\"\",\"\",Riepilogo!K95)","v":""},null,{"$f":"IF(Riepilogo!N95>0,Riepilogo!N95/$E$2,\"\")","v":""},{"$f":"IF(E65=\"\",\"\",Riepilogo!K95)","v":""},null,{"$f":"IF(Riepilogo!O95>0,Riepilogo!O95/$H$2,\"\")","v":""},{"$f":"IF(H65=\"\",\"\",Riepilogo!K95)","v":""},null,null,0,null,null,0,null,null,0,null,null,0,0,{"$f":"ISODD(SUM($V$5:V65))","v":false}]
[null,{"$f":"IF(Riepilogo!M96>0,Riepilogo!M96/$B$2,\"\")","v":""},{"$f":"IF(B66=\"\",\"\",Riepilogo!K96)","v":""},null,{"$f":"IF(Riepilogo!N96>0,Riepilogo!N96/$E$2,\"\")","v":""},{"$f":"IF(E66=\"\",\"\",Riepilogo!K96)","v":""},null,{"$f":"IF(Riepilogo!O96>0,Riepilogo!O96/$H$2,\"\")","v":""},{"$f":"IF(H66=\"\",\"\",Riepilogo!K96)","v":""},null,null,0,null,null,0,null,null,0,null,null,0,0,{"$f":"ISODD(SUM($V$5:V66))","v":false}]
[null,{"$f":"IF(Riepilogo!M97>0,Riepilogo!M97/$B$2,\"\")","v":""},{"$f":"IF(B67=\"\",\"\",Riepilogo!K97)","v":""},null,{"$f":"IF(Riepilogo!N97>0,Riepilogo!N97/$E$2,\"\")","v":""},{"$f":"IF(E67=\"\",\"\",Riepilogo!K97)","v":""},null,{"$f":"IF(Riepilogo!O97>0,Riepilogo!O97/$H$2,\"\")","v":""},{"$f":"IF(H67=\"\",\"\",Riepilogo!K97)","v":""},null,null,0,null,null,0,null,null,0,null,null,0,0,{"$f":"ISODD(SUM($V$5:V67))","v":false}]
[null,{"$f":"IF(Riepilogo!M98>0,Riepilogo!M98/$B$2,\"\")","v":""},{"$f":"IF(B68=\"\",\"\",Riepilogo!K98)","v":""},null,{"$f":"IF(Riepilogo!N98>0,Riepilogo!N98/$E$2,\"\")","v":""},{"$f":"IF(E68=\"\",\"\",Riepilogo!K98)","v":""},null,{"$f":"IF(Riepilogo!O98>0,Riepilogo!O98/$H$2,\"\")","v":""},{"$f":"IF(H68=\"\",\"\",Riepilogo!K98)","v":""},null,null,0,null,null,0,null,null,0,null,null,0,0,{"$f":"ISODD(SUM($V$5:V68))","v":false}]
[null,{"$f":"IF(Riepilogo!M99>0,Riepilogo!M99/$B$2,\"\")","v":""},{"$f":"IF(B69=\"\",\"\",Riepilogo!K99)","v":""},null,{"$f":"IF(Riepilogo!N99>0,Riepilogo!N99/$E$2,\"\")","v":""},{"$f":"IF(E69=\"\",\"\",Riepilogo!K99)","v":""},null,{"$f":"IF(Riepilogo!O99>0,Riepilogo!O99/$H$2,\"\")","v":""},{"$f":"IF(H69=\"\",\"\",Riepilogo!K99)","v":""},null,null,0,null,null,0,null,null,0,null,null,0,0,{"$f":"ISODD(SUM($V$5:V69))","v":false}]
[null,{"$f":"IF(Riepilogo!M100>0,Riepilogo!M100/$B$2,\"\")","v":""},{"$f":"IF(B70=\"\",\"\",Riepilogo!K100)","v":""},null,{"$f":"IF(Riepilogo!N100>0,Riepilogo!N100/$E$2,\"\")","v":""},{"$f":"IF(E70=\"\",\"\",Riepilogo!K100)","v":""},null,{"$f":"IF(Riepilogo!O100>0,Riepilogo!O100/$H$2,\"\")","v":""},{"$f":"IF(H70=\"\",\"\",Riepilogo!K100)","v":""},null,null,0,null,null,0,null,null,0,null,null,0,0,{"$f":"ISODD(SUM($V$5:V70))","v":false}]
[null,{"$f":"IF(Riepilogo!M101>0,Riepilogo!M101/$B$2,\"\")","v":""},{"$f":"IF(B71=\"\",\"\",Riepilogo!K101)","v":""},null,{"$f":"IF(Riepilogo!N101>0,Riepilogo!N101/$E$2,\"\")","v":""},{"$f":"IF(E71=\"\",\"\",Riepilogo!K101)","v":""},null,{"$f":"IF(Riepilogo!O101>0,Riepilogo!O101/$H$2,\"\")","v":""},{"$f":"IF(H71=\"\",\"\",Riepilogo!K101)","v":""},null,null,0,null,null,0,null,null,0,null,null,0,0,{"$f":"ISODD(SUM($V$5:V71))","v":false}]
[null,{"$f":"IF(Riepilogo!M102>0,Riepilogo!M102/$B$2,\"\")","v":""},{"$f":"IF(B72=\"\",\"\",Riepilogo!K102)","v":""},null,{"$f":"IF(Riepilogo!N102>0,Riepilogo!N102/$E$2,\"\")","v":""},{"$f":"IF(E72=\"\",\"\",Riepilogo!K102)","v":""},null,{"$f":"IF(Riepilogo!O102>0,Riepilogo!O102/$H$2,\"\")","v":""},{"$f":"IF(H72=\"\",\"\",Riepilogo!K102)","v":""},null,null,0,null,null,0,null,null,0,null,null,0,0,{"$f":"ISODD(SUM($V$5:V72))","v":false}]
[null,{"$f":"IF(Riepilogo!M103>0,Riepilogo!M103/$B$2,\"\")","v":""},{"$f":"IF(B73=\"\",\"\",Riepilogo!K103)","v":""},null,{"$f":"IF(Riepilogo!N103>0,Riepilogo!N103/$E$2,\"\")","v":""},{"$f":"IF(E73=\"\",\"\",Riepilogo!K103)","v":""},null,{"$f":"IF(Riepilogo!O103>0,Riepilogo!O103/$H$2,\"\")","v":""},{"$f":"IF(H73=\"\",\"\",Riepilogo!K103)","v":""},null,null,0,null,null,0,null,null,0,null,null,0,0,{"$f":"ISODD(SUM($V$5:V73))","v":false}]
[null,{"$f":"IF(Riepilogo!M104>0,Riepilogo!M104/$B$2,\"\")","v":""},{"$f":"IF(B74=\"\",\"\",Riepilogo!K104)","v":""},null,{"$f":"IF(Riepilogo!N104>0,Riepilogo!N104/$E$2,\"\")","v":""},{"$f":"IF(E74=\"\",\"\",Riepilogo!K104)","v":""},null,{"$f":"IF(Riepilogo!O104>0,Riepilogo!O104/$H$2,\"\")","v":""},{"$f":"IF(H74=\"\",\"\",Riepilogo!K104)","v":""},null,null,0,null,null,0,null,null,0,null,null,0,0,{"$f":"ISODD(SUM($V$5:V74))","v":false}]
[null,{"$f":"IF(Riepilogo!M105>0,Riepilogo!M105/$B$2,\"\")","v":""},{"$f":"IF(B75=\"\",\"\",Riepilogo!K105)","v":""},null,{"$f":"IF(Riepilogo!N105>0,Riepilogo!N105/$E$2,\"\")","v":""},{"$f":"IF(E75=\"\",\"\",Riepilogo!K105)","v":""},null,{"$f":"IF(Riepilogo!O105>0,Riepilogo!O105/$H$2,\"\")","v":""},{"$f":"IF(H75=\"\",\"\",Riepilogo!K105)","v":""},null,null,0,null,null,0,null,null,0,null,null,0,0,{"$f":"ISODD(SUM($V$5:V75))","v":false}]
[null,{"$f":"IF(Riepilogo!M106>0,Riepilogo!M106/$B$2,\"\")","v":""},{"$f":"IF(B76=\"\",\"\",Riepilogo!K106)","v":""},null,{"$f":"IF(Riepilogo!N106>0,Riepilogo!N106/$E$2,\"\")","v":""},{"$f":"IF(E76=\"\",\"\",Riepilogo!K106)","v":""},null,{"$f":"IF(Riepilogo!O106>0,Riepilogo!O106/$H$2,\"\")","v":""},{"$f":"IF(H76=\"\",\"\",Riepilogo!K106)","v":""},null,null,0,null,null,0,null,null,0,null,null,0,0,{"$f":"ISODD(SUM($V$5:V76))","v":false}]
[null,{"$f":"IF(Riepilogo!M107>0,Riepilogo!M107/$B$2,\"\")","v":""},{"$f":"IF(B77=\"\",\"\",Riepilogo!K107)","v":""},null,{"$f":"IF(Riepilogo!N107>0,Riepilogo!N107/$E$2,\"\")","v":""},{"$f":"IF(E77=\"\",\"\",Riepilogo!K107)","v":""},null,{"$f":"IF(Riepilogo!O107>0,Riepilogo!O107/$H$2,\"\")","v":""},{"$f":"IF(H77=\"\",\"\",Riepilogo!K107)","v":""},null,null,0,null,null,0,null,null,0,null,null,0,0,{"$f":"ISODD(SUM($V$5:V77))","v":false}]
[null,{"$f":"IF(Riepilogo!M108>0,Riepilogo!M108/$B$2,\"\")","v":""},{"$f":"IF(B78=\"\",\"\",Riepilogo!K108)","v":""},null,{"$f":"IF(Riepilogo!N108>0,Riepilogo!N108/$E$2,\"\")","v":""},{"$f":"IF(E78=\"\",\"\",Riepilogo!K108)","v":""},null,{"$f":"IF(Riepilogo!O108>0,Riepilogo!O108/$H$2,\"\")","v":""},{"$f":"IF(H78=\"\",\"\",Riepilogo!K108)","v":""},null,null,0,null,null,0,null,null,0,null,null,0,0,{"$f":"ISODD(SUM($V$5:V78))","v":false}]
[null,{"$f":"IF(Riepilogo!M109>0,Riepilogo!M109/$B$2,\"\")","v":""},{"$f":"IF(B79=\"\",\"\",Riepilogo!K109)","v":""},null,{"$f":"IF(Riepilogo!N109>0,Riepilogo!N109/$E$2,\"\")","v":""},{"$f":"IF(E79=\"\",\"\",Riepilogo!K109)","v":""},null,{"$f":"IF(Riepilogo!O109>0,Riepilogo!O109/$H$2,\"\")","v":""},{"$f":"IF(H79=\"\",\"\",Riepilogo!K109)","v":""},null,null,{"$f":"IF(B79=\"\",0,B79)","v":0},null,null,{"$f":"IF(E79=\"\",0,E79)","v":0},null,null,{"$f":"IF(H79=\"\",0,H79)","v":0},null,null,{"$f":"SUM(L79:T79)","v":0},{"$f":"IF(U79>0,1,0)","v":0},{"$f":"ISODD(SUM($V$5:V79))","v":false}]
[null,{"$f":"IF(Riepilogo!M110>0,Riepilogo!M110/$B$2,\"\")","v":""},{"$f":"IF(B80=\"\",\"\",Riepilogo!K110)","v":""},null,{"$f":"IF(Riepilogo!N110>0,Riepilogo!N110/$E$2,\"\")","v":""},{"$f":"IF(E80=\"\",\"\",Riepilogo!K110)","v":""},null,{"$f":"IF(Riepilogo!O110>0,Riepilogo!O110/$H$2,\"\")","v":""},{"$f":"IF(H80=\"\",\"\",Riepilogo!K110)","v":""},null,null,0,null,null,0,null,null,0,null,null,0,0,{"$f":"ISODD(SUM($V$5:V80))","v":false}]
[null,{"$f":"IF(Riepilogo!M111>0,Riepilogo!M111/$B$2,\"\")","v":""},{"$f":"IF(B81=\"\",\"\",Riepilogo!K111)","v":""},null,{"$f":"IF(Riepilogo!N111>0,Riepilogo!N111/$E$2,\"\")","v":""},{"$f":"IF(E81=\"\",\"\",Riepilogo!K111)","v":""},null,{"$f":"IF(Riepilogo!O111>0,Riepilogo!O111/$H$2,\"\")","v":""},{"$f":"IF(H81=\"\",\"\",Riepilogo!K111)","v":""},null,null,0,null,null,0,null,null,0,null,null,0,0,{"$f":"ISODD(SUM($V$5:V81))","v":false}]
[null,{"$f":"IF(Riepilogo!M112>0,Riepilogo!M112/$B$2,\"\")","v":""},{"$f":"IF(B82=\"\",\"\",Riepilogo!K112)","v":""},null,{"$f":"IF(Riepilogo!N112>0,Riepilogo!N112/$E$2,\"\")","v":""},{"$f":"IF(E82=\"\",\"\",Riepilogo!K112)","v":""},null,{"$f":"IF(Riepilogo!O112>0,Riepilogo!O112/$H$2,\"\")","v":""},{"$f":"IF(H82=\"\",\"\",Riepilogo!K112)","v":""},null,null,0,null,null,0,null,null,0,null,null,0,0,{"$f":"ISODD(SUM($V$5:V82))","v":false}]
[null,{"$f":"IF(Riepilogo!M113>0,Riepilogo!M113/$B$2,\"\")","v":""},{"$f":"IF(B83=\"\",\"\",Riepilogo!K113)","v":""},null,{"$f":"IF(Riepilogo!N113>0,Riepilogo!N113/$E$2,\"\")","v":""},{"$f":"IF(E83=\"\",\"\",Riepilogo!K113)","v":""},null,{"$f":"IF(Riepilogo!O113>0,Riepilogo!O113/$H$2,\"\")","v":""},{"$f":"IF(H83=\"\",\"\",Riepilogo!K113)","v":""},null,null,0,null,null,0,null,null,0,null,null,0,0,{"$f":"ISODD(SUM($V$5:V83))","v":false}]
[null,{"$f":"IF(Riepilogo!M114>0,Riepilogo!M114/$B$2,\"\")","v":""},{"$f":"IF(B84=\"\",\"\",Riepilogo!K114)","v":""},null,{"$f":"IF(Riepilogo!N114>0,Riepilogo!N114/$E$2,\"\")","v":""},{"$f":"IF(E84=\"\",\"\",Riepilogo!K114)","v":""},null,{"$f":"IF(Riepilogo!O114>0,Riepilogo!O114/$H$2,\"\")","v":""},{"$f":"IF(H84=\"\",\"\",Riepilogo!K114)","v":""},null,null,{"$f":"IF(B84=\"\",0,B84)","v":0},null,null,{"$f":"IF(E84=\"\",0,E84)","v":0},null,null,{"$f":"IF(H84=\"\",0,H84)","v":0},null,null,{"$f":"SUM(L84:T84)","v":0},{"$f":"IF(U84>0,1,0)","v":0},{"$f":"ISODD(SUM($V$5:V84))","v":false}]
[null,{"$f":"IF(Riepilogo!M135>0,Riepilogo!M135/$B$2,\"\")","v":""},{"$f":"IF(B85=\"\",\"\",Riepilogo!K135)","v":""},null,{"$f":"IF(Riepilogo!N135>0,Riepilogo!N135/$E$2,\"\")","v":""},{"$f":"IF(E85=\"\",\"\",Riepilogo!K135)","v":""},null,{"$f":"IF(Riepilogo!O135>0,Riepilogo!O135/$H$2,\"\")","v":""},{"$f":"IF(H85=\"\",\"\",Riepilogo!K135)","v":""},null,null,0,null,null,0,null,null,0,null,null,0,0,{"$f":"ISODD(SUM($V$5:V85))","v":false}]
[null,{"$f":"IF(Riepilogo!M136>0,Riepilogo!M136/$B$2,\"\")","v":""},{"$f":"IF(B86=\"\",\"\",Riepilogo!K136)","v":""},null,{"$f":"IF(Riepilogo!N136>0,Riepilogo!N136/$E$2,\"\")","v":""},{"$f":"IF(E86=\"\",\"\",Riepilogo!K136)","v":""},null,{"$f":"IF(Riepilogo!O136>0,Riepilogo!O136/$H$2,\"\")","v":""},{"$f":"IF(H86=\"\",\"\",Riepilogo!K136)","v":""},null,null,0,null,null,0,null,null,0,null,null,0,0,{"$f":"ISODD(SUM($V$5:V86))","v":false}]
[null,{"$f":"IF(Riepilogo!M137>0,Riepilogo!M137/$B$2,\"\")","v":""},{"$f":"IF(B87=\"\",\"\",Riepilogo!K137)","v":""},null,{"$f":"IF(Riepilogo!N137>0,Riepilogo!N137/$E$2,\"\")","v":""},{"$f":"IF(E87=\"\",\"\",Riepilogo!K137)","v":""},null,{"$f":"IF(Riepilogo!O137>0,Riepilogo!O137/$H$2,\"\")","v":""},{"$f":"IF(H87=\"\",\"\",Riepilogo!K137)","v":""},null,null,0,null,null,0,null,null,0,null,null,0,0,{"$f":"ISODD(SUM($V$5:V87))","v":false}]
[null,{"$f":"IF(Riepilogo!M138>0,Riepilogo!M138/$B$2,\"\")","v":""},{"$f":"IF(B88=\"\",\"\",Riepilogo!K138)","v":""},null,{"$f":"IF(Riepilogo!N138>0,Riepilogo!N138/$E$2,\"\")","v":""},{"$f":"IF(E88=\"\",\"\",Riepilogo!K138)","v":""},null,{"$f":"IF(Riepilogo!O138>0,Riepilogo!O138/$H$2,\"\")","v":""},{"$f":"IF(H88=\"\",\"\",Riepilogo!K138)","v":""},null,null,0,null,null,0,null,null,0,null,null,0,0,{"$f":"ISODD(SUM($V$5:V88))","v":false}]
[null,{"$f":"IF(Riepilogo!M139>0,Riepilogo!M139/$B$2,\"\")","v":""},{"$f":"IF(B89=\"\",\"\",Riepilogo!K139)","v":""},null,{"$f":"IF(Riepilogo!N139>0,Riepilogo!N139/$E$2,\"\")","v":""},{"$f":"IF(E89=\"\",\"\",Riepilogo!K139)","v":""},null,{"$f":"IF(Riepilogo!O139>0,Riepilogo!O139/$H$2,\"\")","v":""},{"$f":"IF(H89=\"\",\"\",Riepilogo!K139)","v":""},null,null,0,null,null,0,null,null,0,null,null,0,0,{"$f":"ISODD(SUM($V$5:V89))","v":false}]
[null,{"$f":"IF(Riepilogo!M140>0,Riepilogo!M140/$B$2,\"\")","v":""},{"$f":"IF(B90=\"\",\"\",Riepilogo!K140)","v":""},null,{"$f":"IF(Riepilogo!N140>0,Riepilogo!N140/$E$2,\"\")","v":""},{"$f":"IF(E90=\"\",\"\",Riepilogo!K140)","v":""},null,{"$f":"IF(Riepilogo!O140>0,Riepilogo!O140/$H$2,\"\")","v":""},{"$f":"IF(H90=\"\",\"\",Riepilogo!K140)","v":""},null,null,0,null,null,0,null,null,0,null,null,0,0,{"$f":"ISODD(SUM($V$5:V90))","v":false}]
[null,{"$f":"IF(Riepilogo!M141>0,Riepilogo!M141/$B$2,\"\")","v":""},{"$f":"IF(B91=\"\",\"\",Riepilogo!K141)","v":""},null,{"$f":"IF(Riepilogo!N141>0,Riepilogo!N141/$E$2,\"\")","v":""},{"$f":"IF(E91=\"\",\"\",Riepilogo!K141)","v":""},null,{"$f":"IF(Riepilogo!O141>0,Riepilogo!O141/$H$2,\"\")","v":""},{"$f":"IF(H91=\"\",\"\",Riepilogo!K141)","v":""},null,null,0,null,null,0,null,null,0,null,null,0,0,{"$f":"ISODD(SUM($V$5:V91))","v":false}]
[null,{"$f":"IF(Riepilogo!M142>0,Riepilogo!M142/$B$2,\"\")","v":""},{"$f":"IF(B92=\"\",\"\",Riepilogo!K142)","v":""},null,{"$f":"IF(Riepilogo!N142>0,Riepilogo!N142/$E$2,\"\")","v":""},{"$f":"IF(E92=\"\",\"\",Riepilogo!K142)","v":""},null,{"$f":"IF(Riepilogo!O142>0,Riepilogo!O142/$H$2,\"\")","v":""},{"$f":"IF(H92=\"\",\"\",Riepilogo!K142)","v":""},null,null,0,null,null,0,null,null,0,null,null,0,0,{"$f":"ISODD(SUM($V$5:V92))","v":false}]
[null,{"$f":"IF(Riepilogo!M143>0,Riepilogo!M143/$B$2,\"\")","v":""},{"$f":"IF(B93=\"\",\"\",Riepilogo!K143)","v":""},null,{"$f":"IF(Riepilogo!N143>0,Riepilogo!N143/$E$2,\"\")","v":""},{"$f":"IF(E93=\"\",\"\",Riepilogo!K143)","v":""},null,{"$f":"IF(Riepilogo!O143>0,Riepilogo!O143/$H$2,\"\")","v":""},{"$f":"IF(H93=\"\",\"\",Riepilogo!K143)","v":""},null,null,0,null,null,0,null,null,0,null,null,0,0,{"$f":"ISODD(SUM($V$5:V93))","v":false}]
[null,{"$f":"IF(Riepilogo!M144>0,Riepilogo!M144/$B$2,\"\")","v":""},{"$f":"IF(B94=\"\",\"\",Riepilogo!K144)","v":""},null,{"$f":"IF(Riepilogo!N144>0,Riepilogo!N144/$E$2,\"\")","v":""},{"$f":"IF(E94=\"\",\"\",Riepilogo!K144)","v":""},null,{"$f":"IF(Riepilogo!O144>0,Riepilogo!O144/$H$2,\"\")","v":""},{"$f":"IF(H94=\"\",\"\",Riepilogo!K144)","v":""},null,null,0,null,null,0,null,null,0,null,null,0,0,{"$f":"ISODD(SUM($V$5:V94))","v":false}]
[null,{"$f":"IF(Riepilogo!M145>0,Riepilogo!M145/$B$2,\"\")","v":""},{"$f":"IF(B95=\"\",\"\",Riepilogo!K145)","v":""},null,{"$f":"IF(Riepilogo!N145>0,Riepilogo!N145/$E$2,\"\")","v":""},{"$f":"IF(E95=\"\",\"\",Riepilogo!K145)","v":""},null,{"$f":"IF(Riepilogo!O145>0,Riepilogo!O145/$H$2,\"\")","v":""},{"$f":"IF(H95=\"\",\"\",Riepilogo!K145)","v":""},null,null,0,null,null,0,null,null,0,null,null,0,0,{"$f":"ISODD(SUM($V$5:V95))","v":false}]
[null,{"$f":"IF(Riepilogo!M146>0,Riepilogo!M146/$B$2,\"\")","v":""},{"$f":"IF(B96=\"\",\"\",Riepilogo!K146)","v":""},null,{"$f":"IF(Riepilogo!N146>0,Riepilogo!N146/$E$2,\"\")","v":""},{"$f":"IF(E96=\"\",\"\",Riepilogo!K146)","v":""},null,{"$f":"IF(Riepilogo!O146>0,Riepilogo!O146/$H$2,\"\")","v":""},{"$f":"IF(H96=\"\",\"\",Riepilogo!K146)","v":""},null,null,0,null,null,0,null,null,0,null,null,0,0,{"$f":"ISODD(SUM($V$5:V96))","v":false}]
[null,{"$f":"IF(Riepilogo!M147>0,Riepilogo!M147/$B$2,\"\")","v":""},{"$f":"IF(B97=\"\",\"\",Riepilogo!K147)","v":""},null,{"$f":"IF(Riepilogo!N147>0,Riepilogo!N147/$E$2,\"\")","v":""},{"$f":"IF(E97=\"\",\"\",Riepilogo!K147)","v":""},null,{"$f":"IF(Riepilogo!O147>0,Riepilogo!O147/$H$2,\"\")","v":""},{"$f":"IF(H97=\"\",\"\",Riepilogo!K147)","v":""},null,null,0,null,null,0,null,null,0,null,null,0,0,{"$f":"ISODD(SUM($V$5:V97))","v":false}]
[null,{"$f":"IF(Riepilogo!M148>0,Riepilogo!M148/$B$2,\"\")","v":""},{"$f":"IF(B98=\"\",\"\",Riepilogo!K148)","v":""},null,{"$f":"IF(Riepilogo!N148>0,Riepilogo!N148/$E$2,\"\")","v":""},{"$f":"IF(E98=\"\",\"\",Riepilogo!K148)","v":""},null,{"$f":"IF(Riepilogo!O148>0,Riepilogo!O148/$H$2,\"\")","v":""},{"$f":"IF(H98=\"\",\"\",Riepilogo!K148)","v":""},null,null,0,null,null,0,null,null,0,null,null,0,0,{"$f":"ISODD(SUM($V$5:V98))","v":false}]
[null,{"$f":"IF(Riepilogo!M149>0,Riepilogo!M149/$B$2,\"\")","v":""},{"$f":"IF(B99=\"\",\"\",Riepilogo!K149)","v":""},null,{"$f":"IF(Riepilogo!N149>0,Riepilogo!N149/$E$2,\"\")","v":""},{"$f":"IF(E99=\"\",\"\",Riepilogo!K149)","v":""},null,{"$f":"IF(Riepilogo!O149>0,Riepilogo!O149/$H$2,\"\")","v":""},{"$f":"IF(H99=\"\",\"\",Riepilogo!K149)","v":""},null,null,{"$f":"IF(B99=\"\",0,B99)","v":0},null,null,{"$f":"IF(E99=\"\",0,E99)","v":0},null,null,{"$f":"IF(H99=\"\",0,H99)","v":0},null,null,{"$f":"SUM(L99:T99)","v":0},{"$f":"IF(U99>0,1,0)","v":0},{"$f":"ISODD(SUM($V$5:V99))","v":false}]
[null,null,null,null,null,null,null,null,null,null,null,null,null,null,null,null,null,null,null,null,null,{"$f":"IF($U$5+$U$6>0,1,0)","v":0}]
[null,"Configurazione RAID e/o NOTE",null,null,"Configurazione RAID e/o NOTE",null,null,"Configurazione RAID e/o NOTE",null,null,null,null,null,null,null,null,null,null,null,null,null,{"$f":"IF($U$5+$U$6>0,1,0)","v":0}]
[null,{"$f":"Lotto6_DL560_1!H34","v":"Specificare la configurazione RAID per l'installazione del Sistema Operativo, se richiesto.\ne/o\ninserire eventuali note."},null,null,{"$f":"Lotto6_DL560_2!H34","v":"Specificare la configurazione RAID per l'installazione del Sistema Operativo, se richiesto.\ne/o\ninserire eventuali note."},null,null,{"$f":"Lotto6_DL560_3!H34","v":"Specificare la configurazione RAID per l'installazione del Sistema Operativo, se richiesto.\ne/o\ninserire eventuali note."},null,null,null,null,null,null,null,null,null,null,null,null,null,0]
[null,null,null,null,null,null,null,null,null,null,null,null,null,null,null,null,null,null,null,null,null,0]
[null,null,null,null,null,null,null,null,null,null,null,null,null,null,null,null,null,null,null,null,null,0]
[null,null,null,null,null,null,null,null,null,null,null,null,null,null,null,null,null,null,null,null,null,0]
[null,null,null,null,null,null,null,null,null,null,null,null,null,null,null,null,null,null,null,null,null,0]
[null,null,null,null,null,null,null,null,null,null,null,null,null,null,null,null,null,null,null,null,null,0]
[null,null,null,null,null,null,null,null,null,null,null,null,null,null,null,null,null,null,null,null,null,0]
[null,null,null,null,null,null,null,null,null,null,null,null,null,null,null,null,null,null,null,null,null,0]
[null,null,null,null,null,null,null,null,null,null,null,null,null,null,null,null,null,null,null,null,null,0]
[null,null,null,null,null,null,null,null,null,null,null,null,null,null,null,null,null,null,null,null,null,0]
[null,null,null,null,null,null,null,null,null,null,null,null,null,null,null,null,null,null,null,null,null,0]
[null,null,null,null,null,null,null,null,null,null,null,null,null,null,null,null,null,null,null,null,null,0]
[null,null,null,null,null,null,null,null,null,null,null,null,null,null,null,null,null,null,null,null,null,0]
[null,null,null,null,null,null,null,null,null,null,null,null,null,null,null,null,null,null,null,null,null,0]
[null,"AREA RISERVATA AL FORNITORE",null,null,null,null,null,null,null,null,null,null,null,null,null,null,null,null,null,null,null,0]
[null,null,null,null,null,null,null,null,null,null,null,null,null,null,null,null,null,null,null,null,null,0]
[null,"VERIFICA STAGING",null,null,null,null,"VERIFICA INSTALLATORE",null,null,null,null,null,null,null,null,null,null,null,null,null,null,0]
[null,null,null,null,null,null,null,null,null,null,null,null,null,null,null,null,null,null,null,null,null,0]
[null,null,null,null,null,null,null,null,null,null,null,null,null,null,null,null,null,null,null,null,null,0]
[null,null,null,null,null,null,null,null,null,null,null,null,null,null,null,null,null,null,null,null,null,0]
[null,null,null,null,null,null,null,null,null,null,null,null,null,null,null,null,null,null,null,null,null,0]