{"text_format":"1","workbook":"xlsx","n_sheets":8,"sheets":["Lotto8_C6525_1","Lotto8_C6525_2","Lotto8_C6525_3","Altre_Opzioni","ConfigurationTS3L8","Tabella_prezzi","Riepilogo","Configurazione"],"not_rendered":{"charts":0,"images":19,"macros":1,"external_links":0,"defined_names":13,"comments":0,"pivot_tables":0},"unopened":[],"bounds":{"document_bytes":16777216,"sheet_cells":100000,"rows_first":2000,"rows_last":500,"rows_between":2000,"halvings":0,"cell_chars":16384,"cell_head_chars":4096},"cells_cut":0,"cells_raw":0,"read":"whole","date_system":"1900"}

{"sheet":"Lotto8_C6525_1","index":0,"n_rows":108,"n_cols":17,"rows_kept":108,"cut":false,"hidden":false,"merged":[[66,3,67,3],[103,3,104,3],[106,3,107,3],[10,7,11,7],[12,7,13,7],[14,7,15,7],[16,7,17,7],[18,7,19,7],[20,7,21,7],[63,7,64,7],[22,7,25,7],[97,7,98,7],[33,2,34,2],[43,7,56,7],[37,4,37,5],[33,4,33,5],[42,4,42,5],[4,0,4,2],[30,3,31,3],[8,7,9,7],[7,3,9,3],[11,3,12,3],[17,3,18,3]]}
[null,null,null,null,"Convenzione",{"$f":"SUM(J:J)*F5","v":0}]
[null,null,null,null,0.2,{"$f":"SUM(K:K)*F5","v":0}]
[null,null,null,null,"Totale",{"$f":"SUM(F1:F2)","v":0}]
[]
["PowerEdge C6400 + 4 x C6525 Consulta la Guida alla Convenzione -->",null,null,{"$f":"HYPERLINK(\"https://convenzioni.converge.it/docs/L8GuidaAllaConvenzioneTecnologieServer3.pdf\",\"&\")","v":"&"},"Quantità Server",null,null,{"$f":"Riepilogo!G8","v":"Version 4.0"}]
[]
[]
[null,null,"Base",{"$f":"HYPERLINK(\"https://convenzioni.converge.it/docs/ts3_datasheet/dell-emc-poweredge-c6525-spec-sheet.pdf\",\"i\")","v":"i"}]
[null,null,"POWEREDGE C6400-R Enclosure ",null,{"$f":"IF($F$5>0,\"TS3L8-SRV-U\",\"\")","v":""},{"$f":"IF($F$5>0,1,\"\")","v":""},null,null,null,{"$f":"VLOOKUP($C9,TS3L8_ALL,10,FALSE)","v":8877},null,{"$f":"VLOOKUP($C9,TS3L8_ALL,12,FALSE)","v":"L8N01"}]
[null,null,"PowerEdge C6525",null,null,{"$f":"IF($F$5>0,4,\"\")","v":""}]
[]
[null,null,"Chassis Configuration",{"$f":"HYPERLINK(\"https://dellservervr.dell.com/poweredge-c6525/\",\"i\")","v":"i"}]
[null,null,"Chassis with up to 24x2.5\" Drives","i"]
[]
[null,null,"Trusted Platform Module (TPM)"]
{"$rows_left_out":94}
{"sheet":"Lotto8_C6525_2","index":1,"n_rows":108,"n_cols":17,"rows_kept":108,"cut":false,"hidden":false,"merged":[[103,3,104,3],[33,2,34,2],[33,4,33,5],[37,4,37,5],[43,7,56,7],[63,7,64,7],[97,7,98,7],[106,3,107,3],[4,0,4,2],[8,7,9,7],[10,7,11,7],[12,7,13,7],[14,7,15,7],[16,7,17,7],[18,7,19,7],[20,7,21,7],[42,4,42,5],[30,3,31,3],[7,3,9,3],[11,3,12,3],[17,3,18,3],[66,3,67,3],[22,7,25,7]]}
[null,null,null,null,"Convenzione",{"$f":"SUM(J9:J120)*F5","v":0}]
[null,null,null,null,0.2,{"$f":"SUM(K9:K120)*F5","v":0}]
[null,null,null,null,"Totale",{"$f":"SUM(F1:F2)","v":0}]
[]
["PowerEdge C6400 + 4 x C6525 Consulta la Guida alla Convenzione -->",null,null,{"$f":"HYPERLINK(\"https://convenzioni.converge.it/docs/L8GuidaAllaConvenzioneTecnologieServer3.pdf\",\"&\")","v":"&"},"Quantità Server",null,null,{"$f":"Riepilogo!G8","v":"Version 4.0"}]
[]
[]
[null,null,"Base",{"$f":"HYPERLINK(\"https://convenzioni.converge.it/docs/ts3_datasheet/dell-emc-poweredge-c6525-spec-sheet.pdf\",\"i\")","v":"i"}]
[null,null,"POWEREDGE C6400-R Enclosure ",null,{"$f":"IF($F$5>0,\"TS3L8-SRV-U\",\"\")","v":""},{"$f":"IF($F$5>0,1,\"\")","v":""},null,null,null,{"$f":"VLOOKUP($C9,TS3L8_ALL,10,FALSE)","v":8877},null,{"$f":"VLOOKUP($C9,TS3L8_ALL,12,FALSE)","v":"L8N01"}]
[null,null,"PowerEdge C6525",null,null,{"$f":"IF($F$5>0,4,\"\")","v":""}]
[]
[null,null,"Chassis Configuration",{"$f":"HYPERLINK(\"https://dellservervr.dell.com/poweredge-c6525/\",\"i\")","v":"i"}]
[null,null,"Chassis with up to 24x2.5\" Drives","i"]
[]
[null,null,"Trusted Platform Module (TPM)"]
{"$rows_left_out":94}
{"sheet":"Lotto8_C6525_3","index":2,"n_rows":108,"n_cols":17,"rows_kept":108,"cut":false,"hidden":false,"merged":[[4,0,4,2],[7,3,9,3],[11,3,12,3],[17,3,18,3],[18,7,19,7],[8,7,9,7],[10,7,11,7],[12,7,13,7],[14,7,15,7],[16,7,17,7],[20,7,21,7],[42,4,42,5],[30,3,31,3],[33,4,33,5],[37,4,37,5],[22,7,25,7],[63,7,64,7],[66,3,67,3],[33,2,34,2],[103,3,104,3],[106,3,107,3],[43,7,56,7],[97,7,98,7]]}
[null,null,null,null,"Convenzione",{"$f":"SUM(J9:J120)*F5","v":0}]
[null,null,null,null,0.2,{"$f":"SUM(K9:K120)*F5","v":0}]
[null,null,null,null,"Totale",{"$f":"SUM(F1:F2)","v":0}]
[]
["PowerEdge C6400 + 4 x C6525 Consulta la Guida alla Convenzione -->",null,null,{"$f":"HYPERLINK(\"https://convenzioni.converge.it/docs/L8GuidaAllaConvenzioneTecnologieServer3.pdf\",\"&\")","v":"&"},"Quantità Server",null,null,{"$f":"Riepilogo!G8","v":"Version 4.0"}]
[]
[]
[null,null,"Base",{"$f":"HYPERLINK(\"https://convenzioni.converge.it/docs/ts3_datasheet/dell-emc-poweredge-c6525-spec-sheet.pdf\",\"i\")","v":"i"}]
[null,null,"POWEREDGE C6400-R Enclosure ",null,{"$f":"IF($F$5>0,\"TS3L8-SRV-U\",\"\")","v":""},{"$f":"IF($F$5>0,1,\"\")","v":""},null,null,null,{"$f":"VLOOKUP($C9,TS3L8_ALL,10,FALSE)","v":8877},null,{"$f":"VLOOKUP($C9,TS3L8_ALL,12,FALSE)","v":"L8N01"}]
[null,null,"PowerEdge C6525",null,null,{"$f":"IF($F$5>0,4,\"\")","v":""}]
[]
[null,null,"Chassis Configuration",{"$f":"HYPERLINK(\"https://dellservervr.dell.com/poweredge-c6525/\",\"i\")","v":"i"}]
[null,null,"Chassis with up to 24x2.5\" Drives","i"]
[]
[null,null,"Trusted Platform Module (TPM)"]
{"$rows_left_out":94}
{"sheet":"Altre_Opzioni","index":3,"n_rows":55,"n_cols":12,"rows_kept":55,"cut":false,"hidden":false,"merged":[[10,3,11,3],[7,3,8,3],[31,3,32,3],[53,3,54,3],[14,3,15,3],[39,3,40,3],[43,3,44,3],[47,3,48,3],[50,3,51,3]]}
[null,null,null,null,"Convenzione",{"$f":"SUM(J9:J148)","v":0}]
[null,null,null,null,0.2,{"$f":"SUM(K9:K148)","v":0}]
[null,null,null,null,"Totale",{"$f":"SUM(F1:F2)","v":0}]
[]
[null,null,"Opzioni"]
[]
[]
[null,null,"Opzione Rack APC con PDU Monofase",{"$f":"HYPERLINK(\"https://convenzioni.converge.it/docs/ts3_datasheet/RACK_APC_MONO.pdf\",\"i\")","v":"i"}]
[null,null,"Armadio Rack 42U 600x1200, 2 x PDU Monofase 2G, ZeroU, 32A, 230V, (36) C13 & (6) C19",null,{"$f":"VLOOKUP($C9,TS3L8_ALL,13,FALSE)","v":"TS3L8-RACKM32A"},null,null,null,null,{"$f":"VLOOKUP($C9,TS3L8_ALL,10,FALSE)*F9","v":0},{"$f":"VLOOKUP($C9,TS3L8_ALL,11,FALSE)*F9","v":0},{"$f":"VLOOKUP($C9,TS3L8_ALL,12,FALSE)","v":"L8N45"}]
[]
[null,null,"Opzione Rack APC con PDU Trifase",{"$f":"HYPERLINK(\"https://convenzioni.converge.it/docs/ts3_datasheet/RACK_APC_3PH.pdf\",\"i\")","v":"i"}]
[null,null,"Armadio Rack 42U 600x1200, 2 x PDU Trifase 2G, ZeroU, 22.0kW(32A) 17.3kW(24A), 230V, (30) C13 & (12) C19",null,{"$f":"VLOOKUP($C12,TS3L8_ALL,13,FALSE)","v":"TS3L8-RACKT32A"},null,null,null,null,{"$f":"VLOOKUP($C12,TS3L8_ALL,10,FALSE)*F12","v":0},{"$f":"VLOOKUP($C12,TS3L8_ALL,11,FALSE)*F12","v":0},{"$f":"VLOOKUP($C12,TS3L8_ALL,12,FALSE)","v":"L8N46"}]
[]
[]
[null,null,"OpzRack",{"$f":"HYPERLINK(\"https://convenzioni.converge.it/docs/ts3_datasheet/TS3Rack.pdf\",\"i\")","v":"i"}]
{"$rows_left_out":41}
{"sheet":"ConfigurationTS3L8","index":4,"n_rows":121,"n_cols":21,"rows_kept":121,"cut":false,"hidden":true,"merged":[]}
[]
["POWEREDGE C6400-R Enclosure ",null,null,{"$f":"VLOOKUP($L$2,Tabella_prezzi!$A$1:$J$223,8,FALSE)","v":"DELL PowerEdge C6400 con 4 x DELL PowerEdge C6525"},null,null,1,{"$f":"VLOOKUP(L2,Tabella_prezzi!$A$1:$J$223,3,FALSE)","v":"Server rackable high-density"},{"$f":"VLOOKUP(L2,Tabella_prezzi!$A$1:$J$223,9,FALSE)","v":"L8N01-ServerC6525"},{"$f":"VLOOKUP(L2,Tabella_prezzi!$A$1:$J$223,4,FALSE)","v":8877},null,"L8N01",{"$f":"VLOOKUP(L2,Tabella_prezzi!$A$1:$J$223,6,FALSE)","v":"TS3L8-SRV-U"}]
[]
["TS3L8_CPU"]
["No Additional Processor",null,null,null,null,null,0,null,{"$f":"\"\"","v":""},null,null,{"$f":"\"\"","v":""},{"$f":"\"\"","v":""}]
["AMD EPYC 7282 2.80GHz, 16C/32T, 64M Cache (120W) DDR4-3200",null,null,{"$f":"VLOOKUP($L$6,Tabella_prezzi!$A$1:$J$223,8,FALSE)","v":"Processore AMD EPYC 7282 16C"},null,null,1,{"$f":"VLOOKUP($L$6,Tabella_prezzi!$A$1:$J$223,3,FALSE)","v":"Kit n. 1 Processore aggiuntivo"},{"$f":"VLOOKUP($L$6,Tabella_prezzi!$A$1:$J$223,9,FALSE)","v":"L8N02-OpzCPU"},{"$f":"VLOOKUP($L$6,Tabella_prezzi!$A$1:$J$223,4,FALSE)*4","v":4628},null,"L8N02",{"$f":"VLOOKUP($L$6,Tabella_prezzi!$A$1:$J$223,6,FALSE)","v":"TS3L8-CPU"}]
[]
["TS3L8_RAM (1CPU)"]
["64GB Totali (1 x 64GB DIMM per Nodo) ⚠","Memory Capacity",null,"64GB RDIMM, 3200MT/s, Dual Rank","*","AA799110",null,{"$f":"VLOOKUP(L9,Tabella_prezzi!$A$1:$J$223,3,FALSE)","v":"OpzRAM64GB"},{"$f":"VLOOKUP(L9,Tabella_prezzi!$A$1:$J$223,9,FALSE)","v":"L8N04-OpzRAM64GB"},{"$f":"VLOOKUP(L9,Tabella_prezzi!$A$1:$J$223,4,FALSE)*G9*4","v":0},null,"L8N04",{"$f":"VLOOKUP(L9,Tabella_prezzi!$A$1:$J$223,6,FALSE)","v":"TS3L8-RAM64"}]
["128GB Totali (2 x 64GB DIMM per Nodo) ⚠","Memory Capacity",null,"64GB RDIMM, 3200MT/s, Dual Rank","*","AA799110",1,{"$f":"VLOOKUP(L10,Tabella_prezzi!$A$1:$J$223,3,FALSE)","v":"OpzRAM64GB"},{"$f":"VLOOKUP(L10,Tabella_prezzi!$A$1:$J$223,9,FALSE)","v":"L8N04-OpzRAM64GB"},{"$f":"VLOOKUP(L10,Tabella_prezzi!$A$1:$J$223,4,FALSE)*G10*4","v":1600},null,"L8N04",{"$f":"VLOOKUP(L10,Tabella_prezzi!$A$1:$J$223,6,FALSE)","v":"TS3L8-RAM64"}]
["256GB Totali (4 x 64GB DIMM per Nodo)","Memory Capacity",null,"64GB RDIMM, 3200MT/s, Dual Rank",null,"AA799110",3,{"$f":"VLOOKUP(L11,Tabella_prezzi!$A$1:$J$223,3,FALSE)","v":"OpzRAM64GB"},{"$f":"VLOOKUP(L11,Tabella_prezzi!$A$1:$J$223,9,FALSE)","v":"L8N04-OpzRAM64GB"},{"$f":"VLOOKUP(L11,Tabella_prezzi!$A$1:$J$223,4,FALSE)*G11*4","v":4800},null,"L8N04",{"$f":"VLOOKUP(L11,Tabella_prezzi!$A$1:$J$223,6,FALSE)","v":"TS3L8-RAM64"}]
["512GB Totali (8 x 64GB DIMM per Nodo)","Memory Capacity",null,"64GB RDIMM, 3200MT/s, Dual Rank",null,"AA799110",7,{"$f":"VLOOKUP(L12,Tabella_prezzi!$A$1:$J$223,3,FALSE)","v":"OpzRAM64GB"},{"$f":"VLOOKUP(L12,Tabella_prezzi!$A$1:$J$223,9,FALSE)","v":"L8N04-OpzRAM64GB"},{"$f":"VLOOKUP(L12,Tabella_prezzi!$A$1:$J$223,4,FALSE)*G12*4","v":11200},null,"L8N04",{"$f":"VLOOKUP(L12,Tabella_prezzi!$A$1:$J$223,6,FALSE)","v":"TS3L8-RAM64"}]
[]
["TS3L8_RAM (2CPU)"]
["64GB Totali (1 x 64GB DIMM per Nodo) ⚠","Memory Capacity",null,"64GB RDIMM, 3200MT/s, Dual Rank","*","AA799110",1,{"$f":"VLOOKUP(L15,Tabella_prezzi!$A$1:$J$223,3,FALSE)","v":"OpzRAM64GB"},{"$f":"VLOOKUP(L15,Tabella_prezzi!$A$1:$J$223,9,FALSE)","v":"L8N04-OpzRAM64GB"},{"$f":"VLOOKUP(L15,Tabella_prezzi!$A$1:$J$223,4,FALSE)*G15*4","v":1600},null,"L8N04",{"$f":"VLOOKUP(L15,Tabella_prezzi!$A$1:$J$223,6,FALSE)","v":"TS3L8-RAM64"}]
{"$rows_left_out":107}
{"sheet":"Tabella_prezzi","index":5,"n_rows":64,"n_cols":11,"rows_kept":64,"cut":false,"hidden":true,"merged":[[19,0,20,0],[19,1,20,1],[6,2,7,2],[8,2,9,2],[10,2,11,2],[19,2,20,2],[6,0,7,0],[6,1,7,1],[8,0,9,0],[8,1,9,1],[10,0,11,0],[10,1,11,1],[6,3,7,3],[8,3,9,3],[10,3,11,3],[19,3,20,3],[6,4,7,4],[8,4,9,4],[10,4,11,4],[19,4,20,4],[33,0,34,0],[33,1,34,1],[33,2,34,2],[33,3,34,3],[33,4,34,4],[33,5,34,5],[33,7,34,7],[33,8,34,8],[6,8,7,8],[8,8,9,8],[10,8,11,8],[19,8,20,8],[19,5,20,5],[19,7,20,7],[6,5,7,5],[6,7,7,7],[8,5,9,5],[8,7,9,7],[10,5,11,5],[10,7,11,7]]}
["N°",null,"Attributo","Valore inserito","N°","Codice Convenzione","Qty:","Description:","Sku Number:","Sku Number:"]
["L8N01",1,"Server rackable high-density",8877,"L8N01","TS3L8-SRV-U",1,"DELL PowerEdge C6400 con 4 x DELL PowerEdge C6525","L8N01-ServerC6525",null,"DELL"]
["L8N02",2,"Kit n. 1 Processore aggiuntivo",1157,"L8N02","TS3L8-CPU",1,"Processore AMD EPYC 7282 16C","L8N02-OpzCPU","338-BWBE","DELL"]
["L8N03",3,"OpzRAM32GB",164,"L8N03","TS3L8-RAM32",1,"32GB - 2Rx4 DDR4 RDIMM 3200MHz","L8N03-OpzRAM32GB","AA799087","DELL"]
["L8N04",4,"OpzRAM64GB",400,"L8N04","TS3L8-RAM64",1,"64GB - 2RX4 DDR4 RDIMM 3200MHz","L8N04-OpzRAM64GB","AA799110","DELL"]
["L8N05",5,"OpzGigabit",26,"L8N05","TS3L8-LAN1-L",1,"Scheda LAN 5719 QP 1Gb LOW","L8N05-OpzGigabitLP","540-BBHB","DELL"]
["L8N06",6,"OpzGigabit10Gbps",153,"L8N06","TS3L8-LAN10-L",1,"Scheda DP X710 10Gb SFP+ LOW","L8N06-OpzGigabit10GbpsLP","540-BBML","DELL"]
[null,null,null,null,null,null,2,null,null,"407-BCBN","DELL"]
["L8N07",7,"OpzGigabit25Gbps",389,"L8N07","TS3L8-LAN25-L",1,"Scheda DP CONNECTX-5 25Gb SFP28 LOW","L8N07-OpzGigabit25GbpsLP","540-BCNJ","DELL"]
[null,null,null,null,null,null,2,null,null,"407-BCHI","DELL"]
["L8N08",8,"OpzGigabit10Gbps CNA",159,"L8N08","TS3L8-CNA10-L",1,"Scheda CNA QL41232 DP 10Gb SFP+ LOW","L8N08-OpzCNA10GbpsLP","540-BCNS","DELL"]
[null,null,null,null,null,null,2,null,null,"407-BCBN","DELL"]
["L8N09",9,"OpzHDD1TB",105,"L8N09","TS3L8-HDD1TB",1,"HDD 1200GB 10K SAS 12Gbps 2.5in Hot-plug","L8N09-OpzHDD1TB","400-ATJL","DELL"]
["L8N10",10,"OpzHDD300GB",89,"L8N10","TS3L8-HDD300GB",1,"HDD 300GB 15K SAS 12Gbps 2.5in Hot-plug","L8N10-OpzHDD300GB","400-ATII","DELL"]
["L8N11",11,"OpzSSD-RI1,6TB",615,"L8N11","TS3L8-RI1600GB",1,"SSD 1,92TB SAS RI 12Gbps 2.5in Hot-plug, 1 DWPD","L8N11-OpzSSD-RI1,6TB","400-BFZC","DELL"]
{"$rows_left_out":50}
{"sheet":"Riepilogo","index":6,"n_rows":116,"n_cols":28,"rows_kept":116,"cut":false,"hidden":false,"merged":[[10,1,10,2],[10,3,10,6],[1,1,1,2],[1,3,1,6],[3,1,3,2],[5,1,5,2],[7,1,7,2],[114,1,114,5],[12,4,12,6],[15,1,15,2],[15,3,15,6],[17,4,17,6],[20,1,20,6],[57,1,57,6],[110,1,110,5],[111,1,111,2],[111,4,111,5],[112,1,112,5],[113,1,113,5]]}
[null,null,null,null,null,null,null,null,null,1]
[null,"Ente:",null,null,null,null,null,null,null,1,null,"ente",{"$f":"IF(D2>0,0,1)","v":1}]
[null,null,null,null,null,null,null,null,null,1]
[null,"Ordine N.",null,null,{"$f":"M7","v":"ERRORE DI MANCATA COPMILAZIONE DATI NECESSARI PER L'ORDINATIVO"},null,null,null,null,1,null,"N°ordine",{"$f":"IF(D4>0,0,1)","v":1}]
[null,null,null,null,{"$f":"M8","v":""},null,null,null,null,1]
[null,"Data",null,null,{"$f":"M9","v":""},null,null,null,null,1,null,"data",{"$f":"IF(D6>0,0,1)","v":1}]
[null,null,null,null,{"$f":"M10","v":""},null,null,null,null,1,null,"ERRORE1",{"$f":"IF(M2+M4+M6+M11+M13+M16+M18+O18+O13,\"ERRORE DI MANCATA COPMILAZIONE DATI NECESSARI PER L'ORDINATIVO\",\"\")","v":"ERRORE DI MANCATA COPMILAZIONE DATI NECESSARI PER L'ORDINATIVO"},{"$f":"IF(M7=\"\",0,1)","v":1}]
[null,"Totale IVA incl.",null,{"$f":"G115","v":0},{"$f":"IF(Q11=0,\"CONFIGURATORE OK\", \"\")","v":""},null,"Version 4.0",null,null,1,null,"Warning2",{"$f":"IF(G112>D112,\"!!! ATTENZIONE !!! L'IMPORTO 20% SUPERA IL VALORE MASSIMO CONSENTITO\",\"\")","v":""},{"$f":"IF(M8=\"\",0,1)","v":0}]
[null,null,null,null,null,null,null,null,null,1,null,"ERRORE3",{"$f":"\"\"","v":""},0]
[null,null,null,null,null,null,null,null,null,1,null,"Waning4",{"$f":"IF(N10>0,\"!!! ATTENZIONE !!! COMPLETARE IL CAMPO NOTE NELLE CONFIGURAZIONI\",\"\")","v":""},{"$f":"IF(M22>0,O10,0)+IF(N22>0,P10,0)+IF(O22>0,Q10,0)","v":0},{"$f":"IF(Lotto8_C6525_1!$H$44=\"Specificare la configurazione RAID per l'installazione del Sistema Operativo, se richiesto.\ne/o\ninserire eventuali note.\",1,0)","v":1},{"$f":"IF(Lotto8_C6525_2!$H$44=\"Specificare la configurazione RAID per l'installazione del Sistema Operativo, se richiesto.\ne/o\ninserire eventuali note.\",1,0)","v":1},{"$f":"IF(Lotto8_C6525_3!$H$44=\"Specificare la configurazione RAID per l'installazione del Sistema Operativo, se richiesto.\ne/o\ninserire eventuali note.\",1,0)","v":1}]
[null,"Referente Consegna",null,null,null,null,null,null,null,1,null,"ref1",{"$f":"IF(D11>0,0,1)","v":1},null,"Verifica Errori",null,{"$f":"N7+N9","v":1}]
[null,null,null,null,null,null,null,null,null,1]
[null,"Telefono",null,"email",null,null,null,null,null,1,null,"tel1",{"$f":"IF(C13>0,0,1)","v":1},"mail1",{"$f":"IF(E13>0,0,1)","v":1}]
[null,null,null,null,null,null,null,null,null,1]
[null,null,null,null,null,null,null,null,null,1]
{"$rows_left_out":102}
{"sheet":"Configurazione","index":7,"n_rows":92,"n_cols":24,"rows_kept":92,"cut":false,"hidden":false,"merged":[[87,1,87,3],[87,6,87,8],[69,1,69,2],[69,4,69,5],[69,7,69,8],[70,1,81,2],[70,4,81,5],[70,7,81,8],[84,1,85,2],[84,4,85,5],[84,7,85,8]]}
[null,null,null,null,null,null,null,null,null,null,null,null,null,null,null,null,null,null,null,null,null,1]
[null,{"$f":"Riepilogo!M22","v":0},"PowerEdge C6400 + 4 x C6525 Conf 1",null,{"$f":"Riepilogo!N22","v":0},"PowerEdge C6400 + 4 x C6525 Conf 2",null,{"$f":"Riepilogo!O22","v":0},"PowerEdge C6400 + 4 x C6525 Conf 3",null,null,null,null,null,null,null,null,null,null,null,null,1]
[null,null,null,null,null,null,null,null,null,null,null,null,null,null,null,null,null,null,null,null,null,{"$f":"IF($U$4>0,1,0)","v":0}]
[null,{"$f":"IF(Riepilogo!M23>0,Riepilogo!M23/$B$2,\"\")","v":""},{"$f":"IF(B4=\"\",\"\",Riepilogo!K23)","v":""},null,{"$f":"IF(Riepilogo!N23>0,Riepilogo!N23/$E$2,\"\")","v":""},{"$f":"IF(E4=\"\",\"\",Riepilogo!K23)","v":""},null,{"$f":"IF(Riepilogo!O23>0,Riepilogo!O23/$H$2,\"\")","v":""},{"$f":"IF(H4=\"\",\"\",Riepilogo!K23)","v":""},null,null,{"$f":"IF(B4=\"\",0,B4)","v":0},null,null,{"$f":"IF(E4=\"\",0,E4)","v":0},null,null,{"$f":"IF(H4=\"\",0,H4)","v":0},null,null,{"$f":"SUM(L4:T4)","v":0},{"$f":"IF(U4>0,1,0)","v":0},{"$f":"ISODD(V4)","v":false}]
[null,{"$f":"IF(Riepilogo!M24>0,Riepilogo!M24/$B$2,\"\")","v":""},{"$f":"IF(B5=\"\",\"\",Riepilogo!K24)","v":""},null,{"$f":"IF(Riepilogo!N24>0,Riepilogo!N24/$E$2,\"\")","v":""},{"$f":"IF(E5=\"\",\"\",Riepilogo!K24)","v":""},null,{"$f":"IF(Riepilogo!O24>0,Riepilogo!O24/$H$2,\"\")","v":""},{"$f":"IF(H5=\"\",\"\",Riepilogo!K24)","v":""},null,null,{"$f":"IF(B5=\"\",0,B5)","v":0},null,null,{"$f":"IF(E5=\"\",0,E5)","v":0},null,null,{"$f":"IF(H5=\"\",0,H5)","v":0},null,null,{"$f":"SUM(L5:T5)","v":0},{"$f":"IF(U5>0,1,0)","v":0},{"$f":"ISODD(SUM($V$4:V5))","v":false}]
[null,{"$f":"IF(Riepilogo!M25>0,Riepilogo!M25/$B$2,\"\")","v":""},{"$f":"IF(B6=\"\",\"\",Riepilogo!K25)","v":""},null,{"$f":"IF(Riepilogo!N25>0,Riepilogo!N25/$E$2,\"\")","v":""},{"$f":"IF(E6=\"\",\"\",Riepilogo!K25)","v":""},null,{"$f":"IF(Riepilogo!O25>0,Riepilogo!O25/$H$2,\"\")","v":""},{"$f":"IF(H6=\"\",\"\",Riepilogo!K25)","v":""},null,null,0,null,null,0,null,null,0,null,null,0,0,{"$f":"ISODD(SUM($V$4:V6))","v":false}]
[null,{"$f":"IF(Riepilogo!M26>0,Riepilogo!M26/$B$2,\"\")","v":""},{"$f":"IF(B7=\"\",\"\",Riepilogo!K26)","v":""},null,{"$f":"IF(Riepilogo!N26>0,Riepilogo!N26/$E$2,\"\")","v":""},{"$f":"IF(E7=\"\",\"\",Riepilogo!K26)","v":""},null,{"$f":"IF(Riepilogo!O26>0,Riepilogo!O26/$H$2,\"\")","v":""},{"$f":"IF(H7=\"\",\"\",Riepilogo!K26)","v":""},null,null,0,null,null,0,null,null,0,null,null,0,0,{"$f":"ISODD(SUM($V$4:V7))","v":false}]
[null,{"$f":"IF(Riepilogo!M27>0,Riepilogo!M27/$B$2,\"\")","v":""},{"$f":"IF(B8=\"\",\"\",Riepilogo!K27)","v":""},null,{"$f":"IF(Riepilogo!N27>0,Riepilogo!N27/$E$2,\"\")","v":""},{"$f":"IF(E8=\"\",\"\",Riepilogo!K27)","v":""},null,{"$f":"IF(Riepilogo!O27>0,Riepilogo!O27/$H$2,\"\")","v":""},{"$f":"IF(H8=\"\",\"\",Riepilogo!K27)","v":""},null,null,0,null,null,0,null,null,0,null,null,0,0,{"$f":"ISODD(SUM($V$4:V8))","v":false}]
[null,{"$f":"IF(Riepilogo!M28>0,Riepilogo!M28/$B$2,\"\")","v":""},{"$f":"IF(B9=\"\",\"\",Riepilogo!K28)","v":""},null,{"$f":"IF(Riepilogo!N28>0,Riepilogo!N28/$E$2,\"\")","v":""},{"$f":"IF(E9=\"\",\"\",Riepilogo!K28)","v":""},null,{"$f":"IF(Riepilogo!O28>0,Riepilogo!O28/$H$2,\"\")","v":""},{"$f":"IF(H9=\"\",\"\",Riepilogo!K28)","v":""},null,null,0,null,null,0,null,null,0,null,null,0,0,{"$f":"ISODD(SUM($V$4:V9))","v":false}]
[null,{"$f":"IF(Riepilogo!M29>0,Riepilogo!M29/$B$2,\"\")","v":""},{"$f":"IF(B10=\"\",\"\",Riepilogo!K29)","v":""},null,{"$f":"IF(Riepilogo!N29>0,Riepilogo!N29/$E$2,\"\")","v":""},{"$f":"IF(E10=\"\",\"\",Riepilogo!K29)","v":""},null,{"$f":"IF(Riepilogo!O29>0,Riepilogo!O29/$H$2,\"\")","v":""},{"$f":"IF(H10=\"\",\"\",Riepilogo!K29)","v":""},null,null,0,null,null,0,null,null,0,null,null,0,0,{"$f":"ISODD(SUM($V$4:V10))","v":false}]
[null,{"$f":"IF(Riepilogo!M30>0,Riepilogo!M30/$B$2,\"\")","v":""},{"$f":"IF(B11=\"\",\"\",Riepilogo!K30)","v":""},null,{"$f":"IF(Riepilogo!N30>0,Riepilogo!N30/$E$2,\"\")","v":""},{"$f":"IF(E11=\"\",\"\",Riepilogo!K30)","v":""},null,{"$f":"IF(Riepilogo!O30>0,Riepilogo!O30/$H$2,\"\")","v":""},{"$f":"IF(H11=\"\",\"\",Riepilogo!K30)","v":""},null,null,0,null,null,0,null,null,0,null,null,0,0,{"$f":"ISODD(SUM($V$4:V11))","v":false}]
[null,{"$f":"IF(Riepilogo!M31>0,Riepilogo!M31/$B$2,\"\")","v":""},{"$f":"IF(B12=\"\",\"\",Riepilogo!K31)","v":""},null,{"$f":"IF(Riepilogo!N31>0,Riepilogo!N31/$E$2,\"\")","v":""},{"$f":"IF(E12=\"\",\"\",Riepilogo!K31)","v":""},null,{"$f":"IF(Riepilogo!O31>0,Riepilogo!O31/$H$2,\"\")","v":""},{"$f":"IF(H12=\"\",\"\",Riepilogo!K31)","v":""},null,null,0,null,null,0,null,null,0,null,null,0,0,{"$f":"ISODD(SUM($V$4:V12))","v":false}]
[null,{"$f":"IF(Riepilogo!M32>0,Riepilogo!M32/$B$2,\"\")","v":""},{"$f":"IF(B13=\"\",\"\",Riepilogo!K32)","v":""},null,{"$f":"IF(Riepilogo!N32>0,Riepilogo!N32/$E$2,\"\")","v":""},{"$f":"IF(E13=\"\",\"\",Riepilogo!K32)","v":""},null,{"$f":"IF(Riepilogo!O32>0,Riepilogo!O32/$H$2,\"\")","v":""},{"$f":"IF(H13=\"\",\"\",Riepilogo!K32)","v":""},null,null,0,null,null,0,null,null,0,null,null,0,0,{"$f":"ISODD(SUM($V$4:V13))","v":false}]
[null,{"$f":"IF(Riepilogo!M33>0,Riepilogo!M33/$B$2,\"\")","v":""},{"$f":"IF(B14=\"\",\"\",Riepilogo!K33)","v":""},null,{"$f":"IF(Riepilogo!N33>0,Riepilogo!N33/$E$2,\"\")","v":""},{"$f":"IF(E14=\"\",\"\",Riepilogo!K33)","v":""},null,{"$f":"IF(Riepilogo!O33>0,Riepilogo!O33/$H$2,\"\")","v":""},{"$f":"IF(H14=\"\",\"\",Riepilogo!K33)","v":""},null,null,0,null,null,0,null,null,0,null,null,0,0,{"$f":"ISODD(SUM($V$4:V14))","v":false}]
[null,{"$f":"IF(Riepilogo!M34>0,Riepilogo!M34/$B$2,\"\")","v":""},{"$f":"IF(B15=\"\",\"\",Riepilogo!K34)","v":""},null,{"$f":"IF(Riepilogo!N34>0,Riepilogo!N34/$E$2,\"\")","v":""},{"$f":"IF(E15=\"\",\"\",Riepilogo!K34)","v":""},null,{"$f":"IF(Riepilogo!O34>0,Riepilogo!O34/$H$2,\"\")","v":""},{"$f":"IF(H15=\"\",\"\",Riepilogo!K34)","v":""},null,null,0,null,null,0,null,null,0,null,null,0,0,{"$f":"ISODD(SUM($V$4:V15))","v":false}]
{"$rows_left_out":77}