{"text_format":"1","workbook":"xlsx","n_sheets":8,"sheets":["Lotto8_C6525_1","Lotto8_C6525_2","Lotto8_C6525_3","Altre_Opzioni","ConfigurationTS3L8","Tabella_prezzi","Riepilogo","Configurazione"],"not_rendered":{"charts":0,"images":19,"macros":1,"external_links":0,"defined_names":13,"comments":0,"pivot_tables":0},"unopened":[],"bounds":{"document_bytes":16777216,"sheet_cells":100000,"rows_first":2000,"rows_last":500,"rows_between":2000,"halvings":0,"cell_chars":16384,"cell_head_chars":4096},"cells_cut":0,"cells_raw":0,"read":"whole","date_system":"1900"}

{"sheet":"Lotto8_C6525_1","index":0,"n_rows":108,"n_cols":17,"rows_kept":108,"cut":false,"hidden":false,"merged":[[66,3,67,3],[103,3,104,3],[106,3,107,3],[10,7,11,7],[12,7,13,7],[14,7,15,7],[16,7,17,7],[18,7,19,7],[20,7,21,7],[63,7,64,7],[22,7,25,7],[97,7,98,7],[33,2,34,2],[43,7,56,7],[37,4,37,5],[33,4,33,5],[42,4,42,5],[4,0,4,2],[30,3,31,3],[8,7,9,7],[7,3,9,3],[11,3,12,3],[17,3,18,3]]}
[null,null,null,null,"Convenzione",{"$f":"SUM(J:J)*F5","v":0}]
[null,null,null,null,0.2,{"$f":"SUM(K:K)*F5","v":0}]
[null,null,null,null,"Totale",{"$f":"SUM(F1:F2)","v":0}]
[]
["PowerEdge C6400 + 4 x C6525 Consulta la Guida alla Convenzione -->",null,null,{"$f":"HYPERLINK(\"https://convenzioni.converge.it/docs/L8GuidaAllaConvenzioneTecnologieServer3.pdf\",\"&\")","v":"&"},"Quantità Server",null,null,{"$f":"Riepilogo!G8","v":"Version 4.0"}]
[]
[]
[null,null,"Base",{"$f":"HYPERLINK(\"https://convenzioni.converge.it/docs/ts3_datasheet/dell-emc-poweredge-c6525-spec-sheet.pdf\",\"i\")","v":"i"}]
[null,null,"POWEREDGE C6400-R Enclosure ",null,{"$f":"IF($F$5>0,\"TS3L8-SRV-U\",\"\")","v":""},{"$f":"IF($F$5>0,1,\"\")","v":""},null,null,null,{"$f":"VLOOKUP($C9,TS3L8_ALL,10,FALSE)","v":8877},null,{"$f":"VLOOKUP($C9,TS3L8_ALL,12,FALSE)","v":"L8N01"}]
[null,null,"PowerEdge C6525",null,null,{"$f":"IF($F$5>0,4,\"\")","v":""}]
[]
[null,null,"Chassis Configuration",{"$f":"HYPERLINK(\"https://dellservervr.dell.com/poweredge-c6525/\",\"i\")","v":"i"}]
[null,null,"Chassis with up to 24x2.5\" Drives","i"]
[]
[null,null,"Trusted Platform Module (TPM)"]
[null,null,"Trusted Platform Module 2.0"]
[]
[null,null,"Processor",{"$f":"IF(J19=\"\",HYPERLINK(\"https://www.amd.com/en/products/cpu/amd-epyc-7282\",\"i\"))","v":"i"}]
[null,null,"AMD EPYC 7282 2.80GHz, 16C/32T, 64M Cache (120W) DDR4-3200"]
[]
[null,null,"Additional Processor"]
[null,null,"No Additional Processor",null,{"$f":"VLOOKUP($C$22,TS3L8_CPU,13,FALSE)","v":""},{"$f":"VLOOKUP($C$22,TS3L8_CPU,7,FALSE)","v":0},null,null,null,{"$f":"VLOOKUP($C$22,TS3L8_CPU,10,FALSE)","v":0},null,{"$f":"VLOOKUP($C22,TS3L8_ALL,12,FALSE)","v":""}]
[null,null,null,null,null,null,null,{"$f":"IF(N25=\"*\",HYPERLINK(\"https://www.dell.com/support/manuals/it-it/poweredge-c6525/pec6525_ism_pub/general-memory-module-installation-guidelines?guid=guid-80b1c1ad-14b7-4dd6-b122-abb0c82bd3e8&lang=en-us\",\"!!!!!                 ATTENZIONE                 !!!!!\nLa configurazione della memoria è supportata, ma non ottimizzata per ottenere le migliori prestazioni.\nPer maggiori informazioni cliccare quì.\"),\"\")","v":"!!!!!                 ATTENZIONE                 !!!!!\nLa configurazione della memoria è supportata, ma non ottimizzata per ottenere le migliori prestazioni.\nPer maggiori informazioni cliccare quì."}]
[null,null,"Memory Capacity"]
[null,null,"64GB Totali (1 x 64GB DIMM per Nodo) ⚠",{"$f":"IF($N$25=\"*\",$M$25,\"\")","v":"⚠"},{"$f":"IF($F$22=1,VLOOKUP($C$25,TS3L8_RAM2CPU,13,FALSE),VLOOKUP($C$25,TS3L8_RAM1CPU,13,FALSE))","v":"TS3L8-RAM64"},{"$f":"IF($F$22=1,VLOOKUP($C$25,TS3L8_RAM2CPU,7,FALSE),VLOOKUP($C$25,TS3L8_RAM1CPU,7,FALSE))","v":0},{"$f":"IF($N$25=\"*\",$M$25,\"\")","v":"⚠"},null,null,{"$f":"IF($F$22=1,VLOOKUP($C$25,TS3L8_RAM2CPU,10,FALSE),VLOOKUP($C$25,TS3L8_RAM1CPU,10,FALSE))","v":0},null,{"$f":"IF($F$22=1,VLOOKUP($C$25,TS3L8_RAM2CPU,12,FALSE),VLOOKUP($C$25,TS3L8_RAM1CPU,12,FALSE))","v":"L8N04"},"⚠",{"$f":"VLOOKUP($C$25,TS3L8_RAM,5,FALSE)","v":"*"}]
[]
[null,null,"Operating System"]
[null,null,"No Operating System",null,{"$f":"VLOOKUP($C$28,TS3L8_OS,13,FALSE)","v":""},{"$f":"VLOOKUP($C$28,TS3L8_OS,7,FALSE)","v":0},null,null,null,{"$f":"VLOOKUP($C$28,TS3L8_OS,10,FALSE)","v":0},{"$f":"VLOOKUP($C$28,TS3L8_OS,11,FALSE)","v":0},{"$f":"VLOOKUP($C28,TS3L8_ALL,12,FALSE)","v":""}]
[null,null,null,null,{"$f":"IF(F22=1,VLOOKUP(C28,TS3L8_OS,21,FALSE),\"\")","v":""},{"$f":"IF(F22=1,VLOOKUP(C28,TS3L8_OS,14,FALSE),0)","v":0},null,null,null,{"$f":"IF($F$28+$F$19=2,0,IF($F$19+$F$22+$F$28=2,VLOOKUP($C$28,TS3L8_OS,17,FALSE),VLOOKUP($C$28,TS3L8_OS,17,FALSE)))","v":""},{"$f":"IF($F$28+$F$19=2,0,IF($F$19+$F$22+$F$28=2,VLOOKUP($C$28,TS3L8_OS,18,FALSE),VLOOKUP($C$28,TS3L8_OS,18,FALSE)))","v":0},{"$f":"IF($F$28+$F$19=2,0,IF($F$19+$F$22+$F$28=2,VLOOKUP($C$28,TS3L8_OS,20,FALSE),VLOOKUP($C$28,TS3L8_OS,20,FALSE)))","v":0}]
[]
[null,null,"Raid Controller",{"$f":"IF(F32=\"\",HYPERLINK(\"https://convenzioni.converge.it/docs/ts3_datasheet/dellemc-poweredge-raid-controller-h745.pdf\",\"i\"),HYPERLINK(\"https://convenzioni.converge.it/docs/ts3_datasheet/dellemc-poweredge-hba345.pdf\",\"i\"))","v":"i"}]
[null,null,"PERC H745 Controller Card",null,{"$f":"VLOOKUP($C32,TS3L8_ALL,13,FALSE)","v":""},{"$f":"VLOOKUP($C32,TS3L8_ALL,7,FALSE)","v":""},null,null,null,{"$f":"VLOOKUP($C32,TS3L8_ALL,10,FALSE)","v":0},{"$f":"VLOOKUP($C32,TS3L8_ALL,11,FALSE)*4","v":0},{"$f":"VLOOKUP($C32,TS3L8_ALL,12,FALSE)","v":""}]
[]
[null,null,"Hard Drivers Bays disponibili n° 24 (n° 6 per Nodo)",null,"Totali Enclosure C6400"]
[null,null,null,null,"Usati","Disponibili"]
[null,null,null,null,{"$f":"SUM(F45:F59)*4","v":8},{"$f":"24-E36","v":16}]
[]
[null,null,null,null,"Per singolo Nodo C6525"]
[null,null,null,null,"Usati","Disponibili"]
[null,null,null,null,{"$f":"SUM(F45:F59)","v":2},{"$f":"6-E40","v":4}]
[]
[]
[null,null,null,null,"INDICARE LA QUANTITA' PER SINGOLO NODO",null,null,"Configurazione RAID e/o NOTE"]
[null,null,null,null,null,null,null,"Specificare la configurazione RAID per l'installazione del Sistema Operativo, se richiesto.\ne/o\ninserire eventuali note."]
[null,null,{"$f":"ConfigurationTS3L8!A35","v":"300GB 15K RPM SAS 12Gbps 2.5in Hot-plug"},null,{"$f":"VLOOKUP($C45,TS3L8_HDD,13,FALSE)","v":"TS3L8-HDD300GB"},null,null,null,null,{"$f":"VLOOKUP($C45,TS3L8_HDD,10,FALSE)*F45*4","v":0},{"$f":"VLOOKUP($C45,TS3L8_HDD,11,FALSE)","v":0},{"$f":"VLOOKUP($C45,TS3L8_ALL,12,FALSE)","v":"L8N10"}]
[]
[null,null,{"$f":"ConfigurationTS3L8!A37","v":"1.2TB 10K RPM SAS 12Gbps 2.5in Hot-plug"},null,{"$f":"VLOOKUP($C47,TS3L8_HDD,13,FALSE)","v":"TS3L8-HDD1TB"},null,null,null,null,{"$f":"VLOOKUP($C47,TS3L8_HDD,10,FALSE)*F47*4","v":0},{"$f":"VLOOKUP($C47,TS3L8_HDD,11,FALSE)","v":0},{"$f":"VLOOKUP($C47,TS3L8_ALL,12,FALSE)","v":"L8N09"}]
[]
[null,null,{"$f":"ConfigurationTS3L8!A39","v":"480GB SSD SAS Read Intensive 12Gbps 2.5in Hot-plug"},null,{"$f":"VLOOKUP($C49,TS3L8_HDD,13,FALSE)","v":"TS3L8-RI400GB-U"},0,null,null,null,{"$f":"IF(F49>2,(VLOOKUP($C49,TS3L8_HDD,10,FALSE)*(F49*4-2*4)),0)","v":0},{"$f":"VLOOKUP($C49,TS3L8_HDD,11,FALSE)","v":0},{"$f":"VLOOKUP($C49,TS3L8_ALL,12,FALSE)","v":"L8N15"}]
[]
[null,null,{"$f":"ConfigurationTS3L8!A41","v":"960GB SSD SAS Read Intensive 12Gbps 2.5in Hot-plug"},null,{"$f":"VLOOKUP($C51,TS3L8_HDD,13,FALSE)","v":"TS3L8-RI800GB"},2,null,null,null,{"$f":"IF(F51>2,(VLOOKUP($C51,TS3L8_HDD,10,FALSE)*(F51*4-2*4)),0)","v":0},{"$f":"VLOOKUP($C51,TS3L8_HDD,11,FALSE)","v":0},{"$f":"VLOOKUP($C51,TS3L8_ALL,12,FALSE)","v":"L8N13"}]
[]
[null,null,{"$f":"ConfigurationTS3L8!A43","v":"1.92TB SSD SAS Read Intensive 12Gbps 2.5in Hot-plug"},null,{"$f":"VLOOKUP($C53,TS3L8_HDD,13,FALSE)","v":"TS3L8-RI1600GB"},null,null,null,null,{"$f":"VLOOKUP($C53,TS3L8_HDD,10,FALSE)*F53*4","v":0},{"$f":"VLOOKUP($C53,TS3L8_HDD,11,FALSE)","v":0},{"$f":"VLOOKUP($C53,TS3L8_ALL,12,FALSE)","v":"L8N11"}]
[]
[null,null,{"$f":"ConfigurationTS3L8!A45","v":"960GB SSD SAS Mixed Use 12Gbps 512e 2.5in Hot-Plug"},null,{"$f":"VLOOKUP($C55,TS3L8_HDD,13,FALSE)","v":"TS3L8-MU800GB"},null,null,null,null,{"$f":"VLOOKUP($C55,TS3L8_HDD,10,FALSE)*F55*4","v":0},{"$f":"VLOOKUP($C55,TS3L8_HDD,11,FALSE)","v":0},{"$f":"VLOOKUP($C55,TS3L8_ALL,12,FALSE)","v":"L8N14"}]
[]
[null,null,{"$f":"ConfigurationTS3L8!A47","v":"1.6TB SSD SAS Mixed Use 12Gbps 2.5in Hot-plug"},null,{"$f":"VLOOKUP($C57,TS3L8_HDD,13,FALSE)","v":"TS3L8-MU1600GB"},null,null,null,null,{"$f":"VLOOKUP($C57,TS3L8_HDD,10,FALSE)*F57*4","v":0},{"$f":"VLOOKUP($C57,TS3L8_HDD,11,FALSE)","v":0},{"$f":"VLOOKUP($C57,TS3L8_ALL,12,FALSE)","v":"L8N12"}]
[]
[null,null,{"$f":"ConfigurationTS3L8!A49","v":"800GB SSD SAS Write Intensive 12Gbps 2.5in Hot-plug"},null,{"$f":"VLOOKUP($C59,TS3L8_HDD,13,FALSE)","v":"TS3L8-WI800GB"},null,null,null,null,{"$f":"VLOOKUP($C59,TS3L8_HDD,10,FALSE)*F59*4","v":0},{"$f":"VLOOKUP($C59,TS3L8_HDD,11,FALSE)*F59*4","v":0},{"$f":"VLOOKUP($C59,TS3L8_ALL,12,FALSE)","v":"L8N32"}]
[]
[null,null,"Power Supply"]
[null,null,"Dual,Hot-plug Power Supply, 2400W,250 Volt"]
[]
[null,null,"Power Cords",null,null,null,null,"Verificare, per ogni Enclosure, la disponibilità di 2 prese C19 sulle PDU"]
[null,null,"C19 to C20, 250V, 0.6m Power Cord",null,null,2]
[]
[null,null,"Boot Optimized Storage Cards",{"$f":"IF(J69=\"\",HYPERLINK(\"https://convenzioni.converge.it/docs/ts3_datasheet/DELL_BOSS.pdf\",\"i\"))","v":"i"}]
[null,null,"",null,{"$f":"VLOOKUP($C68,TS3L8_ALL,13,FALSE)","v":""},{"$f":"VLOOKUP($C68,TS3L8_ALL,7,FALSE)","v":""},null,null,null,{"$f":"VLOOKUP($C68,TS3L8_ALL,10,FALSE)","v":0},{"$f":"VLOOKUP($C68,TS3L8_ALL,11,FALSE)*4","v":0},{"$f":"VLOOKUP($C68,TS3L8_ALL,12,FALSE)","v":""}]
[]
[null,null,"Embedded Systems Management"]
[null,null,"BMC"]
[]
[]
[]
[]
[]
[]
[]
[]
[]
[]
[]
[]
[null,null,"Network Mezzanine Cards"]
[null,null,"Broadcom 5720 Quad Port 1GbE BASE-T Mezzanine Adapter",null,{"$f":"VLOOKUP($C85,TS3L8_ALL,13,FALSE)","v":""},{"$f":"VLOOKUP($C85,TS3L8_ALL,7,FALSE)","v":""},null,null,null,{"$f":"VLOOKUP($C85,TS3L8_ALL,10,FALSE)","v":0},{"$f":"VLOOKUP($C85,TS3L8_ALL,11,FALSE)*4","v":0},{"$f":"VLOOKUP($C85,TS3L8_ALL,12,FALSE)","v":""}]
[]
[null,null,"PCI Slot 1 Processor 1"]
[null,null,"Controller Card"]
[]
[null,null,"PCI Slot 2 Processor 2"]
[null,null,"",null,{"$f":"VLOOKUP($C91,TS3L8_ALL,13,FALSE)","v":""},{"$f":"VLOOKUP($C91,TS3L8_ALL,7,FALSE)","v":""},null,null,null,{"$f":"VLOOKUP($C91,TS3L8_ALL,10,FALSE)*4","v":0},{"$f":"VLOOKUP($C91,TS3L8_ALL,11,FALSE)*4","v":0},{"$f":"VLOOKUP($C91,TS3L8_ALL,12,FALSE)","v":""}]
[]
[null,null,"Transceivers per ENCLOSURE"]
[null,null,"SFP+ SR Optic for SFP+ ports (CONNECTX-5 10Gb OCP)",null,{"$f":"IF(K94>0,VLOOKUP($C94,TS3L8_ALL,13,FALSE),\"\")","v":""},null,null,null,null,0,{"$f":"IF(F94>0,VLOOKUP($C94,TS3L8_ALL,11,FALSE)*(F94),0)","v":0},{"$f":"IF(F94>0,VLOOKUP($C94,TS3L8_ALL,12,FALSE),0)","v":0}]
[null,null,"25GbE Dual Rate SFP28 SR Optic for SFP28 ports (CONNECTX-5 25Gb OCP)",null,{"$f":"IF(K95>0,VLOOKUP($C95,TS3L8_ALL,13,FALSE),\"\")","v":""},null,null,null,null,0,{"$f":"IF(F95>0,VLOOKUP($C95,TS3L8_ALL,11,FALSE)*(F95),0)","v":0},{"$f":"IF(F95>0,VLOOKUP($C95,TS3L8_ALL,12,FALSE),0)","v":0}]
[null,null,"Mellanox LinkX 100Gb/s Passive Copper DAC 3m",null,{"$f":"IF(K96>0,VLOOKUP($C96,TS3L8_ALL,13,FALSE),\"\")","v":""},null,null,null,null,0,{"$f":"IF(F96>0,VLOOKUP($C96,TS3L8_ALL,11,FALSE)*(F96),0)","v":0},{"$f":"IF(F96>0,VLOOKUP($C96,TS3L8_ALL,12,FALSE),0)","v":0}]
[]
[null,null,"Cavi mini DP to VGA",null,null,null,null,{"$f":"IF(F99=4,\"Un cavo per singolo Nodo\",IF(F99=1,\"Un cavo per Enclosure\",\"Nessun cavo video\"))","v":"Un cavo per singolo Nodo"}]
[null,null,"Adapter - Mini DisplayPort to VGA",null,{"$f":"IF(K99>0,VLOOKUP($C99,TS3L8_ALL,13,FALSE),\"\")","v":"TS3L8-MDPVGA"},4,null,null,null,0,{"$f":"IF(F99>0,VLOOKUP($C99,TS3L8_ALL,11,FALSE)*(F99),0)","v":140},{"$f":"IF(F99>0,VLOOKUP($C99,TS3L8_ALL,12,FALSE),0)","v":"L8N56"}]
[]
[null,null,"Cavi RJ45 per ENCLOSURE"]
[null,null,"Cavo “patch” di 3 mt RJ45 certificato per gigabit ethernet",null,{"$f":"IF(K102>0,VLOOKUP($C102,TS3L8_ALL,13,FALSE),\"\")","v":"TS3L8-RJ453M"},20,null,null,null,0,{"$f":"IF(F102>0,VLOOKUP($C102,TS3L8_ALL,11,FALSE)*(F102),0)","v":60},{"$f":"IF(F102>0,VLOOKUP($C102,TS3L8_ALL,12,FALSE),0)","v":"L8N30"}]
[]
[null,null,"Warranty per ENCLOSURE",{"$f":"IF(J106=\"\",HYPERLINK(\"https://convenzioni.converge.it/docs/ts3_datasheet/TS3warranty.pdf\",\"i\"))","v":"i"}]
[null,null,"Manutenzione in garanzia (36 mesi)",null,{"$f":"VLOOKUP($C105,TS3L8_WARRANTY,13,FALSE)","v":""},{"$f":"VLOOKUP($C105,TS3L8_WARRANTY,7,FALSE)","v":""},null,null,null,{"$f":"VLOOKUP($C105,TS3L8_WARRANTY,10,FALSE)","v":0},{"$f":"VLOOKUP($C105,TS3L8_WARRANTY,11,FALSE)","v":0},{"$f":"VLOOKUP($C105,TS3L8_ALL,12,FALSE)","v":""}]
[]
[null,null,"Hard Disk Retention per ENCLOSURE",{"$f":"IF(J109=\"\",HYPERLINK(\"https://convenzioni.converge.it/docs/ts3_datasheet/DELL_HDD_KYHD.pdf\",\"i\"))","v":"i"}]
[null,null,"",null,{"$f":"IFERROR(N108,VLOOKUP(C108,TS3L8_ALL,13,FALSE))","v":""},{"$f":"IF(C108=\"\",\"\",1)","v":""},null,null,null,{"$f":"IFERROR(O108,VLOOKUP(C108,TS3L8_ALL,10,FALSE))","v":0},{"$f":"IFERROR(P108,VLOOKUP(C108,TS3L8_ALL,11,FALSE))","v":0},{"$f":"IFERROR(Q108,VLOOKUP(C108,TS3L8_ALL,12,FALSE))","v":""},null,{"$f":"IF(F105+F108=2,VLOOKUP(\"Hard Disk Retention (60 mesi)\",TS3L8_ALL,13,FALSE),VLOOKUP(C108,TS3L8_ALL,13,FALSE))","v":{"$error":"#VALUE!"}},{"$f":"IF(F105+F108=2,VLOOKUP(\"Hard Disk Retention (60 mesi)\",TS3L8_ALL,10,FALSE),VLOOKUP(C108,TS3L8_ALL,10,FALSE))","v":{"$error":"#VALUE!"}},{"$f":"IF(F105+F108=2,VLOOKUP(\"Hard Disk Retention (60 mesi)\",TS3L8_ALL,11,FALSE),VLOOKUP(C108,TS3L8_ALL,11,FALSE))","v":{"$error":"#VALUE!"}},{"$f":"IF(F105+F108=2,VLOOKUP(\"Hard Disk Retention (60 mesi)\",TS3L8_ALL,12,FALSE),VLOOKUP(C108,TS3L8_ALL,12,FALSE))","v":{"$error":"#VALUE!"}}]

{"sheet":"Lotto8_C6525_2","index":1,"n_rows":108,"n_cols":17,"rows_kept":108,"cut":false,"hidden":false,"merged":[[103,3,104,3],[33,2,34,2],[33,4,33,5],[37,4,37,5],[43,7,56,7],[63,7,64,7],[97,7,98,7],[106,3,107,3],[4,0,4,2],[8,7,9,7],[10,7,11,7],[12,7,13,7],[14,7,15,7],[16,7,17,7],[18,7,19,7],[20,7,21,7],[42,4,42,5],[30,3,31,3],[7,3,9,3],[11,3,12,3],[17,3,18,3],[66,3,67,3],[22,7,25,7]]}
[null,null,null,null,"Convenzione",{"$f":"SUM(J9:J120)*F5","v":0}]
[null,null,null,null,0.2,{"$f":"SUM(K9:K120)*F5","v":0}]
[null,null,null,null,"Totale",{"$f":"SUM(F1:F2)","v":0}]
[]
["PowerEdge C6400 + 4 x C6525 Consulta la Guida alla Convenzione -->",null,null,{"$f":"HYPERLINK(\"https://convenzioni.converge.it/docs/L8GuidaAllaConvenzioneTecnologieServer3.pdf\",\"&\")","v":"&"},"Quantità Server",null,null,{"$f":"Riepilogo!G8","v":"Version 4.0"}]
[]
[]
[null,null,"Base",{"$f":"HYPERLINK(\"https://convenzioni.converge.it/docs/ts3_datasheet/dell-emc-poweredge-c6525-spec-sheet.pdf\",\"i\")","v":"i"}]
[null,null,"POWEREDGE C6400-R Enclosure ",null,{"$f":"IF($F$5>0,\"TS3L8-SRV-U\",\"\")","v":""},{"$f":"IF($F$5>0,1,\"\")","v":""},null,null,null,{"$f":"VLOOKUP($C9,TS3L8_ALL,10,FALSE)","v":8877},null,{"$f":"VLOOKUP($C9,TS3L8_ALL,12,FALSE)","v":"L8N01"}]
[null,null,"PowerEdge C6525",null,null,{"$f":"IF($F$5>0,4,\"\")","v":""}]
[]
[null,null,"Chassis Configuration",{"$f":"HYPERLINK(\"https://dellservervr.dell.com/poweredge-c6525/\",\"i\")","v":"i"}]
[null,null,"Chassis with up to 24x2.5\" Drives","i"]
[]
[null,null,"Trusted Platform Module (TPM)"]
[null,null,"Trusted Platform Module 2.0"]
[]
[null,null,"Processor",{"$f":"IF(J19=\"\",HYPERLINK(\"https://www.amd.com/en/products/cpu/amd-epyc-7282\",\"i\"))","v":"i"}]
[null,null,"AMD EPYC 7282 2.80GHz, 16C/32T, 64M Cache (120W) DDR4-3200"]
[]
[null,null,"Additional Processor"]
[null,null,"No Additional Processor",null,{"$f":"VLOOKUP($C$22,TS3L8_CPU,13,FALSE)","v":""},{"$f":"VLOOKUP($C$22,TS3L8_CPU,7,FALSE)","v":0},null,null,null,{"$f":"VLOOKUP($C$22,TS3L8_CPU,10,FALSE)","v":0},null,{"$f":"VLOOKUP($C22,TS3L8_ALL,12,FALSE)","v":""}]
[null,null,null,null,null,null,null,{"$f":"IF(N25=\"*\",HYPERLINK(\"https://www.dell.com/support/manuals/it-it/poweredge-c6525/pec6525_ism_pub/general-memory-module-installation-guidelines?guid=guid-80b1c1ad-14b7-4dd6-b122-abb0c82bd3e8&lang=en-us\",\"!!!!!                 ATTENZIONE                 !!!!!\nLa configurazione della memoria è supportata, ma non ottimizzata per ottenere le migliori prestazioni.\nPer maggiori informazioni cliccare quì.\"),\"\")","v":"!!!!!                 ATTENZIONE                 !!!!!\nLa configurazione della memoria è supportata, ma non ottimizzata per ottenere le migliori prestazioni.\nPer maggiori informazioni cliccare quì."}]
[null,null,"Memory Capacity"]
[null,null,"64GB Totali (1 x 64GB DIMM per Nodo) ⚠",{"$f":"IF($N$25=\"*\",$M$25,\"\")","v":"⚠"},{"$f":"IF($F$22=1,VLOOKUP($C$25,TS3L8_RAM2CPU,13,FALSE),VLOOKUP($C$25,TS3L8_RAM1CPU,13,FALSE))","v":"TS3L8-RAM64"},{"$f":"IF($F$22=1,VLOOKUP($C$25,TS3L8_RAM2CPU,7,FALSE),VLOOKUP($C$25,TS3L8_RAM1CPU,7,FALSE))","v":0},{"$f":"IF($N$25=\"*\",$M$25,\"\")","v":"⚠"},null,null,{"$f":"IF($F$22=1,VLOOKUP($C$25,TS3L8_RAM2CPU,10,FALSE),VLOOKUP($C$25,TS3L8_RAM1CPU,10,FALSE))","v":0},null,{"$f":"IF($F$22=1,VLOOKUP($C$25,TS3L8_RAM2CPU,12,FALSE),VLOOKUP($C$25,TS3L8_RAM1CPU,12,FALSE))","v":"L8N04"},"⚠",{"$f":"VLOOKUP($C$25,TS3L8_RAM,5,FALSE)","v":"*"}]
[]
[null,null,"Operating System"]
[null,null,"No Operating System",null,{"$f":"VLOOKUP($C$28,TS3L8_OS,13,FALSE)","v":""},{"$f":"VLOOKUP($C$28,TS3L8_OS,7,FALSE)","v":0},null,null,null,{"$f":"VLOOKUP($C$28,TS3L8_OS,10,FALSE)","v":0},{"$f":"VLOOKUP($C$28,TS3L8_OS,11,FALSE)","v":0},{"$f":"VLOOKUP($C28,TS3L8_ALL,12,FALSE)","v":""}]
[null,null,null,null,{"$f":"IF(F22=1,VLOOKUP(C28,TS3L8_OS,21,FALSE),\"\")","v":""},{"$f":"IF(F22=1,VLOOKUP(C28,TS3L8_OS,14,FALSE),0)","v":0},null,null,null,{"$f":"IF($F$28+$F$19=2,0,IF($F$19+$F$22+$F$28=2,VLOOKUP($C$28,TS3L8_OS,17,FALSE),VLOOKUP($C$28,TS3L8_OS,17,FALSE)))","v":""},{"$f":"IF($F$28+$F$19=2,0,IF($F$19+$F$22+$F$28=2,VLOOKUP($C$28,TS3L8_OS,18,FALSE),VLOOKUP($C$28,TS3L8_OS,18,FALSE)))","v":0},{"$f":"IF($F$28+$F$19=2,0,IF($F$19+$F$22+$F$28=2,VLOOKUP($C$28,TS3L8_OS,20,FALSE),VLOOKUP($C$28,TS3L8_OS,20,FALSE)))","v":0}]
[]
[null,null,"Raid Controller",{"$f":"IF(F32=\"\",HYPERLINK(\"https://convenzioni.converge.it/docs/ts3_datasheet/dellemc-poweredge-raid-controller-h745.pdf\",\"i\"),HYPERLINK(\"https://convenzioni.converge.it/docs/ts3_datasheet/dellemc-poweredge-hba345.pdf\",\"i\"))","v":"i"}]
[null,null,"PERC H745 Controller Card",null,{"$f":"VLOOKUP($C32,TS3L8_ALL,13,FALSE)","v":""},{"$f":"VLOOKUP($C32,TS3L8_ALL,7,FALSE)","v":""},null,null,null,{"$f":"VLOOKUP($C32,TS3L8_ALL,10,FALSE)","v":0},{"$f":"VLOOKUP($C32,TS3L8_ALL,11,FALSE)*4","v":0},{"$f":"VLOOKUP($C32,TS3L8_ALL,12,FALSE)","v":""}]
[]
[null,null,"Hard Drivers Bays disponibili n° 24 (n° 6 per Nodo)",null,"Totali Enclosure C6400"]
[null,null,null,null,"Usati","Disponibili"]
[null,null,null,null,{"$f":"SUM(F45:F59)*4","v":8},{"$f":"24-E36","v":16}]
[]
[null,null,null,null,"Per singolo Nodo C6525"]
[null,null,null,null,"Usati","Disponibili"]
[null,null,null,null,{"$f":"SUM(F45:F59)","v":2},{"$f":"6-E40","v":4}]
[]
[]
[null,null,null,null,"INDICARE LA QUANTITA' PER SINGOLO NODO",null,null,"Configurazione RAID e/o NOTE"]
[null,null,null,null,null,null,null,"Specificare la configurazione RAID per l'installazione del Sistema Operativo, se richiesto.\ne/o\ninserire eventuali note."]
[null,null,{"$f":"ConfigurationTS3L8!A35","v":"300GB 15K RPM SAS 12Gbps 2.5in Hot-plug"},null,{"$f":"VLOOKUP($C45,TS3L8_HDD,13,FALSE)","v":"TS3L8-HDD300GB"},null,null,null,null,{"$f":"VLOOKUP($C45,TS3L8_HDD,10,FALSE)*F45*4","v":0},{"$f":"VLOOKUP($C45,TS3L8_HDD,11,FALSE)","v":0},{"$f":"VLOOKUP($C45,TS3L8_ALL,12,FALSE)","v":"L8N10"}]
[]
[null,null,{"$f":"ConfigurationTS3L8!A37","v":"1.2TB 10K RPM SAS 12Gbps 2.5in Hot-plug"},null,{"$f":"VLOOKUP($C47,TS3L8_HDD,13,FALSE)","v":"TS3L8-HDD1TB"},null,null,null,null,{"$f":"VLOOKUP($C47,TS3L8_HDD,10,FALSE)*F47*4","v":0},{"$f":"VLOOKUP($C47,TS3L8_HDD,11,FALSE)","v":0},{"$f":"VLOOKUP($C47,TS3L8_ALL,12,FALSE)","v":"L8N09"}]
[]
[null,null,{"$f":"ConfigurationTS3L8!A39","v":"480GB SSD SAS Read Intensive 12Gbps 2.5in Hot-plug"},null,{"$f":"VLOOKUP($C49,TS3L8_HDD,13,FALSE)","v":"TS3L8-RI400GB-U"},0,null,null,null,{"$f":"IF(F49>2,(VLOOKUP($C49,TS3L8_HDD,10,FALSE)*(F49*4-2*4)),0)","v":0},{"$f":"VLOOKUP($C49,TS3L8_HDD,11,FALSE)","v":0},{"$f":"VLOOKUP($C49,TS3L8_ALL,12,FALSE)","v":"L8N15"}]
[]
[null,null,{"$f":"ConfigurationTS3L8!A41","v":"960GB SSD SAS Read Intensive 12Gbps 2.5in Hot-plug"},null,{"$f":"VLOOKUP($C51,TS3L8_HDD,13,FALSE)","v":"TS3L8-RI800GB"},2,null,null,null,{"$f":"IF(F51>2,(VLOOKUP($C51,TS3L8_HDD,10,FALSE)*(F51*4-2*4)),0)","v":0},{"$f":"VLOOKUP($C51,TS3L8_HDD,11,FALSE)","v":0},{"$f":"VLOOKUP($C51,TS3L8_ALL,12,FALSE)","v":"L8N13"}]
[]
[null,null,{"$f":"ConfigurationTS3L8!A43","v":"1.92TB SSD SAS Read Intensive 12Gbps 2.5in Hot-plug"},null,{"$f":"VLOOKUP($C53,TS3L8_HDD,13,FALSE)","v":"TS3L8-RI1600GB"},null,null,null,null,{"$f":"VLOOKUP($C53,TS3L8_HDD,10,FALSE)*F53*4","v":0},{"$f":"VLOOKUP($C53,TS3L8_HDD,11,FALSE)","v":0},{"$f":"VLOOKUP($C53,TS3L8_ALL,12,FALSE)","v":"L8N11"}]
[]
[null,null,{"$f":"ConfigurationTS3L8!A45","v":"960GB SSD SAS Mixed Use 12Gbps 512e 2.5in Hot-Plug"},null,{"$f":"VLOOKUP($C55,TS3L8_HDD,13,FALSE)","v":"TS3L8-MU800GB"},null,null,null,null,{"$f":"VLOOKUP($C55,TS3L8_HDD,10,FALSE)*F55*4","v":0},{"$f":"VLOOKUP($C55,TS3L8_HDD,11,FALSE)","v":0},{"$f":"VLOOKUP($C55,TS3L8_ALL,12,FALSE)","v":"L8N14"}]
[]
[null,null,{"$f":"ConfigurationTS3L8!A47","v":"1.6TB SSD SAS Mixed Use 12Gbps 2.5in Hot-plug"},null,{"$f":"VLOOKUP($C57,TS3L8_HDD,13,FALSE)","v":"TS3L8-MU1600GB"},null,null,null,null,{"$f":"VLOOKUP($C57,TS3L8_HDD,10,FALSE)*F57*4","v":0},{"$f":"VLOOKUP($C57,TS3L8_HDD,11,FALSE)","v":0},{"$f":"VLOOKUP($C57,TS3L8_ALL,12,FALSE)","v":"L8N12"}]
[]
[null,null,{"$f":"ConfigurationTS3L8!A49","v":"800GB SSD SAS Write Intensive 12Gbps 2.5in Hot-plug"},null,{"$f":"VLOOKUP($C59,TS3L8_HDD,13,FALSE)","v":"TS3L8-WI800GB"},null,null,null,null,{"$f":"VLOOKUP($C59,TS3L8_HDD,10,FALSE)*F59*4","v":0},{"$f":"VLOOKUP($C59,TS3L8_HDD,11,FALSE)*F59*4","v":0},{"$f":"VLOOKUP($C59,TS3L8_ALL,12,FALSE)","v":"L8N32"}]
[]
[null,null,"Power Supply"]
[null,null,"Dual,Hot-plug Power Supply, 2400W,250 Volt"]
[]
[null,null,"Power Cords",null,null,null,null,"Verificare, per ogni Enclosure, la disponibilità di 2 prese C19 sulle PDU"]
[null,null,"C19 to C20, 250V, 0.6m Power Cord",null,null,2]
[]
[null,null,"Boot Optimized Storage Cards",{"$f":"IF(J69=\"\",HYPERLINK(\"https://convenzioni.converge.it/docs/ts3_datasheet/DELL_BOSS.pdf\",\"i\"))","v":"i"}]
[null,null,"",null,{"$f":"VLOOKUP($C68,TS3L8_ALL,13,FALSE)","v":""},{"$f":"VLOOKUP($C68,TS3L8_ALL,7,FALSE)","v":""},null,null,null,{"$f":"VLOOKUP($C68,TS3L8_ALL,10,FALSE)","v":0},{"$f":"VLOOKUP($C68,TS3L8_ALL,11,FALSE)*4","v":0},{"$f":"VLOOKUP($C68,TS3L8_ALL,12,FALSE)","v":""}]
[]
[null,null,"Embedded Systems Management"]
[null,null,"BMC"]
[]
[]
[]
[]
[]
[]
[]
[]
[]
[]
[]
[]
[null,null,"Network Mezzanine Cards"]
[null,null,"Broadcom 5720 Quad Port 1GbE BASE-T Mezzanine Adapter",null,{"$f":"VLOOKUP($C85,TS3L8_ALL,13,FALSE)","v":""},{"$f":"VLOOKUP($C85,TS3L8_ALL,7,FALSE)","v":""},null,null,null,{"$f":"VLOOKUP($C85,TS3L8_ALL,10,FALSE)","v":0},{"$f":"VLOOKUP($C85,TS3L8_ALL,11,FALSE)*4","v":0},{"$f":"VLOOKUP($C85,TS3L8_ALL,12,FALSE)","v":""}]
[]
[null,null,"PCI Slot 1 Processor 1"]
[null,null,"Controller Card"]
[]
[null,null,"PCI Slot 2 Processor 2"]
[null,null,"",null,{"$f":"VLOOKUP($C91,TS3L8_ALL,13,FALSE)","v":""},{"$f":"VLOOKUP($C91,TS3L8_ALL,7,FALSE)","v":""},null,null,null,{"$f":"VLOOKUP($C91,TS3L8_ALL,10,FALSE)*4","v":0},{"$f":"VLOOKUP($C91,TS3L8_ALL,11,FALSE)*4","v":0},{"$f":"VLOOKUP($C91,TS3L8_ALL,12,FALSE)","v":""}]
[]
[null,null,"Transceivers per ENCLOSURE"]
[null,null,"SFP+ SR Optic for SFP+ ports (CONNECTX-5 10Gb OCP)",null,{"$f":"IF(K94>0,VLOOKUP($C94,TS3L8_ALL,13,FALSE),\"\")","v":""},null,null,null,null,0,{"$f":"IF(F94>0,VLOOKUP($C94,TS3L8_ALL,11,FALSE)*(F94),0)","v":0},{"$f":"IF(F94>0,VLOOKUP($C94,TS3L8_ALL,12,FALSE),0)","v":0}]
[null,null,"25GbE Dual Rate SFP28 SR Optic for SFP28 ports (CONNECTX-5 25Gb OCP)",null,{"$f":"IF(K95>0,VLOOKUP($C95,TS3L8_ALL,13,FALSE),\"\")","v":""},null,null,null,null,0,{"$f":"IF(F95>0,VLOOKUP($C95,TS3L8_ALL,11,FALSE)*(F95),0)","v":0},{"$f":"IF(F95>0,VLOOKUP($C95,TS3L8_ALL,12,FALSE),0)","v":0}]
[null,null,"Mellanox LinkX 100Gb/s Passive Copper DAC 3m",null,{"$f":"IF(K96>0,VLOOKUP($C96,TS3L8_ALL,13,FALSE),\"\")","v":""},null,null,null,null,0,{"$f":"IF(F96>0,VLOOKUP($C96,TS3L8_ALL,11,FALSE)*(F96),0)","v":0},{"$f":"IF(F96>0,VLOOKUP($C96,TS3L8_ALL,12,FALSE),0)","v":0}]
[]
[null,null,"Cavi mini DP to VGA",null,null,null,null,{"$f":"IF(F99=4,\"Un cavo per singolo Nodo\",IF(F99=1,\"Un cavo per Enclosure\",\"Nessun cavo video\"))","v":"Un cavo per singolo Nodo"}]
[null,null,"Adapter - Mini DisplayPort to VGA",null,{"$f":"IF(K99>0,VLOOKUP($C99,TS3L8_ALL,13,FALSE),\"\")","v":"TS3L8-MDPVGA"},4,null,null,null,0,{"$f":"IF(F99>0,VLOOKUP($C99,TS3L8_ALL,11,FALSE)*(F99),0)","v":140},{"$f":"IF(F99>0,VLOOKUP($C99,TS3L8_ALL,12,FALSE),0)","v":"L8N56"}]
[]
[null,null,"Cavi RJ45 per ENCLOSURE"]
[null,null,"Cavo “patch” di 3 mt RJ45 certificato per gigabit ethernet",null,{"$f":"IF(K102>0,VLOOKUP($C102,TS3L8_ALL,13,FALSE),\"\")","v":"TS3L8-RJ453M"},20,null,null,null,0,{"$f":"IF(F102>0,VLOOKUP($C102,TS3L8_ALL,11,FALSE)*(F102),0)","v":60},{"$f":"IF(F102>0,VLOOKUP($C102,TS3L8_ALL,12,FALSE),0)","v":"L8N30"}]
[]
[null,null,"Warranty per ENCLOSURE",{"$f":"IF(J106=\"\",HYPERLINK(\"https://convenzioni.converge.it/docs/ts3_datasheet/TS3warranty.pdf\",\"i\"))","v":"i"}]
[null,null,"Manutenzione in garanzia (36 mesi)",null,{"$f":"VLOOKUP($C105,TS3L8_WARRANTY,13,FALSE)","v":""},{"$f":"VLOOKUP($C105,TS3L8_WARRANTY,7,FALSE)","v":""},null,null,null,{"$f":"VLOOKUP($C105,TS3L8_WARRANTY,10,FALSE)","v":0},{"$f":"VLOOKUP($C105,TS3L8_WARRANTY,11,FALSE)","v":0},{"$f":"VLOOKUP($C105,TS3L8_ALL,12,FALSE)","v":""}]
[]
[null,null,"Hard Disk Retention per ENCLOSURE",{"$f":"IF(J109=\"\",HYPERLINK(\"https://convenzioni.converge.it/docs/ts3_datasheet/DELL_HDD_KYHD.pdf\",\"i\"))","v":"i"}]
[null,null,"",null,{"$f":"IFERROR(N108,VLOOKUP(C108,TS3L8_ALL,13,FALSE))","v":""},{"$f":"IF(C108=\"\",\"\",1)","v":""},null,null,null,{"$f":"IFERROR(O108,VLOOKUP(C108,TS3L8_ALL,10,FALSE))","v":0},{"$f":"IFERROR(P108,VLOOKUP(C108,TS3L8_ALL,11,FALSE))","v":0},{"$f":"IFERROR(Q108,VLOOKUP(C108,TS3L8_ALL,12,FALSE))","v":""},null,{"$f":"IF(F105+F108=2,VLOOKUP(\"Hard Disk Retention (60 mesi)\",TS3L8_ALL,13,FALSE),VLOOKUP(C108,TS3L8_ALL,13,FALSE))","v":{"$error":"#VALUE!"}},{"$f":"IF(F105+F108=2,VLOOKUP(\"Hard Disk Retention (60 mesi)\",TS3L8_ALL,10,FALSE),VLOOKUP(C108,TS3L8_ALL,10,FALSE))","v":{"$error":"#VALUE!"}},{"$f":"IF(F105+F108=2,VLOOKUP(\"Hard Disk Retention (60 mesi)\",TS3L8_ALL,11,FALSE),VLOOKUP(C108,TS3L8_ALL,11,FALSE))","v":{"$error":"#VALUE!"}},{"$f":"IF(F105+F108=2,VLOOKUP(\"Hard Disk Retention (60 mesi)\",TS3L8_ALL,12,FALSE),VLOOKUP(C108,TS3L8_ALL,12,FALSE))","v":{"$error":"#VALUE!"}}]

{"sheet":"Lotto8_C6525_3","index":2,"n_rows":108,"n_cols":17,"rows_kept":108,"cut":false,"hidden":false,"merged":[[4,0,4,2],[7,3,9,3],[11,3,12,3],[17,3,18,3],[18,7,19,7],[8,7,9,7],[10,7,11,7],[12,7,13,7],[14,7,15,7],[16,7,17,7],[20,7,21,7],[42,4,42,5],[30,3,31,3],[33,4,33,5],[37,4,37,5],[22,7,25,7],[63,7,64,7],[66,3,67,3],[33,2,34,2],[103,3,104,3],[106,3,107,3],[43,7,56,7],[97,7,98,7]]}
[null,null,null,null,"Convenzione",{"$f":"SUM(J9:J120)*F5","v":0}]
[null,null,null,null,0.2,{"$f":"SUM(K9:K120)*F5","v":0}]
[null,null,null,null,"Totale",{"$f":"SUM(F1:F2)","v":0}]
[]
["PowerEdge C6400 + 4 x C6525 Consulta la Guida alla Convenzione -->",null,null,{"$f":"HYPERLINK(\"https://convenzioni.converge.it/docs/L8GuidaAllaConvenzioneTecnologieServer3.pdf\",\"&\")","v":"&"},"Quantità Server",null,null,{"$f":"Riepilogo!G8","v":"Version 4.0"}]
[]
[]
[null,null,"Base",{"$f":"HYPERLINK(\"https://convenzioni.converge.it/docs/ts3_datasheet/dell-emc-poweredge-c6525-spec-sheet.pdf\",\"i\")","v":"i"}]
[null,null,"POWEREDGE C6400-R Enclosure ",null,{"$f":"IF($F$5>0,\"TS3L8-SRV-U\",\"\")","v":""},{"$f":"IF($F$5>0,1,\"\")","v":""},null,null,null,{"$f":"VLOOKUP($C9,TS3L8_ALL,10,FALSE)","v":8877},null,{"$f":"VLOOKUP($C9,TS3L8_ALL,12,FALSE)","v":"L8N01"}]
[null,null,"PowerEdge C6525",null,null,{"$f":"IF($F$5>0,4,\"\")","v":""}]
[]
[null,null,"Chassis Configuration",{"$f":"HYPERLINK(\"https://dellservervr.dell.com/poweredge-c6525/\",\"i\")","v":"i"}]
[null,null,"Chassis with up to 24x2.5\" Drives","i"]
[]
[null,null,"Trusted Platform Module (TPM)"]
[null,null,"Trusted Platform Module 2.0"]
[]
[null,null,"Processor",{"$f":"IF(J19=\"\",HYPERLINK(\"https://www.amd.com/en/products/cpu/amd-epyc-7282\",\"i\"))","v":"i"}]
[null,null,"AMD EPYC 7282 2.80GHz, 16C/32T, 64M Cache (120W) DDR4-3200"]
[]
[null,null,"Additional Processor"]
[null,null,"No Additional Processor",null,{"$f":"VLOOKUP($C$22,TS3L8_CPU,13,FALSE)","v":""},{"$f":"VLOOKUP($C$22,TS3L8_CPU,7,FALSE)","v":0},null,null,null,{"$f":"VLOOKUP($C$22,TS3L8_CPU,10,FALSE)","v":0},null,{"$f":"VLOOKUP($C22,TS3L8_ALL,12,FALSE)","v":""}]
[null,null,null,null,null,null,null,{"$f":"IF(N25=\"*\",HYPERLINK(\"https://www.dell.com/support/manuals/it-it/poweredge-c6525/pec6525_ism_pub/general-memory-module-installation-guidelines?guid=guid-80b1c1ad-14b7-4dd6-b122-abb0c82bd3e8&lang=en-us\",\"!!!!!                 ATTENZIONE                 !!!!!\nLa configurazione della memoria è supportata, ma non ottimizzata per ottenere le migliori prestazioni.\nPer maggiori informazioni cliccare quì.\"),\"\")","v":"!!!!!                 ATTENZIONE                 !!!!!\nLa configurazione della memoria è supportata, ma non ottimizzata per ottenere le migliori prestazioni.\nPer maggiori informazioni cliccare quì."}]
[null,null,"Memory Capacity"]
[null,null,"64GB Totali (1 x 64GB DIMM per Nodo) ⚠",{"$f":"IF($N$25=\"*\",$M$25,\"\")","v":"⚠"},{"$f":"IF($F$22=1,VLOOKUP($C$25,TS3L8_RAM2CPU,13,FALSE),VLOOKUP($C$25,TS3L8_RAM1CPU,13,FALSE))","v":"TS3L8-RAM64"},{"$f":"IF($F$22=1,VLOOKUP($C$25,TS3L8_RAM2CPU,7,FALSE),VLOOKUP($C$25,TS3L8_RAM1CPU,7,FALSE))","v":0},{"$f":"IF($N$25=\"*\",$M$25,\"\")","v":"⚠"},null,null,{"$f":"IF($F$22=1,VLOOKUP($C$25,TS3L8_RAM2CPU,10,FALSE),VLOOKUP($C$25,TS3L8_RAM1CPU,10,FALSE))","v":0},null,{"$f":"IF($F$22=1,VLOOKUP($C$25,TS3L8_RAM2CPU,12,FALSE),VLOOKUP($C$25,TS3L8_RAM1CPU,12,FALSE))","v":"L8N04"},"⚠",{"$f":"VLOOKUP($C$25,TS3L8_RAM,5,FALSE)","v":"*"}]
[]
[null,null,"Operating System"]
[null,null,"No Operating System",null,{"$f":"VLOOKUP($C$28,TS3L8_OS,13,FALSE)","v":""},{"$f":"VLOOKUP($C$28,TS3L8_OS,7,FALSE)","v":0},null,null,null,{"$f":"VLOOKUP($C$28,TS3L8_OS,10,FALSE)","v":0},{"$f":"VLOOKUP($C$28,TS3L8_OS,11,FALSE)","v":0},{"$f":"VLOOKUP($C28,TS3L8_ALL,12,FALSE)","v":""}]
[null,null,null,null,{"$f":"IF(F22=1,VLOOKUP(C28,TS3L8_OS,21,FALSE),\"\")","v":""},{"$f":"IF(F22=1,VLOOKUP(C28,TS3L8_OS,14,FALSE),0)","v":0},null,null,null,{"$f":"IF($F$28+$F$19=2,0,IF($F$19+$F$22+$F$28=2,VLOOKUP($C$28,TS3L8_OS,17,FALSE),VLOOKUP($C$28,TS3L8_OS,17,FALSE)))","v":""},{"$f":"IF($F$28+$F$19=2,0,IF($F$19+$F$22+$F$28=2,VLOOKUP($C$28,TS3L8_OS,18,FALSE),VLOOKUP($C$28,TS3L8_OS,18,FALSE)))","v":0},{"$f":"IF($F$28+$F$19=2,0,IF($F$19+$F$22+$F$28=2,VLOOKUP($C$28,TS3L8_OS,20,FALSE),VLOOKUP($C$28,TS3L8_OS,20,FALSE)))","v":0}]
[]
[null,null,"Raid Controller",{"$f":"IF(F32=\"\",HYPERLINK(\"https://convenzioni.converge.it/docs/ts3_datasheet/dellemc-poweredge-raid-controller-h745.pdf\",\"i\"),HYPERLINK(\"https://convenzioni.converge.it/docs/ts3_datasheet/dellemc-poweredge-hba345.pdf\",\"i\"))","v":"i"}]
[null,null,"PERC H745 Controller Card",null,{"$f":"VLOOKUP($C32,TS3L8_ALL,13,FALSE)","v":""},{"$f":"VLOOKUP($C32,TS3L8_ALL,7,FALSE)","v":""},null,null,null,{"$f":"VLOOKUP($C32,TS3L8_ALL,10,FALSE)","v":0},{"$f":"VLOOKUP($C32,TS3L8_ALL,11,FALSE)*4","v":0},{"$f":"VLOOKUP($C32,TS3L8_ALL,12,FALSE)","v":""}]
[]
[null,null,"Hard Drivers Bays disponibili n° 24 (n° 6 per Nodo)",null,"Totali Enclosure C6400"]
[null,null,null,null,"Usati","Disponibili"]
[null,null,null,null,{"$f":"SUM(F45:F59)*4","v":8},{"$f":"24-E36","v":16}]
[]
[null,null,null,null,"Per singolo Nodo C6525"]
[null,null,null,null,"Usati","Disponibili"]
[null,null,null,null,{"$f":"SUM(F45:F59)","v":2},{"$f":"6-E40","v":4}]
[]
[]
[null,null,null,null,"INDICARE LA QUANTITA' PER SINGOLO NODO",null,null,"Configurazione RAID e/o NOTE"]
[null,null,null,null,null,null,null,"Specificare la configurazione RAID per l'installazione del Sistema Operativo, se richiesto.\ne/o\ninserire eventuali note."]
[null,null,{"$f":"ConfigurationTS3L8!A35","v":"300GB 15K RPM SAS 12Gbps 2.5in Hot-plug"},null,{"$f":"VLOOKUP($C45,TS3L8_HDD,13,FALSE)","v":"TS3L8-HDD300GB"},null,null,null,null,{"$f":"VLOOKUP($C45,TS3L8_HDD,10,FALSE)*F45*4","v":0},{"$f":"VLOOKUP($C45,TS3L8_HDD,11,FALSE)","v":0},{"$f":"VLOOKUP($C45,TS3L8_ALL,12,FALSE)","v":"L8N10"}]
[]
[null,null,{"$f":"ConfigurationTS3L8!A37","v":"1.2TB 10K RPM SAS 12Gbps 2.5in Hot-plug"},null,{"$f":"VLOOKUP($C47,TS3L8_HDD,13,FALSE)","v":"TS3L8-HDD1TB"},null,null,null,null,{"$f":"VLOOKUP($C47,TS3L8_HDD,10,FALSE)*F47*4","v":0},{"$f":"VLOOKUP($C47,TS3L8_HDD,11,FALSE)","v":0},{"$f":"VLOOKUP($C47,TS3L8_ALL,12,FALSE)","v":"L8N09"}]
[]
[null,null,{"$f":"ConfigurationTS3L8!A39","v":"480GB SSD SAS Read Intensive 12Gbps 2.5in Hot-plug"},null,{"$f":"VLOOKUP($C49,TS3L8_HDD,13,FALSE)","v":"TS3L8-RI400GB-U"},0,null,null,null,{"$f":"IF(F49>2,(VLOOKUP($C49,TS3L8_HDD,10,FALSE)*(F49*4-2*4)),0)","v":0},{"$f":"VLOOKUP($C49,TS3L8_HDD,11,FALSE)","v":0},{"$f":"VLOOKUP($C49,TS3L8_ALL,12,FALSE)","v":"L8N15"}]
[]
[null,null,{"$f":"ConfigurationTS3L8!A41","v":"960GB SSD SAS Read Intensive 12Gbps 2.5in Hot-plug"},null,{"$f":"VLOOKUP($C51,TS3L8_HDD,13,FALSE)","v":"TS3L8-RI800GB"},2,null,null,null,{"$f":"IF(F51>2,(VLOOKUP($C51,TS3L8_HDD,10,FALSE)*(F51*4-2*4)),0)","v":0},{"$f":"VLOOKUP($C51,TS3L8_HDD,11,FALSE)","v":0},{"$f":"VLOOKUP($C51,TS3L8_ALL,12,FALSE)","v":"L8N13"}]
[]
[null,null,{"$f":"ConfigurationTS3L8!A43","v":"1.92TB SSD SAS Read Intensive 12Gbps 2.5in Hot-plug"},null,{"$f":"VLOOKUP($C53,TS3L8_HDD,13,FALSE)","v":"TS3L8-RI1600GB"},null,null,null,null,{"$f":"VLOOKUP($C53,TS3L8_HDD,10,FALSE)*F53*4","v":0},{"$f":"VLOOKUP($C53,TS3L8_HDD,11,FALSE)","v":0},{"$f":"VLOOKUP($C53,TS3L8_ALL,12,FALSE)","v":"L8N11"}]
[]
[null,null,{"$f":"ConfigurationTS3L8!A45","v":"960GB SSD SAS Mixed Use 12Gbps 512e 2.5in Hot-Plug"},null,{"$f":"VLOOKUP($C55,TS3L8_HDD,13,FALSE)","v":"TS3L8-MU800GB"},null,null,null,null,{"$f":"VLOOKUP($C55,TS3L8_HDD,10,FALSE)*F55*4","v":0},{"$f":"VLOOKUP($C55,TS3L8_HDD,11,FALSE)","v":0},{"$f":"VLOOKUP($C55,TS3L8_ALL,12,FALSE)","v":"L8N14"}]
[]
[null,null,{"$f":"ConfigurationTS3L8!A47","v":"1.6TB SSD SAS Mixed Use 12Gbps 2.5in Hot-plug"},null,{"$f":"VLOOKUP($C57,TS3L8_HDD,13,FALSE)","v":"TS3L8-MU1600GB"},null,null,null,null,{"$f":"VLOOKUP($C57,TS3L8_HDD,10,FALSE)*F57*4","v":0},{"$f":"VLOOKUP($C57,TS3L8_HDD,11,FALSE)","v":0},{"$f":"VLOOKUP($C57,TS3L8_ALL,12,FALSE)","v":"L8N12"}]
[]
[null,null,{"$f":"ConfigurationTS3L8!A49","v":"800GB SSD SAS Write Intensive 12Gbps 2.5in Hot-plug"},null,{"$f":"VLOOKUP($C59,TS3L8_HDD,13,FALSE)","v":"TS3L8-WI800GB"},null,null,null,null,{"$f":"VLOOKUP($C59,TS3L8_HDD,10,FALSE)*F59*4","v":0},{"$f":"VLOOKUP($C59,TS3L8_HDD,11,FALSE)*F59*4","v":0},{"$f":"VLOOKUP($C59,TS3L8_ALL,12,FALSE)","v":"L8N32"}]
[]
[null,null,"Power Supply"]
[null,null,"Dual,Hot-plug Power Supply, 2400W,250 Volt"]
[]
[null,null,"Power Cords",null,null,null,null,"Verificare, per ogni Enclosure, la disponibilità di 2 prese C19 sulle PDU"]
[null,null,"C19 to C20, 250V, 0.6m Power Cord",null,null,2]
[]
[null,null,"Boot Optimized Storage Cards",{"$f":"IF(J69=\"\",HYPERLINK(\"https://convenzioni.converge.it/docs/ts3_datasheet/DELL_BOSS.pdf\",\"i\"))","v":"i"}]
[null,null,"",null,{"$f":"VLOOKUP($C68,TS3L8_ALL,13,FALSE)","v":""},{"$f":"VLOOKUP($C68,TS3L8_ALL,7,FALSE)","v":""},null,null,null,{"$f":"VLOOKUP($C68,TS3L8_ALL,10,FALSE)","v":0},{"$f":"VLOOKUP($C68,TS3L8_ALL,11,FALSE)*4","v":0},{"$f":"VLOOKUP($C68,TS3L8_ALL,12,FALSE)","v":""}]
[]
[null,null,"Embedded Systems Management"]
[null,null,"BMC"]
[]
[]
[]
[]
[]
[]
[]
[]
[]
[]
[]
[]
[null,null,"Network Mezzanine Cards"]
[null,null,"Broadcom 5720 Quad Port 1GbE BASE-T Mezzanine Adapter",null,{"$f":"VLOOKUP($C85,TS3L8_ALL,13,FALSE)","v":""},{"$f":"VLOOKUP($C85,TS3L8_ALL,7,FALSE)","v":""},null,null,null,{"$f":"VLOOKUP($C85,TS3L8_ALL,10,FALSE)","v":0},{"$f":"VLOOKUP($C85,TS3L8_ALL,11,FALSE)*4","v":0},{"$f":"VLOOKUP($C85,TS3L8_ALL,12,FALSE)","v":""}]
[]
[null,null,"PCI Slot 1 Processor 1"]
[null,null,"Controller Card"]
[]
[null,null,"PCI Slot 2 Processor 2"]
[null,null,"",null,{"$f":"VLOOKUP($C91,TS3L8_ALL,13,FALSE)","v":""},{"$f":"VLOOKUP($C91,TS3L8_ALL,7,FALSE)","v":""},null,null,null,{"$f":"VLOOKUP($C91,TS3L8_ALL,10,FALSE)*4","v":0},{"$f":"VLOOKUP($C91,TS3L8_ALL,11,FALSE)*4","v":0},{"$f":"VLOOKUP($C91,TS3L8_ALL,12,FALSE)","v":""}]
[]
[null,null,"Transceivers per ENCLOSURE"]
[null,null,"SFP+ SR Optic for SFP+ ports (CONNECTX-5 10Gb OCP)",null,{"$f":"IF(K94>0,VLOOKUP($C94,TS3L8_ALL,13,FALSE),\"\")","v":""},null,null,null,null,0,{"$f":"IF(F94>0,VLOOKUP($C94,TS3L8_ALL,11,FALSE)*(F94),0)","v":0},{"$f":"IF(F94>0,VLOOKUP($C94,TS3L8_ALL,12,FALSE),0)","v":0}]
[null,null,"25GbE Dual Rate SFP28 SR Optic for SFP28 ports (CONNECTX-5 25Gb OCP)",null,{"$f":"IF(K95>0,VLOOKUP($C95,TS3L8_ALL,13,FALSE),\"\")","v":""},null,null,null,null,0,{"$f":"IF(F95>0,VLOOKUP($C95,TS3L8_ALL,11,FALSE)*(F95),0)","v":0},{"$f":"IF(F95>0,VLOOKUP($C95,TS3L8_ALL,12,FALSE),0)","v":0}]
[null,null,"Mellanox LinkX 100Gb/s Passive Copper DAC 3m",null,{"$f":"IF(K96>0,VLOOKUP($C96,TS3L8_ALL,13,FALSE),\"\")","v":""},null,null,null,null,0,{"$f":"IF(F96>0,VLOOKUP($C96,TS3L8_ALL,11,FALSE)*(F96),0)","v":0},{"$f":"IF(F96>0,VLOOKUP($C96,TS3L8_ALL,12,FALSE),0)","v":0}]
[]
[null,null,"Cavi mini DP to VGA",null,null,null,null,{"$f":"IF(F99=4,\"Un cavo per singolo Nodo\",IF(F99=1,\"Un cavo per Enclosure\",\"Nessun cavo video\"))","v":"Un cavo per singolo Nodo"}]
[null,null,"Adapter - Mini DisplayPort to VGA",null,{"$f":"IF(K99>0,VLOOKUP($C99,TS3L8_ALL,13,FALSE),\"\")","v":"TS3L8-MDPVGA"},4,null,null,null,0,{"$f":"IF(F99>0,VLOOKUP($C99,TS3L8_ALL,11,FALSE)*(F99),0)","v":140},{"$f":"IF(F99>0,VLOOKUP($C99,TS3L8_ALL,12,FALSE),0)","v":"L8N56"}]
[]
[null,null,"Cavi RJ45 per ENCLOSURE"]
[null,null,"Cavo “patch” di 3 mt RJ45 certificato per gigabit ethernet",null,{"$f":"IF(K102>0,VLOOKUP($C102,TS3L8_ALL,13,FALSE),\"\")","v":"TS3L8-RJ453M"},20,null,null,null,0,{"$f":"IF(F102>0,VLOOKUP($C102,TS3L8_ALL,11,FALSE)*(F102),0)","v":60},{"$f":"IF(F102>0,VLOOKUP($C102,TS3L8_ALL,12,FALSE),0)","v":"L8N30"}]
[]
[null,null,"Warranty per ENCLOSURE",{"$f":"IF(J106=\"\",HYPERLINK(\"https://convenzioni.converge.it/docs/ts3_datasheet/TS3warranty.pdf\",\"i\"))","v":"i"}]
[null,null,"Manutenzione in garanzia (36 mesi)",null,{"$f":"VLOOKUP($C105,TS3L8_WARRANTY,13,FALSE)","v":""},{"$f":"VLOOKUP($C105,TS3L8_WARRANTY,7,FALSE)","v":""},null,null,null,{"$f":"VLOOKUP($C105,TS3L8_WARRANTY,10,FALSE)","v":0},{"$f":"VLOOKUP($C105,TS3L8_WARRANTY,11,FALSE)","v":0},{"$f":"VLOOKUP($C105,TS3L8_ALL,12,FALSE)","v":""}]
[]
[null,null,"Hard Disk Retention per ENCLOSURE",{"$f":"IF(J109=\"\",HYPERLINK(\"https://convenzioni.converge.it/docs/ts3_datasheet/DELL_HDD_KYHD.pdf\",\"i\"))","v":"i"}]
[null,null,"",null,{"$f":"IFERROR(N108,VLOOKUP(C108,TS3L8_ALL,13,FALSE))","v":""},{"$f":"IF(C108=\"\",\"\",1)","v":""},null,null,null,{"$f":"IFERROR(O108,VLOOKUP(C108,TS3L8_ALL,10,FALSE))","v":0},{"$f":"IFERROR(P108,VLOOKUP(C108,TS3L8_ALL,11,FALSE))","v":0},{"$f":"IFERROR(Q108,VLOOKUP(C108,TS3L8_ALL,12,FALSE))","v":""},null,{"$f":"IF(F105+F108=2,VLOOKUP(\"Hard Disk Retention (60 mesi)\",TS3L8_ALL,13,FALSE),VLOOKUP(C108,TS3L8_ALL,13,FALSE))","v":{"$error":"#VALUE!"}},{"$f":"IF(F105+F108=2,VLOOKUP(\"Hard Disk Retention (60 mesi)\",TS3L8_ALL,10,FALSE),VLOOKUP(C108,TS3L8_ALL,10,FALSE))","v":{"$error":"#VALUE!"}},{"$f":"IF(F105+F108=2,VLOOKUP(\"Hard Disk Retention (60 mesi)\",TS3L8_ALL,11,FALSE),VLOOKUP(C108,TS3L8_ALL,11,FALSE))","v":{"$error":"#VALUE!"}},{"$f":"IF(F105+F108=2,VLOOKUP(\"Hard Disk Retention (60 mesi)\",TS3L8_ALL,12,FALSE),VLOOKUP(C108,TS3L8_ALL,12,FALSE))","v":{"$error":"#VALUE!"}}]

{"sheet":"Altre_Opzioni","index":3,"n_rows":55,"n_cols":12,"rows_kept":55,"cut":false,"hidden":false,"merged":[[10,3,11,3],[7,3,8,3],[31,3,32,3],[53,3,54,3],[14,3,15,3],[39,3,40,3],[43,3,44,3],[47,3,48,3],[50,3,51,3]]}
[null,null,null,null,"Convenzione",{"$f":"SUM(J9:J148)","v":0}]
[null,null,null,null,0.2,{"$f":"SUM(K9:K148)","v":0}]
[null,null,null,null,"Totale",{"$f":"SUM(F1:F2)","v":0}]
[]
[null,null,"Opzioni"]
[]
[]
[null,null,"Opzione Rack APC con PDU Monofase",{"$f":"HYPERLINK(\"https://convenzioni.converge.it/docs/ts3_datasheet/RACK_APC_MONO.pdf\",\"i\")","v":"i"}]
[null,null,"Armadio Rack 42U 600x1200, 2 x PDU Monofase 2G, ZeroU, 32A, 230V, (36) C13 & (6) C19",null,{"$f":"VLOOKUP($C9,TS3L8_ALL,13,FALSE)","v":"TS3L8-RACKM32A"},null,null,null,null,{"$f":"VLOOKUP($C9,TS3L8_ALL,10,FALSE)*F9","v":0},{"$f":"VLOOKUP($C9,TS3L8_ALL,11,FALSE)*F9","v":0},{"$f":"VLOOKUP($C9,TS3L8_ALL,12,FALSE)","v":"L8N45"}]
[]
[null,null,"Opzione Rack APC con PDU Trifase",{"$f":"HYPERLINK(\"https://convenzioni.converge.it/docs/ts3_datasheet/RACK_APC_3PH.pdf\",\"i\")","v":"i"}]
[null,null,"Armadio Rack 42U 600x1200, 2 x PDU Trifase 2G, ZeroU, 22.0kW(32A) 17.3kW(24A), 230V, (30) C13 & (12) C19",null,{"$f":"VLOOKUP($C12,TS3L8_ALL,13,FALSE)","v":"TS3L8-RACKT32A"},null,null,null,null,{"$f":"VLOOKUP($C12,TS3L8_ALL,10,FALSE)*F12","v":0},{"$f":"VLOOKUP($C12,TS3L8_ALL,11,FALSE)*F12","v":0},{"$f":"VLOOKUP($C12,TS3L8_ALL,12,FALSE)","v":"L8N46"}]
[]
[]
[null,null,"OpzRack",{"$f":"HYPERLINK(\"https://convenzioni.converge.it/docs/ts3_datasheet/TS3Rack.pdf\",\"i\")","v":"i"}]
[null,null,"Rack 42U con portata 1000 KG e 4 ruote + coppia PDU 12 prese Shuko bipasso ITA",null,{"$f":"VLOOKUP($C16,TS3L8_ALL,13,FALSE)","v":"TS3L8-RACK"},null,null,null,null,{"$f":"VLOOKUP($C16,TS3L8_ALL,10,FALSE)*F16","v":0},{"$f":"VLOOKUP($C16,TS3L8_ALL,11,FALSE)","v":0},{"$f":"VLOOKUP($C16,TS3L8_ALL,12,FALSE)","v":"L8N26"}]
[]
[]
[null,null,"Prodotti VMware"]
[null,null,"VMware vSphere 7 Standard Acceleration Kit OEM for 6 CPU, 3YR License and Maintenance",null,{"$f":"VLOOKUP($C20,TS3L8_ALL,13,FALSE)","v":"TS3L8-VS7STD6AK"},null,null,null,null,{"$f":"VLOOKUP($C20,TS3L8_ALL,10,FALSE)*F20","v":0},{"$f":"VLOOKUP($C20,TS3L8_ALL,11,FALSE)*F20","v":0},{"$f":"VLOOKUP($C20,TS3L8_ALL,12,FALSE)","v":"L8N33"}]
[null,null,"VMware vSphere 7 Standard OEM, 1 CPU (max 32 cores/CPU socket), 3YR License and Maintenance",null,"TS3L8-VS7STD",null,null,null,null,0,0,"L8N34"]
[null,null,"VMware vSphere 7 Enterprise Plus Acceleration Kit OEM for 6 CPU, 3YR License and Maintenance",null,"TS3L8-VS7EPL6AK",null,null,null,null,0,0,"L8N35"]
[null,null,"VMware vSphere 7 Enterprise Plus OEM, 1 CPU (max 32 cores/CPU socket), 3YR License and Maintenance",null,"TS3L8-VS7EPL",null,null,null,null,0,0,"L8N36"]
[null,null,"VMware vCenter 7 Standard OEM ,Per Instance,3YR License and Maintenance",null,"TS3L8-VCS7STD",null,null,null,null,0,0,"L8N37"]
[null,null,"VMware vSAN 7 Enterprise OEM, 1 CPU (max 32 cores/CPU socket), 3YR License and Maintenance",null,"TS3L8-ST7ENT",null,null,null,null,0,0,"L8N38"]
[null,null,"VMware Horizon 8 Advanced OEM,10 Pack,CCU, 3YR License and Maintenance",null,"TS3L8-HZ8ADC10",null,null,null,null,0,0,"L8N39"]
[null,null,"VMware Horizon 8 Enterprise OEM,10 Pack,CCU, 3YR License and Maintenance",null,"TS3L8-HZ8ENC10",null,null,null,null,0,0,"L8N40"]
[null,null,"VMware Horizon Advanced OEM, 10 Pack, Named User, 3YR License and Maintenance",null,"TS3L8-HZ8ADN10",null,null,null,null,0,0,"L8N41"]
[null,null,"VMware Horizon 8 Enterprise OEM,10 Pack, Named User, 3YR License and Maintenance",null,"TS3L8-HZ8ENN10",null,null,null,null,0,0,"L8N42"]
[]
[]
[null,null,"Enclosure Dischi SAS 3.5\" (No disk)",{"$f":"HYPERLINK(\"https://convenzioni.converge.it/docs/ts3_datasheet/MD1400_MD1420.pdf\",\"i\")","v":"i"}]
[null,null,"Enclosure SAS 12 Slot 3.5\", 3YR ProSupport and 4hr Mission Critical",null,{"$f":"VLOOKUP($C33,TS3L8_ALL,13,FALSE)","v":"TS3L8-Encl13Y4H"},null,null,null,null,{"$f":"VLOOKUP($C33,TS3L8_ALL,10,FALSE)*F33","v":0},{"$f":"VLOOKUP($C33,TS3L8_ALL,11,FALSE)*F33","v":0},{"$f":"VLOOKUP($C33,TS3L8_ALL,12,FALSE)","v":"L8N43"}]
[null,null,"Enclosure SAS 12 Slot 3.5\", 5YR ProSupport and 4hr Mission Critical",null,{"$f":"VLOOKUP($C34,TS3L8_ALL,13,FALSE)","v":"TS3L8-Encl25Y4H"},null,null,null,null,{"$f":"VLOOKUP($C34,TS3L8_ALL,10,FALSE)*F34","v":0},{"$f":"VLOOKUP($C34,TS3L8_ALL,11,FALSE)*F34","v":0},{"$f":"VLOOKUP($C34,TS3L8_ALL,12,FALSE)","v":"L8N44"}]
[null,null,"Dischi per Enclosure 3.5\""]
[null,null,"HDD 16TB SAS 12Gbps 7k 3.5in Hot-Plug per Enclosure 3.5\"",null,{"$f":"VLOOKUP($C36,TS3L8_ALL,13,FALSE)","v":"TS3L8-ED16TB"},null,null,null,null,{"$f":"VLOOKUP($C36,TS3L8_ALL,10,FALSE)*F36","v":0},{"$f":"VLOOKUP($C36,TS3L8_ALL,11,FALSE)*F36","v":0},{"$f":"VLOOKUP($C36,TS3L8_ALL,12,FALSE)","v":"L8N50"}]
[null,null,"HDD 12TB SAS 12Gbps 7k 3.5in Hot-Plug per Enclosure 3.5\"",null,{"$f":"VLOOKUP($C37,TS3L8_ALL,13,FALSE)","v":"TS3L8-ED12TB"},null,null,null,null,{"$f":"VLOOKUP($C37,TS3L8_ALL,10,FALSE)*F37","v":0},{"$f":"VLOOKUP($C37,TS3L8_ALL,11,FALSE)*F37","v":0},{"$f":"VLOOKUP($C37,TS3L8_ALL,12,FALSE)","v":"L8N51"}]
[null,null,"HDD 8TB SAS 12Gbps 7k 3.5in Hot-Plug per Enclosure 3.5\"",null,{"$f":"VLOOKUP($C38,TS3L8_ALL,13,FALSE)","v":"TS3L8-ED08TB"},null,null,null,null,{"$f":"VLOOKUP($C38,TS3L8_ALL,10,FALSE)*F38","v":0},{"$f":"VLOOKUP($C38,TS3L8_ALL,11,FALSE)*F38","v":0},{"$f":"VLOOKUP($C38,TS3L8_ALL,12,FALSE)","v":"L8N52"}]
[]
[null,null,"OpzUps (3000VA)",{"$f":"HYPERLINK(\"https://convenzioni.converge.it/docs/ts3_datasheet/RPMM_UPS.pdf\",\"i\")","v":"i"}]
[null,null,"BUNDLE PMEUPS3RTSER Comprensivo di UPS e scheda SNMP + Kit Rack incluso",null,{"$f":"VLOOKUP($C41,TS3L8_ALL,13,FALSE)","v":"TS3L8-UPS"},null,null,null,null,{"$f":"VLOOKUP($C41,TS3L8_ALL,10,FALSE)*F41","v":0},{"$f":"VLOOKUP($C41,TS3L8_ALL,11,FALSE)","v":0},{"$f":"VLOOKUP($C41,TS3L8_ALL,12,FALSE)","v":"L8N16"}]
[]
[]
[null,null,"OpzGUI",{"$f":"HYPERLINK(\"https://convenzioni.converge.it/docs/ts3_datasheet/KVM_datasheet_ITA.pdf\",\"i\")","v":"i"}]
[null,null,"Unità KVM - monitor 17\", cavo combi PS2 e USB da 1,8mt, tastiera ita, touch pad",null,{"$f":"VLOOKUP($C45,TS3L8_ALL,13,FALSE)","v":"TS3L8-GUI"},null,null,null,null,{"$f":"VLOOKUP($C45,TS3L8_ALL,10,FALSE)*F45","v":0},{"$f":"VLOOKUP($C45,TS3L8_ALL,11,FALSE)","v":0},{"$f":"VLOOKUP($C45,TS3L8_ALL,12,FALSE)","v":"L8N17"}]
[]
[]
[null,null,"OpzKVM",{"$f":"HYPERLINK(\"https://convenzioni.converge.it/docs/ts3_datasheet/T9816NIP.pdf\",\"i\")","v":"i"}]
[null,null,"Switch 16 porte IP con relativi cavi combi PS/2 e USB inclusi",null,{"$f":"VLOOKUP($C49,TS3L8_ALL,13,FALSE)","v":"TS3L8-SWKVM"},null,null,null,null,{"$f":"VLOOKUP($C49,TS3L8_ALL,10,FALSE)*F49","v":0},{"$f":"VLOOKUP($C49,TS3L8_ALL,11,FALSE)","v":0},{"$f":"VLOOKUP($C49,TS3L8_ALL,12,FALSE)","v":"L8N18"}]
[]
[null,null,{"$f":"IF(Riepilogo!P41>0,\"OpzDeviceCal\",\"\")","v":""}]
[null,null,{"$f":"IF(Riepilogo!P41>0,\"1-pack of Windows Server 2019/2016 Device CALs (STD or DC)\",\"\")","v":""},null,{"$f":"VLOOKUP($C52,TS3L8_ALL,13,FALSE)","v":""},null,null,null,null,{"$f":"VLOOKUP($C52,TS3L8_ALL,10,FALSE)*F52","v":0},{"$f":"VLOOKUP($C52,TS3L8_ALL,11,FALSE)","v":0},{"$f":"VLOOKUP($C52,TS3L8_ALL,12,FALSE)","v":""}]
[]
[null,null,{"$f":"IF(Riepilogo!P41>0,\"OpzUserCal\",\"\")","v":""}]
[null,null,{"$f":"IF(Riepilogo!P41>0,\"1-pack of Windows Server 2019/2016 User CALs (STD or DC)\",\"\")","v":""},null,{"$f":"VLOOKUP($C55,TS3L8_ALL,13,FALSE)","v":""},null,null,null,null,{"$f":"VLOOKUP($C55,TS3L8_ALL,10,FALSE)*F55","v":0},{"$f":"VLOOKUP($C55,TS3L8_ALL,11,FALSE)","v":0},{"$f":"VLOOKUP($C55,TS3L8_ALL,12,FALSE)","v":""}]

{"sheet":"ConfigurationTS3L8","index":4,"n_rows":121,"n_cols":21,"rows_kept":121,"cut":false,"hidden":true,"merged":[]}
[]
["POWEREDGE C6400-R Enclosure ",null,null,{"$f":"VLOOKUP($L$2,Tabella_prezzi!$A$1:$J$223,8,FALSE)","v":"DELL PowerEdge C6400 con 4 x DELL PowerEdge C6525"},null,null,1,{"$f":"VLOOKUP(L2,Tabella_prezzi!$A$1:$J$223,3,FALSE)","v":"Server rackable high-density"},{"$f":"VLOOKUP(L2,Tabella_prezzi!$A$1:$J$223,9,FALSE)","v":"L8N01-ServerC6525"},{"$f":"VLOOKUP(L2,Tabella_prezzi!$A$1:$J$223,4,FALSE)","v":8877},null,"L8N01",{"$f":"VLOOKUP(L2,Tabella_prezzi!$A$1:$J$223,6,FALSE)","v":"TS3L8-SRV-U"}]
[]
["TS3L8_CPU"]
["No Additional Processor",null,null,null,null,null,0,null,{"$f":"\"\"","v":""},null,null,{"$f":"\"\"","v":""},{"$f":"\"\"","v":""}]
["AMD EPYC 7282 2.80GHz, 16C/32T, 64M Cache (120W) DDR4-3200",null,null,{"$f":"VLOOKUP($L$6,Tabella_prezzi!$A$1:$J$223,8,FALSE)","v":"Processore AMD EPYC 7282 16C"},null,null,1,{"$f":"VLOOKUP($L$6,Tabella_prezzi!$A$1:$J$223,3,FALSE)","v":"Kit n. 1 Processore aggiuntivo"},{"$f":"VLOOKUP($L$6,Tabella_prezzi!$A$1:$J$223,9,FALSE)","v":"L8N02-OpzCPU"},{"$f":"VLOOKUP($L$6,Tabella_prezzi!$A$1:$J$223,4,FALSE)*4","v":4628},null,"L8N02",{"$f":"VLOOKUP($L$6,Tabella_prezzi!$A$1:$J$223,6,FALSE)","v":"TS3L8-CPU"}]
[]
["TS3L8_RAM (1CPU)"]
["64GB Totali (1 x 64GB DIMM per Nodo) ⚠","Memory Capacity",null,"64GB RDIMM, 3200MT/s, Dual Rank","*","AA799110",null,{"$f":"VLOOKUP(L9,Tabella_prezzi!$A$1:$J$223,3,FALSE)","v":"OpzRAM64GB"},{"$f":"VLOOKUP(L9,Tabella_prezzi!$A$1:$J$223,9,FALSE)","v":"L8N04-OpzRAM64GB"},{"$f":"VLOOKUP(L9,Tabella_prezzi!$A$1:$J$223,4,FALSE)*G9*4","v":0},null,"L8N04",{"$f":"VLOOKUP(L9,Tabella_prezzi!$A$1:$J$223,6,FALSE)","v":"TS3L8-RAM64"}]
["128GB Totali (2 x 64GB DIMM per Nodo) ⚠","Memory Capacity",null,"64GB RDIMM, 3200MT/s, Dual Rank","*","AA799110",1,{"$f":"VLOOKUP(L10,Tabella_prezzi!$A$1:$J$223,3,FALSE)","v":"OpzRAM64GB"},{"$f":"VLOOKUP(L10,Tabella_prezzi!$A$1:$J$223,9,FALSE)","v":"L8N04-OpzRAM64GB"},{"$f":"VLOOKUP(L10,Tabella_prezzi!$A$1:$J$223,4,FALSE)*G10*4","v":1600},null,"L8N04",{"$f":"VLOOKUP(L10,Tabella_prezzi!$A$1:$J$223,6,FALSE)","v":"TS3L8-RAM64"}]
["256GB Totali (4 x 64GB DIMM per Nodo)","Memory Capacity",null,"64GB RDIMM, 3200MT/s, Dual Rank",null,"AA799110",3,{"$f":"VLOOKUP(L11,Tabella_prezzi!$A$1:$J$223,3,FALSE)","v":"OpzRAM64GB"},{"$f":"VLOOKUP(L11,Tabella_prezzi!$A$1:$J$223,9,FALSE)","v":"L8N04-OpzRAM64GB"},{"$f":"VLOOKUP(L11,Tabella_prezzi!$A$1:$J$223,4,FALSE)*G11*4","v":4800},null,"L8N04",{"$f":"VLOOKUP(L11,Tabella_prezzi!$A$1:$J$223,6,FALSE)","v":"TS3L8-RAM64"}]
["512GB Totali (8 x 64GB DIMM per Nodo)","Memory Capacity",null,"64GB RDIMM, 3200MT/s, Dual Rank",null,"AA799110",7,{"$f":"VLOOKUP(L12,Tabella_prezzi!$A$1:$J$223,3,FALSE)","v":"OpzRAM64GB"},{"$f":"VLOOKUP(L12,Tabella_prezzi!$A$1:$J$223,9,FALSE)","v":"L8N04-OpzRAM64GB"},{"$f":"VLOOKUP(L12,Tabella_prezzi!$A$1:$J$223,4,FALSE)*G12*4","v":11200},null,"L8N04",{"$f":"VLOOKUP(L12,Tabella_prezzi!$A$1:$J$223,6,FALSE)","v":"TS3L8-RAM64"}]
[]
["TS3L8_RAM (2CPU)"]
["64GB Totali (1 x 64GB DIMM per Nodo) ⚠","Memory Capacity",null,"64GB RDIMM, 3200MT/s, Dual Rank","*","AA799110",1,{"$f":"VLOOKUP(L15,Tabella_prezzi!$A$1:$J$223,3,FALSE)","v":"OpzRAM64GB"},{"$f":"VLOOKUP(L15,Tabella_prezzi!$A$1:$J$223,9,FALSE)","v":"L8N04-OpzRAM64GB"},{"$f":"VLOOKUP(L15,Tabella_prezzi!$A$1:$J$223,4,FALSE)*G15*4","v":1600},null,"L8N04",{"$f":"VLOOKUP(L15,Tabella_prezzi!$A$1:$J$223,6,FALSE)","v":"TS3L8-RAM64"}]
["128GB Totali (2 x 64GB DIMM per Nodo) ⚠","Memory Capacity",null,"64GB RDIMM, 3200MT/s, Dual Rank","*","AA799110",1,{"$f":"VLOOKUP(L16,Tabella_prezzi!$A$1:$J$223,3,FALSE)","v":"OpzRAM64GB"},{"$f":"VLOOKUP(L16,Tabella_prezzi!$A$1:$J$223,9,FALSE)","v":"L8N04-OpzRAM64GB"},{"$f":"VLOOKUP(L16,Tabella_prezzi!$A$1:$J$223,4,FALSE)*G16*4","v":1600},null,"L8N04",{"$f":"VLOOKUP(L16,Tabella_prezzi!$A$1:$J$223,6,FALSE)","v":"TS3L8-RAM64"}]
["256GB Totali (4 x 64GB DIMM per Nodo) ⚠","Memory Capacity",null,"64GB RDIMM, 3200MT/s, Dual Rank","*","AA799110",3,{"$f":"VLOOKUP(L17,Tabella_prezzi!$A$1:$J$223,3,FALSE)","v":"OpzRAM64GB"},{"$f":"VLOOKUP(L17,Tabella_prezzi!$A$1:$J$223,9,FALSE)","v":"L8N04-OpzRAM64GB"},{"$f":"VLOOKUP(L17,Tabella_prezzi!$A$1:$J$223,4,FALSE)*G17*4","v":4800},null,"L8N04",{"$f":"VLOOKUP(L17,Tabella_prezzi!$A$1:$J$223,6,FALSE)","v":"TS3L8-RAM64"}]
["512GB Totali (8 x 64GB DIMM per Nodo)","Memory Capacity",null,"64GB RDIMM, 3200MT/s, Dual Rank",null,"AA799110",7,{"$f":"VLOOKUP(L18,Tabella_prezzi!$A$1:$J$223,3,FALSE)","v":"OpzRAM64GB"},{"$f":"VLOOKUP(L18,Tabella_prezzi!$A$1:$J$223,9,FALSE)","v":"L8N04-OpzRAM64GB"},{"$f":"VLOOKUP(L18,Tabella_prezzi!$A$1:$J$223,4,FALSE)*G18*4","v":11200},null,"L8N04",{"$f":"VLOOKUP(L18,Tabella_prezzi!$A$1:$J$223,6,FALSE)","v":"TS3L8-RAM64"}]
["1024GB Totali (16 x 64GB DIMM per Nodo)","Memory Capacity",null,"64GB RDIMM, 3200MT/s, Dual Rank",null,"AA799110",15,{"$f":"VLOOKUP(L19,Tabella_prezzi!$A$1:$J$223,3,FALSE)","v":"OpzRAM64GB"},{"$f":"VLOOKUP(L19,Tabella_prezzi!$A$1:$J$223,9,FALSE)","v":"L8N04-OpzRAM64GB"},{"$f":"VLOOKUP(L19,Tabella_prezzi!$A$1:$J$223,4,FALSE)*G19*4","v":24000},null,"L8N04",{"$f":"VLOOKUP(L19,Tabella_prezzi!$A$1:$J$223,6,FALSE)","v":"TS3L8-RAM64"}]
[]
["128GB Totali (1 x 64GB DIMM + 2 x 32GB DIMM per Nodo) ⚠","Memory Capacity",null,"32GB RDIMM, 3200MT/s, Dual Rank","*","AA799087",2,{"$f":"VLOOKUP(L21,Tabella_prezzi!$A$1:$J$223,3,FALSE)","v":"OpzRAM32GB"},{"$f":"VLOOKUP(L21,Tabella_prezzi!$A$1:$J$223,9,FALSE)","v":"L8N03-OpzRAM32GB"},{"$f":"VLOOKUP(L21,Tabella_prezzi!$A$1:$J$223,4,FALSE)*G21*4","v":1312},null,"L8N03",{"$f":"VLOOKUP(L21,Tabella_prezzi!$A$1:$J$223,6,FALSE)","v":"TS3L8-RAM32"}]
["256GB Totali (1 x 64GB DIMM + 6 x 32GB DIMM per Nodo) ⚠","Memory Capacity",null,"32GB RDIMM, 3200MT/s, Dual Rank","*","AA799087",6,{"$f":"VLOOKUP(L22,Tabella_prezzi!$A$1:$J$223,3,FALSE)","v":"OpzRAM32GB"},{"$f":"VLOOKUP(L22,Tabella_prezzi!$A$1:$J$223,9,FALSE)","v":"L8N03-OpzRAM32GB"},{"$f":"VLOOKUP(L22,Tabella_prezzi!$A$1:$J$223,4,FALSE)*G22*4","v":3936},null,"L8N03",{"$f":"VLOOKUP(L22,Tabella_prezzi!$A$1:$J$223,6,FALSE)","v":"TS3L8-RAM32"}]
["512GB Totali (1 x 64GB DIMM + 14 x 32GB DIMM per Nodo) ⚠","Memory Capacity",null,"32GB RDIMM, 3200MT/s, Dual Rank","*","AA799087",6,{"$f":"VLOOKUP(L23,Tabella_prezzi!$A$1:$J$223,3,FALSE)","v":"OpzRAM32GB"},{"$f":"VLOOKUP(L23,Tabella_prezzi!$A$1:$J$223,9,FALSE)","v":"L8N03-OpzRAM32GB"},{"$f":"VLOOKUP(L23,Tabella_prezzi!$A$1:$J$223,4,FALSE)*G23*4","v":3936},null,"L8N03",{"$f":"VLOOKUP(L23,Tabella_prezzi!$A$1:$J$223,6,FALSE)","v":"TS3L8-RAM32"}]
[]
[]
["128GB Totali (1 x 64GB DIMM + 2 x 32GB DIMM per Nodo) ⚠","Memory Capacity",null,"32GB RDIMM, 3200MT/s, Dual Rank","*","AA799087",2,{"$f":"VLOOKUP(L26,Tabella_prezzi!$A$1:$J$223,3,FALSE)","v":"OpzRAM32GB"},{"$f":"VLOOKUP(L26,Tabella_prezzi!$A$1:$J$223,9,FALSE)","v":"L8N03-OpzRAM32GB"},{"$f":"VLOOKUP(L26,Tabella_prezzi!$A$1:$J$223,4,FALSE)*G26*4","v":1312},null,"L8N03",{"$f":"VLOOKUP(L26,Tabella_prezzi!$A$1:$J$223,6,FALSE)","v":"TS3L8-RAM32"}]
["256GB Totali (1 x 64GB DIMM + 6 x 32GB DIMM per Nodo) ⚠","Memory Capacity",null,"32GB RDIMM, 3200MT/s, Dual Rank","*","AA799087",6,{"$f":"VLOOKUP(L27,Tabella_prezzi!$A$1:$J$223,3,FALSE)","v":"OpzRAM32GB"},{"$f":"VLOOKUP(L27,Tabella_prezzi!$A$1:$J$223,9,FALSE)","v":"L8N03-OpzRAM32GB"},{"$f":"VLOOKUP(L27,Tabella_prezzi!$A$1:$J$223,4,FALSE)*G27*4","v":3936},null,"L8N03",{"$f":"VLOOKUP(L27,Tabella_prezzi!$A$1:$J$223,6,FALSE)","v":"TS3L8-RAM32"}]
["TS3L8_OS"]
["No Operating System","Operating System",null,null,null,null,0,null,{"$f":"\"\"","v":""},null,null,{"$f":"\"\"","v":""},{"$f":"\"\"","v":""},0,null,{"$f":"\"\"","v":""},{"$f":"\"\"","v":""},null,0,0,{"$f":"\"\"","v":""}]
["[TS3L8-WINSRVSTD] Windows Server® 2019 Standard","Operating System",null,{"$f":"VLOOKUP(L30,Tabella_prezzi!$A$1:$J$223,8,FALSE)","v":"Windows Server 2019 Standard, ROK, 16CORE"},null,null,1,{"$f":"VLOOKUP(L30,Tabella_prezzi!$A$1:$J$223,3,FALSE)","v":"OpzWinServSTD"},{"$f":"VLOOKUP(L30,Tabella_prezzi!$A$1:$J$223,9,FALSE)","v":"L8N19-OpzWinServSTD"},{"$f":"VLOOKUP(L30,Tabella_prezzi!$A$1:$J$223,4,FALSE)*4","v":2436},null,"L8N19",{"$f":"VLOOKUP(L30,Tabella_prezzi!$A$1:$J$223,6,FALSE)","v":"TS3L8-WINSRVSTD"},8,{"$f":"VLOOKUP(T30,Tabella_prezzi!$A$1:$J$223,3,FALSE)","v":"OpzWinServSTD2core"},{"$f":"VLOOKUP(T30,Tabella_prezzi!$A$1:$J$223,9,FALSE)","v":"L8N22-OpzWinServSTD2core"},{"$f":"VLOOKUP(T30,Tabella_prezzi!$A$1:$J$223,4,FALSE)*N30*4","v":2784},null,0,"L8N22",{"$f":"VLOOKUP(T30,Tabella_prezzi!$A$1:$J$223,6,FALSE)","v":"TS3L8-WINSRV2C"}]
["[TS3L8-LINUX] Ubuntu 18.04 LTS 64 Bit","Operating System",null,{"$f":"VLOOKUP(L31,Tabella_prezzi!$A$1:$J$223,8,FALSE)","v":"Ubuntu 18.04 LTS 64 Bit"},null,null,1,{"$f":"VLOOKUP(L31,Tabella_prezzi!$A$1:$J$223,3,FALSE)","v":"OpzOpenSource"},{"$f":"VLOOKUP(L31,Tabella_prezzi!$A$1:$J$223,9,FALSE)","v":"L8N23-OpzOpenSource"},{"$f":"VLOOKUP(L31,Tabella_prezzi!$A$1:$J$223,4,FALSE)*4","v":208},null,"L8N23",{"$f":"VLOOKUP(L31,Tabella_prezzi!$A$1:$J$223,6,FALSE)","v":"TS3L8-LINUX"},0,null,{"$f":"\"\"","v":""},{"$f":"\"\"","v":""},null,0,0,{"$f":"\"\"","v":""}]
[]
["TS3L8_HDD"]
[{"$f":"\"\"","v":""},null,null,null,null,null,{"$f":"\"\"","v":""},null,{"$f":"\"\"","v":""},null,null,{"$f":"\"\"","v":""},{"$f":"\"\"","v":""}]
["300GB 15K RPM SAS 12Gbps 2.5in Hot-plug","Hard Drives",null,{"$f":"VLOOKUP(L35,Tabella_prezzi!$A$1:$J$223,8,FALSE)","v":"HDD 300GB 15K SAS 12Gbps 2.5in Hot-plug"},null,null,1,{"$f":"VLOOKUP(L35,Tabella_prezzi!$A$1:$J$223,3,FALSE)","v":"OpzHDD300GB"},{"$f":"VLOOKUP(L35,Tabella_prezzi!$A$1:$J$223,9,FALSE)","v":"L8N10-OpzHDD300GB"},{"$f":"VLOOKUP(L35,Tabella_prezzi!$A$1:$J$223,4,FALSE)","v":89},null,"L8N10",{"$f":"VLOOKUP(L35,Tabella_prezzi!$A$1:$J$223,6,FALSE)","v":"TS3L8-HDD300GB"}]
[]
["1.2TB 10K RPM SAS 12Gbps 2.5in Hot-plug","Hard Drives",null,{"$f":"VLOOKUP(L37,Tabella_prezzi!$A$1:$J$223,8,FALSE)","v":"HDD 1200GB 10K SAS 12Gbps 2.5in Hot-plug"},null,null,1,{"$f":"VLOOKUP(L37,Tabella_prezzi!$A$1:$J$223,3,FALSE)","v":"OpzHDD1TB"},{"$f":"VLOOKUP(L37,Tabella_prezzi!$A$1:$J$223,9,FALSE)","v":"L8N09-OpzHDD1TB"},{"$f":"VLOOKUP(L37,Tabella_prezzi!$A$1:$J$223,4,FALSE)","v":105},null,"L8N09",{"$f":"VLOOKUP(L37,Tabella_prezzi!$A$1:$J$223,6,FALSE)","v":"TS3L8-HDD1TB"}]
[]
["480GB SSD SAS Read Intensive 12Gbps 2.5in Hot-plug","Hard Drives",null,{"$f":"VLOOKUP(L39,Tabella_prezzi!$A$1:$J$223,8,FALSE)","v":"SSD 960GB SAS RI 12Gbps 2.5in Hot-plug, 1 DWPD"},null,null,1,{"$f":"VLOOKUP(L39,Tabella_prezzi!$A$1:$J$223,3,FALSE)","v":"OpzSSD-RI400GB"},{"$f":"VLOOKUP(L39,Tabella_prezzi!$A$1:$J$223,9,FALSE)","v":"L8N15-OpzSSD-RI400GB"},{"$f":"VLOOKUP(L39,Tabella_prezzi!$A$1:$J$223,4,FALSE)","v":288},null,"L8N15",{"$f":"VLOOKUP(L39,Tabella_prezzi!$A$1:$J$223,6,FALSE)","v":"TS3L8-RI400GB-U"}]
[]
["960GB SSD SAS Read Intensive 12Gbps 2.5in Hot-plug","Hard Drives",null,{"$f":"VLOOKUP(L41,Tabella_prezzi!$A$1:$J$223,8,FALSE)","v":"SSD 960GB SAS RI 12Gbps 2.5in Hot-plug, 1 DWPD"},null,null,1,{"$f":"VLOOKUP(L41,Tabella_prezzi!$A$1:$J$223,3,FALSE)","v":"OpzSSD-RI800GB"},{"$f":"VLOOKUP(L41,Tabella_prezzi!$A$1:$J$223,9,FALSE)","v":"L8N13-OpzSSD-RI800GB"},{"$f":"VLOOKUP(L41,Tabella_prezzi!$A$1:$J$223,4,FALSE)","v":432},null,"L8N13",{"$f":"VLOOKUP(L41,Tabella_prezzi!$A$1:$J$223,6,FALSE)","v":"TS3L8-RI800GB"}]
[]
["1.92TB SSD SAS Read Intensive 12Gbps 2.5in Hot-plug","Hard Drives",null,{"$f":"VLOOKUP(L43,Tabella_prezzi!$A$1:$J$223,8,FALSE)","v":"SSD 1,92TB SAS RI 12Gbps 2.5in Hot-plug, 1 DWPD"},null,null,1,{"$f":"VLOOKUP(L43,Tabella_prezzi!$A$1:$J$223,3,FALSE)","v":"OpzSSD-RI1,6TB"},{"$f":"VLOOKUP(L43,Tabella_prezzi!$A$1:$J$223,9,FALSE)","v":"L8N11-OpzSSD-RI1,6TB"},{"$f":"VLOOKUP(L43,Tabella_prezzi!$A$1:$J$223,4,FALSE)","v":615},null,"L8N11",{"$f":"VLOOKUP(L43,Tabella_prezzi!$A$1:$J$223,6,FALSE)","v":"TS3L8-RI1600GB"}]
[]
["960GB SSD SAS Mixed Use 12Gbps 512e 2.5in Hot-Plug","Hard Drives",null,{"$f":"VLOOKUP(L45,Tabella_prezzi!$A$1:$J$223,8,FALSE)","v":"SSD 960GB SAS MU 12Gbps 2.5in Hot-plug, 3 DWPD"},null,null,1,{"$f":"VLOOKUP(L45,Tabella_prezzi!$A$1:$J$223,3,FALSE)","v":"OpzSSD-MU800GB"},{"$f":"VLOOKUP(L45,Tabella_prezzi!$A$1:$J$223,9,FALSE)","v":"L8N14-OpzSSD-MU800GB"},{"$f":"VLOOKUP(L45,Tabella_prezzi!$A$1:$J$223,4,FALSE)","v":599},null,"L8N14",{"$f":"VLOOKUP(L45,Tabella_prezzi!$A$1:$J$223,6,FALSE)","v":"TS3L8-MU800GB"}]
[]
["1.6TB SSD SAS Mixed Use 12Gbps 2.5in Hot-plug","Hard Drives",null,{"$f":"VLOOKUP(L47,Tabella_prezzi!$A$1:$J$223,8,FALSE)","v":"SSD 1,6TB SAS MU 12Gbps 2.5in Hot-plug, 3 DWPD"},null,null,1,{"$f":"VLOOKUP(L47,Tabella_prezzi!$A$1:$J$223,3,FALSE)","v":"OpzSSD-MU1,6TB"},{"$f":"VLOOKUP(L47,Tabella_prezzi!$A$1:$J$223,9,FALSE)","v":"L8N12-OpzSSD-MU1,6TB"},{"$f":"VLOOKUP(L47,Tabella_prezzi!$A$1:$J$223,4,FALSE)","v":754},null,"L8N12",{"$f":"VLOOKUP(L47,Tabella_prezzi!$A$1:$J$223,6,FALSE)","v":"TS3L8-MU1600GB"}]
[]
["800GB SSD SAS Write Intensive 12Gbps 2.5in Hot-plug","Hard Drives",null,{"$f":"VLOOKUP(L49,Tabella_prezzi!$A$1:$J$223,8,FALSE)","v":"SSD 800GB SAS WI 12Gbps 2.5in Hot-plug, 10 DWPD"},null,null,1,{"$f":"VLOOKUP(L49,Tabella_prezzi!$A$1:$J$223,3,FALSE)","v":0},{"$f":"VLOOKUP(L49,Tabella_prezzi!$A$1:$J$223,9,FALSE)","v":"TS3-OpzA20800WI"},null,{"$f":"VLOOKUP(L49,Tabella_prezzi!$A$1:$J$223,4,FALSE)","v":1106},"L8N32",{"$f":"VLOOKUP(L49,Tabella_prezzi!$A$1:$J$223,6,FALSE)","v":"TS3L8-WI800GB"}]
[]
["Aggiungere Secondo Processore"]
["TS3L8_PCI_C"]
[{"$f":"\"\"","v":""},null,null,null,null,null,{"$f":"\"\"","v":""},null,{"$f":"\"\"","v":""},null,null,{"$f":"\"\"","v":""},{"$f":"\"\"","v":""}]
["[TS3L8-LAN1-L] Broadcom 5719 Quad Port 1Gb Network Interface Card LP",null,null,{"$f":"VLOOKUP(L54,Tabella_prezzi!$A$1:$J$223,8,FALSE)","v":"Scheda LAN 5719 QP 1Gb LOW"},null,null,1,{"$f":"VLOOKUP(L54,Tabella_prezzi!$A$1:$J$223,3,FALSE)","v":"OpzGigabit"},{"$f":"VLOOKUP(L54,Tabella_prezzi!$A$1:$J$223,9,FALSE)","v":"L8N05-OpzGigabitLP"},{"$f":"VLOOKUP(L54,Tabella_prezzi!$A$1:$J$223,4,FALSE)","v":26},null,"L8N05",{"$f":"VLOOKUP(L54,Tabella_prezzi!$A$1:$J$223,6,FALSE)","v":"TS3L8-LAN1-L"}]
["[TS3L8-LAN10-L] Intel X710 2-port 10GbE Adapter LP",null,null,{"$f":"VLOOKUP(L55,Tabella_prezzi!$A$1:$J$223,8,FALSE)","v":"Scheda DP X710 10Gb SFP+ LOW"},null,null,1,{"$f":"VLOOKUP(L55,Tabella_prezzi!$A$1:$J$223,3,FALSE)","v":"OpzGigabit10Gbps"},{"$f":"VLOOKUP(L55,Tabella_prezzi!$A$1:$J$223,9,FALSE)","v":"L8N06-OpzGigabit10GbpsLP"},{"$f":"VLOOKUP(L55,Tabella_prezzi!$A$1:$J$223,4,FALSE)","v":153},null,"L8N06",{"$f":"VLOOKUP(L55,Tabella_prezzi!$A$1:$J$223,6,FALSE)","v":"TS3L8-LAN10-L"}]
["[TS3L8-LAN25-L] Mellanox ConnectX-5 Dual Port 10/25GbE SFP28 Adapter, PCIe LP",null,null,{"$f":"VLOOKUP(L56,Tabella_prezzi!$A$1:$J$223,8,FALSE)","v":"Scheda DP CONNECTX-5 25Gb SFP28 LOW"},null,null,1,{"$f":"VLOOKUP(L56,Tabella_prezzi!$A$1:$J$223,3,FALSE)","v":"OpzGigabit25Gbps"},{"$f":"VLOOKUP(L56,Tabella_prezzi!$A$1:$J$223,9,FALSE)","v":"L8N07-OpzGigabit25GbpsLP"},{"$f":"VLOOKUP(L56,Tabella_prezzi!$A$1:$J$223,4,FALSE)","v":389},null,"L8N07",{"$f":"VLOOKUP(L56,Tabella_prezzi!$A$1:$J$223,6,FALSE)","v":"TS3L8-LAN25-L"}]
["[TS3L8-CNA10-L] Marvell Qlogic 41232 2-port 10GbE Adapter LP",null,null,{"$f":"VLOOKUP(L57,Tabella_prezzi!$A$1:$J$223,8,FALSE)","v":"Scheda CNA QL41232 DP 10Gb SFP+ LOW"},null,null,1,{"$f":"VLOOKUP(L57,Tabella_prezzi!$A$1:$J$223,3,FALSE)","v":"OpzGigabit10Gbps CNA"},{"$f":"VLOOKUP(L57,Tabella_prezzi!$A$1:$J$223,9,FALSE)","v":"L8N08-OpzCNA10GbpsLP"},{"$f":"VLOOKUP(L57,Tabella_prezzi!$A$1:$J$223,4,FALSE)","v":159},null,"L8N08",{"$f":"VLOOKUP(L57,Tabella_prezzi!$A$1:$J$223,6,FALSE)","v":"TS3L8-CNA10-L"}]
["-=-=-=-=-=-=-=-=-=-=-=-=-=-=-=-=-20%-=-=-=-=-=-=-=-=-=-=-=-=-=-=-=-=-",null,null,null,null,null,{"$f":"\"\"","v":""},null,{"$f":"\"\"","v":""},null,null,{"$f":"\"\"","v":""},{"$f":"\"\"","v":""}]
["[TS3L8-57416BT-L] Broadcom 57416 Dual Port 10Gb, Base-T, PCIe Adapter, LP","TS3L8-57416BT-L",null,{"$f":"VLOOKUP(L59,Tabella_prezzi!$A$1:$J$223,8,FALSE)","v":"Broadcom 57416 Dual Port 10Gb, Base-T, PCIe Adapter, LP"},null,null,1,{"$f":"VLOOKUP(L59,Tabella_prezzi!$A$1:$J$223,3,FALSE)","v":0},{"$f":"VLOOKUP(L59,Tabella_prezzi!$A$1:$J$223,9,FALSE)","v":"TS3-OpzA2057416"},null,{"$f":"VLOOKUP(L59,Tabella_prezzi!$A$1:$J$223,4,FALSE)","v":240},"L8N49",{"$f":"VLOOKUP(L59,Tabella_prezzi!$A$1:$J$223,6,FALSE)","v":"TS3L8-57416BT-L"}]
["[TS3L8-X710BT-L] Intel X710-T2L Dual Port 10GbE BASE-T, PCIE Adapter, LP","TS3L8-X710BT-L",null,{"$f":"VLOOKUP(L60,Tabella_prezzi!$A$1:$J$223,8,FALSE)","v":"Intel X710-T2L Dual Port 10GbE BASE-T, PCIE Adapter, LP"},null,null,1,{"$f":"VLOOKUP(L60,Tabella_prezzi!$A$1:$J$223,3,FALSE)","v":0},{"$f":"VLOOKUP(L60,Tabella_prezzi!$A$1:$J$223,9,FALSE)","v":"TS3-OpzA20X710"},null,{"$f":"VLOOKUP(L60,Tabella_prezzi!$A$1:$J$223,4,FALSE)","v":267},"L8N48",{"$f":"VLOOKUP(L60,Tabella_prezzi!$A$1:$J$223,6,FALSE)","v":"TS3L8-X710BT-L"}]
["[TS3L8-MCX6SP-L] Mellanox ConnectX-6 Single Port HDR100 QSFP56 Infiniband Adapter LP",null,null,{"$f":"VLOOKUP(L61,Tabella_prezzi!$A$1:$J$223,8,FALSE)","v":"Mellanox ConnectX-6 Single Port HDR100 QSFP56 Infiniband Adapter, PCIe Low Profile"},null,null,1,{"$f":"VLOOKUP(L61,Tabella_prezzi!$A$1:$J$223,3,FALSE)","v":0},{"$f":"VLOOKUP(L61,Tabella_prezzi!$A$1:$J$223,9,FALSE)","v":"TS3-OpzA20MCX6L"},null,{"$f":"VLOOKUP(L61,Tabella_prezzi!$A$1:$J$223,4,FALSE)","v":826},"L8N28",{"$f":"VLOOKUP(L61,Tabella_prezzi!$A$1:$J$223,6,FALSE)","v":"TS3L8-MCX6SP-L"}]
[]
[]
["Cavo “patch” di 3 mt RJ45 certificato per gigabit ethernet",null,null,{"$f":"VLOOKUP(L64,Tabella_prezzi!$A$1:$J$223,8,FALSE)","v":"Cavo “patch” di 3 mt RJ45 certificato per gigabit ethernet"},null,null,1,{"$f":"VLOOKUP(L64,Tabella_prezzi!$A$1:$J$223,3,FALSE)","v":"OpzRJ45 3m"},{"$f":"VLOOKUP(L64,Tabella_prezzi!$A$1:$J$223,9,FALSE)","v":"TS3-OpzA20RJ45"},null,{"$f":"VLOOKUP(L64,Tabella_prezzi!$A$1:$J$223,4,FALSE)","v":3},"L8N30",{"$f":"VLOOKUP(L64,Tabella_prezzi!$A$1:$J$223,6,FALSE)","v":"TS3L8-RJ453M"}]
["Adapter - Mini DisplayPort to VGA",null,null,{"$f":"VLOOKUP(L65,Tabella_prezzi!$A$1:$J$223,8,FALSE)","v":"Adapter - Mini DisplayPort to VGA"},null,null,1,{"$f":"VLOOKUP(L65,Tabella_prezzi!$A$1:$J$223,3,FALSE)","v":0},{"$f":"VLOOKUP(L65,Tabella_prezzi!$A$1:$J$223,9,FALSE)","v":"TS3-OpzA20MDPVGA"},null,{"$f":"VLOOKUP(L65,Tabella_prezzi!$A$1:$J$223,4,FALSE)","v":35},"L8N56",{"$f":"VLOOKUP(L65,Tabella_prezzi!$A$1:$J$223,6,FALSE)","v":"TS3L8-MDPVGA"}]
["TS3L8_WARRANTY"]
["Manutenzione in garanzia (36 mesi)","Dell Services: Extended Service",null,"RESTRICTED:ProSupport One Data Center and Next Business Day Onsite Service Volume Low, 39 Month(s)",null,null,{"$f":"\"\"","v":""},null,{"$f":"\"\"","v":""},null,null,{"$f":"\"\"","v":""},{"$f":"\"\"","v":""}]
["[TS3L8-5Y] Manutenzione in garanzia (60 mesi)","Dell Services: Extended Service",null,{"$f":"VLOOKUP(L68,Tabella_prezzi!$A$1:$J$223,8,FALSE)","v":"Estensione della manutenzione in garanzia per ulteriori 24 mesi"},null,null,1,{"$f":"VLOOKUP(L68,Tabella_prezzi!$A$1:$J$223,3,FALSE)","v":"OpzEstensione24"},{"$f":"VLOOKUP(L68,Tabella_prezzi!$A$1:$J$223,9,FALSE)","v":"L8N25-OpzEstensione24"},{"$f":"VLOOKUP(L68,Tabella_prezzi!$A$1:$J$223,4,FALSE)","v":318},null,"L8N25",{"$f":"VLOOKUP(L68,Tabella_prezzi!$A$1:$J$223,6,FALSE)","v":"TS3L8-5Y"}]
[]
["TS3L8_KYHDD"]
[{"$f":"\"\"","v":""},"Keep Your Hard Drive",null,null,null,null,{"$f":"\"\"","v":""},null,{"$f":"\"\"","v":""},null,null,{"$f":"\"\"","v":""},{"$f":"\"\"","v":""}]
["Hard Disk Retention","Keep Your Hard Drive",null,{"$f":"VLOOKUP(L72,Tabella_prezzi!$A$1:$J$223,8,FALSE)","v":"Hard Disk Retention 36m"},null,null,1,{"$f":"VLOOKUP(L72,Tabella_prezzi!$A$1:$J$223,3,FALSE)","v":"OpzHDDRetention"},{"$f":"VLOOKUP(L72,Tabella_prezzi!$A$1:$J$223,9,FALSE)","v":"L8N24-OpzHDDRetention"},{"$f":"VLOOKUP(L72,Tabella_prezzi!$A$1:$J$223,4,FALSE)","v":44},null,"L8N24",{"$f":"VLOOKUP(L72,Tabella_prezzi!$A$1:$J$223,6,FALSE)","v":"TS3L8-HDRTNTN"}]
["Hard Disk Retention (60 mesi)","Keep Your Hard Drive",null,{"$f":"VLOOKUP(L73,Tabella_prezzi!$A$1:$J$223,8,FALSE)","v":"Hard Disk Retention 60m"},null,null,1,{"$f":"VLOOKUP(L73,Tabella_prezzi!$A$1:$J$223,3,FALSE)","v":"OpzHDDRetention"},{"$f":"VLOOKUP(L73,Tabella_prezzi!$A$1:$J$223,9,FALSE)","v":"L8N27-OpzHDDRetention60"},{"$f":"VLOOKUP(L73,Tabella_prezzi!$A$1:$J$223,4,FALSE)","v":73},null,"L8N27",{"$f":"VLOOKUP(L73,Tabella_prezzi!$A$1:$J$223,6,FALSE)","v":"TS3L8-HDRTNTN60"}]
[]
[]
["Broadcom 5720 Quad Port 1GbE BASE-T Mezzanine Adapter",null,null,null,null,null,{"$f":"\"\"","v":""},null,{"$f":"\"\"","v":""},null,null,{"$f":"\"\"","v":""},{"$f":"\"\"","v":""}]
["Scheda DP CONNECTX-5 25Gb SFP28 OCP, Transceiver NON INCLUSI",null,null,null,null,null,1,{"$f":"VLOOKUP(L77,Tabella_prezzi!$A$1:$J$223,3,FALSE)","v":0},{"$f":"VLOOKUP(L77,Tabella_prezzi!$A$1:$J$223,9,FALSE)","v":"TS3-OpzA20OCP25"},null,154,"L8N47",{"$f":"VLOOKUP(L77,Tabella_prezzi!$A$1:$J$223,6,FALSE)","v":"TS3L8-OCP25GB"}]
[]
["TS3L8_BOSS"]
[{"$f":"\"\"","v":""},null,null,null,null,null,{"$f":"\"\"","v":""},null,{"$f":"\"\"","v":""},null,null,{"$f":"\"\"","v":""},{"$f":"\"\"","v":""}]
["[TS3L8-BOSS480] BOSS controller card for C6525, 2 x 480G M.2 Drive",null,null,{"$f":"VLOOKUP(L81,Tabella_prezzi!$A$1:$J$223,8,FALSE)","v":"BOSS controller card for C6525, 2 x 480G M.2 Drive"},null,null,1,{"$f":"VLOOKUP(L81,Tabella_prezzi!$A$1:$J$223,3,FALSE)","v":0},{"$f":"VLOOKUP(L81,Tabella_prezzi!$A$1:$J$223,9,FALSE)","v":"TS3-OpzA20B4808"},null,{"$f":"VLOOKUP(L81,Tabella_prezzi!$A$1:$J$223,4,FALSE)","v":953},"L8N29",{"$f":"VLOOKUP(L81,Tabella_prezzi!$A$1:$J$223,6,FALSE)","v":"TS3L8-BOSS480"}]
["Selezionare HBA345"]
["TS3L8_Controller"]
["PERC H745 Controller Card",null,null,null,null,null,{"$f":"\"\"","v":""},null,{"$f":"\"\"","v":""},null,null,{"$f":"\"\"","v":""},{"$f":"\"\"","v":""}]
["[TS3L8-HBA345] HBA345 Controller Card",null,null,{"$f":"VLOOKUP(L85,Tabella_prezzi!$A$1:$J$223,8,FALSE)","v":"HBA345 Controller Card in sostituzione del Controller in configurazione BASE"},null,null,1,{"$f":"VLOOKUP(L85,Tabella_prezzi!$A$1:$J$223,3,FALSE)","v":"OpzHBA345"},{"$f":"VLOOKUP(L85,Tabella_prezzi!$A$1:$J$223,9,FALSE)","v":"TS3-OpzA20BA345"},null,{"$f":"VLOOKUP(L85,Tabella_prezzi!$A$1:$J$223,4,FALSE)","v":635},"L8N31",{"$f":"VLOOKUP(L85,Tabella_prezzi!$A$1:$J$223,6,FALSE)","v":"TS3L8-HBA345"}]
[]
[]
["BUNDLE PMEUPS3RTSER Comprensivo di UPS e scheda SNMP + Kit Rack incluso",null,null,{"$f":"VLOOKUP(L88,Tabella_prezzi!$A$1:$J$223,8,FALSE)","v":"Powerme Online UPS RPMM/9 3K, Rack, SNMP card"},null,null,1,{"$f":"VLOOKUP(L88,Tabella_prezzi!$A$1:$J$223,3,FALSE)","v":"OpzUps (3000VA)"},{"$f":"VLOOKUP(L88,Tabella_prezzi!$A$1:$J$223,9,FALSE)","v":"L8N16-OpzUps"},{"$f":"VLOOKUP(L88,Tabella_prezzi!$A$1:$J$223,4,FALSE)","v":328},null,"L8N16",{"$f":"VLOOKUP(L88,Tabella_prezzi!$A$1:$J$223,6,FALSE)","v":"TS3L8-UPS"}]
["Unità KVM - monitor 17\", cavo combi PS2 e USB da 1,8mt, tastiera ita, touch pad",null,null,{"$f":"VLOOKUP(L89,Tabella_prezzi!$A$1:$J$223,8,FALSE)","v":"Console KVM GUI da rack"},null,null,1,{"$f":"VLOOKUP(L89,Tabella_prezzi!$A$1:$J$223,3,FALSE)","v":"OpzGUI"},{"$f":"VLOOKUP(L89,Tabella_prezzi!$A$1:$J$223,9,FALSE)","v":"L8N17-OpzGUI"},{"$f":"VLOOKUP(L89,Tabella_prezzi!$A$1:$J$223,4,FALSE)","v":439},null,"L8N17",{"$f":"VLOOKUP(L89,Tabella_prezzi!$A$1:$J$223,6,FALSE)","v":"TS3L8-GUI"}]
["Switch 16 porte IP con relativi cavi combi PS/2 e USB inclusi",null,null,{"$f":"VLOOKUP(L90,Tabella_prezzi!$A$1:$J$223,8,FALSE)","v":"KVM Switch IP per GUI 16P"},null,null,1,{"$f":"VLOOKUP(L90,Tabella_prezzi!$A$1:$J$223,3,FALSE)","v":"OpzKVM"},{"$f":"VLOOKUP(L90,Tabella_prezzi!$A$1:$J$223,9,FALSE)","v":"L8N18-OpzKVM"},{"$f":"VLOOKUP(L90,Tabella_prezzi!$A$1:$J$223,4,FALSE)","v":506},null,"L8N18",{"$f":"VLOOKUP(L90,Tabella_prezzi!$A$1:$J$223,6,FALSE)","v":"TS3L8-SWKVM"}]
["1-pack of Windows Server 2019/2016 Device CALs (STD or DC)",null,null,{"$f":"VLOOKUP(L91,Tabella_prezzi!$A$1:$J$223,8,FALSE)","v":"Windows Server 2019 Device CAL (STD or DC)"},null,null,1,{"$f":"VLOOKUP(L91,Tabella_prezzi!$A$1:$J$223,3,FALSE)","v":"OpzDeviceCal"},{"$f":"VLOOKUP(L91,Tabella_prezzi!$A$1:$J$223,9,FALSE)","v":"L8N20-OpzDeviceCal"},{"$f":"VLOOKUP(L91,Tabella_prezzi!$A$1:$J$223,4,FALSE)","v":21},null,"L8N20",{"$f":"VLOOKUP(L91,Tabella_prezzi!$A$1:$J$223,6,FALSE)","v":"TS3L8-WINDEVCAL"}]
["1-pack of Windows Server 2019/2016 User CALs (STD or DC)",null,null,{"$f":"VLOOKUP(L92,Tabella_prezzi!$A$1:$J$223,8,FALSE)","v":"Windows Server 2019 User CAL (STD or DC)"},null,null,1,{"$f":"VLOOKUP(L92,Tabella_prezzi!$A$1:$J$223,3,FALSE)","v":"OpzUserCal"},{"$f":"VLOOKUP(L92,Tabella_prezzi!$A$1:$J$223,9,FALSE)","v":"L8N21-OpzUserCal"},{"$f":"VLOOKUP(L92,Tabella_prezzi!$A$1:$J$223,4,FALSE)","v":26},null,"L8N21",{"$f":"VLOOKUP(L92,Tabella_prezzi!$A$1:$J$223,6,FALSE)","v":"TS3L8-WINUSRCAL"}]
["Rack 42U con portata 1000 KG e 4 ruote + coppia PDU 12 prese Shuko bipasso ITA",null,null,{"$f":"VLOOKUP(L93,Tabella_prezzi!$A$1:$J$223,8,FALSE)","v":"Armadio Rack 42U"},null,null,1,{"$f":"VLOOKUP(L93,Tabella_prezzi!$A$1:$J$223,3,FALSE)","v":"OpzRack"},{"$f":"VLOOKUP(L93,Tabella_prezzi!$A$1:$J$223,9,FALSE)","v":"L8N26-OpzRack"},{"$f":"VLOOKUP(L93,Tabella_prezzi!$A$1:$J$223,4,FALSE)","v":511},null,"L8N26",{"$f":"VLOOKUP(L93,Tabella_prezzi!$A$1:$J$223,6,FALSE)","v":"TS3L8-RACK"}]
["Armadio Rack 42U 600x1200, 2 x PDU Monofase 2G, ZeroU, 32A, 230V, (36) C13 & (6) C19",null,null,{"$f":"VLOOKUP(L94,Tabella_prezzi!$A$1:$J$223,8,FALSE)","v":"Armadio Rack 42U 600x1200, 2 x PDU Monofase 2G, ZeroU, 32A, 230V, (36) C13 & (6) C19"},null,null,1,{"$f":"VLOOKUP(L94,Tabella_prezzi!$A$1:$J$223,3,FALSE)","v":0},{"$f":"VLOOKUP(L94,Tabella_prezzi!$A$1:$J$223,9,FALSE)","v":"TS3-OpzA20RAPCM"},null,{"$f":"VLOOKUP(L94,Tabella_prezzi!$A$1:$J$223,4,FALSE)","v":2653},"L8N45",{"$f":"VLOOKUP(L94,Tabella_prezzi!$A$1:$J$223,6,FALSE)","v":"TS3L8-RACKM32A"}]
["Armadio Rack 42U 600x1200, 2 x PDU Trifase 2G, ZeroU, 22.0kW(32A) 17.3kW(24A), 230V, (30) C13 & (12) C19",null,null,{"$f":"VLOOKUP(L95,Tabella_prezzi!$A$1:$J$223,8,FALSE)","v":"Armadio Rack 42U 600x1200, 2 x PDU Trifase 2G, ZeroU, 22.0kW(32A) 17.3kW(24A), 230V, (30) C13 & (12) C19"},null,null,1,{"$f":"VLOOKUP(L95,Tabella_prezzi!$A$1:$J$223,3,FALSE)","v":0},{"$f":"VLOOKUP(L95,Tabella_prezzi!$A$1:$J$223,9,FALSE)","v":"TS3-OpzA20RAPCT"},null,{"$f":"VLOOKUP(L95,Tabella_prezzi!$A$1:$J$223,4,FALSE)","v":4311},"L8N46",{"$f":"VLOOKUP(L95,Tabella_prezzi!$A$1:$J$223,6,FALSE)","v":"TS3L8-RACKT32A"}]
["VMware vSphere 7 Standard Acceleration Kit OEM for 6 CPU, 3YR License and Maintenance",null,null,{"$f":"VLOOKUP(L96,Tabella_prezzi!$A$1:$J$223,8,FALSE)","v":"VMware vSphere 7 Standard Acceleration Kit OEM for 6 CPU, 3YR License and Maintenance"},null,null,1,{"$f":"VLOOKUP(L96,Tabella_prezzi!$A$1:$J$223,3,FALSE)","v":0},{"$f":"VLOOKUP(L96,Tabella_prezzi!$A$1:$J$223,9,FALSE)","v":"TS3-OpzA20VMW01"},null,{"$f":"VLOOKUP(L96,Tabella_prezzi!$A$1:$J$223,4,FALSE)","v":16549},"L8N33",{"$f":"VLOOKUP(L96,Tabella_prezzi!$A$1:$J$223,6,FALSE)","v":"TS3L8-VS7STD6AK"}]
["VMware vSphere 7 Standard OEM, 1 CPU (max 32 cores/CPU socket), 3YR License and Maintenance",null,null,{"$f":"VLOOKUP(L97,Tabella_prezzi!$A$1:$J$223,8,FALSE)","v":"VMware vSphere 7 Standard OEM, 1 CPU (max 32 cores/CPU socket), 3YR License and Maintenance"},null,null,1,{"$f":"VLOOKUP(L97,Tabella_prezzi!$A$1:$J$223,3,FALSE)","v":0},{"$f":"VLOOKUP(L97,Tabella_prezzi!$A$1:$J$223,9,FALSE)","v":"TS3-OpzA20VMW02"},null,{"$f":"VLOOKUP(L97,Tabella_prezzi!$A$1:$J$223,4,FALSE)","v":1557},"L8N34",{"$f":"VLOOKUP(L97,Tabella_prezzi!$A$1:$J$223,6,FALSE)","v":"TS3L8-VS7STD"}]
["VMware vSphere 7 Enterprise Plus Acceleration Kit OEM for 6 CPU, 3YR License and Maintenance",null,null,{"$f":"VLOOKUP(L98,Tabella_prezzi!$A$1:$J$223,8,FALSE)","v":"VMware vSphere 7 Enterprise Plus Acceleration Kit OEM for 6 CPU, 3YR License and Maintenance"},null,null,1,{"$f":"VLOOKUP(L98,Tabella_prezzi!$A$1:$J$223,3,FALSE)","v":0},{"$f":"VLOOKUP(L98,Tabella_prezzi!$A$1:$J$223,9,FALSE)","v":"TS3-OpzA20VMW03"},null,{"$f":"VLOOKUP(L98,Tabella_prezzi!$A$1:$J$223,4,FALSE)","v":34860},"L8N35",{"$f":"VLOOKUP(L98,Tabella_prezzi!$A$1:$J$223,6,FALSE)","v":"TS3L8-VS7EPL6AK"}]
["VMware vSphere 7 Enterprise Plus OEM, 1 CPU (max 32 cores/CPU socket), 3YR License and Maintenance",null,null,{"$f":"VLOOKUP(L99,Tabella_prezzi!$A$1:$J$223,8,FALSE)","v":"VMware vSphere 7 Enterprise Plus OEM, 1 CPU (max 32 cores/CPU socket), 3YR License and Maintenance"},null,null,1,{"$f":"VLOOKUP(L99,Tabella_prezzi!$A$1:$J$223,3,FALSE)","v":0},{"$f":"VLOOKUP(L99,Tabella_prezzi!$A$1:$J$223,9,FALSE)","v":"TS3-OpzA20VMW04"},null,{"$f":"VLOOKUP(L99,Tabella_prezzi!$A$1:$J$223,4,FALSE)","v":4576},"L8N36",{"$f":"VLOOKUP(L99,Tabella_prezzi!$A$1:$J$223,6,FALSE)","v":"TS3L8-VS7EPL"}]
["VMware vCenter 7 Standard OEM ,Per Instance,3YR License and Maintenance",null,null,{"$f":"VLOOKUP(L100,Tabella_prezzi!$A$1:$J$223,8,FALSE)","v":"VMware vCenter 7 Standard OEM ,Per Instance,3YR License and Maintenance"},null,null,1,{"$f":"VLOOKUP(L100,Tabella_prezzi!$A$1:$J$223,3,FALSE)","v":0},{"$f":"VLOOKUP(L100,Tabella_prezzi!$A$1:$J$223,9,FALSE)","v":"TS3-OpzA20VMW05"},null,{"$f":"VLOOKUP(L100,Tabella_prezzi!$A$1:$J$223,4,FALSE)","v":7860},"L8N37",{"$f":"VLOOKUP(L100,Tabella_prezzi!$A$1:$J$223,6,FALSE)","v":"TS3L8-VCS7STD"}]
["VMware vSAN 7 Enterprise OEM, 1 CPU (max 32 cores/CPU socket), 3YR License and Maintenance",null,null,{"$f":"VLOOKUP(L101,Tabella_prezzi!$A$1:$J$223,8,FALSE)","v":"VMware vSAN 7 Enterprise OEM, 1 CPU (max 32 cores/CPU socket), 3YR License and Maintenance"},null,null,1,{"$f":"VLOOKUP(L101,Tabella_prezzi!$A$1:$J$223,3,FALSE)","v":0},{"$f":"VLOOKUP(L101,Tabella_prezzi!$A$1:$J$223,9,FALSE)","v":"TS3-OpzA20VMW06"},null,{"$f":"VLOOKUP(L101,Tabella_prezzi!$A$1:$J$223,4,FALSE)","v":7196},"L8N38",{"$f":"VLOOKUP(L101,Tabella_prezzi!$A$1:$J$223,6,FALSE)","v":"TS3L8-ST7ENT"}]
["VMware Horizon 8 Advanced OEM,10 Pack,CCU, 3YR License and Maintenance",null,null,{"$f":"VLOOKUP(L102,Tabella_prezzi!$A$1:$J$223,8,FALSE)","v":"VMware Horizon 8 Advanced OEM,10 Pack,CCU, 3YR License and Maintenance"},null,null,1,{"$f":"VLOOKUP(L102,Tabella_prezzi!$A$1:$J$223,3,FALSE)","v":0},{"$f":"VLOOKUP(L102,Tabella_prezzi!$A$1:$J$223,9,FALSE)","v":"TS3-OpzA20VMW07"},null,{"$f":"VLOOKUP(L102,Tabella_prezzi!$A$1:$J$223,4,FALSE)","v":5028},"L8N39",{"$f":"VLOOKUP(L102,Tabella_prezzi!$A$1:$J$223,6,FALSE)","v":"TS3L8-HZ8ADC10"}]
["VMware Horizon 8 Enterprise OEM,10 Pack,CCU, 3YR License and Maintenance",null,null,{"$f":"VLOOKUP(L103,Tabella_prezzi!$A$1:$J$223,8,FALSE)","v":"VMware Horizon 8 Enterprise OEM,10 Pack,CCU, 3YR License and Maintenance"},null,null,1,{"$f":"VLOOKUP(L103,Tabella_prezzi!$A$1:$J$223,3,FALSE)","v":0},{"$f":"VLOOKUP(L103,Tabella_prezzi!$A$1:$J$223,9,FALSE)","v":"TS3-OpzA20VMW08"},null,{"$f":"VLOOKUP(L103,Tabella_prezzi!$A$1:$J$223,4,FALSE)","v":7116},"L8N40",{"$f":"VLOOKUP(L103,Tabella_prezzi!$A$1:$J$223,6,FALSE)","v":"TS3L8-HZ8ENC10"}]
["VMware Horizon Advanced OEM, 10 Pack, Named User, 3YR License and Maintenance",null,null,{"$f":"VLOOKUP(L104,Tabella_prezzi!$A$1:$J$223,8,FALSE)","v":"VMware Horizon Advanced OEM, 10 Pack, Named User, 3YR License and Maintenance"},null,null,1,{"$f":"VLOOKUP(L104,Tabella_prezzi!$A$1:$J$223,3,FALSE)","v":0},{"$f":"VLOOKUP(L104,Tabella_prezzi!$A$1:$J$223,9,FALSE)","v":"TS3-OpzA20VMW09"},null,{"$f":"VLOOKUP(L104,Tabella_prezzi!$A$1:$J$223,4,FALSE)","v":3089},"L8N41",{"$f":"VLOOKUP(L104,Tabella_prezzi!$A$1:$J$223,6,FALSE)","v":"TS3L8-HZ8ADN10"}]
["VMware Horizon 8 Enterprise OEM,10 Pack, Named User, 3YR License and Maintenance",null,null,{"$f":"VLOOKUP(L105,Tabella_prezzi!$A$1:$J$223,8,FALSE)","v":"VMware Horizon 8 Enterprise OEM,10 Pack, Named User, 3YR License and Maintenance"},null,null,1,{"$f":"VLOOKUP(L105,Tabella_prezzi!$A$1:$J$223,3,FALSE)","v":0},{"$f":"VLOOKUP(L105,Tabella_prezzi!$A$1:$J$223,9,FALSE)","v":"TS3-OpzA20VMW10"},null,{"$f":"VLOOKUP(L105,Tabella_prezzi!$A$1:$J$223,4,FALSE)","v":4398},"L8N42",{"$f":"VLOOKUP(L105,Tabella_prezzi!$A$1:$J$223,6,FALSE)","v":"TS3L8-HZ8ENN10"}]
["Enclosure SAS 12 Slot 3.5\", 3YR ProSupport and 4hr Mission Critical",null,null,{"$f":"VLOOKUP(L106,Tabella_prezzi!$A$1:$J$223,8,FALSE)","v":"Enclosure SAS 12 Slot 3.5\", 3YR ProSupport and 4hr Mission Critical"},null,null,1,{"$f":"VLOOKUP(L106,Tabella_prezzi!$A$1:$J$223,3,FALSE)","v":0},{"$f":"VLOOKUP(L106,Tabella_prezzi!$A$1:$J$223,9,FALSE)","v":"TS3-OpzA20E13Y4"},null,{"$f":"VLOOKUP(L106,Tabella_prezzi!$A$1:$J$223,4,FALSE)","v":2727},"L8N43",{"$f":"VLOOKUP(L106,Tabella_prezzi!$A$1:$J$223,6,FALSE)","v":"TS3L8-Encl13Y4H"}]
["Enclosure SAS 12 Slot 3.5\", 5YR ProSupport and 4hr Mission Critical",null,null,{"$f":"VLOOKUP(L107,Tabella_prezzi!$A$1:$J$223,8,FALSE)","v":"Enclosure SAS 12 Slot 3.5\", 5YR ProSupport and 4hr Mission Critical"},null,null,1,{"$f":"VLOOKUP(L107,Tabella_prezzi!$A$1:$J$223,3,FALSE)","v":0},{"$f":"VLOOKUP(L107,Tabella_prezzi!$A$1:$J$223,9,FALSE)","v":"TS3-OpzA20E25Y4"},null,{"$f":"VLOOKUP(L107,Tabella_prezzi!$A$1:$J$223,4,FALSE)","v":2827},"L8N44",{"$f":"VLOOKUP(L107,Tabella_prezzi!$A$1:$J$223,6,FALSE)","v":"TS3L8-Encl25Y4H"}]
[]
["HDD 16TB SAS 12Gbps 7k 3.5in Hot-Plug per Enclosure 3.5\"",null,null,{"$f":"VLOOKUP(L109,Tabella_prezzi!$A$1:$J$223,8,FALSE)","v":"HDD 16TB SAS 12Gbps 7k 3.5in Hot-Plug per Enclosure 3.5\""},null,null,1,{"$f":"VLOOKUP(L109,Tabella_prezzi!$A$1:$J$223,3,FALSE)","v":0},{"$f":"VLOOKUP(L109,Tabella_prezzi!$A$1:$J$223,9,FALSE)","v":"TS3-OpzA20ED16TB"},null,{"$f":"VLOOKUP(L109,Tabella_prezzi!$A$1:$J$223,4,FALSE)","v":494},"L8N50",{"$f":"VLOOKUP(L109,Tabella_prezzi!$A$1:$J$223,6,FALSE)","v":"TS3L8-ED16TB"}]
["HDD 12TB SAS 12Gbps 7k 3.5in Hot-Plug per Enclosure 3.5\"",null,null,{"$f":"VLOOKUP(L110,Tabella_prezzi!$A$1:$J$223,8,FALSE)","v":"HDD 12TB SAS 12Gbps 7k 3.5in Hot-Plug per Enclosure 3.5\""},null,null,1,{"$f":"VLOOKUP(L110,Tabella_prezzi!$A$1:$J$223,3,FALSE)","v":0},{"$f":"VLOOKUP(L110,Tabella_prezzi!$A$1:$J$223,9,FALSE)","v":"TS3-OpzA20ED12TB"},null,{"$f":"VLOOKUP(L110,Tabella_prezzi!$A$1:$J$223,4,FALSE)","v":443},"L8N51",{"$f":"VLOOKUP(L110,Tabella_prezzi!$A$1:$J$223,6,FALSE)","v":"TS3L8-ED12TB"}]
["HDD 8TB SAS 12Gbps 7k 3.5in Hot-Plug per Enclosure 3.5\"",null,null,{"$f":"VLOOKUP(L111,Tabella_prezzi!$A$1:$J$223,8,FALSE)","v":"HDD 8TB SAS 12Gbps 7k 3.5in Hot-Plug per Enclosure 3.5\""},null,null,1,{"$f":"VLOOKUP(L111,Tabella_prezzi!$A$1:$J$223,3,FALSE)","v":0},{"$f":"VLOOKUP(L111,Tabella_prezzi!$A$1:$J$223,9,FALSE)","v":"TS3-OpzA20ED8TB"},null,{"$f":"VLOOKUP(L111,Tabella_prezzi!$A$1:$J$223,4,FALSE)","v":281},"L8N52",{"$f":"VLOOKUP(L111,Tabella_prezzi!$A$1:$J$223,6,FALSE)","v":"TS3L8-ED08TB"}]
[]
["SFP+ SR Optic for SFP+ ports (CONNECTX-5 10Gb OCP)",null,null,{"$f":"VLOOKUP(L113,Tabella_prezzi!$A$1:$J$223,8,FALSE)","v":"SFP+ SR Optic for SFP+ ports (CONNECTX-5 10Gb OCP)"},null,null,1,{"$f":"VLOOKUP(L113,Tabella_prezzi!$A$1:$J$223,3,FALSE)","v":0},{"$f":"VLOOKUP(L113,Tabella_prezzi!$A$1:$J$223,9,FALSE)","v":"TS3-OpzA20O10GB"},null,{"$f":"VLOOKUP(L113,Tabella_prezzi!$A$1:$J$223,4,FALSE)","v":126},"L8N53",{"$f":"VLOOKUP(L113,Tabella_prezzi!$A$1:$J$223,6,FALSE)","v":"TS3L8-OT10GB"}]
["25GbE Dual Rate SFP28 SR Optic for SFP28 ports (CONNECTX-5 25Gb OCP)",null,null,{"$f":"VLOOKUP(L114,Tabella_prezzi!$A$1:$J$223,8,FALSE)","v":"25GbE Dual Rate SFP28 SR Optic for SFP28 ports (CONNECTX-5 25Gb OCP)"},null,null,2,{"$f":"VLOOKUP(L114,Tabella_prezzi!$A$1:$J$223,3,FALSE)","v":0},{"$f":"VLOOKUP(L114,Tabella_prezzi!$A$1:$J$223,9,FALSE)","v":"TS3-OpzA20O25GB"},null,{"$f":"VLOOKUP(L114,Tabella_prezzi!$A$1:$J$223,4,FALSE)","v":258},"L8N54",{"$f":"VLOOKUP(L114,Tabella_prezzi!$A$1:$J$223,6,FALSE)","v":"TS3L8-OT25GB"}]
["Mellanox LinkX 100Gb/s Passive Copper DAC 3m",null,null,{"$f":"VLOOKUP(L115,Tabella_prezzi!$A$1:$J$223,8,FALSE)","v":"Mellanox LinkX 100Gb/s Passive Copper DAC 3m"},null,null,3,{"$f":"VLOOKUP(L115,Tabella_prezzi!$A$1:$J$223,3,FALSE)","v":0},{"$f":"VLOOKUP(L115,Tabella_prezzi!$A$1:$J$223,9,FALSE)","v":"TS3-OpzA20MLX3M"},null,{"$f":"VLOOKUP(L115,Tabella_prezzi!$A$1:$J$223,4,FALSE)","v":258},"L8N55",{"$f":"VLOOKUP(L115,Tabella_prezzi!$A$1:$J$223,6,FALSE)","v":"TS3L8-MLX100M3"}]
[]
[]
["Mini DisplayPort to VGA"]
[null,0,0]
[null,1,1]
[null,4,4]

{"sheet":"Tabella_prezzi","index":5,"n_rows":64,"n_cols":11,"rows_kept":64,"cut":false,"hidden":true,"merged":[[19,0,20,0],[19,1,20,1],[6,2,7,2],[8,2,9,2],[10,2,11,2],[19,2,20,2],[6,0,7,0],[6,1,7,1],[8,0,9,0],[8,1,9,1],[10,0,11,0],[10,1,11,1],[6,3,7,3],[8,3,9,3],[10,3,11,3],[19,3,20,3],[6,4,7,4],[8,4,9,4],[10,4,11,4],[19,4,20,4],[33,0,34,0],[33,1,34,1],[33,2,34,2],[33,3,34,3],[33,4,34,4],[33,5,34,5],[33,7,34,7],[33,8,34,8],[6,8,7,8],[8,8,9,8],[10,8,11,8],[19,8,20,8],[19,5,20,5],[19,7,20,7],[6,5,7,5],[6,7,7,7],[8,5,9,5],[8,7,9,7],[10,5,11,5],[10,7,11,7]]}
["N°",null,"Attributo","Valore inserito","N°","Codice Convenzione","Qty:","Description:","Sku Number:","Sku Number:"]
["L8N01",1,"Server rackable high-density",8877,"L8N01","TS3L8-SRV-U",1,"DELL PowerEdge C6400 con 4 x DELL PowerEdge C6525","L8N01-ServerC6525",null,"DELL"]
["L8N02",2,"Kit n. 1 Processore aggiuntivo",1157,"L8N02","TS3L8-CPU",1,"Processore AMD EPYC 7282 16C","L8N02-OpzCPU","338-BWBE","DELL"]
["L8N03",3,"OpzRAM32GB",164,"L8N03","TS3L8-RAM32",1,"32GB - 2Rx4 DDR4 RDIMM 3200MHz","L8N03-OpzRAM32GB","AA799087","DELL"]
["L8N04",4,"OpzRAM64GB",400,"L8N04","TS3L8-RAM64",1,"64GB - 2RX4 DDR4 RDIMM 3200MHz","L8N04-OpzRAM64GB","AA799110","DELL"]
["L8N05",5,"OpzGigabit",26,"L8N05","TS3L8-LAN1-L",1,"Scheda LAN 5719 QP 1Gb LOW","L8N05-OpzGigabitLP","540-BBHB","DELL"]
["L8N06",6,"OpzGigabit10Gbps",153,"L8N06","TS3L8-LAN10-L",1,"Scheda DP X710 10Gb SFP+ LOW","L8N06-OpzGigabit10GbpsLP","540-BBML","DELL"]
[null,null,null,null,null,null,2,null,null,"407-BCBN","DELL"]
["L8N07",7,"OpzGigabit25Gbps",389,"L8N07","TS3L8-LAN25-L",1,"Scheda DP CONNECTX-5 25Gb SFP28 LOW","L8N07-OpzGigabit25GbpsLP","540-BCNJ","DELL"]
[null,null,null,null,null,null,2,null,null,"407-BCHI","DELL"]
["L8N08",8,"OpzGigabit10Gbps CNA",159,"L8N08","TS3L8-CNA10-L",1,"Scheda CNA QL41232 DP 10Gb SFP+ LOW","L8N08-OpzCNA10GbpsLP","540-BCNS","DELL"]
[null,null,null,null,null,null,2,null,null,"407-BCBN","DELL"]
["L8N09",9,"OpzHDD1TB",105,"L8N09","TS3L8-HDD1TB",1,"HDD 1200GB 10K SAS 12Gbps 2.5in Hot-plug","L8N09-OpzHDD1TB","400-ATJL","DELL"]
["L8N10",10,"OpzHDD300GB",89,"L8N10","TS3L8-HDD300GB",1,"HDD 300GB 15K SAS 12Gbps 2.5in Hot-plug","L8N10-OpzHDD300GB","400-ATII","DELL"]
["L8N11",11,"OpzSSD-RI1,6TB",615,"L8N11","TS3L8-RI1600GB",1,"SSD 1,92TB SAS RI 12Gbps 2.5in Hot-plug, 1 DWPD","L8N11-OpzSSD-RI1,6TB","400-BFZC","DELL"]
["L8N12",12,"OpzSSD-MU1,6TB",754,"L8N12","TS3L8-MU1600GB",1,"SSD 1,6TB SAS MU 12Gbps 2.5in Hot-plug, 3 DWPD","L8N12-OpzSSD-MU1,6TB","400-AZIH","DELL"]
["L8N13",13,"OpzSSD-RI800GB",432,"L8N13","TS3L8-RI800GB",1,"SSD 960GB SAS RI 12Gbps 2.5in Hot-plug, 1 DWPD","L8N13-OpzSSD-RI800GB","400-BBPN","DELL"]
["L8N14",14,"OpzSSD-MU800GB",599,"L8N14","TS3L8-MU800GB",1,"SSD 960GB SAS MU 12Gbps 2.5in Hot-plug, 3 DWPD","L8N14-OpzSSD-MU800GB","400-BCNN","DELL"]
["L8N15",15,"OpzSSD-RI400GB",288,"L8N15","TS3L8-RI400GB-U",1,"SSD 960GB SAS RI 12Gbps 2.5in Hot-plug, 1 DWPD","L8N15-OpzSSD-RI400GB","400-BKYR","DELL"]
["L8N16",16,"OpzUps (3000VA)",328,"L8N16","TS3L8-UPS",1,"Powerme Online UPS RPMM/9 3K, Rack, SNMP card","L8N16-OpzUps","RPMM9/3K","DELL"]
[null,null,null,null,null,null,1,null,null,null,"DELL"]
["L8N17",17,"OpzGUI",439,"L8N17","TS3L8-GUI",1,"Console KVM GUI da rack","L8N17-OpzGUI","F9857N","DELL"]
["L8N18",18,"OpzKVM",506,"L8N18","TS3L8-SWKVM",1,"KVM Switch IP per GUI 16P","L8N18-OpzKVM","T9816NIP","DELL"]
["L8N19",19,"OpzWinServSTD",609,"L8N19","TS3L8-WINSRVSTD",1,"Windows Server 2019 Standard, ROK, 16CORE","L8N19-OpzWinServSTD","634-BSFX","DELL"]
["L8N20",20,"OpzDeviceCal",21,"L8N20","TS3L8-WINDEVCAL",1,"Windows Server 2019 Device CAL (STD or DC)","L8N20-OpzDeviceCal","623-BBCV","DELL"]
["L8N21",21,"OpzUserCal",26,"L8N21","TS3L8-WINUSRCAL",1,"Windows Server 2019 User CAL (STD or DC)","L8N21-OpzUserCal","623-BBCT","DELL"]
["L8N22",22,"OpzWinServSTD2core",87,"L8N22","TS3L8-WINSRV2C",1,"Windows Server 2019 Standard, Additional License, 2CORE","L8N22-OpzWinServSTD2core","634-BSGS","DELL"]
["L8N23",23,"OpzOpenSource",52,"L8N23","TS3L8-LINUX",1,"Ubuntu 18.04 LTS 64 Bit","L8N23-OpzOpenSource","UbuntuSRV18","DELL"]
["L8N24",24,"OpzHDDRetention",44,"L8N24","TS3L8-HDRTNTN",1,"Hard Disk Retention 36m","L8N24-OpzHDDRetention","785-10921","DELL"]
["L8N25",25,"OpzEstensione24",318,"L8N25","TS3L8-5Y",1,"Estensione della manutenzione in garanzia per ulteriori 24 mesi","L8N25-OpzEstensione24","742-10105","DELL"]
["L8N26",26,"OpzRack",511,"L8N26","TS3L8-RACK",1,"Armadio Rack 42U","L8N26-OpzRack","P6142NCONSIP","DELL"]
["L8N27",27,"OpzHDDRetention",73,"L8N27","TS3L8-HDRTNTN60",1,"Hard Disk Retention 60m","L8N27-OpzHDDRetention60",null,"DELL"]
["L8N28",28,null,826,"L8N28","TS3L8-MCX6SP-L",1,"Mellanox ConnectX-6 Single Port HDR100 QSFP56 Infiniband Adapter, PCIe Low Profile","TS3-OpzA20MCX6L","540-BCMX","DELL"]
["L8N29",29,null,953,"L8N29","TS3L8-BOSS480",1,"BOSS controller card for C6525, 2 x 480G M.2 Drive","TS3-OpzA20B4808","403-BBRN","DELL"]
[null,null,null,null,null,null,2,null,null,"400-AVSS","DELL"]
["L8N30",30,"OpzRJ45 3m",3,"L8N30","TS3L8-RJ453M",1,"Cavo “patch” di 3 mt RJ45 certificato per gigabit ethernet","TS3-OpzA20RJ45"]
["L8N31",31,"OpzHBA345",635,"L8N31","TS3L8-HBA345",1,"HBA345 Controller Card in sostituzione del Controller in configurazione BASE","TS3-OpzA20BA345",null,"DELL"]
["L8N32",32,null,1106,"L8N32","TS3L8-WI800GB",1,"SSD 800GB SAS WI 12Gbps 2.5in Hot-plug, 10 DWPD","TS3-OpzA20800WI"]
["L8N33",null,null,16549,"L8N33","TS3L8-VS7STD6AK",1,"VMware vSphere 7 Standard Acceleration Kit OEM for 6 CPU, 3YR License and Maintenance","TS3-OpzA20VMW01"]
["L8N34",null,null,1557,"L8N34","TS3L8-VS7STD",1,"VMware vSphere 7 Standard OEM, 1 CPU (max 32 cores/CPU socket), 3YR License and Maintenance","TS3-OpzA20VMW02"]
["L8N35",null,null,34860,"L8N35","TS3L8-VS7EPL6AK",1,"VMware vSphere 7 Enterprise Plus Acceleration Kit OEM for 6 CPU, 3YR License and Maintenance","TS3-OpzA20VMW03"]
["L8N36",null,null,4576,"L8N36","TS3L8-VS7EPL",1,"VMware vSphere 7 Enterprise Plus OEM, 1 CPU (max 32 cores/CPU socket), 3YR License and Maintenance","TS3-OpzA20VMW04"]
["L8N37",null,null,7860,"L8N37","TS3L8-VCS7STD",1,"VMware vCenter 7 Standard OEM ,Per Instance,3YR License and Maintenance","TS3-OpzA20VMW05"]
["L8N38",null,null,7196,"L8N38","TS3L8-ST7ENT",1,"VMware vSAN 7 Enterprise OEM, 1 CPU (max 32 cores/CPU socket), 3YR License and Maintenance","TS3-OpzA20VMW06"]
["L8N39",null,null,5028,"L8N39","TS3L8-HZ8ADC10",1,"VMware Horizon 8 Advanced OEM,10 Pack,CCU, 3YR License and Maintenance","TS3-OpzA20VMW07"]
["L8N40",null,null,7116,"L8N40","TS3L8-HZ8ENC10",1,"VMware Horizon 8 Enterprise OEM,10 Pack,CCU, 3YR License and Maintenance","TS3-OpzA20VMW08"]
["L8N41",null,null,3089,"L8N41","TS3L8-HZ8ADN10",1,"VMware Horizon Advanced OEM, 10 Pack, Named User, 3YR License and Maintenance","TS3-OpzA20VMW09"]
["L8N42",null,null,4398,"L8N42","TS3L8-HZ8ENN10",1,"VMware Horizon 8 Enterprise OEM,10 Pack, Named User, 3YR License and Maintenance","TS3-OpzA20VMW10"]
["L8N43",null,null,2727,"L8N43","TS3L8-Encl13Y4H",1,"Enclosure SAS 12 Slot 3.5\", 3YR ProSupport and 4hr Mission Critical","TS3-OpzA20E13Y4"]
["L8N44",null,null,2827,"L8N44","TS3L8-Encl25Y4H",1,"Enclosure SAS 12 Slot 3.5\", 5YR ProSupport and 4hr Mission Critical","TS3-OpzA20E25Y4"]
["L8N45",null,null,2653,"L8N45","TS3L8-RACKM32A",1,"Armadio Rack 42U 600x1200, 2 x PDU Monofase 2G, ZeroU, 32A, 230V, (36) C13 & (6) C19","TS3-OpzA20RAPCM"]
["L8N46",null,null,4311,"L8N46","TS3L8-RACKT32A",1,"Armadio Rack 42U 600x1200, 2 x PDU Trifase 2G, ZeroU, 22.0kW(32A) 17.3kW(24A), 230V, (30) C13 & (12) C19","TS3-OpzA20RAPCT"]
["L8N47",null,null,154,"L8N47","TS3L8-OCP25GB",1,"Scheda DP CONNECTX-5 25Gb SFP28 OCP, Transceiver NON INCLUSI","TS3-OpzA20OCP25"]
["L8N48",null,null,267,"L8N48","TS3L8-X710BT-L",1,"Intel X710-T2L Dual Port 10GbE BASE-T, PCIE Adapter, LP","TS3-OpzA20X710"]
["L8N49",null,null,240,"L8N49","TS3L8-57416BT-L",1,"Broadcom 57416 Dual Port 10Gb, Base-T, PCIe Adapter, LP","TS3-OpzA2057416"]
["L8N50",null,null,494,"L8N50","TS3L8-ED16TB",1,"HDD 16TB SAS 12Gbps 7k 3.5in Hot-Plug per Enclosure 3.5\"","TS3-OpzA20ED16TB"]
["L8N51",null,null,443,"L8N51","TS3L8-ED12TB",1,"HDD 12TB SAS 12Gbps 7k 3.5in Hot-Plug per Enclosure 3.5\"","TS3-OpzA20ED12TB"]
["L8N52",null,null,281,"L8N52","TS3L8-ED08TB",1,"HDD 8TB SAS 12Gbps 7k 3.5in Hot-Plug per Enclosure 3.5\"","TS3-OpzA20ED8TB"]
["L8N53",null,null,126,"L8N53","TS3L8-OT10GB",1,"SFP+ SR Optic for SFP+ ports (CONNECTX-5 10Gb OCP)","TS3-OpzA20O10GB"]
["L8N54",null,null,258,"L8N54","TS3L8-OT25GB",1,"25GbE Dual Rate SFP28 SR Optic for SFP28 ports (CONNECTX-5 25Gb OCP)","TS3-OpzA20O25GB"]
["L8N55",null,null,258,"L8N55","TS3L8-MLX100M3",1,"Mellanox LinkX 100Gb/s Passive Copper DAC 3m","TS3-OpzA20MLX3M"]
["L8N56",null,null,35,"L8N56","TS3L8-MDPVGA",1,"Adapter - Mini DisplayPort to VGA","TS3-OpzA20MDPVGA"]
["L8N57",null,null,null,"L8N57"]
["L8N99",99,"OpzCodiceNATO",200,"L8N99","TS3L8-NATO",1,"Codifica NATO","L8N99-OpzCodiceNATO",null,"DELL"]

{"sheet":"Riepilogo","index":6,"n_rows":116,"n_cols":28,"rows_kept":116,"cut":false,"hidden":false,"merged":[[10,1,10,2],[10,3,10,6],[1,1,1,2],[1,3,1,6],[3,1,3,2],[5,1,5,2],[7,1,7,2],[114,1,114,5],[12,4,12,6],[15,1,15,2],[15,3,15,6],[17,4,17,6],[20,1,20,6],[57,1,57,6],[110,1,110,5],[111,1,111,2],[111,4,111,5],[112,1,112,5],[113,1,113,5]]}
[null,null,null,null,null,null,null,null,null,1]
[null,"Ente:",null,null,null,null,null,null,null,1,null,"ente",{"$f":"IF(D2>0,0,1)","v":1}]
[null,null,null,null,null,null,null,null,null,1]
[null,"Ordine N.",null,null,{"$f":"M7","v":"ERRORE DI MANCATA COPMILAZIONE DATI NECESSARI PER L'ORDINATIVO"},null,null,null,null,1,null,"N°ordine",{"$f":"IF(D4>0,0,1)","v":1}]
[null,null,null,null,{"$f":"M8","v":""},null,null,null,null,1]
[null,"Data",null,null,{"$f":"M9","v":""},null,null,null,null,1,null,"data",{"$f":"IF(D6>0,0,1)","v":1}]
[null,null,null,null,{"$f":"M10","v":""},null,null,null,null,1,null,"ERRORE1",{"$f":"IF(M2+M4+M6+M11+M13+M16+M18+O18+O13,\"ERRORE DI MANCATA COPMILAZIONE DATI NECESSARI PER L'ORDINATIVO\",\"\")","v":"ERRORE DI MANCATA COPMILAZIONE DATI NECESSARI PER L'ORDINATIVO"},{"$f":"IF(M7=\"\",0,1)","v":1}]
[null,"Totale IVA incl.",null,{"$f":"G115","v":0},{"$f":"IF(Q11=0,\"CONFIGURATORE OK\", \"\")","v":""},null,"Version 4.0",null,null,1,null,"Warning2",{"$f":"IF(G112>D112,\"!!! ATTENZIONE !!! L'IMPORTO 20% SUPERA IL VALORE MASSIMO CONSENTITO\",\"\")","v":""},{"$f":"IF(M8=\"\",0,1)","v":0}]
[null,null,null,null,null,null,null,null,null,1,null,"ERRORE3",{"$f":"\"\"","v":""},0]
[null,null,null,null,null,null,null,null,null,1,null,"Waning4",{"$f":"IF(N10>0,\"!!! ATTENZIONE !!! COMPLETARE IL CAMPO NOTE NELLE CONFIGURAZIONI\",\"\")","v":""},{"$f":"IF(M22>0,O10,0)+IF(N22>0,P10,0)+IF(O22>0,Q10,0)","v":0},{"$f":"IF(Lotto8_C6525_1!$H$44=\"Specificare la configurazione RAID per l'installazione del Sistema Operativo, se richiesto.\ne/o\ninserire eventuali note.\",1,0)","v":1},{"$f":"IF(Lotto8_C6525_2!$H$44=\"Specificare la configurazione RAID per l'installazione del Sistema Operativo, se richiesto.\ne/o\ninserire eventuali note.\",1,0)","v":1},{"$f":"IF(Lotto8_C6525_3!$H$44=\"Specificare la configurazione RAID per l'installazione del Sistema Operativo, se richiesto.\ne/o\ninserire eventuali note.\",1,0)","v":1}]
[null,"Referente Consegna",null,null,null,null,null,null,null,1,null,"ref1",{"$f":"IF(D11>0,0,1)","v":1},null,"Verifica Errori",null,{"$f":"N7+N9","v":1}]
[null,null,null,null,null,null,null,null,null,1]
[null,"Telefono",null,"email",null,null,null,null,null,1,null,"tel1",{"$f":"IF(C13>0,0,1)","v":1},"mail1",{"$f":"IF(E13>0,0,1)","v":1}]
[null,null,null,null,null,null,null,null,null,1]
[null,null,null,null,null,null,null,null,null,1]
[null,"Referente Installazione",null,null,null,null,null,null,null,1,null,"ref2",{"$f":"IF(D16>0,0,1)","v":1}]
[null,null,null,null,null,null,null,null,null,1]
[null,"Telefono",null,"email",null,null,null,null,null,1,null,"tel2",{"$f":"IF(C18>0,0,1)","v":1},"mail2",{"$f":"IF(E18>0,0,1)","v":1}]
[null,null,null,null,null,null,null,null,null,1]
[null,null,null,null,null,null,null,null,null,1,null,null,"Server1","Server2","Server3","Totale"]
[null,"TECNOLOGIE SERVER 3 LOTTO 8 - LISTA ARTICOLI IN CONVENZIONE -",null,null,null,null,null,null,null,{"$f":"IF($G$111>0,1,0)","v":0}]
[null,"Quantità","Codice Articolo Produttore","Codice Articolo Convenzione","Descrizione","Costo unitario","Costo complessivo",null,null,{"$f":"IF($G$111>0,1,0)","v":0},null,null,{"$f":"Lotto8_C6525_1!F5","v":0},{"$f":"Lotto8_C6525_2!F5","v":0},{"$f":"Lotto8_C6525_3!F5","v":0},null,"Qty_1","Qty_2","Qty_3"]
[null,{"$f":"IF(P23>0,P23,\"\")","v":""},{"$f":"IF(B23=\"\",\"\",VLOOKUP(L23,Tabella_prezzi!$A$1:$K$183,9,FALSE))","v":""},{"$f":"IF(B23=\"\",\"\",VLOOKUP(L23,Tabella_prezzi!$A$1:$K$183,6,FALSE))","v":""},{"$f":"IF(B23=\"\",\"\",VLOOKUP(L23,Tabella_prezzi!$A$1:$K$183,8,FALSE))","v":""},{"$f":"IF(B23=\"\",\"\",VLOOKUP(L23,Tabella_prezzi!$A$1:$K$183,4,FALSE))","v":""},{"$f":"IF(C23=\"\",\"\",F23*B23)","v":""},null,null,{"$f":"IF(B23=\"\",0,1)","v":0},"TS3L8-SRV-U","L8N01",{"$f":"COUNTIF(TS3L8_L8N_1,L23)*$M$22","v":0},{"$f":"COUNTIF(TS3L8_L8N_2,L23)*$N$22","v":0},{"$f":"COUNTIF(TS3L8_L8N_3,L23)*$O$22","v":0},{"$f":"SUM(M23:O23)","v":0},null,null,null,{"$f":"Lotto8_C6525_1!L9","v":"L8N01"},{"$f":"Lotto8_C6525_1!F9","v":""},{"$f":"Lotto8_C6525_2!L9","v":"L8N01"},{"$f":"Lotto8_C6525_2!F9","v":""},{"$f":"Lotto8_C6525_3!L9","v":"L8N01"},{"$f":"Lotto8_C6525_3!F9","v":""},null,{"$f":"ISODD(J23)","v":false},"server"]
[null,{"$f":"IF(P24>0,P24,\"\")","v":""},{"$f":"IF(B24=\"\",\"\",VLOOKUP(L24,Tabella_prezzi!$A$1:$K$183,9,FALSE))","v":""},{"$f":"IF(B24=\"\",\"\",VLOOKUP(L24,Tabella_prezzi!$A$1:$K$183,6,FALSE))","v":""},{"$f":"IF(B24=\"\",\"\",VLOOKUP(L24,Tabella_prezzi!$A$1:$K$183,8,FALSE))","v":""},{"$f":"IF(B24=\"\",\"\",VLOOKUP(L24,Tabella_prezzi!$A$1:$K$183,4,FALSE))","v":""},{"$f":"IF(C24=\"\",\"\",F24*B24)","v":""},null,null,{"$f":"IF(B24=\"\",0,1)","v":0},"TS3L8-CPU","L8N02",{"$f":"COUNTIF(TS3L8_L8N_1,L24)*$M$22*4","v":0},{"$f":"COUNTIF(TS3L8_L8N_2,L24)*$N$22*4","v":0},{"$f":"COUNTIF(TS3L8_L8N_3,L24)*$O$22*4","v":0},0,null,null,null,{"$f":"Lotto8_C6525_1!L22","v":""},{"$f":"Lotto8_C6525_1!F22","v":0},{"$f":"Lotto8_C6525_2!L22","v":""},{"$f":"Lotto8_C6525_2!F22","v":0},{"$f":"Lotto8_C6525_3!L22","v":""},{"$f":"Lotto8_C6525_3!F22","v":0},null,{"$f":"ISODD(SUM($J$23:J24))","v":false},"Cpu"]
[null,"",{"$f":"IF(B25=\"\",\"\",VLOOKUP(L25,Tabella_prezzi!$A$1:$K$183,9,FALSE))","v":""},{"$f":"IF(B25=\"\",\"\",VLOOKUP(L25,Tabella_prezzi!$A$1:$K$183,6,FALSE))","v":""},{"$f":"IF(B25=\"\",\"\",VLOOKUP(L25,Tabella_prezzi!$A$1:$K$183,8,FALSE))","v":""},{"$f":"IF(B25=\"\",\"\",VLOOKUP(L25,Tabella_prezzi!$A$1:$K$183,4,FALSE))","v":""},"",null,null,0,"TS3L8-RAM32","L8N03",{"$f":"COUNTIF(TS3L8_L8N_1,L25)*$M$22*Q25*4","v":0},{"$f":"COUNTIF(TS3L8_L8N_2,L25)*$N$22*R25*4","v":0},{"$f":"COUNTIF(TS3L8_L8N_3,L25)*$O$22*S25*4","v":0},{"$f":"SUM(M25:O25)","v":0},{"$f":"Lotto8_C6525_1!F25","v":0},{"$f":"Lotto8_C6525_2!F25","v":0},{"$f":"Lotto8_C6525_3!F25","v":0},null,null,null,null,null,null,null,{"$f":"ISODD(SUM($J$23:J25))","v":false}]
[null,"",{"$f":"IF(B26=\"\",\"\",VLOOKUP(L26,Tabella_prezzi!$A$1:$K$183,9,FALSE))","v":""},{"$f":"IF(B26=\"\",\"\",VLOOKUP(L26,Tabella_prezzi!$A$1:$K$183,6,FALSE))","v":""},{"$f":"IF(B26=\"\",\"\",VLOOKUP(L26,Tabella_prezzi!$A$1:$K$183,8,FALSE))","v":""},{"$f":"IF(B26=\"\",\"\",VLOOKUP(L26,Tabella_prezzi!$A$1:$K$183,4,FALSE))","v":""},"",null,null,0,"TS3L8-RAM64","L8N04",{"$f":"COUNTIF(TS3L8_L8N_1,L26)*$M$22*Q26*4","v":0},{"$f":"COUNTIF(TS3L8_L8N_2,L26)*$N$22*R26*4","v":0},{"$f":"COUNTIF(TS3L8_L8N_3,L26)*$O$22*S26*4","v":0},0,{"$f":"Lotto8_C6525_1!F25","v":0},{"$f":"Lotto8_C6525_2!F25","v":0},{"$f":"Lotto8_C6525_3!F25","v":0},{"$f":"Lotto8_C6525_1!L25","v":"L8N04"},null,{"$f":"Lotto8_C6525_2!L25","v":"L8N04"},null,{"$f":"Lotto8_C6525_3!L25","v":"L8N04"},null,null,{"$f":"ISODD(SUM($J$23:J26))","v":false}]
[null,"",{"$f":"IF(B27=\"\",\"\",VLOOKUP(L27,Tabella_prezzi!$A$1:$K$183,9,FALSE))","v":""},{"$f":"IF(B27=\"\",\"\",VLOOKUP(L27,Tabella_prezzi!$A$1:$K$183,6,FALSE))","v":""},{"$f":"IF(B27=\"\",\"\",VLOOKUP(L27,Tabella_prezzi!$A$1:$K$183,8,FALSE))","v":""},{"$f":"IF(B27=\"\",\"\",VLOOKUP(L27,Tabella_prezzi!$A$1:$K$183,4,FALSE))","v":""},"",null,null,0,"TS3L8-LAN1-L","L8N05",{"$f":"COUNTIF(TS3L8_L8N_1,L27)*$M$22*4","v":0},{"$f":"COUNTIF(TS3L8_L8N_2,L27)*$N$22*4","v":0},{"$f":"COUNTIF(TS3L8_L8N_3,L27)*$O$22*4","v":0},{"$f":"SUM(M27:O27)","v":0},null,null,null,{"$f":"Lotto8_C6525_1!L26","v":0},{"$f":"Lotto8_C6525_1!F26","v":0},{"$f":"Lotto8_C6525_2!L26","v":0},{"$f":"Lotto8_C6525_2!F26","v":0},{"$f":"Lotto8_C6525_3!L26","v":0},{"$f":"Lotto8_C6525_3!F26","v":0},null,{"$f":"ISODD(SUM($J$23:J27))","v":false}]
[null,"",{"$f":"IF(B28=\"\",\"\",VLOOKUP(L28,Tabella_prezzi!$A$1:$K$183,9,FALSE))","v":""},{"$f":"IF(B28=\"\",\"\",VLOOKUP(L28,Tabella_prezzi!$A$1:$K$183,6,FALSE))","v":""},{"$f":"IF(B28=\"\",\"\",VLOOKUP(L28,Tabella_prezzi!$A$1:$K$183,8,FALSE))","v":""},{"$f":"IF(B28=\"\",\"\",VLOOKUP(L28,Tabella_prezzi!$A$1:$K$183,4,FALSE))","v":""},"",null,null,0,"TS3L8-LAN10-L","L8N06",{"$f":"COUNTIF(TS3L8_L8N_1,L28)*$M$22*4","v":0},{"$f":"COUNTIF(TS3L8_L8N_2,L28)*$N$22*4","v":0},{"$f":"COUNTIF(TS3L8_L8N_3,L28)*$O$22*4","v":0},{"$f":"SUM(M28:O28)","v":0},null,null,null,{"$f":"Lotto8_C6525_1!L27","v":0},{"$f":"Lotto8_C6525_1!F27","v":0},{"$f":"Lotto8_C6525_2!L27","v":0},{"$f":"Lotto8_C6525_2!F27","v":0},{"$f":"Lotto8_C6525_3!L27","v":0},{"$f":"Lotto8_C6525_3!F27","v":0},null,{"$f":"ISODD(SUM($J$23:J28))","v":false}]
[null,"",{"$f":"IF(B29=\"\",\"\",VLOOKUP(L29,Tabella_prezzi!$A$1:$K$183,9,FALSE))","v":""},{"$f":"IF(B29=\"\",\"\",VLOOKUP(L29,Tabella_prezzi!$A$1:$K$183,6,FALSE))","v":""},{"$f":"IF(B29=\"\",\"\",VLOOKUP(L29,Tabella_prezzi!$A$1:$K$183,8,FALSE))","v":""},{"$f":"IF(B29=\"\",\"\",VLOOKUP(L29,Tabella_prezzi!$A$1:$K$183,4,FALSE))","v":""},"",null,null,0,"TS3L8-LAN25-L","L8N07",{"$f":"COUNTIF(TS3L8_L8N_1,L29)*$M$22*4","v":0},{"$f":"COUNTIF(TS3L8_L8N_2,L29)*$N$22*4","v":0},{"$f":"COUNTIF(TS3L8_L8N_3,L29)*$O$22*4","v":0},0,null,null,null,null,null,null,null,null,null,null,{"$f":"ISODD(SUM($J$23:J29))","v":false}]
[null,"",{"$f":"IF(B30=\"\",\"\",VLOOKUP(L30,Tabella_prezzi!$A$1:$K$183,9,FALSE))","v":""},{"$f":"IF(B30=\"\",\"\",VLOOKUP(L30,Tabella_prezzi!$A$1:$K$183,6,FALSE))","v":""},{"$f":"IF(B30=\"\",\"\",VLOOKUP(L30,Tabella_prezzi!$A$1:$K$183,8,FALSE))","v":""},{"$f":"IF(B30=\"\",\"\",VLOOKUP(L30,Tabella_prezzi!$A$1:$K$183,4,FALSE))","v":""},"",null,null,0,"TS3L8-CNA10-L","L8N08",{"$f":"COUNTIF(TS3L8_L8N_1,L30)*$M$22*4","v":0},{"$f":"COUNTIF(TS3L8_L8N_2,L30)*$N$22*4","v":0},{"$f":"COUNTIF(TS3L8_L8N_3,L30)*$O$22*4","v":0},0,null,null,null,null,null,null,null,null,null,null,{"$f":"ISODD(SUM($J$23:J30))","v":false}]
[null,"",{"$f":"IF(B31=\"\",\"\",VLOOKUP(L31,Tabella_prezzi!$A$1:$K$183,9,FALSE))","v":""},{"$f":"IF(B31=\"\",\"\",VLOOKUP(L31,Tabella_prezzi!$A$1:$K$183,6,FALSE))","v":""},{"$f":"IF(B31=\"\",\"\",VLOOKUP(L31,Tabella_prezzi!$A$1:$K$183,8,FALSE))","v":""},{"$f":"IF(B31=\"\",\"\",VLOOKUP(L31,Tabella_prezzi!$A$1:$K$183,4,FALSE))","v":""},"",null,null,0,"TS3L8-HDD1TB","L8N09",{"$f":"COUNTIF(TS3L8_L8N_1,L31)*$M$22*Q31*4","v":0},{"$f":"COUNTIF(TS3L8_L8N_2,L31)*$N$22*R31*4","v":0},{"$f":"COUNTIF(TS3L8_L8N_3,L31)*$O$22*S31*4","v":0},0,{"$f":"Lotto8_C6525_1!F47","v":0},{"$f":"Lotto8_C6525_2!F47","v":0},{"$f":"Lotto8_C6525_3!F47","v":0},{"$f":"Lotto8_C6525_1!L47","v":"L8N09"},null,{"$f":"Lotto8_C6525_2!L47","v":"L8N09"},null,{"$f":"Lotto8_C6525_3!L47","v":"L8N09"},null,null,{"$f":"ISODD(SUM($J$23:J31))","v":false}]
[null,"",{"$f":"IF(B32=\"\",\"\",VLOOKUP(L32,Tabella_prezzi!$A$1:$K$183,9,FALSE))","v":""},{"$f":"IF(B32=\"\",\"\",VLOOKUP(L32,Tabella_prezzi!$A$1:$K$183,6,FALSE))","v":""},{"$f":"IF(B32=\"\",\"\",VLOOKUP(L32,Tabella_prezzi!$A$1:$K$183,8,FALSE))","v":""},{"$f":"IF(B32=\"\",\"\",VLOOKUP(L32,Tabella_prezzi!$A$1:$K$183,4,FALSE))","v":""},"",null,null,0,"TS3L8-HDD300GB","L8N10",0,0,0,0,{"$f":"Lotto8_C6525_1!F45","v":0},{"$f":"Lotto8_C6525_2!F45","v":0},{"$f":"Lotto8_C6525_3!F45","v":0},{"$f":"Lotto8_C6525_1!L45","v":"L8N10"},null,{"$f":"Lotto8_C6525_2!L45","v":"L8N10"},null,{"$f":"Lotto8_C6525_3!L45","v":"L8N10"},null,null,{"$f":"ISODD(SUM($J$23:J32))","v":false}]
[null,"",{"$f":"IF(B33=\"\",\"\",VLOOKUP(L33,Tabella_prezzi!$A$1:$K$183,9,FALSE))","v":""},{"$f":"IF(B33=\"\",\"\",VLOOKUP(L33,Tabella_prezzi!$A$1:$K$183,6,FALSE))","v":""},{"$f":"IF(B33=\"\",\"\",VLOOKUP(L33,Tabella_prezzi!$A$1:$K$183,8,FALSE))","v":""},{"$f":"IF(B33=\"\",\"\",VLOOKUP(L33,Tabella_prezzi!$A$1:$K$183,4,FALSE))","v":""},"",null,null,0,"TS3L8-RI1600GB","L8N11",0,0,0,0,{"$f":"Lotto8_C6525_1!F53","v":0},{"$f":"Lotto8_C6525_2!F53","v":0},{"$f":"Lotto8_C6525_3!F53","v":0},{"$f":"Lotto8_C6525_1!L53","v":"L8N11"},null,{"$f":"Lotto8_C6525_2!L53","v":"L8N11"},null,{"$f":"Lotto8_C6525_3!L53","v":"L8N11"},null,null,{"$f":"ISODD(SUM($J$23:J33))","v":false}]
[null,"",{"$f":"IF(B34=\"\",\"\",VLOOKUP(L34,Tabella_prezzi!$A$1:$K$183,9,FALSE))","v":""},{"$f":"IF(B34=\"\",\"\",VLOOKUP(L34,Tabella_prezzi!$A$1:$K$183,6,FALSE))","v":""},{"$f":"IF(B34=\"\",\"\",VLOOKUP(L34,Tabella_prezzi!$A$1:$K$183,8,FALSE))","v":""},{"$f":"IF(B34=\"\",\"\",VLOOKUP(L34,Tabella_prezzi!$A$1:$K$183,4,FALSE))","v":""},"",null,null,0,"TS3L8-MU1600GB","L8N12",0,0,0,0,{"$f":"Lotto8_C6525_1!F57","v":0},{"$f":"Lotto8_C6525_2!F57","v":0},{"$f":"Lotto8_C6525_3!F57","v":0},{"$f":"Lotto8_C6525_1!L57","v":"L8N12"},null,{"$f":"Lotto8_C6525_2!L57","v":"L8N12"},null,{"$f":"Lotto8_C6525_3!L57","v":"L8N12"},null,null,{"$f":"ISODD(SUM($J$23:J34))","v":false}]
[null,"",{"$f":"IF(B35=\"\",\"\",VLOOKUP(L35,Tabella_prezzi!$A$1:$K$183,9,FALSE))","v":""},{"$f":"IF(B35=\"\",\"\",VLOOKUP(L35,Tabella_prezzi!$A$1:$K$183,6,FALSE))","v":""},{"$f":"IF(B35=\"\",\"\",VLOOKUP(L35,Tabella_prezzi!$A$1:$K$183,8,FALSE))","v":""},{"$f":"IF(B35=\"\",\"\",VLOOKUP(L35,Tabella_prezzi!$A$1:$K$183,4,FALSE))","v":""},"",null,null,0,"TS3L8-RI800GB","L8N13",0,0,0,0,{"$f":"IF(Lotto8_C6525_1!F51>=2,Lotto8_C6525_1!F51-2,0)","v":0},{"$f":"IF(Lotto8_C6525_2!F51>=2,Lotto8_C6525_2!F51-2,0)","v":0},{"$f":"IF(Lotto8_C6525_3!F51>=2,Lotto8_C6525_3!F51-2,0)","v":0},{"$f":"Lotto8_C6525_1!L51","v":"L8N13"},null,{"$f":"Lotto8_C6525_2!L51","v":"L8N13"},null,{"$f":"Lotto8_C6525_3!L51","v":"L8N13"},null,null,{"$f":"ISODD(SUM($J$23:J35))","v":false}]
[null,"",{"$f":"IF(B36=\"\",\"\",VLOOKUP(L36,Tabella_prezzi!$A$1:$K$183,9,FALSE))","v":""},{"$f":"IF(B36=\"\",\"\",VLOOKUP(L36,Tabella_prezzi!$A$1:$K$183,6,FALSE))","v":""},{"$f":"IF(B36=\"\",\"\",VLOOKUP(L36,Tabella_prezzi!$A$1:$K$183,8,FALSE))","v":""},{"$f":"IF(B36=\"\",\"\",VLOOKUP(L36,Tabella_prezzi!$A$1:$K$183,4,FALSE))","v":""},"",null,null,0,"TS3L8-MU800GB","L8N14",0,0,0,0,{"$f":"Lotto8_C6525_1!F55","v":0},{"$f":"Lotto8_C6525_2!F55","v":0},{"$f":"Lotto8_C6525_3!F55","v":0},{"$f":"Lotto8_C6525_1!L55","v":"L8N14"},null,{"$f":"Lotto8_C6525_2!L55","v":"L8N14"},null,{"$f":"Lotto8_C6525_3!L55","v":"L8N14"},null,null,{"$f":"ISODD(SUM($J$23:J36))","v":false}]
[null,"",{"$f":"IF(B37=\"\",\"\",VLOOKUP(L37,Tabella_prezzi!$A$1:$K$183,9,FALSE))","v":""},{"$f":"IF(B37=\"\",\"\",VLOOKUP(L37,Tabella_prezzi!$A$1:$K$183,6,FALSE))","v":""},{"$f":"IF(B37=\"\",\"\",VLOOKUP(L37,Tabella_prezzi!$A$1:$K$183,8,FALSE))","v":""},{"$f":"IF(B37=\"\",\"\",VLOOKUP(L37,Tabella_prezzi!$A$1:$K$183,4,FALSE))","v":""},"",null,null,0,"TS3L8-RI400GB-U","L8N15",0,0,0,0,{"$f":"IF(Lotto8_C6525_1!F49>=2,Lotto8_C6525_1!F49-2,0)","v":0},{"$f":"IF(Lotto8_C6525_2!F49>=2,Lotto8_C6525_2!F49-2,0)","v":0},{"$f":"IF(Lotto8_C6525_3!F49>=2,Lotto8_C6525_3!F49-2,0)","v":0},{"$f":"Lotto8_C6525_1!L49","v":"L8N15"},null,{"$f":"Lotto8_C6525_2!L49","v":"L8N15"},null,{"$f":"Lotto8_C6525_3!L49","v":"L8N15"},null,null,{"$f":"ISODD(SUM($J$23:J37))","v":false}]
[null,"",{"$f":"IF(B38=\"\",\"\",VLOOKUP(L38,Tabella_prezzi!$A$1:$K$183,9,FALSE))","v":""},{"$f":"IF(B38=\"\",\"\",VLOOKUP(L38,Tabella_prezzi!$A$1:$K$183,6,FALSE))","v":""},{"$f":"IF(B38=\"\",\"\",VLOOKUP(L38,Tabella_prezzi!$A$1:$K$183,8,FALSE))","v":""},{"$f":"IF(B38=\"\",\"\",VLOOKUP(L38,Tabella_prezzi!$A$1:$K$183,4,FALSE))","v":""},"",null,null,0,"TS3L8-UPS","L8N16",null,null,null,{"$f":"Altre_Opzioni!F41","v":0},null,null,null,null,null,null,null,null,null,null,{"$f":"ISODD(SUM($J$23:J38))","v":false}]
[null,"",{"$f":"IF(B39=\"\",\"\",VLOOKUP(L39,Tabella_prezzi!$A$1:$K$183,9,FALSE))","v":""},{"$f":"IF(B39=\"\",\"\",VLOOKUP(L39,Tabella_prezzi!$A$1:$K$183,6,FALSE))","v":""},{"$f":"IF(B39=\"\",\"\",VLOOKUP(L39,Tabella_prezzi!$A$1:$K$183,8,FALSE))","v":""},{"$f":"IF(B39=\"\",\"\",VLOOKUP(L39,Tabella_prezzi!$A$1:$K$183,4,FALSE))","v":""},"",null,null,0,"TS3L8-GUI","L8N17",null,null,null,{"$f":"Altre_Opzioni!F45","v":0},null,null,null,null,null,null,null,null,null,null,{"$f":"ISODD(SUM($J$23:J39))","v":false}]
[null,"",{"$f":"IF(B40=\"\",\"\",VLOOKUP(L40,Tabella_prezzi!$A$1:$K$183,9,FALSE))","v":""},{"$f":"IF(B40=\"\",\"\",VLOOKUP(L40,Tabella_prezzi!$A$1:$K$183,6,FALSE))","v":""},{"$f":"IF(B40=\"\",\"\",VLOOKUP(L40,Tabella_prezzi!$A$1:$K$183,8,FALSE))","v":""},{"$f":"IF(B40=\"\",\"\",VLOOKUP(L40,Tabella_prezzi!$A$1:$K$183,4,FALSE))","v":""},"",null,null,0,"TS3L8-SWKVM","L8N18",null,null,null,{"$f":"Altre_Opzioni!F49","v":0},null,null,null,{"$f":"Lotto8_C6525_1!L39","v":0},{"$f":"Lotto8_C6525_1!F39","v":"Disponibili"},{"$f":"Lotto8_C6525_2!L39","v":0},{"$f":"Lotto8_C6525_2!F39","v":"Disponibili"},{"$f":"Lotto8_C6525_3!L39","v":0},{"$f":"Lotto8_C6525_3!F39","v":"Disponibili"},null,{"$f":"ISODD(SUM($J$23:J40))","v":false}]
[null,"",{"$f":"IF(B41=\"\",\"\",VLOOKUP(L41,Tabella_prezzi!$A$1:$K$183,9,FALSE))","v":""},{"$f":"IF(B41=\"\",\"\",VLOOKUP(L41,Tabella_prezzi!$A$1:$K$183,6,FALSE))","v":""},{"$f":"IF(B41=\"\",\"\",VLOOKUP(L41,Tabella_prezzi!$A$1:$K$183,8,FALSE))","v":""},{"$f":"IF(B41=\"\",\"\",VLOOKUP(L41,Tabella_prezzi!$A$1:$K$183,4,FALSE))","v":""},"",null,null,0,"TS3L8-WINSRVSTD","L8N19",{"$f":"COUNTIF(TS3L8_L8N_1,L41)*$M$22*4","v":0},{"$f":"COUNTIF(TS3L8_L8N_2,L41)*$N$22*4","v":0},{"$f":"COUNTIF(TS3L8_L8N_3,L41)*$O$22*4","v":0},{"$f":"SUM(M41:O41)","v":0},null,null,null,{"$f":"Lotto8_C6525_1!L28","v":""},{"$f":"Lotto8_C6525_1!F28","v":0},{"$f":"Lotto8_C6525_2!L28","v":""},{"$f":"Lotto8_C6525_2!F28","v":0},{"$f":"Lotto8_C6525_3!L28","v":""},{"$f":"Lotto8_C6525_3!F28","v":0},null,{"$f":"ISODD(SUM($J$23:J41))","v":false}]
[null,"",{"$f":"IF(B42=\"\",\"\",VLOOKUP(L42,Tabella_prezzi!$A$1:$K$183,9,FALSE))","v":""},{"$f":"IF(B42=\"\",\"\",VLOOKUP(L42,Tabella_prezzi!$A$1:$K$183,6,FALSE))","v":""},{"$f":"IF(B42=\"\",\"\",VLOOKUP(L42,Tabella_prezzi!$A$1:$K$183,8,FALSE))","v":""},{"$f":"IF(B42=\"\",\"\",VLOOKUP(L42,Tabella_prezzi!$A$1:$K$183,4,FALSE))","v":""},"",null,null,0,"TS3L8-WINDEVCAL","L8N20",null,null,null,{"$f":"IF(P41>0,Altre_Opzioni!F52,0)","v":0},null,null,null,{"$f":"Lotto8_C6525_1!L41","v":0},{"$f":"Lotto8_C6525_1!F41","v":0},{"$f":"Lotto8_C6525_2!L41","v":0},{"$f":"Lotto8_C6525_2!F41","v":0},{"$f":"Lotto8_C6525_3!L41","v":0},{"$f":"Lotto8_C6525_3!F41","v":0},null,{"$f":"ISODD(SUM($J$23:J42))","v":false}]
[null,"",{"$f":"IF(B43=\"\",\"\",VLOOKUP(L43,Tabella_prezzi!$A$1:$K$183,9,FALSE))","v":""},{"$f":"IF(B43=\"\",\"\",VLOOKUP(L43,Tabella_prezzi!$A$1:$K$183,6,FALSE))","v":""},{"$f":"IF(B43=\"\",\"\",VLOOKUP(L43,Tabella_prezzi!$A$1:$K$183,8,FALSE))","v":""},{"$f":"IF(B43=\"\",\"\",VLOOKUP(L43,Tabella_prezzi!$A$1:$K$183,4,FALSE))","v":""},"",null,null,0,"TS3L8-WINUSRCAL","L8N21",null,null,null,{"$f":"IF(P41>0,Altre_Opzioni!F55,0)","v":0},null,null,null,null,null,null,null,null,null,null,{"$f":"ISODD(SUM($J$23:J43))","v":false}]
[null,"",{"$f":"IF(B44=\"\",\"\",VLOOKUP(L44,Tabella_prezzi!$A$1:$K$183,9,FALSE))","v":""},{"$f":"IF(B44=\"\",\"\",VLOOKUP(L44,Tabella_prezzi!$A$1:$K$183,6,FALSE))","v":""},{"$f":"IF(B44=\"\",\"\",VLOOKUP(L44,Tabella_prezzi!$A$1:$K$183,8,FALSE))","v":""},{"$f":"IF(B44=\"\",\"\",VLOOKUP(L44,Tabella_prezzi!$A$1:$K$183,4,FALSE))","v":""},"",null,null,0,"TS3L8-WINSRV2C","L8N22",{"$f":"COUNTIF(TS3L8_L8N_1,L44)*$M$22*U44*4","v":0},{"$f":"COUNTIF(TS3L8_L8N_2,L44)*$N$22*W44*4","v":0},{"$f":"COUNTIF(TS3L8_L8N_3,L44)*$O$22*Y44*4","v":0},{"$f":"SUM(M44:O44)","v":0},null,null,null,{"$f":"Lotto8_C6525_1!L29","v":0},{"$f":"Lotto8_C6525_1!F29","v":0},{"$f":"Lotto8_C6525_2!L29","v":0},{"$f":"Lotto8_C6525_2!F29","v":0},{"$f":"Lotto8_C6525_3!L29","v":0},{"$f":"Lotto8_C6525_3!F29","v":0},null,{"$f":"ISODD(SUM($J$23:J44))","v":false}]
[null,"",{"$f":"IF(B45=\"\",\"\",VLOOKUP(L45,Tabella_prezzi!$A$1:$K$183,9,FALSE))","v":""},{"$f":"IF(B45=\"\",\"\",VLOOKUP(L45,Tabella_prezzi!$A$1:$K$183,6,FALSE))","v":""},{"$f":"IF(B45=\"\",\"\",VLOOKUP(L45,Tabella_prezzi!$A$1:$K$183,8,FALSE))","v":""},{"$f":"IF(B45=\"\",\"\",VLOOKUP(L45,Tabella_prezzi!$A$1:$K$183,4,FALSE))","v":""},"",null,null,0,"TS3L8-LINUX","L8N23",{"$f":"COUNTIF(TS3L8_L8N_1,L45)*$M$22*4","v":0},{"$f":"COUNTIF(TS3L8_L8N_2,L45)*$N$22*4","v":0},{"$f":"COUNTIF(TS3L8_L8N_3,L45)*$O$22*4","v":0},0,null,null,null,{"$f":"Lotto8_C6525_1!L44","v":0},{"$f":"Lotto8_C6525_1!F44","v":0},{"$f":"Lotto8_C6525_2!L44","v":0},{"$f":"Lotto8_C6525_2!F44","v":0},{"$f":"Lotto8_C6525_3!L44","v":0},{"$f":"Lotto8_C6525_3!F44","v":0},null,{"$f":"ISODD(SUM($J$23:J45))","v":false}]
[null,"",{"$f":"IF(B46=\"\",\"\",VLOOKUP(L46,Tabella_prezzi!$A$1:$K$183,9,FALSE))","v":""},{"$f":"IF(B46=\"\",\"\",VLOOKUP(L46,Tabella_prezzi!$A$1:$K$183,6,FALSE))","v":""},{"$f":"IF(B46=\"\",\"\",VLOOKUP(L46,Tabella_prezzi!$A$1:$K$183,8,FALSE))","v":""},{"$f":"IF(B46=\"\",\"\",VLOOKUP(L46,Tabella_prezzi!$A$1:$K$183,4,FALSE))","v":""},"",null,null,0,"TS3L8-HDRTNTN","L8N24",{"$f":"COUNTIF(TS3L8_L8N_1,L46)*$M$22","v":0},{"$f":"COUNTIF(TS3L8_L8N_2,L46)*$N$22","v":0},{"$f":"COUNTIF(TS3L8_L8N_3,L46)*$O$22","v":0},0,null,null,null,null,null,null,null,null,null,null,{"$f":"ISODD(SUM($J$23:J46))","v":false}]
[null,"",{"$f":"IF(B47=\"\",\"\",VLOOKUP(L47,Tabella_prezzi!$A$1:$K$183,9,FALSE))","v":""},{"$f":"IF(B47=\"\",\"\",VLOOKUP(L47,Tabella_prezzi!$A$1:$K$183,6,FALSE))","v":""},{"$f":"IF(B47=\"\",\"\",VLOOKUP(L47,Tabella_prezzi!$A$1:$K$183,8,FALSE))","v":""},{"$f":"IF(B47=\"\",\"\",VLOOKUP(L47,Tabella_prezzi!$A$1:$K$183,4,FALSE))","v":""},"",null,null,0,"TS3L8-5Y","L8N25",{"$f":"COUNTIF(TS3L8_L8N_1,L47)*$M$22","v":0},{"$f":"COUNTIF(TS3L8_L8N_2,L47)*$N$22","v":0},{"$f":"COUNTIF(TS3L8_L8N_3,L47)*$O$22","v":0},0,null,null,null,{"$f":"Lotto8_C6525_1!L46","v":0},{"$f":"Lotto8_C6525_1!F46","v":0},{"$f":"Lotto8_C6525_2!L46","v":0},{"$f":"Lotto8_C6525_2!F46","v":0},{"$f":"Lotto8_C6525_3!L46","v":0},{"$f":"Lotto8_C6525_3!F46","v":0},null,{"$f":"ISODD(SUM($J$23:J47))","v":false}]
[null,"",{"$f":"IF(B48=\"\",\"\",VLOOKUP(L48,Tabella_prezzi!$A$1:$K$183,9,FALSE))","v":""},{"$f":"IF(B48=\"\",\"\",VLOOKUP(L48,Tabella_prezzi!$A$1:$K$183,6,FALSE))","v":""},{"$f":"IF(B48=\"\",\"\",VLOOKUP(L48,Tabella_prezzi!$A$1:$K$183,8,FALSE))","v":""},{"$f":"IF(B48=\"\",\"\",VLOOKUP(L48,Tabella_prezzi!$A$1:$K$183,4,FALSE))","v":""},"",null,null,0,"TS3L8-RACK","L8N26",null,null,null,{"$f":"Altre_Opzioni!F16","v":0},null,null,null,null,null,null,null,null,null,null,{"$f":"ISODD(SUM($J$23:J48))","v":false}]
[null,"",{"$f":"IF(B49=\"\",\"\",VLOOKUP(L49,Tabella_prezzi!$A$1:$K$183,9,FALSE))","v":""},{"$f":"IF(B49=\"\",\"\",VLOOKUP(L49,Tabella_prezzi!$A$1:$K$183,6,FALSE))","v":""},{"$f":"IF(B49=\"\",\"\",VLOOKUP(L49,Tabella_prezzi!$A$1:$K$183,8,FALSE))","v":""},{"$f":"IF(B49=\"\",\"\",VLOOKUP(L49,Tabella_prezzi!$A$1:$K$183,4,FALSE))","v":""},"",null,null,0,"TS3L8-HDRTNTN60","L8N27",{"$f":"COUNTIF(TS3L8_L8N_1,L49)*$M$22","v":0},{"$f":"COUNTIF(TS3L8_L8N_2,L49)*$N$22","v":0},{"$f":"COUNTIF(TS3L8_L8N_3,L49)*$O$22","v":0},{"$f":"SUM(M49:O49)","v":0},null,null,null,{"$f":"Lotto8_C6525_1!L48","v":0},{"$f":"Lotto8_C6525_1!F48","v":0},{"$f":"Lotto8_C6525_2!L48","v":0},{"$f":"Lotto8_C6525_2!F48","v":0},{"$f":"Lotto8_C6525_3!L48","v":0},{"$f":"Lotto8_C6525_3!F48","v":0},null,{"$f":"ISODD(SUM($J$23:J49))","v":false}]
[null,{"$f":"IF(P50>0,P50,\"\")","v":""},{"$f":"IF(B50=\"\",\"\",VLOOKUP(L50,Tabella_prezzi!$A$1:$K$183,9,FALSE))","v":""},{"$f":"IF(B50=\"\",\"\",VLOOKUP(L50,Tabella_prezzi!$A$1:$K$183,6,FALSE))","v":""},{"$f":"IF(B50=\"\",\"\",VLOOKUP(L50,Tabella_prezzi!$A$1:$K$183,8,FALSE))","v":""},{"$f":"IF(B50=\"\",\"\",VLOOKUP(L50,Tabella_prezzi!$A$1:$K$183,4,FALSE))","v":""},{"$f":"IF(C50=\"\",\"\",F50*B50)","v":""},null,null,0,null,null,null,null,null,null,null,null,null,null,null,null,null,null,null,null,{"$f":"ISODD(SUM($J$23:J50))","v":false}]
[null,"",{"$f":"IF(B51=\"\",\"\",VLOOKUP(L51,Tabella_prezzi!$A$1:$K$183,9,FALSE))","v":""},{"$f":"IF(B51=\"\",\"\",VLOOKUP(L51,Tabella_prezzi!$A$1:$K$183,6,FALSE))","v":""},{"$f":"IF(B51=\"\",\"\",VLOOKUP(L51,Tabella_prezzi!$A$1:$K$183,8,FALSE))","v":""},{"$f":"IF(B51=\"\",\"\",VLOOKUP(L51,Tabella_prezzi!$A$1:$K$183,4,FALSE))","v":""},"",null,null,0,null,null,null,null,null,null,null,null,null,{"$f":"Lotto8_C6525_1!L50","v":0},{"$f":"Lotto8_C6525_1!F50","v":0},{"$f":"Lotto8_C6525_2!L50","v":0},{"$f":"Lotto8_C6525_2!F50","v":0},{"$f":"Lotto8_C6525_3!L50","v":0},{"$f":"Lotto8_C6525_3!F50","v":0},null,{"$f":"ISODD(SUM($J$23:J51))","v":false}]
[null,"",{"$f":"IF(B52=\"\",\"\",VLOOKUP(L52,Tabella_prezzi!$A$1:$K$183,9,FALSE))","v":""},{"$f":"IF(B52=\"\",\"\",VLOOKUP(L52,Tabella_prezzi!$A$1:$K$183,6,FALSE))","v":""},{"$f":"IF(B52=\"\",\"\",VLOOKUP(L52,Tabella_prezzi!$A$1:$K$183,8,FALSE))","v":""},{"$f":"IF(B52=\"\",\"\",VLOOKUP(L52,Tabella_prezzi!$A$1:$K$183,4,FALSE))","v":""},"",null,null,0,null,null,null,null,null,null,null,null,null,null,null,null,null,null,null,null,{"$f":"ISODD(SUM($J$23:J52))","v":false}]
[null,"",{"$f":"IF(B53=\"\",\"\",VLOOKUP(L53,Tabella_prezzi!$A$1:$K$183,9,FALSE))","v":""},{"$f":"IF(B53=\"\",\"\",VLOOKUP(L53,Tabella_prezzi!$A$1:$K$183,6,FALSE))","v":""},{"$f":"IF(B53=\"\",\"\",VLOOKUP(L53,Tabella_prezzi!$A$1:$K$183,8,FALSE))","v":""},{"$f":"IF(B53=\"\",\"\",VLOOKUP(L53,Tabella_prezzi!$A$1:$K$183,4,FALSE))","v":""},"",null,null,0,null,null,null,null,null,null,null,null,null,{"$f":"Lotto8_C6525_1!L52","v":0},{"$f":"Lotto8_C6525_1!F52","v":0},{"$f":"Lotto8_C6525_2!L52","v":0},{"$f":"Lotto8_C6525_2!F52","v":0},{"$f":"Lotto8_C6525_3!L52","v":0},{"$f":"Lotto8_C6525_3!F52","v":0},null,{"$f":"ISODD(SUM($J$23:J53))","v":false}]
[null,"",{"$f":"IF(B54=\"\",\"\",VLOOKUP(L54,Tabella_prezzi!$A$1:$K$183,9,FALSE))","v":""},{"$f":"IF(B54=\"\",\"\",VLOOKUP(L54,Tabella_prezzi!$A$1:$K$183,6,FALSE))","v":""},{"$f":"IF(B54=\"\",\"\",VLOOKUP(L54,Tabella_prezzi!$A$1:$K$183,8,FALSE))","v":""},{"$f":"IF(B54=\"\",\"\",VLOOKUP(L54,Tabella_prezzi!$A$1:$K$183,4,FALSE))","v":""},"",null,null,0,null,null,null,null,null,null,null,null,null,null,null,null,null,null,null,null,{"$f":"ISODD(SUM($J$23:J54))","v":false}]
[null,"",{"$f":"IF(B55=\"\",\"\",VLOOKUP(L55,Tabella_prezzi!$A$1:$K$183,9,FALSE))","v":""},{"$f":"IF(B55=\"\",\"\",VLOOKUP(L55,Tabella_prezzi!$A$1:$K$183,6,FALSE))","v":""},{"$f":"IF(B55=\"\",\"\",VLOOKUP(L55,Tabella_prezzi!$A$1:$K$183,8,FALSE))","v":""},{"$f":"IF(B55=\"\",\"\",VLOOKUP(L55,Tabella_prezzi!$A$1:$K$183,4,FALSE))","v":""},"",null,null,0,null,null,null,null,null,null,null,null,null,{"$f":"Lotto8_C6525_1!L54","v":0},{"$f":"Lotto8_C6525_1!F54","v":0},{"$f":"Lotto8_C6525_2!L54","v":0},{"$f":"Lotto8_C6525_2!F54","v":0},{"$f":"Lotto8_C6525_3!L54","v":0},{"$f":"Lotto8_C6525_3!F54","v":0},null,{"$f":"ISODD(SUM($J$23:J55))","v":false}]
[null,"",{"$f":"IF(B56=\"\",\"\",VLOOKUP(L56,Tabella_prezzi!$A$1:$K$183,9,FALSE))","v":""},{"$f":"IF(B56=\"\",\"\",VLOOKUP(L56,Tabella_prezzi!$A$1:$K$183,6,FALSE))","v":""},{"$f":"IF(B56=\"\",\"\",VLOOKUP(L56,Tabella_prezzi!$A$1:$K$183,8,FALSE))","v":""},{"$f":"IF(B56=\"\",\"\",VLOOKUP(L56,Tabella_prezzi!$A$1:$K$183,4,FALSE))","v":""},"",null,null,0,null,null,null,null,null,null,null,null,null,null,null,null,null,null,null,null,{"$f":"ISODD(SUM($J$23:J56))","v":false}]
[null,"",{"$f":"IF(B57=\"\",\"\",VLOOKUP(L57,Tabella_prezzi!$A$1:$K$183,9,FALSE))","v":""},{"$f":"IF(B57=\"\",\"\",VLOOKUP(L57,Tabella_prezzi!$A$1:$K$183,6,FALSE))","v":""},{"$f":"IF(B57=\"\",\"\",VLOOKUP(L57,Tabella_prezzi!$A$1:$K$183,8,FALSE))","v":""},{"$f":"IF(B57=\"\",\"\",VLOOKUP(L57,Tabella_prezzi!$A$1:$K$183,4,FALSE))","v":""},"",null,null,0,null,null,null,null,null,null,null,null,null,{"$f":"Lotto8_C6525_1!L56","v":0},{"$f":"Lotto8_C6525_1!F56","v":0},{"$f":"Lotto8_C6525_2!L56","v":0},{"$f":"Lotto8_C6525_2!F56","v":0},{"$f":"Lotto8_C6525_3!L56","v":0},{"$f":"Lotto8_C6525_3!F56","v":0},null,{"$f":"ISODD(SUM($J$23:J57))","v":false}]
[null,"TECNOLOGIE SERVER 3 LOTTO 8 - LISTA ULTERIORI ARTICOLI IN CONVENZIONE (20%) -",null,null,null,null,null,null,null,{"$f":"IF(G112>0,1,0)","v":0},null,null,null,null,null,null,null,null,null,null,null,null,null,null,null,null,{"$f":"ISODD(SUM($J$23:J58))","v":false}]
[null,"Quantità","Codice Articolo Produttore","Codice Articolo Convenzione","Descrizione","Costo unitario","Costo complessivo",null,null,{"$f":"IF(G112>0,1,0)","v":0},null,null,null,null,null,null,null,null,null,{"$f":"Lotto8_C6525_1!L58","v":0},{"$f":"Lotto8_C6525_1!F58","v":0},{"$f":"Lotto8_C6525_2!L58","v":0},{"$f":"Lotto8_C6525_2!F58","v":0},{"$f":"Lotto8_C6525_3!L58","v":0},{"$f":"Lotto8_C6525_3!F58","v":0},null,{"$f":"ISODD(SUM($J$23:J59))","v":false}]
[null,{"$f":"IF(P60>0,P60,\"\")","v":""},{"$f":"IF(B60=\"\",\"\",VLOOKUP(L60,Tabella_prezzi!$A$1:$K$183,9,FALSE))","v":""},{"$f":"IF(B60=\"\",\"\",VLOOKUP(L60,Tabella_prezzi!$A$1:$K$183,6,FALSE))","v":""},{"$f":"IF(B60=\"\",\"\",VLOOKUP(L60,Tabella_prezzi!$A$1:$K$183,8,FALSE))","v":""},{"$f":"IF(B60=\"\",\"\",VLOOKUP(L60,Tabella_prezzi!$A$1:$K$183,4,FALSE))","v":""},{"$f":"IF(C60=\"\",\"\",F60*B60)","v":""},null,null,0,"TS3L8-MCX6SP-L","L8N28",{"$f":"COUNTIF(TS3L8_L8N_1,L60)*$M$22*4","v":0},{"$f":"COUNTIF(TS3L8_L8N_2,L60)*$N$22*4","v":0},{"$f":"COUNTIF(TS3L8_L8N_3,L60)*$O$22*4","v":0},{"$f":"SUM(M60:O60)","v":0},null,null,null,{"$f":"Lotto8_C6525_1!L61","v":0},{"$f":"Lotto8_C6525_1!F61","v":0},{"$f":"Lotto8_C6525_2!L61","v":0},{"$f":"Lotto8_C6525_2!F61","v":0},{"$f":"Lotto8_C6525_3!L61","v":0},{"$f":"Lotto8_C6525_3!F61","v":0},null,{"$f":"ISODD(SUM($J$23:J60))","v":false}]
[null,{"$f":"IF(P61>0,P61,\"\")","v":""},{"$f":"IF(B61=\"\",\"\",VLOOKUP(L61,Tabella_prezzi!$A$1:$K$183,9,FALSE))","v":""},{"$f":"IF(B61=\"\",\"\",VLOOKUP(L61,Tabella_prezzi!$A$1:$K$183,6,FALSE))","v":""},{"$f":"IF(B61=\"\",\"\",VLOOKUP(L61,Tabella_prezzi!$A$1:$K$183,8,FALSE))","v":""},{"$f":"IF(B61=\"\",\"\",VLOOKUP(L61,Tabella_prezzi!$A$1:$K$183,4,FALSE))","v":""},{"$f":"IF(C61=\"\",\"\",F61*B61)","v":""},null,null,0,"TS3L8-BOSS480","L8N29",{"$f":"COUNTIF(TS3L8_L8N_1,L61)*$M$22*4","v":0},{"$f":"COUNTIF(TS3L8_L8N_2,L61)*$N$22*4","v":0},{"$f":"COUNTIF(TS3L8_L8N_3,L61)*$O$22*4","v":0},{"$f":"SUM(M61:O61)","v":0},null,null,null,{"$f":"Lotto8_C6525_1!L62","v":0},{"$f":"Lotto8_C6525_1!F62","v":0},{"$f":"Lotto8_C6525_2!L62","v":0},{"$f":"Lotto8_C6525_2!F62","v":0},{"$f":"Lotto8_C6525_3!L62","v":0},{"$f":"Lotto8_C6525_3!F62","v":0},null,{"$f":"ISODD(SUM($J$23:J61))","v":false}]
[null,"",{"$f":"IF(B62=\"\",\"\",VLOOKUP(L62,Tabella_prezzi!$A$1:$K$183,9,FALSE))","v":""},{"$f":"IF(B62=\"\",\"\",VLOOKUP(L62,Tabella_prezzi!$A$1:$K$183,6,FALSE))","v":""},{"$f":"IF(B62=\"\",\"\",VLOOKUP(L62,Tabella_prezzi!$A$1:$K$183,8,FALSE))","v":""},{"$f":"IF(B62=\"\",\"\",VLOOKUP(L62,Tabella_prezzi!$A$1:$K$183,4,FALSE))","v":""},"",null,null,0,"TS3L8-RJ453M","L8N30",{"$f":"COUNTIF(TS3L8_L8N_1,L62)*$M$22*(Lotto8_C6525_1!F102)","v":0},{"$f":"COUNTIF(TS3L8_L8N_2,L62)*$N$22*(Lotto8_C6525_2!F102)","v":0},{"$f":"COUNTIF(TS3L8_L8N_3,L62)*$O$22*(Lotto8_C6525_3!F102)","v":0},0,null,null,null,{"$f":"Lotto8_C6525_1!L63","v":0},{"$f":"Lotto8_C6525_1!F63","v":0},{"$f":"Lotto8_C6525_2!L63","v":0},{"$f":"Lotto8_C6525_2!F63","v":0},{"$f":"Lotto8_C6525_3!L63","v":0},{"$f":"Lotto8_C6525_3!F63","v":0},null,{"$f":"ISODD(SUM($J$23:J62))","v":false}]
[null,"",{"$f":"IF(B63=\"\",\"\",VLOOKUP(L63,Tabella_prezzi!$A$1:$K$183,9,FALSE))","v":""},{"$f":"IF(B63=\"\",\"\",VLOOKUP(L63,Tabella_prezzi!$A$1:$K$183,6,FALSE))","v":""},{"$f":"IF(B63=\"\",\"\",VLOOKUP(L63,Tabella_prezzi!$A$1:$K$183,8,FALSE))","v":""},{"$f":"IF(B63=\"\",\"\",VLOOKUP(L63,Tabella_prezzi!$A$1:$K$183,4,FALSE))","v":""},"",null,null,0,"TS3L8-HBA345","L8N31",{"$f":"COUNTIF(TS3L8_L8N_1,L63)*$M$22*4","v":0},{"$f":"COUNTIF(TS3L8_L8N_2,L63)*$N$22*4","v":0},{"$f":"COUNTIF(TS3L8_L8N_3,L63)*$O$22*4","v":0},{"$f":"SUM(M63:O63)","v":0},null,null,null,{"$f":"Lotto8_C6525_1!L64","v":0},{"$f":"Lotto8_C6525_1!F64","v":0},{"$f":"Lotto8_C6525_2!L64","v":0},{"$f":"Lotto8_C6525_2!F64","v":0},{"$f":"Lotto8_C6525_3!L64","v":0},{"$f":"Lotto8_C6525_3!F64","v":0},null,{"$f":"ISODD(SUM($J$23:J63))","v":false}]
[null,"",{"$f":"IF(B64=\"\",\"\",VLOOKUP(L64,Tabella_prezzi!$A$1:$K$183,9,FALSE))","v":""},{"$f":"IF(B64=\"\",\"\",VLOOKUP(L64,Tabella_prezzi!$A$1:$K$183,6,FALSE))","v":""},{"$f":"IF(B64=\"\",\"\",VLOOKUP(L64,Tabella_prezzi!$A$1:$K$183,8,FALSE))","v":""},{"$f":"IF(B64=\"\",\"\",VLOOKUP(L64,Tabella_prezzi!$A$1:$K$183,4,FALSE))","v":""},"",null,null,0,"TS3L8-WI800GB","L8N32",{"$f":"COUNTIF(TS3L8_L8N_1,L64)*$M$22*Q64*4","v":0},{"$f":"COUNTIF(TS3L8_L8N_2,L64)*$N$22*R64*4","v":0},{"$f":"COUNTIF(TS3L8_L8N_3,L64)*$O$22*S64*4","v":0},0,{"$f":"Lotto8_C6525_1!F59","v":0},{"$f":"Lotto8_C6525_2!F59","v":0},{"$f":"Lotto8_C6525_3!F59","v":0},{"$f":"Lotto8_C6525_1!L87","v":0},null,{"$f":"Lotto8_C6525_2!L87","v":0},null,{"$f":"Lotto8_C6525_3!L87","v":0},{"$f":"Lotto8_C6525_3!F65","v":2},null,{"$f":"ISODD(SUM($J$23:J64))","v":false}]
[null,"",{"$f":"IF(B65=\"\",\"\",VLOOKUP(L65,Tabella_prezzi!$A$1:$K$183,9,FALSE))","v":""},{"$f":"IF(B65=\"\",\"\",VLOOKUP(L65,Tabella_prezzi!$A$1:$K$183,6,FALSE))","v":""},{"$f":"IF(B65=\"\",\"\",VLOOKUP(L65,Tabella_prezzi!$A$1:$K$183,8,FALSE))","v":""},{"$f":"IF(B65=\"\",\"\",VLOOKUP(L65,Tabella_prezzi!$A$1:$K$183,4,FALSE))","v":""},"",null,null,0,"TS3L8-VS7STD6AK","L8N33",null,null,null,{"$f":"Altre_Opzioni!F20","v":0},null,null,null,{"$f":"Lotto8_C6525_1!L66","v":0},{"$f":"Lotto8_C6525_1!F66","v":0},{"$f":"Lotto8_C6525_2!L66","v":0},{"$f":"Lotto8_C6525_2!F66","v":0},{"$f":"Lotto8_C6525_3!L66","v":0},{"$f":"Lotto8_C6525_3!F66","v":0},null,{"$f":"ISODD(SUM($J$23:J65))","v":false}]
[null,"",{"$f":"IF(B66=\"\",\"\",VLOOKUP(L66,Tabella_prezzi!$A$1:$K$183,9,FALSE))","v":""},{"$f":"IF(B66=\"\",\"\",VLOOKUP(L66,Tabella_prezzi!$A$1:$K$183,6,FALSE))","v":""},{"$f":"IF(B66=\"\",\"\",VLOOKUP(L66,Tabella_prezzi!$A$1:$K$183,8,FALSE))","v":""},{"$f":"IF(B66=\"\",\"\",VLOOKUP(L66,Tabella_prezzi!$A$1:$K$183,4,FALSE))","v":""},"",null,null,0,"TS3L8-VS7STD","L8N34",null,null,null,{"$f":"Altre_Opzioni!F21","v":0},null,null,null,{"$f":"Lotto8_C6525_1!L67","v":0},{"$f":"Lotto8_C6525_1!F67","v":0},{"$f":"Lotto8_C6525_2!L67","v":0},{"$f":"Lotto8_C6525_2!F67","v":0},{"$f":"Lotto8_C6525_3!L67","v":0},{"$f":"Lotto8_C6525_3!F67","v":0},null,{"$f":"ISODD(SUM($J$23:J66))","v":false}]
[null,"",{"$f":"IF(B67=\"\",\"\",VLOOKUP(L67,Tabella_prezzi!$A$1:$K$183,9,FALSE))","v":""},{"$f":"IF(B67=\"\",\"\",VLOOKUP(L67,Tabella_prezzi!$A$1:$K$183,6,FALSE))","v":""},{"$f":"IF(B67=\"\",\"\",VLOOKUP(L67,Tabella_prezzi!$A$1:$K$183,8,FALSE))","v":""},{"$f":"IF(B67=\"\",\"\",VLOOKUP(L67,Tabella_prezzi!$A$1:$K$183,4,FALSE))","v":""},"",null,null,0,"TS3L8-VS7EPL6AK","L8N35",null,null,null,{"$f":"Altre_Opzioni!F22","v":0},null,null,null,{"$f":"Lotto8_C6525_1!L68","v":""},{"$f":"Lotto8_C6525_1!F68","v":""},{"$f":"Lotto8_C6525_2!L68","v":""},{"$f":"Lotto8_C6525_2!F68","v":""},{"$f":"Lotto8_C6525_3!L68","v":""},{"$f":"Lotto8_C6525_3!F68","v":""},null,{"$f":"ISODD(SUM($J$23:J67))","v":false}]
[null,"",{"$f":"IF(B68=\"\",\"\",VLOOKUP(L68,Tabella_prezzi!$A$1:$K$183,9,FALSE))","v":""},{"$f":"IF(B68=\"\",\"\",VLOOKUP(L68,Tabella_prezzi!$A$1:$K$183,6,FALSE))","v":""},{"$f":"IF(B68=\"\",\"\",VLOOKUP(L68,Tabella_prezzi!$A$1:$K$183,8,FALSE))","v":""},{"$f":"IF(B68=\"\",\"\",VLOOKUP(L68,Tabella_prezzi!$A$1:$K$183,4,FALSE))","v":""},"",null,null,0,"TS3L8-VS7EPL","L8N36",null,null,null,{"$f":"Altre_Opzioni!F23","v":0},null,null,null,{"$f":"Lotto8_C6525_1!L69","v":0},{"$f":"Lotto8_C6525_1!F69","v":0},{"$f":"Lotto8_C6525_2!L69","v":0},{"$f":"Lotto8_C6525_2!F69","v":0},{"$f":"Lotto8_C6525_3!L69","v":0},{"$f":"Lotto8_C6525_3!F69","v":0},null,{"$f":"ISODD(SUM($J$23:J68))","v":false}]
[null,"",{"$f":"IF(B69=\"\",\"\",VLOOKUP(L69,Tabella_prezzi!$A$1:$K$183,9,FALSE))","v":""},{"$f":"IF(B69=\"\",\"\",VLOOKUP(L69,Tabella_prezzi!$A$1:$K$183,6,FALSE))","v":""},{"$f":"IF(B69=\"\",\"\",VLOOKUP(L69,Tabella_prezzi!$A$1:$K$183,8,FALSE))","v":""},{"$f":"IF(B69=\"\",\"\",VLOOKUP(L69,Tabella_prezzi!$A$1:$K$183,4,FALSE))","v":""},"",null,null,0,"TS3L8-VCS7STD","L8N37",null,null,null,{"$f":"Altre_Opzioni!F24","v":0},null,null,null,{"$f":"Lotto8_C6525_1!L70","v":0},{"$f":"Lotto8_C6525_1!F70","v":0},{"$f":"Lotto8_C6525_2!L70","v":0},{"$f":"Lotto8_C6525_2!F70","v":0},{"$f":"Lotto8_C6525_3!L70","v":0},{"$f":"Lotto8_C6525_3!F70","v":0},null,{"$f":"ISODD(SUM($J$23:J69))","v":false}]
[null,"",{"$f":"IF(B70=\"\",\"\",VLOOKUP(L70,Tabella_prezzi!$A$1:$K$183,9,FALSE))","v":""},{"$f":"IF(B70=\"\",\"\",VLOOKUP(L70,Tabella_prezzi!$A$1:$K$183,6,FALSE))","v":""},{"$f":"IF(B70=\"\",\"\",VLOOKUP(L70,Tabella_prezzi!$A$1:$K$183,8,FALSE))","v":""},{"$f":"IF(B70=\"\",\"\",VLOOKUP(L70,Tabella_prezzi!$A$1:$K$183,4,FALSE))","v":""},"",null,null,0,"TS3L8-ST7ENT","L8N38",null,null,null,{"$f":"Altre_Opzioni!F25","v":0},null,null,null,{"$f":"Lotto8_C6525_1!L71","v":0},{"$f":"Lotto8_C6525_1!F71","v":0},{"$f":"Lotto8_C6525_2!L71","v":0},{"$f":"Lotto8_C6525_2!F71","v":0},{"$f":"Lotto8_C6525_3!L71","v":0},{"$f":"Lotto8_C6525_3!F71","v":0},null,{"$f":"ISODD(SUM($J$23:J70))","v":false}]
[null,"",{"$f":"IF(B71=\"\",\"\",VLOOKUP(L71,Tabella_prezzi!$A$1:$K$183,9,FALSE))","v":""},{"$f":"IF(B71=\"\",\"\",VLOOKUP(L71,Tabella_prezzi!$A$1:$K$183,6,FALSE))","v":""},{"$f":"IF(B71=\"\",\"\",VLOOKUP(L71,Tabella_prezzi!$A$1:$K$183,8,FALSE))","v":""},{"$f":"IF(B71=\"\",\"\",VLOOKUP(L71,Tabella_prezzi!$A$1:$K$183,4,FALSE))","v":""},"",null,null,0,"TS3L8-HZ8ADC10","L8N39",null,null,null,{"$f":"Altre_Opzioni!F26","v":0},null,null,null,{"$f":"Lotto8_C6525_1!L72","v":0},{"$f":"Lotto8_C6525_1!F72","v":0},{"$f":"Lotto8_C6525_2!L72","v":0},{"$f":"Lotto8_C6525_2!F72","v":0},{"$f":"Lotto8_C6525_3!L72","v":0},{"$f":"Lotto8_C6525_3!F72","v":0},null,{"$f":"ISODD(SUM($J$23:J71))","v":false}]
[null,"",{"$f":"IF(B72=\"\",\"\",VLOOKUP(L72,Tabella_prezzi!$A$1:$K$183,9,FALSE))","v":""},{"$f":"IF(B72=\"\",\"\",VLOOKUP(L72,Tabella_prezzi!$A$1:$K$183,6,FALSE))","v":""},{"$f":"IF(B72=\"\",\"\",VLOOKUP(L72,Tabella_prezzi!$A$1:$K$183,8,FALSE))","v":""},{"$f":"IF(B72=\"\",\"\",VLOOKUP(L72,Tabella_prezzi!$A$1:$K$183,4,FALSE))","v":""},"",null,null,0,"TS3L8-HZ8ENC10","L8N40",null,null,null,{"$f":"Altre_Opzioni!F27","v":0},null,null,null,{"$f":"Lotto8_C6525_1!L73","v":0},{"$f":"Lotto8_C6525_1!F73","v":0},{"$f":"Lotto8_C6525_2!L73","v":0},{"$f":"Lotto8_C6525_2!F73","v":0},{"$f":"Lotto8_C6525_3!L73","v":0},{"$f":"Lotto8_C6525_3!F73","v":0},null,{"$f":"ISODD(SUM($J$23:J72))","v":false}]
[null,"",{"$f":"IF(B73=\"\",\"\",VLOOKUP(L73,Tabella_prezzi!$A$1:$K$183,9,FALSE))","v":""},{"$f":"IF(B73=\"\",\"\",VLOOKUP(L73,Tabella_prezzi!$A$1:$K$183,6,FALSE))","v":""},{"$f":"IF(B73=\"\",\"\",VLOOKUP(L73,Tabella_prezzi!$A$1:$K$183,8,FALSE))","v":""},{"$f":"IF(B73=\"\",\"\",VLOOKUP(L73,Tabella_prezzi!$A$1:$K$183,4,FALSE))","v":""},"",null,null,0,"TS3L8-HZ8ADN10","L8N41",null,null,null,{"$f":"Altre_Opzioni!F28","v":0},null,null,null,{"$f":"Lotto8_C6525_1!L74","v":0},{"$f":"Lotto8_C6525_1!F74","v":0},{"$f":"Lotto8_C6525_2!L74","v":0},{"$f":"Lotto8_C6525_2!F74","v":0},{"$f":"Lotto8_C6525_3!L74","v":0},{"$f":"Lotto8_C6525_3!F74","v":0},null,{"$f":"ISODD(SUM($J$23:J73))","v":false}]
[null,"",{"$f":"IF(B74=\"\",\"\",VLOOKUP(L74,Tabella_prezzi!$A$1:$K$183,9,FALSE))","v":""},{"$f":"IF(B74=\"\",\"\",VLOOKUP(L74,Tabella_prezzi!$A$1:$K$183,6,FALSE))","v":""},{"$f":"IF(B74=\"\",\"\",VLOOKUP(L74,Tabella_prezzi!$A$1:$K$183,8,FALSE))","v":""},{"$f":"IF(B74=\"\",\"\",VLOOKUP(L74,Tabella_prezzi!$A$1:$K$183,4,FALSE))","v":""},"",null,null,0,"TS3L8-HZ8ENN10","L8N42",null,null,null,{"$f":"Altre_Opzioni!F29","v":0},null,null,null,{"$f":"Lotto8_C6525_1!L75","v":0},{"$f":"Lotto8_C6525_1!F75","v":0},{"$f":"Lotto8_C6525_2!L75","v":0},{"$f":"Lotto8_C6525_2!F75","v":0},{"$f":"Lotto8_C6525_3!L75","v":0},{"$f":"Lotto8_C6525_3!F75","v":0},null,{"$f":"ISODD(SUM($J$23:J74))","v":false}]
[null,"",{"$f":"IF(B75=\"\",\"\",VLOOKUP(L75,Tabella_prezzi!$A$1:$K$183,9,FALSE))","v":""},{"$f":"IF(B75=\"\",\"\",VLOOKUP(L75,Tabella_prezzi!$A$1:$K$183,6,FALSE))","v":""},{"$f":"IF(B75=\"\",\"\",VLOOKUP(L75,Tabella_prezzi!$A$1:$K$183,8,FALSE))","v":""},{"$f":"IF(B75=\"\",\"\",VLOOKUP(L75,Tabella_prezzi!$A$1:$K$183,4,FALSE))","v":""},"",null,null,0,"TS3L8-Encl13Y4H","L8N43",null,null,null,{"$f":"Altre_Opzioni!F33","v":0},null,null,null,{"$f":"Lotto8_C6525_1!L76","v":0},{"$f":"Lotto8_C6525_1!F76","v":0},{"$f":"Lotto8_C6525_2!L76","v":0},{"$f":"Lotto8_C6525_2!F76","v":0},{"$f":"Lotto8_C6525_3!L76","v":0},{"$f":"Lotto8_C6525_3!F76","v":0},null,{"$f":"ISODD(SUM($J$23:J75))","v":false}]
[null,"",{"$f":"IF(B76=\"\",\"\",VLOOKUP(L76,Tabella_prezzi!$A$1:$K$183,9,FALSE))","v":""},{"$f":"IF(B76=\"\",\"\",VLOOKUP(L76,Tabella_prezzi!$A$1:$K$183,6,FALSE))","v":""},{"$f":"IF(B76=\"\",\"\",VLOOKUP(L76,Tabella_prezzi!$A$1:$K$183,8,FALSE))","v":""},{"$f":"IF(B76=\"\",\"\",VLOOKUP(L76,Tabella_prezzi!$A$1:$K$183,4,FALSE))","v":""},"",null,null,0,"TS3L8-Encl25Y4H","L8N44",null,null,null,{"$f":"Altre_Opzioni!F34","v":0},null,null,null,{"$f":"Lotto8_C6525_1!L77","v":0},{"$f":"Lotto8_C6525_1!F77","v":0},{"$f":"Lotto8_C6525_2!L77","v":0},{"$f":"Lotto8_C6525_2!F77","v":0},{"$f":"Lotto8_C6525_3!L77","v":0},{"$f":"Lotto8_C6525_3!F77","v":0},null,{"$f":"ISODD(SUM($J$23:J76))","v":false}]
[null,"",{"$f":"IF(B77=\"\",\"\",VLOOKUP(L77,Tabella_prezzi!$A$1:$K$183,9,FALSE))","v":""},{"$f":"IF(B77=\"\",\"\",VLOOKUP(L77,Tabella_prezzi!$A$1:$K$183,6,FALSE))","v":""},{"$f":"IF(B77=\"\",\"\",VLOOKUP(L77,Tabella_prezzi!$A$1:$K$183,8,FALSE))","v":""},{"$f":"IF(B77=\"\",\"\",VLOOKUP(L77,Tabella_prezzi!$A$1:$K$183,4,FALSE))","v":""},"",null,null,0,"TS3L8-RACKM32A","L8N45",null,null,null,{"$f":"Altre_Opzioni!F9","v":0},null,null,null,{"$f":"Lotto8_C6525_1!L78","v":0},{"$f":"Lotto8_C6525_1!F78","v":0},{"$f":"Lotto8_C6525_2!L78","v":0},{"$f":"Lotto8_C6525_2!F78","v":0},{"$f":"Lotto8_C6525_3!L78","v":0},{"$f":"Lotto8_C6525_3!F78","v":0},null,{"$f":"ISODD(SUM($J$23:J77))","v":false}]
[null,"",{"$f":"IF(B78=\"\",\"\",VLOOKUP(L78,Tabella_prezzi!$A$1:$K$183,9,FALSE))","v":""},{"$f":"IF(B78=\"\",\"\",VLOOKUP(L78,Tabella_prezzi!$A$1:$K$183,6,FALSE))","v":""},{"$f":"IF(B78=\"\",\"\",VLOOKUP(L78,Tabella_prezzi!$A$1:$K$183,8,FALSE))","v":""},{"$f":"IF(B78=\"\",\"\",VLOOKUP(L78,Tabella_prezzi!$A$1:$K$183,4,FALSE))","v":""},"",null,null,0,"TS3L8-RACKT32A","L8N46",null,null,null,{"$f":"Altre_Opzioni!F12","v":0},null,null,null,{"$f":"Lotto8_C6525_1!L79","v":0},{"$f":"Lotto8_C6525_1!F79","v":0},{"$f":"Lotto8_C6525_2!L79","v":0},{"$f":"Lotto8_C6525_2!F79","v":0},{"$f":"Lotto8_C6525_3!L79","v":0},{"$f":"Lotto8_C6525_3!F79","v":0},null,{"$f":"ISODD(SUM($J$23:J78))","v":false}]
[null,{"$f":"IF(P79>0,P79,\"\")","v":""},{"$f":"IF(B79=\"\",\"\",VLOOKUP(L79,Tabella_prezzi!$A$1:$K$183,9,FALSE))","v":""},{"$f":"IF(B79=\"\",\"\",VLOOKUP(L79,Tabella_prezzi!$A$1:$K$183,6,FALSE))","v":""},{"$f":"IF(B79=\"\",\"\",VLOOKUP(L79,Tabella_prezzi!$A$1:$K$183,8,FALSE))","v":""},{"$f":"IF(B79=\"\",\"\",VLOOKUP(L79,Tabella_prezzi!$A$1:$K$183,4,FALSE))","v":""},{"$f":"IF(C79=\"\",\"\",F79*B79)","v":""},null,null,0,"TS3L8-OCP25GB","L8N47",{"$f":"COUNTIF(TS3L8_L8N_1,L79)*$M$22*4","v":0},{"$f":"COUNTIF(TS3L8_L8N_2,L79)*$N$22*4","v":0},{"$f":"COUNTIF(TS3L8_L8N_3,L79)*$O$22*4","v":0},{"$f":"SUM(M79:O79)","v":0},null,null,null,{"$f":"Lotto8_C6525_1!L80","v":0},{"$f":"Lotto8_C6525_1!F80","v":0},{"$f":"Lotto8_C6525_2!L80","v":0},{"$f":"Lotto8_C6525_2!F80","v":0},{"$f":"Lotto8_C6525_3!L80","v":0},{"$f":"Lotto8_C6525_3!F80","v":0},null,{"$f":"ISODD(SUM($J$23:J79))","v":false}]
[null,"",{"$f":"IF(B80=\"\",\"\",VLOOKUP(L80,Tabella_prezzi!$A$1:$K$183,9,FALSE))","v":""},{"$f":"IF(B80=\"\",\"\",VLOOKUP(L80,Tabella_prezzi!$A$1:$K$183,6,FALSE))","v":""},{"$f":"IF(B80=\"\",\"\",VLOOKUP(L80,Tabella_prezzi!$A$1:$K$183,8,FALSE))","v":""},{"$f":"IF(B80=\"\",\"\",VLOOKUP(L80,Tabella_prezzi!$A$1:$K$183,4,FALSE))","v":""},"",null,null,0,"TS3L8-X710BT-L","L8N48",{"$f":"COUNTIF(TS3L8_L8N_1,L80)*$M$22*4","v":0},{"$f":"COUNTIF(TS3L8_L8N_2,L80)*$N$22*4","v":0},{"$f":"COUNTIF(TS3L8_L8N_3,L80)*$O$22*4","v":0},0,null,null,null,{"$f":"Lotto8_C6525_1!L81","v":0},{"$f":"Lotto8_C6525_1!F81","v":0},{"$f":"Lotto8_C6525_2!L81","v":0},{"$f":"Lotto8_C6525_2!F81","v":0},{"$f":"Lotto8_C6525_3!L81","v":0},{"$f":"Lotto8_C6525_3!F81","v":0},null,{"$f":"ISODD(SUM($J$23:J80))","v":false}]
[null,"",{"$f":"IF(B81=\"\",\"\",VLOOKUP(L81,Tabella_prezzi!$A$1:$K$183,9,FALSE))","v":""},{"$f":"IF(B81=\"\",\"\",VLOOKUP(L81,Tabella_prezzi!$A$1:$K$183,6,FALSE))","v":""},{"$f":"IF(B81=\"\",\"\",VLOOKUP(L81,Tabella_prezzi!$A$1:$K$183,8,FALSE))","v":""},{"$f":"IF(B81=\"\",\"\",VLOOKUP(L81,Tabella_prezzi!$A$1:$K$183,4,FALSE))","v":""},"",null,null,0,"TS3L8-57416BT-L","L8N49",{"$f":"COUNTIF(TS3L8_L8N_1,L81)*$M$22*4","v":0},{"$f":"COUNTIF(TS3L8_L8N_2,L81)*$N$22*4","v":0},{"$f":"COUNTIF(TS3L8_L8N_3,L81)*$O$22*4","v":0},0,null,null,null,{"$f":"Lotto8_C6525_1!L82","v":0},{"$f":"Lotto8_C6525_1!F82","v":0},{"$f":"Lotto8_C6525_2!L82","v":0},{"$f":"Lotto8_C6525_2!F82","v":0},{"$f":"Lotto8_C6525_3!L82","v":0},{"$f":"Lotto8_C6525_3!F82","v":0},null,{"$f":"ISODD(SUM($J$23:J81))","v":false}]
[null,"",{"$f":"IF(B82=\"\",\"\",VLOOKUP(L82,Tabella_prezzi!$A$1:$K$183,9,FALSE))","v":""},{"$f":"IF(B82=\"\",\"\",VLOOKUP(L82,Tabella_prezzi!$A$1:$K$183,6,FALSE))","v":""},{"$f":"IF(B82=\"\",\"\",VLOOKUP(L82,Tabella_prezzi!$A$1:$K$183,8,FALSE))","v":""},{"$f":"IF(B82=\"\",\"\",VLOOKUP(L82,Tabella_prezzi!$A$1:$K$183,4,FALSE))","v":""},"",null,null,0,"TS3L8-ED16TB","L8N50",null,null,null,{"$f":"Altre_Opzioni!F36","v":0},null,null,null,{"$f":"Lotto8_C6525_1!L83","v":0},{"$f":"Lotto8_C6525_1!F83","v":0},{"$f":"Lotto8_C6525_2!L83","v":0},{"$f":"Lotto8_C6525_2!F83","v":0},{"$f":"Lotto8_C6525_3!L83","v":0},{"$f":"Lotto8_C6525_3!F83","v":0},null,{"$f":"ISODD(SUM($J$23:J82))","v":false}]
[null,"",{"$f":"IF(B83=\"\",\"\",VLOOKUP(L83,Tabella_prezzi!$A$1:$K$183,9,FALSE))","v":""},{"$f":"IF(B83=\"\",\"\",VLOOKUP(L83,Tabella_prezzi!$A$1:$K$183,6,FALSE))","v":""},{"$f":"IF(B83=\"\",\"\",VLOOKUP(L83,Tabella_prezzi!$A$1:$K$183,8,FALSE))","v":""},{"$f":"IF(B83=\"\",\"\",VLOOKUP(L83,Tabella_prezzi!$A$1:$K$183,4,FALSE))","v":""},"",null,null,0,"TS3L8-ED12TB","L8N51",null,null,null,{"$f":"Altre_Opzioni!F37","v":0},null,null,null,{"$f":"Lotto8_C6525_1!L84","v":0},{"$f":"Lotto8_C6525_1!F84","v":0},{"$f":"Lotto8_C6525_2!L84","v":0},{"$f":"Lotto8_C6525_2!F84","v":0},{"$f":"Lotto8_C6525_3!L84","v":0},{"$f":"Lotto8_C6525_3!F84","v":0},null,{"$f":"ISODD(SUM($J$23:J83))","v":false}]
[null,"",{"$f":"IF(B84=\"\",\"\",VLOOKUP(L84,Tabella_prezzi!$A$1:$K$183,9,FALSE))","v":""},{"$f":"IF(B84=\"\",\"\",VLOOKUP(L84,Tabella_prezzi!$A$1:$K$183,6,FALSE))","v":""},{"$f":"IF(B84=\"\",\"\",VLOOKUP(L84,Tabella_prezzi!$A$1:$K$183,8,FALSE))","v":""},{"$f":"IF(B84=\"\",\"\",VLOOKUP(L84,Tabella_prezzi!$A$1:$K$183,4,FALSE))","v":""},"",null,null,0,"TS3L8-ED08TB","L8N52",null,null,null,{"$f":"Altre_Opzioni!F38","v":0},null,null,null,{"$f":"Lotto8_C6525_1!L85","v":""},{"$f":"Lotto8_C6525_1!F85","v":""},{"$f":"Lotto8_C6525_2!L85","v":""},{"$f":"Lotto8_C6525_2!F85","v":""},{"$f":"Lotto8_C6525_3!L85","v":""},{"$f":"Lotto8_C6525_3!F85","v":""},null,{"$f":"ISODD(SUM($J$23:J84))","v":false}]
[null,"",{"$f":"IF(B85=\"\",\"\",VLOOKUP(L85,Tabella_prezzi!$A$1:$K$183,9,FALSE))","v":""},{"$f":"IF(B85=\"\",\"\",VLOOKUP(L85,Tabella_prezzi!$A$1:$K$183,6,FALSE))","v":""},{"$f":"IF(B85=\"\",\"\",VLOOKUP(L85,Tabella_prezzi!$A$1:$K$183,8,FALSE))","v":""},{"$f":"IF(B85=\"\",\"\",VLOOKUP(L85,Tabella_prezzi!$A$1:$K$183,4,FALSE))","v":""},"",null,null,0,"TS3L8-OT10GB","L8N53",{"$f":"COUNTIF(TS3L8_L8N_1,L85)*$M$22*(Lotto8_C6525_1!F94)","v":0},{"$f":"COUNTIF(TS3L8_L8N_2,L85)*$N$22*(Lotto8_C6525_2!F94)","v":0},{"$f":"COUNTIF(TS3L8_L8N_3,L85)*$O$22*(Lotto8_C6525_3!F94)","v":0},{"$f":"SUM(M85:O85)","v":0},null,null,null,{"$f":"Lotto8_C6525_1!L86","v":0},{"$f":"Lotto8_C6525_1!F86","v":0},{"$f":"Lotto8_C6525_2!L86","v":0},{"$f":"Lotto8_C6525_2!F86","v":0},{"$f":"Lotto8_C6525_3!L86","v":0},{"$f":"Lotto8_C6525_3!F86","v":0},null,{"$f":"ISODD(SUM($J$23:J85))","v":false}]
[null,"",{"$f":"IF(B86=\"\",\"\",VLOOKUP(L86,Tabella_prezzi!$A$1:$K$183,9,FALSE))","v":""},{"$f":"IF(B86=\"\",\"\",VLOOKUP(L86,Tabella_prezzi!$A$1:$K$183,6,FALSE))","v":""},{"$f":"IF(B86=\"\",\"\",VLOOKUP(L86,Tabella_prezzi!$A$1:$K$183,8,FALSE))","v":""},{"$f":"IF(B86=\"\",\"\",VLOOKUP(L86,Tabella_prezzi!$A$1:$K$183,4,FALSE))","v":""},"",null,null,0,"TS3L8-OT25GB","L8N54",{"$f":"COUNTIF(TS3L8_L8N_1,L86)*$M$22*(Lotto8_C6525_1!F95)","v":0},{"$f":"COUNTIF(TS3L8_L8N_2,L86)*$N$22*(Lotto8_C6525_2!F95)","v":0},{"$f":"COUNTIF(TS3L8_L8N_3,L86)*$O$22*(Lotto8_C6525_3!F95)","v":0},0,null,null,null,{"$f":"Lotto8_C6525_1!L87","v":0},{"$f":"Lotto8_C6525_1!F87","v":0},{"$f":"Lotto8_C6525_2!L87","v":0},{"$f":"Lotto8_C6525_2!F87","v":0},{"$f":"Lotto8_C6525_3!L87","v":0},{"$f":"Lotto8_C6525_3!F87","v":0},null,{"$f":"ISODD(SUM($J$23:J86))","v":false}]
[null,"",{"$f":"IF(B87=\"\",\"\",VLOOKUP(L87,Tabella_prezzi!$A$1:$K$183,9,FALSE))","v":""},{"$f":"IF(B87=\"\",\"\",VLOOKUP(L87,Tabella_prezzi!$A$1:$K$183,6,FALSE))","v":""},{"$f":"IF(B87=\"\",\"\",VLOOKUP(L87,Tabella_prezzi!$A$1:$K$183,8,FALSE))","v":""},{"$f":"IF(B87=\"\",\"\",VLOOKUP(L87,Tabella_prezzi!$A$1:$K$183,4,FALSE))","v":""},"",null,null,0,"TS3L8-MLX100M3","L8N55",{"$f":"COUNTIF(TS3L8_L8N_1,L87)*$M$22*(Lotto8_C6525_1!F96)","v":0},{"$f":"COUNTIF(TS3L8_L8N_2,L87)*$N$22*(Lotto8_C6525_2!F96)","v":0},{"$f":"COUNTIF(TS3L8_L8N_3,L87)*$O$22*(Lotto8_C6525_3!F95)","v":0},{"$f":"SUM(M87:O87)","v":0},null,null,null,{"$f":"Lotto8_C6525_1!L88","v":0},{"$f":"Lotto8_C6525_1!F88","v":0},{"$f":"Lotto8_C6525_2!L88","v":0},{"$f":"Lotto8_C6525_2!F88","v":0},{"$f":"Lotto8_C6525_3!L88","v":0},{"$f":"Lotto8_C6525_3!F88","v":0},null,{"$f":"ISODD(SUM($J$23:J87))","v":false}]
[null,{"$f":"IF(P88>0,P88,\"\")","v":""},{"$f":"IF(B88=\"\",\"\",VLOOKUP(L88,Tabella_prezzi!$A$1:$K$183,9,FALSE))","v":""},{"$f":"IF(B88=\"\",\"\",VLOOKUP(L88,Tabella_prezzi!$A$1:$K$183,6,FALSE))","v":""},{"$f":"IF(B88=\"\",\"\",VLOOKUP(L88,Tabella_prezzi!$A$1:$K$183,8,FALSE))","v":""},{"$f":"IF(B88=\"\",\"\",VLOOKUP(L88,Tabella_prezzi!$A$1:$K$183,4,FALSE))","v":""},{"$f":"IF(C88=\"\",\"\",F88*B88)","v":""},null,null,{"$f":"IF(B88=\"\",0,1)","v":0},"TS3L8-MDPVGA","L8N56",{"$f":"COUNTIF(TS3L8_L8N_1,L88)*$M$22*(Lotto8_C6525_1!F99)","v":0},{"$f":"COUNTIF(TS3L8_L8N_2,L88)*$N$22*(Lotto8_C6525_2!F99)","v":0},{"$f":"COUNTIF(TS3L8_L8N_3,L88)*$O$22*(Lotto8_C6525_3!F99)","v":0},0,null,null,null,{"$f":"Lotto8_C6525_1!L89","v":0},{"$f":"Lotto8_C6525_1!F89","v":0},{"$f":"Lotto8_C6525_2!L89","v":0},{"$f":"Lotto8_C6525_2!F89","v":0},{"$f":"Lotto8_C6525_3!L89","v":0},{"$f":"Lotto8_C6525_3!F89","v":0},null,{"$f":"ISODD(SUM($J$23:J88))","v":false}]
[null,"",{"$f":"IF(B89=\"\",\"\",VLOOKUP(L89,Tabella_prezzi!$A$1:$K$183,9,FALSE))","v":""},{"$f":"IF(B89=\"\",\"\",VLOOKUP(L89,Tabella_prezzi!$A$1:$K$183,6,FALSE))","v":""},{"$f":"IF(B89=\"\",\"\",VLOOKUP(L89,Tabella_prezzi!$A$1:$K$183,8,FALSE))","v":""},{"$f":"IF(B89=\"\",\"\",VLOOKUP(L89,Tabella_prezzi!$A$1:$K$183,4,FALSE))","v":""},"",null,null,{"$f":"IF(B89=\"\",0,1)","v":0},null,null,null,null,null,null,null,null,null,{"$f":"Lotto8_C6525_1!L90","v":0},{"$f":"Lotto8_C6525_1!F90","v":0},{"$f":"Lotto8_C6525_2!L90","v":0},{"$f":"Lotto8_C6525_2!F90","v":0},{"$f":"Lotto8_C6525_3!L90","v":0},{"$f":"Lotto8_C6525_3!F90","v":0},null,{"$f":"ISODD(SUM($J$23:J89))","v":false}]
[null,"",{"$f":"IF(B90=\"\",\"\",VLOOKUP(L90,Tabella_prezzi!$A$1:$K$183,9,FALSE))","v":""},{"$f":"IF(B90=\"\",\"\",VLOOKUP(L90,Tabella_prezzi!$A$1:$K$183,6,FALSE))","v":""},{"$f":"IF(B90=\"\",\"\",VLOOKUP(L90,Tabella_prezzi!$A$1:$K$183,8,FALSE))","v":""},{"$f":"IF(B90=\"\",\"\",VLOOKUP(L90,Tabella_prezzi!$A$1:$K$183,4,FALSE))","v":""},"",null,null,0,null,null,null,null,null,null,null,null,null,{"$f":"Lotto8_C6525_1!L91","v":""},{"$f":"Lotto8_C6525_1!F91","v":""},{"$f":"Lotto8_C6525_2!L91","v":""},{"$f":"Lotto8_C6525_2!F91","v":""},{"$f":"Lotto8_C6525_3!L91","v":""},{"$f":"Lotto8_C6525_3!F91","v":""},null,{"$f":"ISODD(SUM($J$23:J90))","v":false}]
[null,"",{"$f":"IF(B91=\"\",\"\",VLOOKUP(L91,Tabella_prezzi!$A$1:$K$183,9,FALSE))","v":""},{"$f":"IF(B91=\"\",\"\",VLOOKUP(L91,Tabella_prezzi!$A$1:$K$183,6,FALSE))","v":""},{"$f":"IF(B91=\"\",\"\",VLOOKUP(L91,Tabella_prezzi!$A$1:$K$183,8,FALSE))","v":""},{"$f":"IF(B91=\"\",\"\",VLOOKUP(L91,Tabella_prezzi!$A$1:$K$183,4,FALSE))","v":""},"",null,null,0,null,null,null,null,null,null,null,null,null,{"$f":"Lotto8_C6525_1!L92","v":0},{"$f":"Lotto8_C6525_1!F92","v":0},{"$f":"Lotto8_C6525_2!L92","v":0},{"$f":"Lotto8_C6525_2!F92","v":0},{"$f":"Lotto8_C6525_3!L92","v":0},{"$f":"Lotto8_C6525_3!F92","v":0},null,{"$f":"ISODD(SUM($J$23:J91))","v":false}]
[null,"",{"$f":"IF(B92=\"\",\"\",VLOOKUP(L92,Tabella_prezzi!$A$1:$K$183,9,FALSE))","v":""},{"$f":"IF(B92=\"\",\"\",VLOOKUP(L92,Tabella_prezzi!$A$1:$K$183,6,FALSE))","v":""},{"$f":"IF(B92=\"\",\"\",VLOOKUP(L92,Tabella_prezzi!$A$1:$K$183,8,FALSE))","v":""},{"$f":"IF(B92=\"\",\"\",VLOOKUP(L92,Tabella_prezzi!$A$1:$K$183,4,FALSE))","v":""},"",null,null,0,null,null,null,null,null,null,null,null,null,{"$f":"Lotto8_C6525_1!L101","v":0},{"$f":"Lotto8_C6525_1!F101","v":0},{"$f":"Lotto8_C6525_2!L101","v":0},{"$f":"Lotto8_C6525_2!F101","v":0},{"$f":"Lotto8_C6525_3!L101","v":0},{"$f":"Lotto8_C6525_3!F101","v":0},null,{"$f":"ISODD(SUM($J$23:J92))","v":false}]
[null,"",{"$f":"IF(B93=\"\",\"\",VLOOKUP(L93,Tabella_prezzi!$A$1:$K$183,9,FALSE))","v":""},{"$f":"IF(B93=\"\",\"\",VLOOKUP(L93,Tabella_prezzi!$A$1:$K$183,6,FALSE))","v":""},{"$f":"IF(B93=\"\",\"\",VLOOKUP(L93,Tabella_prezzi!$A$1:$K$183,8,FALSE))","v":""},{"$f":"IF(B93=\"\",\"\",VLOOKUP(L93,Tabella_prezzi!$A$1:$K$183,4,FALSE))","v":""},"",null,null,0,null,null,null,null,null,null,null,null,null,{"$f":"Lotto8_C6525_1!L102","v":"L8N30"},{"$f":"Lotto8_C6525_1!F102","v":20},{"$f":"Lotto8_C6525_2!L102","v":"L8N30"},{"$f":"Lotto8_C6525_2!F102","v":20},{"$f":"Lotto8_C6525_3!L102","v":"L8N30"},{"$f":"Lotto8_C6525_3!F102","v":20},null,{"$f":"ISODD(SUM($J$23:J93))","v":false}]
[null,"",{"$f":"IF(B94=\"\",\"\",VLOOKUP(L94,Tabella_prezzi!$A$1:$K$183,9,FALSE))","v":""},{"$f":"IF(B94=\"\",\"\",VLOOKUP(L94,Tabella_prezzi!$A$1:$K$183,6,FALSE))","v":""},{"$f":"IF(B94=\"\",\"\",VLOOKUP(L94,Tabella_prezzi!$A$1:$K$183,8,FALSE))","v":""},{"$f":"IF(B94=\"\",\"\",VLOOKUP(L94,Tabella_prezzi!$A$1:$K$183,4,FALSE))","v":""},"",null,null,0,null,null,null,null,null,null,null,null,null,{"$f":"Lotto8_C6525_1!L103","v":0},{"$f":"Lotto8_C6525_1!F103","v":0},{"$f":"Lotto8_C6525_2!L103","v":0},{"$f":"Lotto8_C6525_2!F103","v":0},{"$f":"Lotto8_C6525_3!L103","v":0},{"$f":"Lotto8_C6525_3!F103","v":0},null,{"$f":"ISODD(SUM($J$23:J94))","v":false}]
[null,"",{"$f":"IF(B95=\"\",\"\",VLOOKUP(L95,Tabella_prezzi!$A$1:$K$183,9,FALSE))","v":""},{"$f":"IF(B95=\"\",\"\",VLOOKUP(L95,Tabella_prezzi!$A$1:$K$183,6,FALSE))","v":""},{"$f":"IF(B95=\"\",\"\",VLOOKUP(L95,Tabella_prezzi!$A$1:$K$183,8,FALSE))","v":""},{"$f":"IF(B95=\"\",\"\",VLOOKUP(L95,Tabella_prezzi!$A$1:$K$183,4,FALSE))","v":""},"",null,null,0,null,null,null,null,null,null,null,null,null,{"$f":"Lotto8_C6525_1!L104","v":0},{"$f":"Lotto8_C6525_1!F104","v":0},{"$f":"Lotto8_C6525_2!L104","v":0},{"$f":"Lotto8_C6525_2!F104","v":0},{"$f":"Lotto8_C6525_3!L104","v":0},{"$f":"Lotto8_C6525_3!F104","v":0},null,{"$f":"ISODD(SUM($J$23:J95))","v":false}]
[null,"",{"$f":"IF(B96=\"\",\"\",VLOOKUP(L96,Tabella_prezzi!$A$1:$K$183,9,FALSE))","v":""},{"$f":"IF(B96=\"\",\"\",VLOOKUP(L96,Tabella_prezzi!$A$1:$K$183,6,FALSE))","v":""},{"$f":"IF(B96=\"\",\"\",VLOOKUP(L96,Tabella_prezzi!$A$1:$K$183,8,FALSE))","v":""},{"$f":"IF(B96=\"\",\"\",VLOOKUP(L96,Tabella_prezzi!$A$1:$K$183,4,FALSE))","v":""},"",null,null,0,null,null,null,null,null,null,null,null,null,{"$f":"Lotto8_C6525_1!L105","v":""},{"$f":"Lotto8_C6525_1!F105","v":""},{"$f":"Lotto8_C6525_2!L105","v":""},{"$f":"Lotto8_C6525_2!F105","v":""},{"$f":"Lotto8_C6525_3!L105","v":""},{"$f":"Lotto8_C6525_3!F105","v":""},null,{"$f":"ISODD(SUM($J$23:J96))","v":false}]
[null,"",{"$f":"IF(B97=\"\",\"\",VLOOKUP(L97,Tabella_prezzi!$A$1:$K$183,9,FALSE))","v":""},{"$f":"IF(B97=\"\",\"\",VLOOKUP(L97,Tabella_prezzi!$A$1:$K$183,6,FALSE))","v":""},{"$f":"IF(B97=\"\",\"\",VLOOKUP(L97,Tabella_prezzi!$A$1:$K$183,8,FALSE))","v":""},{"$f":"IF(B97=\"\",\"\",VLOOKUP(L97,Tabella_prezzi!$A$1:$K$183,4,FALSE))","v":""},"",null,null,0,null,null,null,null,null,null,null,null,null,{"$f":"Lotto8_C6525_1!L106","v":0},{"$f":"Lotto8_C6525_1!F106","v":0},{"$f":"Lotto8_C6525_2!L106","v":0},{"$f":"Lotto8_C6525_2!F106","v":0},{"$f":"Lotto8_C6525_3!L106","v":0},{"$f":"Lotto8_C6525_3!F106","v":0},null,{"$f":"ISODD(SUM($J$23:J97))","v":false}]
[null,"",{"$f":"IF(B98=\"\",\"\",VLOOKUP(L98,Tabella_prezzi!$A$1:$K$183,9,FALSE))","v":""},{"$f":"IF(B98=\"\",\"\",VLOOKUP(L98,Tabella_prezzi!$A$1:$K$183,6,FALSE))","v":""},{"$f":"IF(B98=\"\",\"\",VLOOKUP(L98,Tabella_prezzi!$A$1:$K$183,8,FALSE))","v":""},{"$f":"IF(B98=\"\",\"\",VLOOKUP(L98,Tabella_prezzi!$A$1:$K$183,4,FALSE))","v":""},"",null,null,0,null,null,null,null,null,null,null,null,null,{"$f":"Lotto8_C6525_1!L107","v":0},{"$f":"Lotto8_C6525_1!F107","v":0},{"$f":"Lotto8_C6525_2!L107","v":0},{"$f":"Lotto8_C6525_2!F107","v":0},{"$f":"Lotto8_C6525_3!L107","v":0},{"$f":"Lotto8_C6525_3!F107","v":0},null,{"$f":"ISODD(SUM($J$23:J98))","v":false}]
[null,"",{"$f":"IF(B99=\"\",\"\",VLOOKUP(L99,Tabella_prezzi!$A$1:$K$183,9,FALSE))","v":""},{"$f":"IF(B99=\"\",\"\",VLOOKUP(L99,Tabella_prezzi!$A$1:$K$183,6,FALSE))","v":""},{"$f":"IF(B99=\"\",\"\",VLOOKUP(L99,Tabella_prezzi!$A$1:$K$183,8,FALSE))","v":""},{"$f":"IF(B99=\"\",\"\",VLOOKUP(L99,Tabella_prezzi!$A$1:$K$183,4,FALSE))","v":""},"",null,null,0,null,null,null,null,null,null,null,null,null,{"$f":"Lotto8_C6525_1!L108","v":""},{"$f":"Lotto8_C6525_1!F108","v":""},{"$f":"Lotto8_C6525_2!L108","v":""},{"$f":"Lotto8_C6525_2!F108","v":""},{"$f":"Lotto8_C6525_3!L108","v":""},{"$f":"Lotto8_C6525_3!F108","v":""},null,{"$f":"ISODD(SUM($J$23:J99))","v":false}]
[null,"",{"$f":"IF(B100=\"\",\"\",VLOOKUP(L100,Tabella_prezzi!$A$1:$K$183,9,FALSE))","v":""},{"$f":"IF(B100=\"\",\"\",VLOOKUP(L100,Tabella_prezzi!$A$1:$K$183,6,FALSE))","v":""},{"$f":"IF(B100=\"\",\"\",VLOOKUP(L100,Tabella_prezzi!$A$1:$K$183,8,FALSE))","v":""},{"$f":"IF(B100=\"\",\"\",VLOOKUP(L100,Tabella_prezzi!$A$1:$K$183,4,FALSE))","v":""},"",null,null,0,null,null,null,null,null,null,null,null,null,{"$f":"Lotto8_C6525_1!L109","v":0},{"$f":"Lotto8_C6525_1!F109","v":0},{"$f":"Lotto8_C6525_2!L109","v":0},{"$f":"Lotto8_C6525_2!F109","v":0},{"$f":"Lotto8_C6525_3!L109","v":0},{"$f":"Lotto8_C6525_3!F109","v":0},null,{"$f":"ISODD(SUM($J$23:J100))","v":false}]
[null,"",{"$f":"IF(B101=\"\",\"\",VLOOKUP(L101,Tabella_prezzi!$A$1:$K$183,9,FALSE))","v":""},{"$f":"IF(B101=\"\",\"\",VLOOKUP(L101,Tabella_prezzi!$A$1:$K$183,6,FALSE))","v":""},{"$f":"IF(B101=\"\",\"\",VLOOKUP(L101,Tabella_prezzi!$A$1:$K$183,8,FALSE))","v":""},{"$f":"IF(B101=\"\",\"\",VLOOKUP(L101,Tabella_prezzi!$A$1:$K$183,4,FALSE))","v":""},"",null,null,0,null,null,null,null,null,null,null,null,null,{"$f":"Lotto8_C6525_1!L110","v":0},{"$f":"Lotto8_C6525_1!F110","v":0},{"$f":"Lotto8_C6525_2!L110","v":0},{"$f":"Lotto8_C6525_2!F110","v":0},{"$f":"Lotto8_C6525_3!L110","v":0},{"$f":"Lotto8_C6525_3!F110","v":0},null,{"$f":"ISODD(SUM($J$23:J101))","v":false}]
[null,"",{"$f":"IF(B102=\"\",\"\",VLOOKUP(L102,Tabella_prezzi!$A$1:$K$183,9,FALSE))","v":""},{"$f":"IF(B102=\"\",\"\",VLOOKUP(L102,Tabella_prezzi!$A$1:$K$183,6,FALSE))","v":""},{"$f":"IF(B102=\"\",\"\",VLOOKUP(L102,Tabella_prezzi!$A$1:$K$183,8,FALSE))","v":""},{"$f":"IF(B102=\"\",\"\",VLOOKUP(L102,Tabella_prezzi!$A$1:$K$183,4,FALSE))","v":""},"",null,null,0,null,null,null,null,null,null,null,null,null,null,null,null,null,null,null,null,{"$f":"ISODD(SUM($J$23:J102))","v":false}]
[null,"",{"$f":"IF(B103=\"\",\"\",VLOOKUP(L103,Tabella_prezzi!$A$1:$K$183,9,FALSE))","v":""},{"$f":"IF(B103=\"\",\"\",VLOOKUP(L103,Tabella_prezzi!$A$1:$K$183,6,FALSE))","v":""},{"$f":"IF(B103=\"\",\"\",VLOOKUP(L103,Tabella_prezzi!$A$1:$K$183,8,FALSE))","v":""},{"$f":"IF(B103=\"\",\"\",VLOOKUP(L103,Tabella_prezzi!$A$1:$K$183,4,FALSE))","v":""},"",null,null,0,null,null,null,null,null,null,null,null,null,null,null,null,null,null,null,null,{"$f":"ISODD(SUM($J$23:J103))","v":false}]
[null,"",{"$f":"IF(B104=\"\",\"\",VLOOKUP(L104,Tabella_prezzi!$A$1:$K$183,9,FALSE))","v":""},{"$f":"IF(B104=\"\",\"\",VLOOKUP(L104,Tabella_prezzi!$A$1:$K$183,6,FALSE))","v":""},{"$f":"IF(B104=\"\",\"\",VLOOKUP(L104,Tabella_prezzi!$A$1:$K$183,8,FALSE))","v":""},{"$f":"IF(B104=\"\",\"\",VLOOKUP(L104,Tabella_prezzi!$A$1:$K$183,4,FALSE))","v":""},"",null,null,0,null,null,null,null,null,null,null,null,null,null,null,null,null,null,null,null,{"$f":"ISODD(SUM($J$23:J104))","v":false}]
[null,"",{"$f":"IF(B105=\"\",\"\",VLOOKUP(L105,Tabella_prezzi!$A$1:$K$183,9,FALSE))","v":""},{"$f":"IF(B105=\"\",\"\",VLOOKUP(L105,Tabella_prezzi!$A$1:$K$183,6,FALSE))","v":""},{"$f":"IF(B105=\"\",\"\",VLOOKUP(L105,Tabella_prezzi!$A$1:$K$183,8,FALSE))","v":""},{"$f":"IF(B105=\"\",\"\",VLOOKUP(L105,Tabella_prezzi!$A$1:$K$183,4,FALSE))","v":""},"",null,null,0,null,null,null,null,null,null,null,null,null,null,null,null,null,null,null,null,{"$f":"ISODD(SUM($J$23:J105))","v":false}]
[null,"",{"$f":"IF(B106=\"\",\"\",VLOOKUP(L106,Tabella_prezzi!$A$1:$K$183,9,FALSE))","v":""},{"$f":"IF(B106=\"\",\"\",VLOOKUP(L106,Tabella_prezzi!$A$1:$K$183,6,FALSE))","v":""},{"$f":"IF(B106=\"\",\"\",VLOOKUP(L106,Tabella_prezzi!$A$1:$K$183,8,FALSE))","v":""},{"$f":"IF(B106=\"\",\"\",VLOOKUP(L106,Tabella_prezzi!$A$1:$K$183,4,FALSE))","v":""},"",null,null,0,null,null,null,null,null,null,null,null,null,null,null,null,null,null,null,null,{"$f":"ISODD(SUM($J$23:J106))","v":false}]
[null,"",{"$f":"IF(B107=\"\",\"\",VLOOKUP(L107,Tabella_prezzi!$A$1:$K$183,9,FALSE))","v":""},{"$f":"IF(B107=\"\",\"\",VLOOKUP(L107,Tabella_prezzi!$A$1:$K$183,6,FALSE))","v":""},{"$f":"IF(B107=\"\",\"\",VLOOKUP(L107,Tabella_prezzi!$A$1:$K$183,8,FALSE))","v":""},{"$f":"IF(B107=\"\",\"\",VLOOKUP(L107,Tabella_prezzi!$A$1:$K$183,4,FALSE))","v":""},"",null,null,0,null,null,null,null,null,null,null,null,null,null,null,null,null,null,null,null,{"$f":"ISODD(SUM($J$23:J107))","v":false}]
[null,"",{"$f":"IF(B108=\"\",\"\",VLOOKUP(L108,Tabella_prezzi!$A$1:$K$183,9,FALSE))","v":""},{"$f":"IF(B108=\"\",\"\",VLOOKUP(L108,Tabella_prezzi!$A$1:$K$183,6,FALSE))","v":""},{"$f":"IF(B108=\"\",\"\",VLOOKUP(L108,Tabella_prezzi!$A$1:$K$183,8,FALSE))","v":""},{"$f":"IF(B108=\"\",\"\",VLOOKUP(L108,Tabella_prezzi!$A$1:$K$183,4,FALSE))","v":""},"",null,null,0,null,null,null,null,null,null,null,null,null,null,null,null,null,null,null,null,{"$f":"ISODD(SUM($J$23:J108))","v":false}]
[null,"",{"$f":"IF(B109=\"\",\"\",VLOOKUP(L109,Tabella_prezzi!$A$1:$K$183,9,FALSE))","v":""},{"$f":"IF(B109=\"\",\"\",VLOOKUP(L109,Tabella_prezzi!$A$1:$K$183,6,FALSE))","v":""},{"$f":"IF(B109=\"\",\"\",VLOOKUP(L109,Tabella_prezzi!$A$1:$K$183,8,FALSE))","v":""},{"$f":"IF(B109=\"\",\"\",VLOOKUP(L109,Tabella_prezzi!$A$1:$K$183,4,FALSE))","v":""},"",null,null,0,null,null,null,null,null,null,null,null,null,null,null,null,null,null,null,null,{"$f":"ISODD(SUM($J$23:J109))","v":false}]
[null,"",{"$f":"IF(B110=\"\",\"\",VLOOKUP(L110,Tabella_prezzi!$A$1:$K$183,9,FALSE))","v":""},{"$f":"IF(B110=\"\",\"\",VLOOKUP(L110,Tabella_prezzi!$A$1:$K$183,6,FALSE))","v":""},{"$f":"IF(B110=\"\",\"\",VLOOKUP(L110,Tabella_prezzi!$A$1:$K$183,8,FALSE))","v":""},{"$f":"IF(B110=\"\",\"\",VLOOKUP(L110,Tabella_prezzi!$A$1:$K$183,4,FALSE))","v":""},"",null,null,0,null,null,null,null,null,null,null,null,null,null,null,null,null,null,null,null,{"$f":"ISODD(SUM($J$23:J110))","v":false}]
[null,"Convenzione",null,null,null,null,{"$f":"SUM(G23:G57)","v":0},null,null,{"$f":"IF(G111=0,0,1)","v":0}]
[null,"Valore economico 20% consentito",null,{"$f":"G111/100*20","v":0},"Ulteriori componenti opzionali (20%)",null,{"$f":"SUM(G60:G110)","v":0},null,null,{"$f":"IF(G112=0,0,1)","v":0}]
[null,"Totale iva esclusa",null,null,null,null,{"$f":"G112+G111","v":0},null,null,0]
[null,"I.V.A.",null,null,null,null,{"$f":"G113/100*22","v":0},null,null,0]
[null,"TOTALE ORDINE",null,null,null,null,{"$f":"G113+G114","v":0},null,null,0]
[null,null,null,null,null,null,null,null,null,1]

{"sheet":"Configurazione","index":7,"n_rows":92,"n_cols":24,"rows_kept":92,"cut":false,"hidden":false,"merged":[[87,1,87,3],[87,6,87,8],[69,1,69,2],[69,4,69,5],[69,7,69,8],[70,1,81,2],[70,4,81,5],[70,7,81,8],[84,1,85,2],[84,4,85,5],[84,7,85,8]]}
[null,null,null,null,null,null,null,null,null,null,null,null,null,null,null,null,null,null,null,null,null,1]
[null,{"$f":"Riepilogo!M22","v":0},"PowerEdge C6400 + 4 x C6525 Conf 1",null,{"$f":"Riepilogo!N22","v":0},"PowerEdge C6400 + 4 x C6525 Conf 2",null,{"$f":"Riepilogo!O22","v":0},"PowerEdge C6400 + 4 x C6525 Conf 3",null,null,null,null,null,null,null,null,null,null,null,null,1]
[null,null,null,null,null,null,null,null,null,null,null,null,null,null,null,null,null,null,null,null,null,{"$f":"IF($U$4>0,1,0)","v":0}]
[null,{"$f":"IF(Riepilogo!M23>0,Riepilogo!M23/$B$2,\"\")","v":""},{"$f":"IF(B4=\"\",\"\",Riepilogo!K23)","v":""},null,{"$f":"IF(Riepilogo!N23>0,Riepilogo!N23/$E$2,\"\")","v":""},{"$f":"IF(E4=\"\",\"\",Riepilogo!K23)","v":""},null,{"$f":"IF(Riepilogo!O23>0,Riepilogo!O23/$H$2,\"\")","v":""},{"$f":"IF(H4=\"\",\"\",Riepilogo!K23)","v":""},null,null,{"$f":"IF(B4=\"\",0,B4)","v":0},null,null,{"$f":"IF(E4=\"\",0,E4)","v":0},null,null,{"$f":"IF(H4=\"\",0,H4)","v":0},null,null,{"$f":"SUM(L4:T4)","v":0},{"$f":"IF(U4>0,1,0)","v":0},{"$f":"ISODD(V4)","v":false}]
[null,{"$f":"IF(Riepilogo!M24>0,Riepilogo!M24/$B$2,\"\")","v":""},{"$f":"IF(B5=\"\",\"\",Riepilogo!K24)","v":""},null,{"$f":"IF(Riepilogo!N24>0,Riepilogo!N24/$E$2,\"\")","v":""},{"$f":"IF(E5=\"\",\"\",Riepilogo!K24)","v":""},null,{"$f":"IF(Riepilogo!O24>0,Riepilogo!O24/$H$2,\"\")","v":""},{"$f":"IF(H5=\"\",\"\",Riepilogo!K24)","v":""},null,null,{"$f":"IF(B5=\"\",0,B5)","v":0},null,null,{"$f":"IF(E5=\"\",0,E5)","v":0},null,null,{"$f":"IF(H5=\"\",0,H5)","v":0},null,null,{"$f":"SUM(L5:T5)","v":0},{"$f":"IF(U5>0,1,0)","v":0},{"$f":"ISODD(SUM($V$4:V5))","v":false}]
[null,{"$f":"IF(Riepilogo!M25>0,Riepilogo!M25/$B$2,\"\")","v":""},{"$f":"IF(B6=\"\",\"\",Riepilogo!K25)","v":""},null,{"$f":"IF(Riepilogo!N25>0,Riepilogo!N25/$E$2,\"\")","v":""},{"$f":"IF(E6=\"\",\"\",Riepilogo!K25)","v":""},null,{"$f":"IF(Riepilogo!O25>0,Riepilogo!O25/$H$2,\"\")","v":""},{"$f":"IF(H6=\"\",\"\",Riepilogo!K25)","v":""},null,null,0,null,null,0,null,null,0,null,null,0,0,{"$f":"ISODD(SUM($V$4:V6))","v":false}]
[null,{"$f":"IF(Riepilogo!M26>0,Riepilogo!M26/$B$2,\"\")","v":""},{"$f":"IF(B7=\"\",\"\",Riepilogo!K26)","v":""},null,{"$f":"IF(Riepilogo!N26>0,Riepilogo!N26/$E$2,\"\")","v":""},{"$f":"IF(E7=\"\",\"\",Riepilogo!K26)","v":""},null,{"$f":"IF(Riepilogo!O26>0,Riepilogo!O26/$H$2,\"\")","v":""},{"$f":"IF(H7=\"\",\"\",Riepilogo!K26)","v":""},null,null,0,null,null,0,null,null,0,null,null,0,0,{"$f":"ISODD(SUM($V$4:V7))","v":false}]
[null,{"$f":"IF(Riepilogo!M27>0,Riepilogo!M27/$B$2,\"\")","v":""},{"$f":"IF(B8=\"\",\"\",Riepilogo!K27)","v":""},null,{"$f":"IF(Riepilogo!N27>0,Riepilogo!N27/$E$2,\"\")","v":""},{"$f":"IF(E8=\"\",\"\",Riepilogo!K27)","v":""},null,{"$f":"IF(Riepilogo!O27>0,Riepilogo!O27/$H$2,\"\")","v":""},{"$f":"IF(H8=\"\",\"\",Riepilogo!K27)","v":""},null,null,0,null,null,0,null,null,0,null,null,0,0,{"$f":"ISODD(SUM($V$4:V8))","v":false}]
[null,{"$f":"IF(Riepilogo!M28>0,Riepilogo!M28/$B$2,\"\")","v":""},{"$f":"IF(B9=\"\",\"\",Riepilogo!K28)","v":""},null,{"$f":"IF(Riepilogo!N28>0,Riepilogo!N28/$E$2,\"\")","v":""},{"$f":"IF(E9=\"\",\"\",Riepilogo!K28)","v":""},null,{"$f":"IF(Riepilogo!O28>0,Riepilogo!O28/$H$2,\"\")","v":""},{"$f":"IF(H9=\"\",\"\",Riepilogo!K28)","v":""},null,null,0,null,null,0,null,null,0,null,null,0,0,{"$f":"ISODD(SUM($V$4:V9))","v":false}]
[null,{"$f":"IF(Riepilogo!M29>0,Riepilogo!M29/$B$2,\"\")","v":""},{"$f":"IF(B10=\"\",\"\",Riepilogo!K29)","v":""},null,{"$f":"IF(Riepilogo!N29>0,Riepilogo!N29/$E$2,\"\")","v":""},{"$f":"IF(E10=\"\",\"\",Riepilogo!K29)","v":""},null,{"$f":"IF(Riepilogo!O29>0,Riepilogo!O29/$H$2,\"\")","v":""},{"$f":"IF(H10=\"\",\"\",Riepilogo!K29)","v":""},null,null,0,null,null,0,null,null,0,null,null,0,0,{"$f":"ISODD(SUM($V$4:V10))","v":false}]
[null,{"$f":"IF(Riepilogo!M30>0,Riepilogo!M30/$B$2,\"\")","v":""},{"$f":"IF(B11=\"\",\"\",Riepilogo!K30)","v":""},null,{"$f":"IF(Riepilogo!N30>0,Riepilogo!N30/$E$2,\"\")","v":""},{"$f":"IF(E11=\"\",\"\",Riepilogo!K30)","v":""},null,{"$f":"IF(Riepilogo!O30>0,Riepilogo!O30/$H$2,\"\")","v":""},{"$f":"IF(H11=\"\",\"\",Riepilogo!K30)","v":""},null,null,0,null,null,0,null,null,0,null,null,0,0,{"$f":"ISODD(SUM($V$4:V11))","v":false}]
[null,{"$f":"IF(Riepilogo!M31>0,Riepilogo!M31/$B$2,\"\")","v":""},{"$f":"IF(B12=\"\",\"\",Riepilogo!K31)","v":""},null,{"$f":"IF(Riepilogo!N31>0,Riepilogo!N31/$E$2,\"\")","v":""},{"$f":"IF(E12=\"\",\"\",Riepilogo!K31)","v":""},null,{"$f":"IF(Riepilogo!O31>0,Riepilogo!O31/$H$2,\"\")","v":""},{"$f":"IF(H12=\"\",\"\",Riepilogo!K31)","v":""},null,null,0,null,null,0,null,null,0,null,null,0,0,{"$f":"ISODD(SUM($V$4:V12))","v":false}]
[null,{"$f":"IF(Riepilogo!M32>0,Riepilogo!M32/$B$2,\"\")","v":""},{"$f":"IF(B13=\"\",\"\",Riepilogo!K32)","v":""},null,{"$f":"IF(Riepilogo!N32>0,Riepilogo!N32/$E$2,\"\")","v":""},{"$f":"IF(E13=\"\",\"\",Riepilogo!K32)","v":""},null,{"$f":"IF(Riepilogo!O32>0,Riepilogo!O32/$H$2,\"\")","v":""},{"$f":"IF(H13=\"\",\"\",Riepilogo!K32)","v":""},null,null,0,null,null,0,null,null,0,null,null,0,0,{"$f":"ISODD(SUM($V$4:V13))","v":false}]
[null,{"$f":"IF(Riepilogo!M33>0,Riepilogo!M33/$B$2,\"\")","v":""},{"$f":"IF(B14=\"\",\"\",Riepilogo!K33)","v":""},null,{"$f":"IF(Riepilogo!N33>0,Riepilogo!N33/$E$2,\"\")","v":""},{"$f":"IF(E14=\"\",\"\",Riepilogo!K33)","v":""},null,{"$f":"IF(Riepilogo!O33>0,Riepilogo!O33/$H$2,\"\")","v":""},{"$f":"IF(H14=\"\",\"\",Riepilogo!K33)","v":""},null,null,0,null,null,0,null,null,0,null,null,0,0,{"$f":"ISODD(SUM($V$4:V14))","v":false}]
[null,{"$f":"IF(Riepilogo!M34>0,Riepilogo!M34/$B$2,\"\")","v":""},{"$f":"IF(B15=\"\",\"\",Riepilogo!K34)","v":""},null,{"$f":"IF(Riepilogo!N34>0,Riepilogo!N34/$E$2,\"\")","v":""},{"$f":"IF(E15=\"\",\"\",Riepilogo!K34)","v":""},null,{"$f":"IF(Riepilogo!O34>0,Riepilogo!O34/$H$2,\"\")","v":""},{"$f":"IF(H15=\"\",\"\",Riepilogo!K34)","v":""},null,null,0,null,null,0,null,null,0,null,null,0,0,{"$f":"ISODD(SUM($V$4:V15))","v":false}]
[null,{"$f":"IF(Riepilogo!M35>0,Riepilogo!M35/$B$2,\"\")","v":""},{"$f":"IF(B16=\"\",\"\",Riepilogo!K35)","v":""},null,{"$f":"IF(Riepilogo!N35>0,Riepilogo!N35/$E$2,\"\")","v":""},{"$f":"IF(E16=\"\",\"\",Riepilogo!K35)","v":""},null,{"$f":"IF(Riepilogo!O35>0,Riepilogo!O35/$H$2,\"\")","v":""},{"$f":"IF(H16=\"\",\"\",Riepilogo!K35)","v":""},null,null,0,null,null,0,null,null,0,null,null,0,0,{"$f":"ISODD(SUM($V$4:V16))","v":false}]
[null,{"$f":"IF(Riepilogo!M36>0,Riepilogo!M36/$B$2,\"\")","v":""},{"$f":"IF(B17=\"\",\"\",Riepilogo!K36)","v":""},null,{"$f":"IF(Riepilogo!N36>0,Riepilogo!N36/$E$2,\"\")","v":""},{"$f":"IF(E17=\"\",\"\",Riepilogo!K36)","v":""},null,{"$f":"IF(Riepilogo!O36>0,Riepilogo!O36/$H$2,\"\")","v":""},{"$f":"IF(H17=\"\",\"\",Riepilogo!K36)","v":""},null,null,0,null,null,0,null,null,0,null,null,0,0,{"$f":"ISODD(SUM($V$4:V17))","v":false}]
[null,{"$f":"IF(Riepilogo!M37>0,Riepilogo!M37/$B$2,\"\")","v":""},{"$f":"IF(B18=\"\",\"\",Riepilogo!K37)","v":""},null,{"$f":"IF(Riepilogo!N37>0,Riepilogo!N37/$E$2,\"\")","v":""},{"$f":"IF(E18=\"\",\"\",Riepilogo!K37)","v":""},null,{"$f":"IF(Riepilogo!O37>0,Riepilogo!O37/$H$2,\"\")","v":""},{"$f":"IF(H18=\"\",\"\",Riepilogo!K37)","v":""},null,null,0,null,null,0,null,null,0,null,null,0,0,{"$f":"ISODD(SUM($V$4:V18))","v":false}]
[null,{"$f":"IF(Riepilogo!M38>0,Riepilogo!M38/$B$2,\"\")","v":""},{"$f":"IF(B19=\"\",\"\",Riepilogo!K38)","v":""},null,{"$f":"IF(Riepilogo!N38>0,Riepilogo!N38/$E$2,\"\")","v":""},{"$f":"IF(E19=\"\",\"\",Riepilogo!K38)","v":""},null,{"$f":"IF(Riepilogo!O38>0,Riepilogo!O38/$H$2,\"\")","v":""},{"$f":"IF(H19=\"\",\"\",Riepilogo!K38)","v":""},null,null,0,null,null,0,null,null,0,null,null,0,0,{"$f":"ISODD(SUM($V$4:V19))","v":false}]
[null,{"$f":"IF(Riepilogo!M39>0,Riepilogo!M39/$B$2,\"\")","v":""},{"$f":"IF(B20=\"\",\"\",Riepilogo!K39)","v":""},null,{"$f":"IF(Riepilogo!N39>0,Riepilogo!N39/$E$2,\"\")","v":""},{"$f":"IF(E20=\"\",\"\",Riepilogo!K39)","v":""},null,{"$f":"IF(Riepilogo!O39>0,Riepilogo!O39/$H$2,\"\")","v":""},{"$f":"IF(H20=\"\",\"\",Riepilogo!K39)","v":""},null,null,0,null,null,0,null,null,0,null,null,0,0,{"$f":"ISODD(SUM($V$4:V20))","v":false}]
[null,{"$f":"IF(Riepilogo!M40>0,Riepilogo!M40/$B$2,\"\")","v":""},{"$f":"IF(B21=\"\",\"\",Riepilogo!K40)","v":""},null,{"$f":"IF(Riepilogo!N40>0,Riepilogo!N40/$E$2,\"\")","v":""},{"$f":"IF(E21=\"\",\"\",Riepilogo!K40)","v":""},null,{"$f":"IF(Riepilogo!O40>0,Riepilogo!O40/$H$2,\"\")","v":""},{"$f":"IF(H21=\"\",\"\",Riepilogo!K40)","v":""},null,null,0,null,null,0,null,null,0,null,null,0,0,{"$f":"ISODD(SUM($V$4:V21))","v":false}]
[null,{"$f":"IF(Riepilogo!M41>0,Riepilogo!M41/$B$2,\"\")","v":""},{"$f":"IF(B22=\"\",\"\",Riepilogo!K41)","v":""},null,{"$f":"IF(Riepilogo!N41>0,Riepilogo!N41/$E$2,\"\")","v":""},{"$f":"IF(E22=\"\",\"\",Riepilogo!K41)","v":""},null,{"$f":"IF(Riepilogo!O41>0,Riepilogo!O41/$H$2,\"\")","v":""},{"$f":"IF(H22=\"\",\"\",Riepilogo!K41)","v":""},null,null,0,null,null,0,null,null,0,null,null,0,0,{"$f":"ISODD(SUM($V$4:V22))","v":false}]
[null,{"$f":"IF(Riepilogo!M42>0,Riepilogo!M42/$B$2,\"\")","v":""},{"$f":"IF(B23=\"\",\"\",Riepilogo!K42)","v":""},null,{"$f":"IF(Riepilogo!N42>0,Riepilogo!N42/$E$2,\"\")","v":""},{"$f":"IF(E23=\"\",\"\",Riepilogo!K42)","v":""},null,{"$f":"IF(Riepilogo!O42>0,Riepilogo!O42/$H$2,\"\")","v":""},{"$f":"IF(H23=\"\",\"\",Riepilogo!K42)","v":""},null,null,0,null,null,0,null,null,0,null,null,0,0,{"$f":"ISODD(SUM($V$4:V23))","v":false}]
[null,{"$f":"IF(Riepilogo!M43>0,Riepilogo!M43/$B$2,\"\")","v":""},{"$f":"IF(B24=\"\",\"\",Riepilogo!K43)","v":""},null,{"$f":"IF(Riepilogo!N43>0,Riepilogo!N43/$E$2,\"\")","v":""},{"$f":"IF(E24=\"\",\"\",Riepilogo!K43)","v":""},null,{"$f":"IF(Riepilogo!O43>0,Riepilogo!O43/$H$2,\"\")","v":""},{"$f":"IF(H24=\"\",\"\",Riepilogo!K43)","v":""},null,null,0,null,null,0,null,null,0,null,null,0,0,{"$f":"ISODD(SUM($V$4:V24))","v":false}]
[null,{"$f":"IF(Riepilogo!M44>0,Riepilogo!M44/$B$2,\"\")","v":""},{"$f":"IF(B25=\"\",\"\",Riepilogo!K44)","v":""},null,{"$f":"IF(Riepilogo!N44>0,Riepilogo!N44/$E$2,\"\")","v":""},{"$f":"IF(E25=\"\",\"\",Riepilogo!K44)","v":""},null,{"$f":"IF(Riepilogo!O44>0,Riepilogo!O44/$H$2,\"\")","v":""},{"$f":"IF(H25=\"\",\"\",Riepilogo!K44)","v":""},null,null,0,null,null,0,null,null,0,null,null,0,0,{"$f":"ISODD(SUM($V$4:V25))","v":false}]
[null,{"$f":"IF(Riepilogo!M45>0,Riepilogo!M45/$B$2,\"\")","v":""},{"$f":"IF(B26=\"\",\"\",Riepilogo!K45)","v":""},null,{"$f":"IF(Riepilogo!N45>0,Riepilogo!N45/$E$2,\"\")","v":""},{"$f":"IF(E26=\"\",\"\",Riepilogo!K45)","v":""},null,{"$f":"IF(Riepilogo!O45>0,Riepilogo!O45/$H$2,\"\")","v":""},{"$f":"IF(H26=\"\",\"\",Riepilogo!K45)","v":""},null,null,0,null,null,0,null,null,0,null,null,0,0,{"$f":"ISODD(SUM($V$4:V26))","v":false}]
[null,{"$f":"IF(Riepilogo!M46>0,Riepilogo!M46/$B$2,\"\")","v":""},{"$f":"IF(B27=\"\",\"\",Riepilogo!K46)","v":""},null,{"$f":"IF(Riepilogo!N46>0,Riepilogo!N46/$E$2,\"\")","v":""},{"$f":"IF(E27=\"\",\"\",Riepilogo!K46)","v":""},null,{"$f":"IF(Riepilogo!O46>0,Riepilogo!O46/$H$2,\"\")","v":""},{"$f":"IF(H27=\"\",\"\",Riepilogo!K46)","v":""},null,null,0,null,null,0,null,null,0,null,null,0,0,{"$f":"ISODD(SUM($V$4:V27))","v":false}]
[null,{"$f":"IF(Riepilogo!M47>0,Riepilogo!M47/$B$2,\"\")","v":""},{"$f":"IF(B28=\"\",\"\",Riepilogo!K47)","v":""},null,{"$f":"IF(Riepilogo!N47>0,Riepilogo!N47/$E$2,\"\")","v":""},{"$f":"IF(E28=\"\",\"\",Riepilogo!K47)","v":""},null,{"$f":"IF(Riepilogo!O47>0,Riepilogo!O47/$H$2,\"\")","v":""},{"$f":"IF(H28=\"\",\"\",Riepilogo!K47)","v":""},null,null,0,null,null,0,null,null,0,null,null,0,0,{"$f":"ISODD(SUM($V$4:V28))","v":false}]
[null,{"$f":"IF(Riepilogo!M48>0,Riepilogo!M48/$B$2,\"\")","v":""},{"$f":"IF(B29=\"\",\"\",Riepilogo!K48)","v":""},null,{"$f":"IF(Riepilogo!N48>0,Riepilogo!N48/$E$2,\"\")","v":""},{"$f":"IF(E29=\"\",\"\",Riepilogo!K48)","v":""},null,{"$f":"IF(Riepilogo!O48>0,Riepilogo!O48/$H$2,\"\")","v":""},{"$f":"IF(H29=\"\",\"\",Riepilogo!K48)","v":""},null,null,0,null,null,0,null,null,0,null,null,0,0,{"$f":"ISODD(SUM($V$4:V29))","v":false}]
[null,{"$f":"IF(Riepilogo!M49>0,Riepilogo!M49/$B$2,\"\")","v":""},{"$f":"IF(B30=\"\",\"\",Riepilogo!K49)","v":""},null,{"$f":"IF(Riepilogo!N49>0,Riepilogo!N49/$E$2,\"\")","v":""},{"$f":"IF(E30=\"\",\"\",Riepilogo!K49)","v":""},null,{"$f":"IF(Riepilogo!O49>0,Riepilogo!O49/$H$2,\"\")","v":""},{"$f":"IF(H30=\"\",\"\",Riepilogo!K49)","v":""},null,null,0,null,null,0,null,null,0,null,null,0,0,{"$f":"ISODD(SUM($V$4:V30))","v":false}]
[null,{"$f":"IF(Riepilogo!M50>0,Riepilogo!M50/$B$2,\"\")","v":""},{"$f":"IF(B31=\"\",\"\",Riepilogo!K50)","v":""},null,{"$f":"IF(Riepilogo!N50>0,Riepilogo!N50/$E$2,\"\")","v":""},{"$f":"IF(E31=\"\",\"\",Riepilogo!K50)","v":""},null,{"$f":"IF(Riepilogo!O50>0,Riepilogo!O50/$H$2,\"\")","v":""},{"$f":"IF(H31=\"\",\"\",Riepilogo!K50)","v":""},null,null,0,null,null,0,null,null,0,null,null,0,0,{"$f":"ISODD(SUM($V$4:V31))","v":false}]
[null,{"$f":"IF(Riepilogo!M51>0,Riepilogo!M51/$B$2,\"\")","v":""},{"$f":"IF(B32=\"\",\"\",Riepilogo!K51)","v":""},null,{"$f":"IF(Riepilogo!N51>0,Riepilogo!N51/$E$2,\"\")","v":""},{"$f":"IF(E32=\"\",\"\",Riepilogo!K51)","v":""},null,{"$f":"IF(Riepilogo!O51>0,Riepilogo!O51/$H$2,\"\")","v":""},{"$f":"IF(H32=\"\",\"\",Riepilogo!K51)","v":""},null,null,0,null,null,0,null,null,0,null,null,0,0,{"$f":"ISODD(SUM($V$4:V32))","v":false}]
[null,{"$f":"IF(Riepilogo!M52>0,Riepilogo!M52/$B$2,\"\")","v":""},{"$f":"IF(B33=\"\",\"\",Riepilogo!K52)","v":""},null,{"$f":"IF(Riepilogo!N52>0,Riepilogo!N52/$E$2,\"\")","v":""},{"$f":"IF(E33=\"\",\"\",Riepilogo!K52)","v":""},null,{"$f":"IF(Riepilogo!O52>0,Riepilogo!O52/$H$2,\"\")","v":""},{"$f":"IF(H33=\"\",\"\",Riepilogo!K52)","v":""},null,null,0,null,null,0,null,null,0,null,null,0,0,{"$f":"ISODD(SUM($V$4:V33))","v":false}]
[null,{"$f":"IF(Riepilogo!M53>0,Riepilogo!M53/$B$2,\"\")","v":""},{"$f":"IF(B34=\"\",\"\",Riepilogo!K53)","v":""},null,{"$f":"IF(Riepilogo!N53>0,Riepilogo!N53/$E$2,\"\")","v":""},{"$f":"IF(E34=\"\",\"\",Riepilogo!K53)","v":""},null,{"$f":"IF(Riepilogo!O53>0,Riepilogo!O53/$H$2,\"\")","v":""},{"$f":"IF(H34=\"\",\"\",Riepilogo!K53)","v":""},null,null,{"$f":"IF(B34=\"\",0,B34)","v":0},null,null,{"$f":"IF(E34=\"\",0,E34)","v":0},null,null,{"$f":"IF(H34=\"\",0,H34)","v":0},null,null,{"$f":"SUM(L34:T34)","v":0},{"$f":"IF(U34>0,1,0)","v":0},{"$f":"ISODD(SUM($V$4:V34))","v":false}]
[null,{"$f":"IF(Riepilogo!M54>0,Riepilogo!M54/$B$2,\"\")","v":""},{"$f":"IF(B35=\"\",\"\",Riepilogo!K54)","v":""},null,{"$f":"IF(Riepilogo!N54>0,Riepilogo!N54/$E$2,\"\")","v":""},{"$f":"IF(E35=\"\",\"\",Riepilogo!K54)","v":""},null,{"$f":"IF(Riepilogo!O54>0,Riepilogo!O54/$H$2,\"\")","v":""},{"$f":"IF(H35=\"\",\"\",Riepilogo!K54)","v":""},null,null,0,null,null,0,null,null,0,null,null,0,0,{"$f":"ISODD(SUM($V$4:V35))","v":false}]
[null,{"$f":"IF(Riepilogo!M55>0,Riepilogo!M55/$B$2,\"\")","v":""},{"$f":"IF(B36=\"\",\"\",Riepilogo!K55)","v":""},null,{"$f":"IF(Riepilogo!N55>0,Riepilogo!N55/$E$2,\"\")","v":""},{"$f":"IF(E36=\"\",\"\",Riepilogo!K55)","v":""},null,{"$f":"IF(Riepilogo!O55>0,Riepilogo!O55/$H$2,\"\")","v":""},{"$f":"IF(H36=\"\",\"\",Riepilogo!K55)","v":""},null,null,0,null,null,0,null,null,0,null,null,0,0,{"$f":"ISODD(SUM($V$4:V36))","v":false}]
[null,{"$f":"IF(Riepilogo!M56>0,Riepilogo!M56/$B$2,\"\")","v":""},{"$f":"IF(B37=\"\",\"\",Riepilogo!K56)","v":""},null,{"$f":"IF(Riepilogo!N56>0,Riepilogo!N56/$E$2,\"\")","v":""},{"$f":"IF(E37=\"\",\"\",Riepilogo!K56)","v":""},null,{"$f":"IF(Riepilogo!O56>0,Riepilogo!O56/$H$2,\"\")","v":""},{"$f":"IF(H37=\"\",\"\",Riepilogo!K56)","v":""},null,null,0,null,null,0,null,null,0,null,null,0,0,{"$f":"ISODD(SUM($V$4:V37))","v":false}]
[null,{"$f":"IF(Riepilogo!M57>0,Riepilogo!M57/$B$2,\"\")","v":""},{"$f":"IF(B38=\"\",\"\",Riepilogo!K57)","v":""},null,{"$f":"IF(Riepilogo!N57>0,Riepilogo!N57/$E$2,\"\")","v":""},{"$f":"IF(E38=\"\",\"\",Riepilogo!K57)","v":""},null,{"$f":"IF(Riepilogo!O57>0,Riepilogo!O57/$H$2,\"\")","v":""},{"$f":"IF(H38=\"\",\"\",Riepilogo!K57)","v":""},null,null,0,null,null,0,null,null,0,null,null,0,0,{"$f":"ISODD(SUM($V$4:V38))","v":false}]
[null,{"$f":"IF(Riepilogo!M60>0,Riepilogo!M60/$B$2,\"\")","v":""},{"$f":"IF(B39=\"\",\"\",Riepilogo!K60)","v":""},null,{"$f":"IF(Riepilogo!N60>0,Riepilogo!N60/$E$2,\"\")","v":""},{"$f":"IF(E39=\"\",\"\",Riepilogo!K60)","v":""},null,{"$f":"IF(Riepilogo!O60>0,Riepilogo!O60/$H$2,\"\")","v":""},{"$f":"IF(H39=\"\",\"\",Riepilogo!K60)","v":""},null,null,0,null,null,0,null,null,0,null,null,0,0,{"$f":"ISODD(SUM($V$4:V39))","v":false},"inizio 20%"]
[null,{"$f":"IF(Riepilogo!M61>0,Riepilogo!M61/$B$2,\"\")","v":""},{"$f":"IF(B40=\"\",\"\",Riepilogo!K61)","v":""},null,{"$f":"IF(Riepilogo!N61>0,Riepilogo!N61/$E$2,\"\")","v":""},{"$f":"IF(E40=\"\",\"\",Riepilogo!K61)","v":""},null,{"$f":"IF(Riepilogo!O61>0,Riepilogo!O61/$H$2,\"\")","v":""},{"$f":"IF(H40=\"\",\"\",Riepilogo!K61)","v":""},null,null,0,null,null,0,null,null,0,null,null,0,0,{"$f":"ISODD(SUM($V$4:V40))","v":false}]
[null,{"$f":"IF(Riepilogo!M62>0,Riepilogo!M62/$B$2,\"\")","v":""},{"$f":"IF(B41=\"\",\"\",Riepilogo!K62)","v":""},null,{"$f":"IF(Riepilogo!N62>0,Riepilogo!N62/$E$2,\"\")","v":""},{"$f":"IF(E41=\"\",\"\",Riepilogo!K62)","v":""},null,{"$f":"IF(Riepilogo!O62>0,Riepilogo!O62/$H$2,\"\")","v":""},{"$f":"IF(H41=\"\",\"\",Riepilogo!K62)","v":""},null,null,0,null,null,0,null,null,0,null,null,0,0,{"$f":"ISODD(SUM($V$4:V41))","v":false}]
[null,{"$f":"IF(Riepilogo!M63>0,Riepilogo!M63/$B$2,\"\")","v":""},{"$f":"IF(B42=\"\",\"\",Riepilogo!K63)","v":""},null,{"$f":"IF(Riepilogo!N63>0,Riepilogo!N63/$E$2,\"\")","v":""},{"$f":"IF(E42=\"\",\"\",Riepilogo!K63)","v":""},null,{"$f":"IF(Riepilogo!O63>0,Riepilogo!O63/$H$2,\"\")","v":""},{"$f":"IF(H42=\"\",\"\",Riepilogo!K63)","v":""},null,null,0,null,null,0,null,null,0,null,null,0,0,{"$f":"ISODD(SUM($V$4:V42))","v":false}]
[null,{"$f":"IF(Riepilogo!M64>0,Riepilogo!M64/$B$2,\"\")","v":""},{"$f":"IF(B43=\"\",\"\",Riepilogo!K64)","v":""},null,{"$f":"IF(Riepilogo!N64>0,Riepilogo!N64/$E$2,\"\")","v":""},{"$f":"IF(E43=\"\",\"\",Riepilogo!K64)","v":""},null,{"$f":"IF(Riepilogo!O64>0,Riepilogo!O64/$H$2,\"\")","v":""},{"$f":"IF(H43=\"\",\"\",Riepilogo!K64)","v":""},null,null,0,null,null,0,null,null,0,null,null,0,0,{"$f":"ISODD(SUM($V$4:V43))","v":false}]
[null,{"$f":"IF(Riepilogo!M65>0,Riepilogo!M65/$B$2,\"\")","v":""},{"$f":"IF(B44=\"\",\"\",Riepilogo!K65)","v":""},null,{"$f":"IF(Riepilogo!N65>0,Riepilogo!N65/$E$2,\"\")","v":""},{"$f":"IF(E44=\"\",\"\",Riepilogo!K65)","v":""},null,{"$f":"IF(Riepilogo!O65>0,Riepilogo!O65/$H$2,\"\")","v":""},{"$f":"IF(H44=\"\",\"\",Riepilogo!K65)","v":""},null,null,0,null,null,0,null,null,0,null,null,0,0,{"$f":"ISODD(SUM($V$4:V44))","v":false}]
[null,{"$f":"IF(Riepilogo!M66>0,Riepilogo!M66/$B$2,\"\")","v":""},{"$f":"IF(B45=\"\",\"\",Riepilogo!K66)","v":""},null,{"$f":"IF(Riepilogo!N66>0,Riepilogo!N66/$E$2,\"\")","v":""},{"$f":"IF(E45=\"\",\"\",Riepilogo!K66)","v":""},null,{"$f":"IF(Riepilogo!O66>0,Riepilogo!O66/$H$2,\"\")","v":""},{"$f":"IF(H45=\"\",\"\",Riepilogo!K66)","v":""},null,null,0,null,null,0,null,null,0,null,null,0,0,{"$f":"ISODD(SUM($V$4:V45))","v":false}]
[null,{"$f":"IF(Riepilogo!M67>0,Riepilogo!M67/$B$2,\"\")","v":""},{"$f":"IF(B46=\"\",\"\",Riepilogo!K67)","v":""},null,{"$f":"IF(Riepilogo!N67>0,Riepilogo!N67/$E$2,\"\")","v":""},{"$f":"IF(E46=\"\",\"\",Riepilogo!K67)","v":""},null,{"$f":"IF(Riepilogo!O67>0,Riepilogo!O67/$H$2,\"\")","v":""},{"$f":"IF(H46=\"\",\"\",Riepilogo!K67)","v":""},null,null,0,null,null,0,null,null,0,null,null,0,0,{"$f":"ISODD(SUM($V$4:V46))","v":false}]
[null,{"$f":"IF(Riepilogo!M68>0,Riepilogo!M68/$B$2,\"\")","v":""},{"$f":"IF(B47=\"\",\"\",Riepilogo!K68)","v":""},null,{"$f":"IF(Riepilogo!N68>0,Riepilogo!N68/$E$2,\"\")","v":""},{"$f":"IF(E47=\"\",\"\",Riepilogo!K68)","v":""},null,{"$f":"IF(Riepilogo!O68>0,Riepilogo!O68/$H$2,\"\")","v":""},{"$f":"IF(H47=\"\",\"\",Riepilogo!K68)","v":""},null,null,0,null,null,0,null,null,0,null,null,0,0,{"$f":"ISODD(SUM($V$4:V47))","v":false}]
[null,{"$f":"IF(Riepilogo!M69>0,Riepilogo!M69/$B$2,\"\")","v":""},{"$f":"IF(B48=\"\",\"\",Riepilogo!K69)","v":""},null,{"$f":"IF(Riepilogo!N69>0,Riepilogo!N69/$E$2,\"\")","v":""},{"$f":"IF(E48=\"\",\"\",Riepilogo!K69)","v":""},null,{"$f":"IF(Riepilogo!O69>0,Riepilogo!O69/$H$2,\"\")","v":""},{"$f":"IF(H48=\"\",\"\",Riepilogo!K69)","v":""},null,null,0,null,null,0,null,null,0,null,null,0,0,{"$f":"ISODD(SUM($V$4:V48))","v":false}]
[null,{"$f":"IF(Riepilogo!M70>0,Riepilogo!M70/$B$2,\"\")","v":""},{"$f":"IF(B49=\"\",\"\",Riepilogo!K70)","v":""},null,{"$f":"IF(Riepilogo!N70>0,Riepilogo!N70/$E$2,\"\")","v":""},{"$f":"IF(E49=\"\",\"\",Riepilogo!K70)","v":""},null,{"$f":"IF(Riepilogo!O70>0,Riepilogo!O70/$H$2,\"\")","v":""},{"$f":"IF(H49=\"\",\"\",Riepilogo!K70)","v":""},null,null,0,null,null,0,null,null,0,null,null,0,0,{"$f":"ISODD(SUM($V$4:V49))","v":false}]
[null,{"$f":"IF(Riepilogo!M71>0,Riepilogo!M71/$B$2,\"\")","v":""},{"$f":"IF(B50=\"\",\"\",Riepilogo!K71)","v":""},null,{"$f":"IF(Riepilogo!N71>0,Riepilogo!N71/$E$2,\"\")","v":""},{"$f":"IF(E50=\"\",\"\",Riepilogo!K71)","v":""},null,{"$f":"IF(Riepilogo!O71>0,Riepilogo!O71/$H$2,\"\")","v":""},{"$f":"IF(H50=\"\",\"\",Riepilogo!K71)","v":""},null,null,0,null,null,0,null,null,0,null,null,0,0,{"$f":"ISODD(SUM($V$4:V50))","v":false}]
[null,{"$f":"IF(Riepilogo!M72>0,Riepilogo!M72/$B$2,\"\")","v":""},{"$f":"IF(B51=\"\",\"\",Riepilogo!K72)","v":""},null,{"$f":"IF(Riepilogo!N72>0,Riepilogo!N72/$E$2,\"\")","v":""},{"$f":"IF(E51=\"\",\"\",Riepilogo!K72)","v":""},null,{"$f":"IF(Riepilogo!O72>0,Riepilogo!O72/$H$2,\"\")","v":""},{"$f":"IF(H51=\"\",\"\",Riepilogo!K72)","v":""},null,null,0,null,null,0,null,null,0,null,null,0,0,{"$f":"ISODD(SUM($V$4:V51))","v":false}]
[null,{"$f":"IF(Riepilogo!M73>0,Riepilogo!M73/$B$2,\"\")","v":""},{"$f":"IF(B52=\"\",\"\",Riepilogo!K73)","v":""},null,{"$f":"IF(Riepilogo!N73>0,Riepilogo!N73/$E$2,\"\")","v":""},{"$f":"IF(E52=\"\",\"\",Riepilogo!K73)","v":""},null,{"$f":"IF(Riepilogo!O73>0,Riepilogo!O73/$H$2,\"\")","v":""},{"$f":"IF(H52=\"\",\"\",Riepilogo!K73)","v":""},null,null,0,null,null,0,null,null,0,null,null,0,0,{"$f":"ISODD(SUM($V$4:V52))","v":false}]
[null,{"$f":"IF(Riepilogo!M74>0,Riepilogo!M74/$B$2,\"\")","v":""},{"$f":"IF(B53=\"\",\"\",Riepilogo!K74)","v":""},null,{"$f":"IF(Riepilogo!N74>0,Riepilogo!N74/$E$2,\"\")","v":""},{"$f":"IF(E53=\"\",\"\",Riepilogo!K74)","v":""},null,{"$f":"IF(Riepilogo!O74>0,Riepilogo!O74/$H$2,\"\")","v":""},{"$f":"IF(H53=\"\",\"\",Riepilogo!K74)","v":""},null,null,0,null,null,0,null,null,0,null,null,0,0,{"$f":"ISODD(SUM($V$4:V53))","v":false}]
[null,{"$f":"IF(Riepilogo!M75>0,Riepilogo!M75/$B$2,\"\")","v":""},{"$f":"IF(B54=\"\",\"\",Riepilogo!K75)","v":""},null,{"$f":"IF(Riepilogo!N75>0,Riepilogo!N75/$E$2,\"\")","v":""},{"$f":"IF(E54=\"\",\"\",Riepilogo!K75)","v":""},null,{"$f":"IF(Riepilogo!O75>0,Riepilogo!O75/$H$2,\"\")","v":""},{"$f":"IF(H54=\"\",\"\",Riepilogo!K75)","v":""},null,null,{"$f":"IF(B54=\"\",0,B54)","v":0},null,null,{"$f":"IF(E54=\"\",0,E54)","v":0},null,null,{"$f":"IF(H54=\"\",0,H54)","v":0},null,null,{"$f":"SUM(L54:T54)","v":0},{"$f":"IF(U54>0,1,0)","v":0},{"$f":"ISODD(SUM($V$4:V54))","v":false}]
[null,{"$f":"IF(Riepilogo!M76>0,Riepilogo!M76/$B$2,\"\")","v":""},{"$f":"IF(B55=\"\",\"\",Riepilogo!K76)","v":""},null,{"$f":"IF(Riepilogo!N76>0,Riepilogo!N76/$E$2,\"\")","v":""},{"$f":"IF(E55=\"\",\"\",Riepilogo!K76)","v":""},null,{"$f":"IF(Riepilogo!O76>0,Riepilogo!O76/$H$2,\"\")","v":""},{"$f":"IF(H55=\"\",\"\",Riepilogo!K76)","v":""},null,null,0,null,null,0,null,null,0,null,null,0,0,{"$f":"ISODD(SUM($V$4:V55))","v":false}]
[null,{"$f":"IF(Riepilogo!M77>0,Riepilogo!M77/$B$2,\"\")","v":""},{"$f":"IF(B56=\"\",\"\",Riepilogo!K77)","v":""},null,{"$f":"IF(Riepilogo!N77>0,Riepilogo!N77/$E$2,\"\")","v":""},{"$f":"IF(E56=\"\",\"\",Riepilogo!K77)","v":""},null,{"$f":"IF(Riepilogo!O77>0,Riepilogo!O77/$H$2,\"\")","v":""},{"$f":"IF(H56=\"\",\"\",Riepilogo!K77)","v":""},null,null,0,null,null,0,null,null,0,null,null,0,0,{"$f":"ISODD(SUM($V$4:V56))","v":false}]
[null,{"$f":"IF(Riepilogo!M78>0,Riepilogo!M78/$B$2,\"\")","v":""},{"$f":"IF(B57=\"\",\"\",Riepilogo!K78)","v":""},null,{"$f":"IF(Riepilogo!N78>0,Riepilogo!N78/$E$2,\"\")","v":""},{"$f":"IF(E57=\"\",\"\",Riepilogo!K78)","v":""},null,{"$f":"IF(Riepilogo!O78>0,Riepilogo!O78/$H$2,\"\")","v":""},{"$f":"IF(H57=\"\",\"\",Riepilogo!K78)","v":""},null,null,0,null,null,0,null,null,0,null,null,0,0,{"$f":"ISODD(SUM($V$4:V57))","v":false}]
[null,{"$f":"IF(Riepilogo!M79>0,Riepilogo!M79/$B$2,\"\")","v":""},{"$f":"IF(B58=\"\",\"\",Riepilogo!K79)","v":""},null,{"$f":"IF(Riepilogo!N79>0,Riepilogo!N79/$E$2,\"\")","v":""},{"$f":"IF(E58=\"\",\"\",Riepilogo!K79)","v":""},null,{"$f":"IF(Riepilogo!O79>0,Riepilogo!O79/$H$2,\"\")","v":""},{"$f":"IF(H58=\"\",\"\",Riepilogo!K79)","v":""},null,null,0,null,null,0,null,null,0,null,null,0,0,{"$f":"ISODD(SUM($V$4:V58))","v":false}]
[null,{"$f":"IF(Riepilogo!M80>0,Riepilogo!M80/$B$2,\"\")","v":""},{"$f":"IF(B59=\"\",\"\",Riepilogo!K80)","v":""},null,{"$f":"IF(Riepilogo!N80>0,Riepilogo!N80/$E$2,\"\")","v":""},{"$f":"IF(E59=\"\",\"\",Riepilogo!K80)","v":""},null,{"$f":"IF(Riepilogo!O80>0,Riepilogo!O80/$H$2,\"\")","v":""},{"$f":"IF(H59=\"\",\"\",Riepilogo!K80)","v":""},null,null,0,null,null,0,null,null,0,null,null,0,0,{"$f":"ISODD(SUM($V$4:V59))","v":false}]
[null,{"$f":"IF(Riepilogo!M81>0,Riepilogo!M81/$B$2,\"\")","v":""},{"$f":"IF(B60=\"\",\"\",Riepilogo!K81)","v":""},null,{"$f":"IF(Riepilogo!N81>0,Riepilogo!N81/$E$2,\"\")","v":""},{"$f":"IF(E60=\"\",\"\",Riepilogo!K81)","v":""},null,{"$f":"IF(Riepilogo!O81>0,Riepilogo!O81/$H$2,\"\")","v":""},{"$f":"IF(H60=\"\",\"\",Riepilogo!K81)","v":""},null,null,0,null,null,0,null,null,0,null,null,0,0,{"$f":"ISODD(SUM($V$4:V60))","v":false}]
[null,{"$f":"IF(Riepilogo!M82>0,Riepilogo!M82/$B$2,\"\")","v":""},{"$f":"IF(B61=\"\",\"\",Riepilogo!K82)","v":""},null,{"$f":"IF(Riepilogo!N82>0,Riepilogo!N82/$E$2,\"\")","v":""},{"$f":"IF(E61=\"\",\"\",Riepilogo!K82)","v":""},null,{"$f":"IF(Riepilogo!O82>0,Riepilogo!O82/$H$2,\"\")","v":""},{"$f":"IF(H61=\"\",\"\",Riepilogo!K82)","v":""},null,null,0,null,null,0,null,null,0,null,null,0,{"$f":"IF(U61>0,1,0)","v":0},{"$f":"ISODD(SUM($V$4:V61))","v":false}]
[null,{"$f":"IF(Riepilogo!M83>0,Riepilogo!M83/$B$2,\"\")","v":""},{"$f":"IF(B62=\"\",\"\",Riepilogo!K83)","v":""},null,{"$f":"IF(Riepilogo!N83>0,Riepilogo!N83/$E$2,\"\")","v":""},{"$f":"IF(E62=\"\",\"\",Riepilogo!K83)","v":""},null,{"$f":"IF(Riepilogo!O83>0,Riepilogo!O83/$H$2,\"\")","v":""},{"$f":"IF(H62=\"\",\"\",Riepilogo!K83)","v":""},null,null,0,null,null,0,null,null,0,null,null,0,0,{"$f":"ISODD(SUM($V$4:V62))","v":false}]
[null,{"$f":"IF(Riepilogo!M84>0,Riepilogo!M84/$B$2,\"\")","v":""},{"$f":"IF(B63=\"\",\"\",Riepilogo!K84)","v":""},null,{"$f":"IF(Riepilogo!N84>0,Riepilogo!N84/$E$2,\"\")","v":""},{"$f":"IF(E63=\"\",\"\",Riepilogo!K84)","v":""},null,{"$f":"IF(Riepilogo!O84>0,Riepilogo!O84/$H$2,\"\")","v":""},{"$f":"IF(H63=\"\",\"\",Riepilogo!K84)","v":""},null,null,0,null,null,0,null,null,0,null,null,0,0,{"$f":"ISODD(SUM($V$4:V63))","v":false}]
[null,{"$f":"IF(Riepilogo!M85>0,Riepilogo!M85/$B$2,\"\")","v":""},{"$f":"IF(B64=\"\",\"\",Riepilogo!K85)","v":""},null,{"$f":"IF(Riepilogo!N85>0,Riepilogo!N85/$E$2,\"\")","v":""},{"$f":"IF(E64=\"\",\"\",Riepilogo!K85)","v":""},null,{"$f":"IF(Riepilogo!O85>0,Riepilogo!O85/$H$2,\"\")","v":""},{"$f":"IF(H64=\"\",\"\",Riepilogo!K85)","v":""},null,null,0,null,null,0,null,null,0,null,null,{"$f":"SUM(L64:T64)","v":0},{"$f":"IF(U64>0,1,0)","v":0},{"$f":"ISODD(SUM($V$4:V64))","v":false}]
[null,{"$f":"IF(Riepilogo!M86>0,Riepilogo!M86/$B$2,\"\")","v":""},{"$f":"IF(B65=\"\",\"\",Riepilogo!K86)","v":""},null,{"$f":"IF(Riepilogo!N86>0,Riepilogo!N86/$E$2,\"\")","v":""},{"$f":"IF(E65=\"\",\"\",Riepilogo!K86)","v":""},null,{"$f":"IF(Riepilogo!O86>0,Riepilogo!O86/$H$2,\"\")","v":""},{"$f":"IF(H65=\"\",\"\",Riepilogo!K86)","v":""},null,null,0,null,null,0,null,null,0,null,null,0,0,{"$f":"ISODD(SUM($V$4:V65))","v":false}]
[null,{"$f":"IF(Riepilogo!M87>0,Riepilogo!M87/$B$2,\"\")","v":""},{"$f":"IF(B66=\"\",\"\",Riepilogo!K87)","v":""},null,{"$f":"IF(Riepilogo!N87>0,Riepilogo!N87/$E$2,\"\")","v":""},{"$f":"IF(E66=\"\",\"\",Riepilogo!K87)","v":""},null,{"$f":"IF(Riepilogo!O87>0,Riepilogo!O87/$H$2,\"\")","v":""},{"$f":"IF(H66=\"\",\"\",Riepilogo!K87)","v":""},null,null,0,null,null,0,null,null,0,null,null,0,0,{"$f":"ISODD(SUM($V$4:V66))","v":false}]
[null,{"$f":"IF(Riepilogo!M88>0,Riepilogo!M88/$B$2,\"\")","v":""},{"$f":"IF(B67=\"\",\"\",Riepilogo!K88)","v":""},null,{"$f":"IF(Riepilogo!N88>0,Riepilogo!N88/$E$2,\"\")","v":""},{"$f":"IF(E67=\"\",\"\",Riepilogo!K88)","v":""},null,{"$f":"IF(Riepilogo!O88>0,Riepilogo!O88/$H$2,\"\")","v":""},{"$f":"IF(H67=\"\",\"\",Riepilogo!K88)","v":""},null,null,0,null,null,0,null,null,0,null,null,0,0,{"$f":"ISODD(SUM($V$4:V67))","v":false}]
[null,{"$f":"IF(Riepilogo!M89>0,Riepilogo!M89/$B$2,\"\")","v":""},{"$f":"IF(B68=\"\",\"\",Riepilogo!K89)","v":""},null,{"$f":"IF(Riepilogo!N89>0,Riepilogo!N89/$E$2,\"\")","v":""},{"$f":"IF(E68=\"\",\"\",Riepilogo!K89)","v":""},null,{"$f":"IF(Riepilogo!O89>0,Riepilogo!O89/$H$2,\"\")","v":""},{"$f":"IF(H68=\"\",\"\",Riepilogo!K89)","v":""},null,null,0,null,null,0,null,null,0,null,null,0,0,{"$f":"ISODD(SUM($V$4:V68))","v":false}]
[null,null,null,null,null,null,null,null,null,null,null,null,null,null,null,null,null,null,null,null,null,{"$f":"IF($U$4>0,1,0)","v":0}]
[null,"Configurazione RAID e/o NOTE",null,null,"Configurazione RAID e/o NOTE",null,null,"Configurazione RAID e/o NOTE",null,null,null,null,null,null,null,null,null,null,null,null,null,{"$f":"IF($U$4>0,1,0)","v":0}]
[null,{"$f":"Lotto8_C6525_1!H44","v":"Specificare la configurazione RAID per l'installazione del Sistema Operativo, se richiesto.\ne/o\ninserire eventuali note."},null,null,{"$f":"Lotto8_C6525_2!H44","v":"Specificare la configurazione RAID per l'installazione del Sistema Operativo, se richiesto.\ne/o\ninserire eventuali note."},null,null,{"$f":"Lotto8_C6525_3!H44","v":"Specificare la configurazione RAID per l'installazione del Sistema Operativo, se richiesto.\ne/o\ninserire eventuali note."},null,null,null,null,null,null,null,null,null,null,null,null,null,0]
[null,null,null,null,null,null,null,null,null,null,null,null,null,null,null,null,null,null,null,null,null,0]
[null,null,null,null,null,null,null,null,null,null,null,null,null,null,null,null,null,null,null,null,null,0]
[null,null,null,null,null,null,null,null,null,null,null,null,null,null,null,null,null,null,null,null,null,0]
[null,null,null,null,null,null,null,null,null,null,null,null,null,null,null,null,null,null,null,null,null,0]
[null,null,null,null,null,null,null,null,null,null,null,null,null,null,null,null,null,null,null,null,null,0]
[null,null,null,null,null,null,null,null,null,null,null,null,null,null,null,null,null,null,null,null,null,0]
[null,null,null,null,null,null,null,null,null,null,null,null,null,null,null,null,null,null,null,null,null,0]
[null,null,null,null,null,null,null,null,null,null,null,null,null,null,null,null,null,null,null,null,null,0]
[null,null,null,null,null,null,null,null,null,null,null,null,null,null,null,null,null,null,null,null,null,0]
[null,null,null,null,null,null,null,null,null,null,null,null,null,null,null,null,null,null,null,null,null,0]
[null,null,null,null,null,null,null,null,null,null,null,null,null,null,null,null,null,null,null,null,null,0]
[null,null,null,null,null,null,null,null,null,null,null,null,null,null,null,null,null,null,null,null,null,1]
[null,null,null,null,null,null,null,null,null,null,null,null,null,null,null,null,null,null,null,null,null,1]
[null,{"$f":"IF(B2=0,\"\",IF(Lotto8_C6525_1!$N$25=\"*\",$X$85,\"\"))","v":""},null,null,{"$f":"IF(E2=0,\"\",IF(Lotto8_C6525_2!$N$25=\"*\",$X$85,\"\"))","v":""},null,null,{"$f":"IF(H2=0,\"\",IF(Lotto8_C6525_3!$N$25=\"*\",$X$85,\"\"))","v":""},null,null,null,null,null,null,null,null,null,null,null,null,null,1,null,"!!!!!                 ATTENZIONE                 !!!!!\nLa configurazione della memoria è supportata, ma non ottimizzata per ottenere le migliori prestazioni."]
[null,null,null,null,null,null,null,null,null,null,null,null,null,null,null,null,null,null,null,null,null,1]
[null,null,null,null,null,null,null,null,null,null,null,null,null,null,null,null,null,null,null,null,null,1]
[null,null,null,null,null,null,null,null,null,null,null,null,null,null,null,null,null,null,null,null,null,1]
[null,null,null,null,null,null,null,null,null,null,null,null,null,null,null,null,null,null,null,null,null,1]
[null,null,null,null,null,null,null,null,null,null,null,null,null,null,null,null,null,null,null,null,null,1]
[null,null,null,null,null,null,null,null,null,null,null,null,null,null,null,null,null,null,null,null,null,1]
[null,null,null,null,null,null,null,null,null,null,null,null,null,null,null,null,null,null,null,null,null,1]