{"text_format":"1","workbook":"xlsx","n_sheets":10,"sheets":["Input","OdA","AS","Riepilogo_Spec_Tecniche","Specs","Prezzi","Congelam_PC","Config_Dispo","Contatti_Fornitori","Ana"],"not_rendered":{"charts":0,"images":1,"macros":1,"external_links":1,"defined_names":31,"comments":0,"pivot_tables":0},"unopened":[],"bounds":{"document_bytes":16777216,"sheet_cells":100000,"rows_first":2000,"rows_last":500,"rows_between":2000,"halvings":0,"cell_chars":16384,"cell_head_chars":4096},"cells_cut":0,"cells_raw":0,"read":"whole","date_system":"1900"}

{"sheet":"Input","index":0,"n_rows":39,"n_cols":6,"rows_kept":39,"cut":false,"hidden":false,"merged":[]}
[null,"Nome amministrazione (ad es: Comune di Milano) *",null,"Ad es., Comune di Milano"]
[]
[null,"Prodotto principale"]
[null,null,"PC portatile da"]
[null,null,"Quantitativo prodotti (>= 10)",null,null,"L'Amministrazione deve verificare che la versione del configuratore utilizzato è la stessa pubblicata su Acquistinrete PA. "]
[null,null,"Sostenibilità ambientale","Nessuna certificazione",null,"In presenza di versioni differenti deve essere necessariamente utilizzato il configuratore aggiornato pubblicato sul portale."]
[]
[null,"Configurazione prescelta",null,null,null,"Una volta compilati i campi, aprire lo sheet \"ODA\", stampare e firmare il documento da allegare all'ordine."]
{"$rows_left_out":32}
{"sheet":"OdA","index":1,"n_rows":26,"n_cols":6,"rows_kept":26,"cut":false,"hidden":true,"merged":[]}
[null,null,null,null,null,"versione 13"]
[null,null,"Nome amministrazione:",{"$f":"+Input!D1","v":"Ad es., Comune di Milano"}]
[]
[]
[null,null,"Fornitore aggiudicatario","Nome prodotto","Prezzo unitario","Importo complessivo ordine"]
[1,null,{"$f":"Prezzi!AO58","v":""},{"$f":"Prezzi!AP58","v":""},{"$f":"IF(Prezzi!AR58=0,\"\",Prezzi!AR58)","v":""},{"$f":"+E6*Input!D5","v":{"$error":"#VALUE!"}}]
[]
[null,null,"Riferimenti fornitore aggiudicatario"]
{"$rows_left_out":19}
{"sheet":"AS","index":2,"n_rows":4,"n_cols":5,"rows_kept":4,"cut":false,"hidden":true,"merged":[]}
[null,null,null,null,"versione 13"]
[]
[]
[null,null,"Il presente configuratore è utilizzabile per quantitativi fino a 10.000 pc portatili. Per quanto riguarda gli AS si invita a seguire quanto riportato nell'apposita Guida."]

{"sheet":"Riepilogo_Spec_Tecniche","index":3,"n_rows":43,"n_cols":44,"rows_kept":43,"cut":false,"hidden":true,"merged":[]}
[null,null,null,null,null,null,null,null,null,null,null,null,null,null,null,null,null,null,null,null,null,null,null,null,null,null,null,null,null,null,null,null,{"$f":"IF(AG2=0,0,COUNTIF($AG$2:AG2,1))","v":0},{"$f":"IF(AH2=0,0,COUNTIF($AG$2:AH2,1))","v":0},{"$f":"IF(AI2=0,0,COUNTIF($AG$2:AI2,1))","v":0},{"$f":"IF(AJ2=0,0,COUNTIF($AG$2:AJ2,1))","v":0},{"$f":"IF(AK2=0,0,COUNTIF($AG$2:AK2,1))","v":0},{"$f":"IF(AL2=0,0,COUNTIF($AG$2:AL2,1))","v":0},{"$f":"IF(AM2=0,0,COUNTIF($AG$2:AM2,1))","v":0},{"$f":"IF(AN2=0,0,COUNTIF($AG$2:AN2,1))","v":0}]
[null,null,null,null,null,null,null,null,null,null,null,null,null,null,null,null,null,null,null,null,null,null,null,null,null,null,null,null,null,null,null,null,{"$f":"+IF(Input!D30=\"No\",0,1)","v":0},{"$f":"+IF(Input!D31=\"No\",0,1)","v":0},{"$f":"+IF(Input!D32=\"No\",0,1)","v":0},{"$f":"+IF(Input!D33=\"No\",0,1)","v":0},{"$f":"+IF(Input!D34=\"No\",0,1)","v":0},{"$f":"+IF(Input!D35=\"No\",0,1)","v":0},{"$f":"+IF(OR(Input!D36=Ana!I3,Input!D36=Ana!I5),1,0)","v":0},{"$f":"+IF(OR(Input!D36=Ana!I4,Input!D36=Ana!I6),1,0)","v":0}]
[null,null,null,null,null,null,null,null,null,null,null,null,null,null,null,null,null,null,null,null,null,null,null,null,null,null,null,null,null,{"$f":"\"c\"&IF(Input!D9=\"Low\",COLUMN(AD3),IF(Input!D9=\"Mid *\",COLUMN(AE3),COLUMN(AF3)))","v":"c30"},null,null,{"$f":"+COLUMN(AG1)","v":33},34,35,36,37,38,39,40,null,null,1,{"$f":"\"c\"&HLOOKUP(AQ3,$AG$1:$AN$3,3,FALSE)","v":{"$error":"#N/A"}}]
["Fornitore","Prodotto","Schermo","Processore","Espandibilità RAM [GB]","Lettore biometrico","N. porte USB","Tastiera retroillum.","N. monitor supportati","Lettore micro-SD card","Camera shutter",{"$f":"IFERROR(INDIRECT(\"r\"&ROW(L4)&$AR$3,FALSE),\"\")","v":""},{"$f":"IFERROR(INDIRECT(\"r\"&ROW(M4)&$AR$4,FALSE),\"\")","v":""},{"$f":"IFERROR(INDIRECT(\"r\"&ROW(N4)&$AR$5,FALSE),\"\")","v":""},{"$f":"IFERROR(INDIRECT(\"r\"&ROW(O4)&$AR$6,FALSE),\"\")","v":""},{"$f":"IFERROR(INDIRECT(\"r\"&ROW(P4)&$AR$7,FALSE),\"\")","v":""},{"$f":"IFERROR(INDIRECT(\"r\"&ROW(Q4)&$AR$8,FALSE),\"\")","v":""},{"$f":"IFERROR(INDIRECT(\"r\"&ROW(R4)&$AR$9,FALSE),\"\")","v":""},null,null,null,null,null,null,null,null,null,null,null,"Low","Mid *","High *","Docking station / Port replicator","Unità storage esterna da 2 TB","Unità esterna DVD RW","Set mouse e tastiera wireless","Cuffie stereo e microfono","Zaino porta computer","Monitor multimediale","Monitor multimediale",null,null,2,{"$f":"\"c\"&HLOOKUP(AQ4,$AG$1:$AN$3,3,FALSE)","v":{"$error":"#N/A"}}]
[null,null,null,null,null,null,null,null,null,null,null,null,null,null,null,null,null,null,null,null,null,null,null,null,null,null,null,null,null,null,null,null,null,null,null,null,null,null,null,null,null,null,3,{"$error":"#N/A"}]
["Bellucci S.p.A.","Acer TMP215-54",15,{"$f":"+INDIRECT(\"r\"&ROW(D6)&$AD$3,FALSE)","v":"Intel Core i3-1215U"},32,"Sì",4,"Sì",3,"Sì","Sì",{"$f":"IFERROR(INDIRECT(\"r\"&ROW(L6)&$AR$3,FALSE),\"\")","v":""},{"$f":"IFERROR(INDIRECT(\"r\"&ROW(M6)&$AR$4,FALSE),\"\")","v":""},{"$f":"IFERROR(INDIRECT(\"r\"&ROW(N6)&$AR$5,FALSE),\"\")","v":""},{"$f":"IFERROR(INDIRECT(\"r\"&ROW(O6)&$AR$6,FALSE),\"\")","v":""},{"$f":"IFERROR(INDIRECT(\"r\"&ROW(P6)&$AR$7,FALSE),\"\")","v":""},{"$f":"IFERROR(INDIRECT(\"r\"&ROW(Q6)&$AR$8,FALSE),\"\")","v":""},{"$f":"IFERROR(INDIRECT(\"r\"&ROW(R6)&$AR$9,FALSE),\"\")","v":""},null,null,null,null,null,null,null,null,null,null,{"$f":"INDIRECT(\"Prezzi!r46c\"&ROW(AC6)+38,FALSE)+INDIRECT(\"Prezzi!r47c\"&ROW(AC6)+38,FALSE)","v":1},"Intel Core i3-1215U","Intel Core i5-1235U","Intel Core i7-1255U","Sanxi Co. CK-0290D","Toshiba Canvio Basics","Shenzen Hengzhe Technology ECD002","Shenzen Phynoon Tech Q5000","Jabra Evolve 20 MS Stereo","Mobilis 111226","Acer CB242YEBMIRX","ACER CB272UEBMIIPRX",null,null,4,{"$error":"#N/A"}]
["Bellucci S.p.A.","HP Probook 440 G9",14,{"$f":"+INDIRECT(\"r\"&ROW(D7)&$AD$3,FALSE)","v":"Intel Core i3-1215U"},32,"Sì",4,"Sì",1,"No","Sì",{"$f":"IFERROR(INDIRECT(\"r\"&ROW(L7)&$AR$3,FALSE),\"\")","v":""},{"$f":"IFERROR(INDIRECT(\"r\"&ROW(M7)&$AR$4,FALSE),\"\")","v":""},{"$f":"IFERROR(INDIRECT(\"r\"&ROW(N7)&$AR$5,FALSE),\"\")","v":""},{"$f":"IFERROR(INDIRECT(\"r\"&ROW(O7)&$AR$6,FALSE),\"\")","v":""},{"$f":"IFERROR(INDIRECT(\"r\"&ROW(P7)&$AR$7,FALSE),\"\")","v":""},{"$f":"IFERROR(INDIRECT(\"r\"&ROW(Q7)&$AR$8,FALSE),\"\")","v":""},{"$f":"IFERROR(INDIRECT(\"r\"&ROW(R7)&$AR$9,FALSE),\"\")","v":""},null,null,null,null,null,null,null,null,null,null,{"$f":"INDIRECT(\"Prezzi!r46c\"&ROW(AC7)+38,FALSE)+INDIRECT(\"Prezzi!r47c\"&ROW(AC7)+38,FALSE)","v":0},"Intel Core i3-1215U","Intel Core i5-1235U","Intel Core i7-1255U","Sanxi Co. CK-0290D","Toshiba Canvio Basics","Shenzen Hengzhe Technology ECD002","Shenzen Phynoon Tech Q5000","Jabra Evolve 20 MS Stereo","Mobilis 111226","Acer CB242YEBMIRX","ACER CB272UEBMIIPRX",null,null,5,{"$error":"#N/A"}]
["Bellucci S.p.A.","HP EliteBook 630 G9",13,{"$f":"+INDIRECT(\"r\"&ROW(D8)&$AD$3,FALSE)","v":"Intel Core i3-1215U"},64,"Sì",3,"Sì",1,"No","Sì",{"$f":"IFERROR(INDIRECT(\"r\"&ROW(L8)&$AR$3,FALSE),\"\")","v":""},{"$f":"IFERROR(INDIRECT(\"r\"&ROW(M8)&$AR$4,FALSE),\"\")","v":""},{"$f":"IFERROR(INDIRECT(\"r\"&ROW(N8)&$AR$5,FALSE),\"\")","v":""},{"$f":"IFERROR(INDIRECT(\"r\"&ROW(O8)&$AR$6,FALSE),\"\")","v":""},{"$f":"IFERROR(INDIRECT(\"r\"&ROW(P8)&$AR$7,FALSE),\"\")","v":""},{"$f":"IFERROR(INDIRECT(\"r\"&ROW(Q8)&$AR$8,FALSE),\"\")","v":""},{"$f":"IFERROR(INDIRECT(\"r\"&ROW(R8)&$AR$9,FALSE),\"\")","v":""},null,null,null,null,null,null,null,null,null,null,{"$f":"INDIRECT(\"Prezzi!r46c\"&ROW(AC8)+38,FALSE)+INDIRECT(\"Prezzi!r47c\"&ROW(AC8)+38,FALSE)","v":0},"Intel Core i3-1215U","Intel Core i5-1235U","Intel Core i7-1255U","Sanxi Co. CK-0290D","Toshiba Canvio Basics","Shenzen Hengzhe Technology ECD002","Shenzen Phynoon Q5000","Jabra Evolve 20 MS Stereo","Mobilis 111226","Acer CB242YEBMIRX","Acer CB272UEBMIIPRX",null,null,6,{"$error":"#N/A"}]
{"$rows_left_out":36}
{"sheet":"Specs","index":4,"n_rows":47,"n_cols":81,"rows_kept":47,"cut":false,"hidden":true,"merged":[]}
["Dati offerti",null,null,null,null,null,null,null,null,null,null,null,null,null,null,null,null,null,null,null,null,null,null,null,null,null,null,null,null,null,null,null,null,null,null,null,null,null,null,null,"Selezione",null,null,"Calcoli selezioni prodotti"]
[]
[null,"Bellucci_15_config_TCO","Bellucci_14_config_TCO","Bellucci_13_config_TCO","Bsistemi_15_config_standard","Bsistemi_15_config_TCO","Bsistemi_14_config_standard","Bsistemi_14_config_TCO","Bsistemi_13_config_standard","Bsistemi_13_config_TCO","Converge_15_config_standard","Converge_15_config_TCO","Converge_14_config_standard","Converge_14_config_TCO","Converge_13_config_standard","Converge_13_config_TCO","Eurome_15_config_standard","Eurome_15_config_TCO","Eurome_14_config_standard","Eurome_14_config_TCO","Eurome_13_config_standard","Eurome_13_config_TCO","Finbuc_15_config_standard","Finbuc_14_config_standard","RTI IM Direct & Partner_15_config_TCO","RTI IM Direct & Partner_14_config_TCO","RTI IM Direct & Partner_13_config_TCO","Infordata_15_config_TCO","Infordata_14_config_TCO","Infordata_13_config_TCO","Italware_15_config_standard","Italware_15_config_TCO","Italware_14_config_standard","Italware_14_config_TCO","Italware_13_config_standard","Italware_13_config_TCO","VAR_Group_15_config_TCO","VAR_Group_14_config_TCO","VAR_Group_13_config_TCO",null,null,null,null,"Bellucci_15_config_TCO","Bellucci_14_config_TCO","Bellucci_13_config_TCO","Bsistemi_15_config_standard","Bsistemi_15_config_TCO","Bsistemi_14_config_standard","Bsistemi_14_config_TCO","Bsistemi_13_config_standard","Bsistemi_13_config_TCO","Converge_15_config_standard","Converge_15_config_TCO","Converge_14_config_standard","Converge_14_config_TCO","Converge_13_config_standard","Converge_13_config_TCO","Eurome_15_config_standard","Eurome_15_config_TCO","Eurome_14_config_standard","Eurome_14_config_TCO","Eurome_13_config_standard","Eurome_13_config_TCO","Finbuc_15_config_standard","Finbuc_14_config_standard","RTI IM Direct & Partner_15_config_TCO","RTI IM Direct & Partner_14_config_TCO","RTI IM Direct & Partner_13_config_TCO","Infordata_15_config_TCO","Infordata_14_config_TCO","Infordata_13_config_TCO","Italware_15_config_standard","Italware_15_config_TCO","Italware_14_config_standard","Italware_14_config_TCO","Italware_13_config_standard","Italware_13_config_TCO","VAR_Group_15_config_TCO","VAR_Group_14_config_TCO","VAR_Group_13_config_TCO"]
["Marca e modello del personal computer portatile offerto","Acer TMP215-53","HP Probook 440 G9","HP EliteBook 630 G9","Dell Latitude 5540","Dell Latitude 5540 (TCO)","Dell Latitude 5440","Dell Latitude 5440","Dell Latitude 5340","Dell Latitude 5340","LENOVO ThinkBook 15 G4 ABA","LENOVO ThinkBook 15 G4 ABA","LENOVO ThinkBook 14 G6 ABP","LENOVO ThinkBook 14 G6 ABP","LENOVO ThinkPad L13 Gen 4 (AMD)","LENOVO ThinkPad L13 Gen 4 (AMD)","Dell Latitude 5540","Dell Latitude 5540 (TCO)","Dell Latitude 5440","Dell Latitude 5440","Dell Latitude 5340","Dell Latitude 5340","SICOMPUTER NAUTA C1502","SICOMPUTER NAUTA C1402","Lenovo ThinkPad L15 Gen 4 (AMD)","Lenovo ThinkBook 14\" Gen 6 ABP","LENOVO ThinkPad L13 Gen 4 (AMD)","HP PROBOOK 455  G10","HP PROBOOK 445 G10","HP EliteBook 630 G9","Lenovo ThinkPad L15 Gen 4 Intel","Lenovo ThinkPad L15 Gen 4 Intel","Lenovo ThinkBook 14 G6 ABP","Lenovo ThinkBook 14 G6 IRL","Lenovo ThinkPad L13 gen 4","Lenovo ThinkPad L13 gen 4 AMD","HP ProBook 450 15.6 inch G9"," HP ProBook 440 14-inch G9 Notebook PC","HP EliteBook 630 13.3 inch G9 Notebook PC"]
["Prodotto principale in possesso di certificazione TCO (SI/NO)",1,1,1,0,1,0,1,0,1,1,1,1,1,1,1,0,1,0,1,0,1,0,0,1,1,1,1,1,1,1,1,1,1,1,1,1,1,1,null,{"$f":"+Input!D6","v":"Nessuna certificazione"},{"$f":"+IF(AO5=Ana!$B$4,1,0)","v":0},null,{"$f":"+IF(B5>=$AP5,1,0)","v":1},1,1,1,1,1,1,1,1,1,1,1,1,1,1,1,1,1,1,1,1,1,1,1,1,1,1,1,1,1,1,1,1,1,1,1,1,1]
["dimensione schermo (pollici)",15,14,13,15,15,14,14,13,13,15,15,14,14,13,13,15,15,14,14,13,13,15,14,15,14,13,15,14,13,15,15,14,14,13,13,15,14,13,null,{"$f":"+Input!D4","v":0},{"$f":"+LEFT(AO6,2)*1","v":0},null,{"$f":"+IF(B6=$AP6,1,0)","v":0},0,0,0,0,0,0,0,0,0,0,0,0,0,0,0,0,0,0,0,0,0,0,0,0,0,0,0,0,0,0,0,0,0,0,0,0,0]
["OPZIONI DI PRODOTTO STANDARD"]
["Processore - Marca e modello CPU Low",null,null,null,null,null,null,null,null,null,null,null,null,null,null,null,null,null,null,null,null,null,null,null,null,null,null,null,null,null,null,null,null,null,null,null,null,null,null,null,{"$f":"+Input!D9","v":"Low"},{"$f":"+IF(AO8=Ana!C2,1,0)","v":1}]
{"$rows_left_out":40}
{"sheet":"Prezzi","index":5,"n_rows":77,"n_cols":81,"rows_kept":77,"cut":false,"hidden":true,"merged":[]}
["Dati offerti",null,null,null,null,null,null,null,null,null,null,null,null,null,null,null,null,null,null,null,null,null,null,null,null,null,null,null,null,null,null,null,null,null,null,null,null,null,null,null,"Selezione",null,null,"Calcoli selezioni prodotti"]
[]
[null,"Bellucci_15_config_TCO","Bellucci_14_config_TCO","Bellucci_13_config_TCO","Bsistemi_15_config_standard","Bsistemi_15_config_TCO","Bsistemi_14_config_standard","Bsistemi_14_config_TCO","Bsistemi_13_config_standard","Bsistemi_13_config_TCO","Converge_15_config_standard","Converge_15_config_TCO","Converge_14_config_standard","Converge_14_config_TCO","Converge_13_config_standard","Converge_13_config_TCO","Eurome_15_config_standard","Eurome_15_config_TCO","Eurome_14_config_standard","Eurome_14_config_TCO","Eurome_13_config_standard","Eurome_13_config_TCO","Finbuc_15_config_standard","Finbuc_14_config_standard","RTI IM Direct & Partner_15_config_TCO","RTI IM Direct & Partner_14_config_TCO","RTI IM Direct & Partner_13_config_TCO","Infordata_15_config_TCO","Infordata_14_config_TCO","Infordata_13_config_TCO","Italware_15_config_standard","Italware_15_config_TCO","Italware_14_config_standard","Italware_14_config_TCO","Italware_13_config_standard","Italware_13_config_TCO","VAR_Group_15_config_TCO","VAR_Group_14_config_TCO","VAR_Group_13_config_TCO",null,null,null,null,"Bellucci_15_config_TCO","Bellucci_14_config_TCO","Bellucci_13_config_TCO","Bsistemi_15_config_standard","Bsistemi_15_config_TCO","Bsistemi_14_config_standard","Bsistemi_14_config_TCO","Bsistemi_13_config_standard","Bsistemi_13_config_TCO","Converge_15_config_standard","Converge_15_config_TCO","Converge_14_config_standard","Converge_14_config_TCO","Converge_13_config_standard","Converge_13_config_TCO","Eurome_15_config_standard","Eurome_15_config_TCO","Eurome_14_config_standard","Eurome_14_config_TCO","Eurome_13_config_standard","Eurome_13_config_TCO","Finbuc_15_config_standard","Finbuc_14_config_standard","RTI IM Direct & Partner_15_config_TCO","RTI IM Direct & Partner_14_config_TCO","RTI IM Direct & Partner_13_config_TCO","Infordata_15_config_TCO","Infordata_14_config_TCO","Infordata_13_config_TCO","Italware_15_config_standard","Italware_15_config_TCO","Italware_14_config_standard","Italware_14_config_TCO","Italware_13_config_standard","Italware_13_config_TCO","VAR_Group_15_config_TCO","VAR_Group_14_config_TCO","VAR_Group_13_config_TCO"]
["Marca e modello del personal computer portatile offerto",355,555,630,534,539,534,539,604.88,627.32000000000005,480.3,480.3,336.71,336.71,420.02,419.04,550,560,559,560,604,625,337.05,337.05,375.61,379.99,457.21,538,375,622,370,370,535.36,542.77,440,440,554.96,554.96,602.41,null,null,1,null,{"$f":"+B4*$AP4","v":355},555,630,534,539,534,539,604.88,627.32000000000005,480.3,480.3,336.71,336.71,420.02,419.04,550,560,559,560,604,625,337.05,337.05,375.61,379.99,457.21,538,375,622,370,370,535.36,542.77,440,440,554.96,554.96,602.41]
["Prodotto principale in possesso di certificazione TCO (SI/NO)",null,null,null,null,null,null,null,null,null,null,null,null,null,null,null,null,null,null,null,null,null,null,null,null,null,null,null,null,null,null,null,null,null,null,null,null,null,null,null,{"$f":"+Input!D6","v":"Nessuna certificazione"},{"$f":"+IF(AO5=Ana!$B$4,1,0)","v":0}]
["dimensione schermo (pollici)",null,null,null,null,null,null,null,null,null,null,null,null,null,null,null,null,null,null,null,null,null,null,null,null,null,null,null,null,null,null,null,null,null,null,null,null,null,null,null,{"$f":"+Input!D4","v":0},{"$f":"+LEFT(AO6,2)*1","v":0}]
["OPZIONI DI PRODOTTO STANDARD"]
["Processore - Marca e modello CPU Low",null,null,null,null,null,null,null,null,null,null,null,null,null,null,null,null,null,null,null,null,null,null,null,null,null,null,null,null,null,null,null,null,null,null,null,null,null,null,null,{"$f":"+Input!D9","v":"Low"},{"$f":"+IF(AO8=Ana!C2,1,0)","v":1}]
{"$rows_left_out":70}
{"sheet":"Congelam_PC","index":6,"n_rows":40,"n_cols":6,"rows_kept":40,"cut":false,"hidden":true,"merged":[]}
[]
[null," ","PC","Congelamento",null,"Selezionare Sì SOLO per i prodotti momentanemaente congelati."]
[null,1,"Bellucci_15_config_TCO",null,null,"Tali prodotti non compariranno negli fogli di output OdA e AS."]
[null,2,"Bellucci_14_config_TCO","Sì",null,"e saranno osxcurati nel foglio \"Riepilogo_Spec_Tecniche\""]
[null,3,"Bellucci_13_config_TCO","Sì"]
[null,4,"Bsistemi_15_config_standard"]
[null,5,"Bsistemi_15_config_TCO"]
[null,6,"Bsistemi_14_config_standard"]
{"$rows_left_out":33}
{"sheet":"Config_Dispo","index":7,"n_rows":3435,"n_cols":13,"rows_kept":3435,"cut":false,"hidden":true,"merged":[[0,12,2,18]]}
[{"$f":"+D1&E1&F1&G1&H1","v":"Low8256HDDistribuzione Linux"},null,"Selezione",{"$f":"VLOOKUP(Input!D9,Ana!$R:$S,2,FALSE)","v":"Low"},{"$f":"VLOOKUP(Input!D10,Ana!$R:$S,2,FALSE)","v":8},{"$f":"VLOOKUP(Input!D11,Ana!$R:$S,2,FALSE)","v":256},{"$f":"VLOOKUP(Input!D12,Ana!$R:$S,2,FALSE)","v":"HD"},{"$f":"VLOOKUP(Input!D13,Ana!$R:$S,2,FALSE)","v":"Distribuzione Linux"},null,null,null,null,"Per aggiungere altre configurazioni:\nincollare le colonne dalla D alla H\ninserire nella colonna C il nome dell'OE\ninserire in colonna I nupollici_config_TCO/standard\ncopiare in colonna J i valori SI/NO\nincollare le formule in colonna A e K fino all'ultima riga"]
[]
[null,null,"OE","CPU","RAM (GB)","SSD (GB)","Display","Sistema Operativo","OE","Config dispo","Config dispo"]
[{"$f":"C4&\"_\"&I4&D4&E4&F4&G4&H4","v":"Bellucci_15_config_standardLOW8256HDDistribuzione Linux"},null,"Bellucci","LOW",8,256,"HD","Distribuzione Linux","15_config_standard","SI",{"$f":"+IF(J4=\"NO\",0,1)","v":1}]
["Bellucci_15_config_standardLOW8256HDWindows 11 Pro Education",null,"Bellucci","LOW",8,256,"HD","Windows 11 Pro Education","15_config_standard","SI",1]
["Bellucci_15_config_standardLOW8256HDWindows 11 Pro",null,"Bellucci","LOW",8,256,"HD","Windows 11 Pro","15_config_standard","NO",0]
["Bellucci_15_config_standardLOW16256HDDistribuzione Linux",null,"Bellucci","LOW",16,256,"HD","Distribuzione Linux","15_config_standard","SI",1]
["Bellucci_15_config_standardLOW16256HDWindows 11 Pro Education",null,"Bellucci","LOW",16,256,"HD","Windows 11 Pro Education","15_config_standard","SI",1]
{"$rows_left_out":3428}
{"sheet":"Contatti_Fornitori","index":8,"n_rows":11,"n_cols":5,"rows_kept":11,"cut":false,"hidden":true,"merged":[]}
[]
[null,"OE","Nome e Cognome","e-mail","Tel"]
[null,"Bellucci S.p.A.","Alessandro Garampi","agarampi@gruppobellucci.it"]
[null,"Bsistemi S.p.A."," Stefania Scappaticci"," s.scappaticci@bsistemi.com"]
[null,"Converge S.r.l.","Call Center 800 893 402","ordini-AQ2425_PC@converge.it"]
[null,"Eurome S.r.l."," Giorgio Marinelli"," Giorgio.Marinelli@eurome.it"]
[null,"Finbuc S.r.l."," Francesca Simoncelli"," f.simoncelli@finbuc.it"]
[null,"RTI IM Direct & Partner"," Riccardo Bellatreccia"," riccardo.bellatreccia@imdirect.it"]
{"$rows_left_out":4}
{"sheet":"Ana","index":9,"n_rows":16,"n_cols":19,"rows_kept":16,"cut":false,"hidden":true,"merged":[]}
["Prodotto_Princip","Sosten_Amb","CPU","RAM","SSD","Sist_Operat","Sì/No","Sì/No/StessoProd","Monitor","Num","Scheda_Graf","Display","EspRAM","EspSSD",null,"Monitor",null,"Tendine","Valori"]
["15\"","Nessuna certificazione","Low",8,256,"Distribuzione Linux","No","No","No",2,"Integrata","HD",16,512,null,"No",null,8,8]
["14\"","Etichetta ISO di tipo I (UNI EN ISO 14024)","Mid *","16 *","512 *","Windows 11 Pro Education *","Sì *","Sì *","Sì, da 23.6” *",3,"Discreta *","FHD *",32,1024,null,"Sì, da 23.6” *",null,"16 *",16]
["13\"","Certificazione TCO","High *",null,null,"Windows 11 Pro *",null,"Sì, dello stesso produttore del PC *","Sì, da 27” *",4,null,null,64,null,null,"Sì, da 27” *",null,"Low","Low"]
[null,null,null,null,null,null,null,null,"Sì, da 23.6” dello stesso produttore del PC *",5,null,null,128,null,null,"Sì, da 23.6” dello stesso produttore del PC *",null,"Mid *","Mid"]
[null,null,null,null,null,null,null,null,"Sì, da 27” dello stesso produttore del PC *",null,null,null,null,null,null,"Sì, da 27” dello stesso produttore del PC *",null,"High *","High"]
[null,null,null,null,null,null,null,null,null,null,null,null,null,null,null,null,null,256,256]
[null,null,null,null,null,null,null,null,null,null,null,null,null,null,null,null,null,"512 *",512]
{"$rows_left_out":8}