{"text_format":"1","workbook":"xlsx","n_sheets":9,"sheets":["Input","OdA","Riepilogo_Spec_Tecniche","ReadMe","Offerte_e_Calcoli","Congelam_PC","Config_Dispo","Contatti_Fornitori","Ana"],"not_rendered":{"charts":0,"images":1,"macros":1,"external_links":1,"defined_names":31,"comments":0,"pivot_tables":0},"unopened":[],"bounds":{"document_bytes":16777216,"sheet_cells":100000,"rows_first":2000,"rows_last":500,"rows_between":2000,"halvings":0,"cell_chars":16384,"cell_head_chars":4096},"cells_cut":0,"cells_raw":0,"read":"whole","date_system":"1900"}

{"sheet":"Input","index":0,"n_rows":32,"n_cols":8,"rows_kept":32,"cut":false,"hidden":false,"merged":[[7,7,9,21]]}
[null,"Nome amministrazione (ad es: Comune di Milano) *",null,"Ad es., Comune di Milano"]
[]
[null,"Prodotto principale"]
[null,null,"PC portatile da"]
[null,null,"Quantitativo prodotti (>= 10)",null,null,null,null," - L'Amministrazione deve verificare che la versione del configuratore utilizzato è la stessa pubblicata su Acquistinrete PA."]
[null,null,null,null,null,null,null," - In presenza di versioni differenti deve essere necessariamente utilizzato il configuratore aggiornato pubblicato sul portale."]
[null,"Configurazione prescelta",null,null,null,null,null," - Una volta compilati i campi del foglio Input, aprire lo sheet \"ODA\", stampare e firmare il documento da allegare all'ordine."]
[null,null,"CPU","Media",null,null,null," - In caso di anomalie nella visualizzazione della graduatoria, si invita a contattare Consip tramite il Call Center degli Acquisti in Rete della P.A. al numero verde 800 753 783 oppure attraverso la funzione “Filo diretto con il programma” disponibile nell’area riservata del sito https://www.acquistinretepa.it/ accendibile con il profilo di punto istruttore o di punto ordinante."]
{"$rows_left_out":25}
{"sheet":"OdA","index":1,"n_rows":25,"n_cols":6,"rows_kept":25,"cut":false,"hidden":true,"merged":[]}
[]
[null,null,"Nome amministrazione:",{"$f":"+Input!D1","v":"Ad es., Comune di Milano"}]
[]
[]
[null,null,"Fornitore aggiudicatario","Nome prodotto","Prezzo unitario","Importo complessivo ordine"]
[1,null,{"$f":"+Offerte_e_Calcoli!AS25","v":""},{"$f":"+Offerte_e_Calcoli!AT25","v":""},{"$f":"+Offerte_e_Calcoli!AR25","v":""},{"$f":"+E6*Input!D5","v":{"$error":"#VALUE!"}}]
[]
[null,null,"Riferimenti fornitore aggiudicatario"]
{"$rows_left_out":18}
{"sheet":"Riepilogo_Spec_Tecniche","index":2,"n_rows":23,"n_cols":55,"rows_kept":23,"cut":false,"hidden":true,"merged":[]}
["Operatore Economico","Bellucci S.p.A.","Bsistemi S.p.A.","Converge S.r.l.","Eurome S.r.l.","Hitech Distribuzione Informatica S.r.l.","ITD Solutions S.p.A.","Posdata S.r.l.","RTI Trust Technology Services  S.r.l.","Sistemi Hardware & Software S.p.A.","Team Memores Computer S.p.A.","Wetech’s S.p.A.","Zucchetti Informatica S.p.A.",null,null,null,null,"Operatore Economico",{"$f":"+Offerte_e_Calcoli!E1&Riepilogo_Spec_Tecniche!S4","v":"Bellucci S.p.A.13"},{"$f":"+Offerte_e_Calcoli!F1&Riepilogo_Spec_Tecniche!T4","v":"Bsistemi S.p.A.13"},{"$f":"+Offerte_e_Calcoli!G1&Riepilogo_Spec_Tecniche!U4","v":"Converge S.r.l.13"},{"$f":"+Offerte_e_Calcoli!H1&Riepilogo_Spec_Tecniche!V4","v":"Eurome S.r.l.13"},{"$f":"+Offerte_e_Calcoli!I1&Riepilogo_Spec_Tecniche!W4","v":"Hitech Distribuzione Informatica S.r.l."},{"$f":"+Offerte_e_Calcoli!J1&Riepilogo_Spec_Tecniche!X4","v":"ITD Solutions S.p.A.13"},{"$f":"+Offerte_e_Calcoli!K1&Riepilogo_Spec_Tecniche!Y4","v":"Posdata S.r.l.13"},{"$f":"+Offerte_e_Calcoli!L1&Riepilogo_Spec_Tecniche!Z4","v":"RTI Trust Technology Services  S.r.l.13"},{"$f":"+Offerte_e_Calcoli!M1&Riepilogo_Spec_Tecniche!AA4","v":"Sistemi Hardware & Software S.p.A.13"},{"$f":"+Offerte_e_Calcoli!N1&Riepilogo_Spec_Tecniche!AB4","v":"Team Memores Computer S.p.A.13"},{"$f":"+Offerte_e_Calcoli!O1&Riepilogo_Spec_Tecniche!AC4","v":"Wetech’s S.p.A.13"},{"$f":"+Offerte_e_Calcoli!P1&Riepilogo_Spec_Tecniche!AD4","v":"Zucchetti Informatica S.p.A.13"},{"$f":"+Offerte_e_Calcoli!Q1&Riepilogo_Spec_Tecniche!AE4","v":"Bellucci S.p.A.14"},{"$f":"+Offerte_e_Calcoli!R1&Riepilogo_Spec_Tecniche!AF4","v":"Bsistemi S.p.A.14"},{"$f":"+Offerte_e_Calcoli!S1&Riepilogo_Spec_Tecniche!AG4","v":"Converge S.r.l.14"},{"$f":"+Offerte_e_Calcoli!T1&Riepilogo_Spec_Tecniche!AH4","v":"Eurome S.r.l.14"},{"$f":"+Offerte_e_Calcoli!U1&Riepilogo_Spec_Tecniche!AI4","v":"Hitech Distribuzione Informatica S.r.l.14"},{"$f":"+Offerte_e_Calcoli!V1&Riepilogo_Spec_Tecniche!AJ4","v":"ITD Solutions S.p.A.14"},{"$f":"+Offerte_e_Calcoli!W1&Riepilogo_Spec_Tecniche!AK4","v":"Posdata S.r.l.14"},{"$f":"+Offerte_e_Calcoli!X1&Riepilogo_Spec_Tecniche!AL4","v":"RTI Trust Technology Services  S.r.l.14"},{"$f":"+Offerte_e_Calcoli!Y1&Riepilogo_Spec_Tecniche!AM4","v":"Sistemi Hardware & Software S.p.A.14"},{"$f":"+Offerte_e_Calcoli!Z1&Riepilogo_Spec_Tecniche!AN4","v":"Team Memores Computer S.p.A.14"},{"$f":"+Offerte_e_Calcoli!AA1&Riepilogo_Spec_Tecniche!AO4","v":"Wetech’s S.p.A.14"},{"$f":"+Offerte_e_Calcoli!AB1&Riepilogo_Spec_Tecniche!AP4","v":"Zucchetti Informatica S.p.A.14"},{"$f":"+Offerte_e_Calcoli!AC1&Riepilogo_Spec_Tecniche!AQ4","v":"Bellucci S.p.A.15"},{"$f":"+Offerte_e_Calcoli!AD1&Riepilogo_Spec_Tecniche!AR4","v":"Bsistemi S.p.A.15"},{"$f":"+Offerte_e_Calcoli!AE1&Riepilogo_Spec_Tecniche!AS4","v":"Converge S.r.l.15"},{"$f":"+Offerte_e_Calcoli!AF1&Riepilogo_Spec_Tecniche!AT4","v":"Eurome S.r.l.15"},{"$f":"+Offerte_e_Calcoli!AG1&Riepilogo_Spec_Tecniche!AU4","v":"Hitech Distribuzione Informatica S.r.l."},{"$f":"+Offerte_e_Calcoli!AH1&Riepilogo_Spec_Tecniche!AV4","v":"ITD Solutions S.p.A.15"},{"$f":"+Offerte_e_Calcoli!AI1&Riepilogo_Spec_Tecniche!AW4","v":"Posdata S.r.l.15"},{"$f":"+Offerte_e_Calcoli!AJ1&Riepilogo_Spec_Tecniche!AX4","v":"RTI Trust Technology Services  S.r.l.15"},{"$f":"+Offerte_e_Calcoli!AK1&Riepilogo_Spec_Tecniche!AY4","v":"Sistemi Hardware & Software S.p.A.15"},{"$f":"+Offerte_e_Calcoli!AL1&Riepilogo_Spec_Tecniche!AZ4","v":"Team Memores Computer S.p.A.15"},{"$f":"+Offerte_e_Calcoli!AM1&Riepilogo_Spec_Tecniche!BA4","v":"Wetech’s S.p.A.15"},{"$f":"+Offerte_e_Calcoli!AN1&Riepilogo_Spec_Tecniche!BB4","v":"Zucchetti Informatica S.p.A.15"}]
["Prodotto principale",null,null,null,null,null,null,null,null,null,null,null,null,null,null,null,null,"Prodotto principale"]
["Marca e modello",{"$f":"IFERROR(HLOOKUP(B$1&B$4,$S$1:$BB$23,ROWS(B$1:B3),FALSE),\"\")","v":""},{"$f":"IFERROR(HLOOKUP(C$1&C$4,$S$1:$BB$23,ROWS(C$1:C3),FALSE),\"\")","v":""},{"$f":"IFERROR(HLOOKUP(D$1&D$4,$S$1:$BB$23,ROWS(D$1:D3),FALSE),\"\")","v":""},{"$f":"IFERROR(HLOOKUP(E$1&E$4,$S$1:$BB$23,ROWS(E$1:E3),FALSE),\"\")","v":""},{"$f":"IFERROR(HLOOKUP(F$1&F$4,$S$1:$BB$23,ROWS(F$1:F3),FALSE),\"\")","v":""},{"$f":"IFERROR(HLOOKUP(G$1&G$4,$S$1:$BB$23,ROWS(G$1:G3),FALSE),\"\")","v":""},{"$f":"IFERROR(HLOOKUP(H$1&H$4,$S$1:$BB$23,ROWS(H$1:H3),FALSE),\"\")","v":""},{"$f":"IFERROR(HLOOKUP(I$1&I$4,$S$1:$BB$23,ROWS(I$1:I3),FALSE),\"\")","v":""},{"$f":"IFERROR(HLOOKUP(J$1&J$4,$S$1:$BB$23,ROWS(J$1:J3),FALSE),\"\")","v":""},{"$f":"IFERROR(HLOOKUP(K$1&K$4,$S$1:$BB$23,ROWS(K$1:K3),FALSE),\"\")","v":""},{"$f":"IFERROR(HLOOKUP(L$1&L$4,$S$1:$BB$23,ROWS(L$1:L3),FALSE),\"\")","v":""},{"$f":"IFERROR(HLOOKUP(M$1&M$4,$S$1:$BB$23,ROWS(M$1:M3),FALSE),\"\")","v":""},null,null,null,null,"Marca e modello","HP EliteBook 630 G11","Dell Pro 13 Plus","LENOVO ThinkPad L13 Gen 6","Dell Pro 13 Plus",null,"LENOVO THINKPAD L13 Gen 6","Lenovo ThinkPad L13 Gen 6","HP EliteBook 630 G11","HP Elitebook 630 G11","Lenovo ThinkPad L13 Gen 6","HP EliteBook 630 G11","HP EliteBook 630 G11","HP Probook 440 G11","Dell Pro 14 Plus","LENOVO ThinkBook 14 G7 ARP","Dell Pro 14 Plus","Acer TM P214","LENOVO ThinkBook 14 G8 IAL","Lenovo ThinkPad L14 Gen 6","HP EliteBook 640 G11","HP ELITEBOOK 6 G1a 14","Lenovo ThinkPad L14 Gen 6","HP ProBook 440 G11","HP ProBook 445 G11","HP Probook 465 G11","Dell Pro 16 Plus","LENOVO ThinkBook 16 G8 IAL","Dell Pro 16 Plus",null,"LENOVO ThinkBook 16 G7 ARP","Lenovo ThinkPad L16 Gen 2","HP EliteBook 660 G11"," HP Elitebook 6 G1a 16","Lenovo ThinkPad L16 Gen 2","HP ProBook 460 G11","HP ProBook 460 G11"]
["Schermo",{"$f":"+Offerte_e_Calcoli!$C$5","v":0},{"$f":"+Offerte_e_Calcoli!$C$5","v":0},{"$f":"+Offerte_e_Calcoli!$C$5","v":0},{"$f":"+Offerte_e_Calcoli!$C$5","v":0},{"$f":"+Offerte_e_Calcoli!$C$5","v":0},{"$f":"+Offerte_e_Calcoli!$C$5","v":0},{"$f":"+Offerte_e_Calcoli!$C$5","v":0},{"$f":"+Offerte_e_Calcoli!$C$5","v":0},{"$f":"+Offerte_e_Calcoli!$C$5","v":0},{"$f":"+Offerte_e_Calcoli!$C$5","v":0},{"$f":"+Offerte_e_Calcoli!$C$5","v":0},{"$f":"+Offerte_e_Calcoli!$C$5","v":0},null,null,null,null,"Schermo",13,13,13,13,null,13,13,13,13,13,13,13,14,14,14,14,14,14,14,14,14,14,14,14,15,15,15,15,null,15,15,15,15,15,15,15]
["Specifiche tecniche primarie",null,null,null,null,null,null,null,null,null,null,null,null,null,null,null,null,"Specifiche tecniche primarie"]
["Processore",{"$f":"+Input!$D$8","v":"Media"},{"$f":"+Input!$D$8","v":"Media"},{"$f":"+Input!$D$8","v":"Media"},{"$f":"+Input!$D$8","v":"Media"},{"$f":"+Input!$D$8","v":"Media"},{"$f":"+Input!$D$8","v":"Media"},{"$f":"+Input!$D$8","v":"Media"},{"$f":"+Input!$D$8","v":"Media"},{"$f":"+Input!$D$8","v":"Media"},{"$f":"+Input!$D$8","v":"Media"},{"$f":"+Input!$D$8","v":"Media"},{"$f":"+Input!$D$8","v":"Media"},null,null,null,null,"Processore","Intel® Core™ Ultra 5 125U","Intel Core Ultra 5 225U","Intel Core Ultra 5 225U","Intel Core Ultra 5 225U",null,"Intel Core Ultra 5 Processor 225U","Intel Core Ultra 5 225U","Intel® CoreTM Ultra 5 125U","Intel® Core™ Ultra 5 125U","Intel Core Ultra 5 225U","Intel® Core™ Ultra 5 125U","Intel® Core™ Ultra 5 125U","Intel® Core™ Ultra 5 125U","Intel Core Ultra 5 225U","AMD Ryzen 5 7535HS","Intel Core Ultra 5 225U","Intel Core i5-1334U","Intel Core Ultra 5 Processor 225U","Intel Core Ultra 5 225U","Intel® CoreTM Ultra 5 125U","AMD Ryzen™ 5 220","Intel Core Ultra 5 225U","Intel® Core™ Ultra 5 125U","AMD Ryzen 5 7535U","AMD Ryzen 5 7535U","Intel Core Ultra 5 225U","Intel Core Ultra 5 225U","Intel Core Ultra 5 225U",null,"AMD Ryzen 5 7535HS","Intel Core Ultra 5 225U","Intel® CoreTM Ultra 5 125U","AMD Ryzen™ 5 220","Intel Core Ultra 5 225U","Intel® Core™ Ultra 5 125U","Intel® Core™ Ultra 5 125U"]
["CPU con Neural Processing Unit",{"$f":"IFERROR(HLOOKUP(B$1&B$4,$S$1:$BB$23,ROWS(B$1:B7),FALSE),\"\")","v":""},{"$f":"IFERROR(HLOOKUP(C$1&C$4,$S$1:$BB$23,ROWS(C$1:C7),FALSE),\"\")","v":""},{"$f":"IFERROR(HLOOKUP(D$1&D$4,$S$1:$BB$23,ROWS(D$1:D7),FALSE),\"\")","v":""},{"$f":"IFERROR(HLOOKUP(E$1&E$4,$S$1:$BB$23,ROWS(E$1:E7),FALSE),\"\")","v":""},{"$f":"IFERROR(HLOOKUP(F$1&F$4,$S$1:$BB$23,ROWS(F$1:F7),FALSE),\"\")","v":""},{"$f":"IFERROR(HLOOKUP(G$1&G$4,$S$1:$BB$23,ROWS(G$1:G7),FALSE),\"\")","v":""},{"$f":"IFERROR(HLOOKUP(H$1&H$4,$S$1:$BB$23,ROWS(H$1:H7),FALSE),\"\")","v":""},{"$f":"IFERROR(HLOOKUP(I$1&I$4,$S$1:$BB$23,ROWS(I$1:I7),FALSE),\"\")","v":""},{"$f":"IFERROR(HLOOKUP(J$1&J$4,$S$1:$BB$23,ROWS(J$1:J7),FALSE),\"\")","v":""},{"$f":"IFERROR(HLOOKUP(K$1&K$4,$S$1:$BB$23,ROWS(K$1:K7),FALSE),\"\")","v":""},{"$f":"IFERROR(HLOOKUP(L$1&L$4,$S$1:$BB$23,ROWS(L$1:L7),FALSE),\"\")","v":""},{"$f":"IFERROR(HLOOKUP(M$1&M$4,$S$1:$BB$23,ROWS(M$1:M7),FALSE),\"\")","v":""},null,null,null,null,"CPU con Neural Processing Unit","Sì","Sì","Sì","Sì",null,"Sì","Sì","Sì","Sì","Sì","Sì","Sì","Sì","Sì","No","Sì","No","Sì","Sì","Sì","No","Sì","Sì","No","No","Sì","Sì","Sì",null,"No","Sì","Sì","No","Sì","Sì","Sì"]
["Lettore biometrico integrato",{"$f":"IFERROR(HLOOKUP(B$1&B$4,$S$1:$BB$23,ROWS(B$1:B8),FALSE),\"\")","v":""},{"$f":"IFERROR(HLOOKUP(C$1&C$4,$S$1:$BB$23,ROWS(C$1:C8),FALSE),\"\")","v":""},{"$f":"IFERROR(HLOOKUP(D$1&D$4,$S$1:$BB$23,ROWS(D$1:D8),FALSE),\"\")","v":""},{"$f":"IFERROR(HLOOKUP(E$1&E$4,$S$1:$BB$23,ROWS(E$1:E8),FALSE),\"\")","v":""},{"$f":"IFERROR(HLOOKUP(F$1&F$4,$S$1:$BB$23,ROWS(F$1:F8),FALSE),\"\")","v":""},{"$f":"IFERROR(HLOOKUP(G$1&G$4,$S$1:$BB$23,ROWS(G$1:G8),FALSE),\"\")","v":""},{"$f":"IFERROR(HLOOKUP(H$1&H$4,$S$1:$BB$23,ROWS(H$1:H8),FALSE),\"\")","v":""},{"$f":"IFERROR(HLOOKUP(I$1&I$4,$S$1:$BB$23,ROWS(I$1:I8),FALSE),\"\")","v":""},{"$f":"IFERROR(HLOOKUP(J$1&J$4,$S$1:$BB$23,ROWS(J$1:J8),FALSE),\"\")","v":""},{"$f":"IFERROR(HLOOKUP(K$1&K$4,$S$1:$BB$23,ROWS(K$1:K8),FALSE),\"\")","v":""},{"$f":"IFERROR(HLOOKUP(L$1&L$4,$S$1:$BB$23,ROWS(L$1:L8),FALSE),\"\")","v":""},{"$f":"IFERROR(HLOOKUP(M$1&M$4,$S$1:$BB$23,ROWS(M$1:M8),FALSE),\"\")","v":""},null,null,null,null,"Lettore biometrico integrato","Sì","Sì","Sì","Sì",null,"Sì","Sì","Sì","Sì","Sì","Sì","Sì","Sì","Sì","Sì","Sì","Sì","Sì","Sì","Sì","Sì","Sì","Sì","Sì","Sì","Sì","Sì","Sì",null,"Sì","Sì","Sì","Sì","Sì","Sì","Sì"]
{"$rows_left_out":16}
{"sheet":"ReadMe","index":3,"n_rows":18,"n_cols":3,"rows_kept":18,"cut":false,"hidden":true,"merged":[]}
[]
[null,"Congelamento prodotto"]
[null,null,"Nel foglio Congelam_PC\n- Selezionare il prodotto da congelare\n- Inserire un 1 nella colonna E della riga selezionata"]
[]
[null,"Modifica specifiche tecniche prodotto esistente"]
[null,null,"Nel foglio Offerte_e_Calcoli\n- Selezionare la colonna corrispondente al prodotto da modificare (da E ad AN)\n- Modificare il valore corrispondente alla riga riguardante la/le specifica/che da modificare (dalla riga 5 alla riga 33)\n\nNel foglio Riepilogo_Spec_Tecniche\n- Selezionare la colonna corrispondente al prodotto da modificare (da R a BB, NON TOCCARE da B ad M)\n- Modificare il valore corrispondente alla riga riguardante la/le specifica/che da modificare (dalla riga 3 alla riga 21)"]
[]
[null,"Modifica configurazioni disponibili"]
{"$rows_left_out":11}
{"sheet":"Offerte_e_Calcoli","index":4,"n_rows":39,"n_cols":78,"rows_kept":39,"cut":false,"hidden":true,"merged":[]}
[null,null,null,"OE","Bellucci S.p.A.","Bsistemi S.p.A.","Converge S.r.l.","Eurome S.r.l.","Hitech Distribuzione Informatica S.r.l.","ITD Solutions S.p.A.","Posdata S.r.l.","RTI Trust Technology Services  S.r.l.","Sistemi Hardware & Software S.p.A.","Team Memores Computer S.p.A.","Wetech’s S.p.A.","Zucchetti Informatica S.p.A.","Bellucci S.p.A.","Bsistemi S.p.A.","Converge S.r.l.","Eurome S.r.l.","Hitech Distribuzione Informatica S.r.l.","ITD Solutions S.p.A.","Posdata S.r.l.","RTI Trust Technology Services  S.r.l.","Sistemi Hardware & Software S.p.A.","Team Memores Computer S.p.A.","Wetech’s S.p.A.","Zucchetti Informatica S.p.A.","Bellucci S.p.A.","Bsistemi S.p.A.","Converge S.r.l.","Eurome S.r.l.","Hitech Distribuzione Informatica S.r.l.","ITD Solutions S.p.A.","Posdata S.r.l.","RTI Trust Technology Services  S.r.l.","Sistemi Hardware & Software S.p.A.","Team Memores Computer S.p.A.","Wetech’s S.p.A.","Zucchetti Informatica S.p.A.",null,null,{"$f":"+E1","v":"Bellucci S.p.A."},{"$f":"+F1","v":"Bsistemi S.p.A."},"Converge S.r.l.","Eurome S.r.l.","Hitech Distribuzione Informatica S.r.l.","ITD Solutions S.p.A.","Posdata S.r.l.","RTI Trust Technology Services  S.r.l.","Sistemi Hardware & Software S.p.A.","Team Memores Computer S.p.A.","Wetech’s S.p.A.","Zucchetti Informatica S.p.A.","Bellucci S.p.A.","Bsistemi S.p.A.","Converge S.r.l.","Eurome S.r.l.","Hitech Distribuzione Informatica S.r.l.","ITD Solutions S.p.A.","Posdata S.r.l.","RTI Trust Technology Services  S.r.l.","Sistemi Hardware & Software S.p.A.","Team Memores Computer S.p.A.","Wetech’s S.p.A.","Zucchetti Informatica S.p.A.","Bellucci S.p.A.","Bsistemi S.p.A.","Converge S.r.l.","Eurome S.r.l.","Hitech Distribuzione Informatica S.r.l.","ITD Solutions S.p.A.","Posdata S.r.l.","RTI Trust Technology Services  S.r.l.","Sistemi Hardware & Software S.p.A.",{"$f":"+AL1","v":"Team Memores Computer S.p.A."},{"$f":"+AM1","v":"Wetech’s S.p.A."},{"$f":"+AN1","v":"Zucchetti Informatica S.p.A."}]
[null,null,null,null,null,null,null,null,null,null,null,null,null,null,null,null,null,null,null,null,null,null,null,null,null,null,null,null,null,null,null,null,null,null,null,null,null,null,null,null,null,null,{"$f":"+E5","v":13},{"$f":"+F5","v":13},13,13,0,13,13,13,13,13,13,13,14,14,14,14,14,14,14,14,14,14,14,14,15,15,15,15,0,15,15,15,15,15,15,15]
["Da Input",null,null,null,"Dati tecnici da cataloghi",null,null,null,null,null,null,null,null,null,null,null,null,null,null,null,null,null,null,null,null,null,null,null,null,null,null,null,null,null,null,null,null,null,null,null,null,null,"Check specifiche disponibili"]
[]
[{"$f":"+Input!C4","v":"PC portatile da"},{"$f":"+Input!D4","v":0},{"$f":"+LEFT(B5,2)*1","v":0},null,13,13,13,13,null,13,13,13,13,13,13,13,14,14,14,14,14,14,14,14,14,14,14,14,15,15,15,15,null,15,15,15,15,15,15,15,null,null,{"$f":"IF($C5=E5,1,0)","v":0},{"$f":"IF($C5=F5,1,0)","v":0},0,0,1,0,0,0,0,0,0,0,0,0,0,0,0,0,0,0,0,0,0,0,0,0,0,0,1,0,0,0,0,0,0,0]
[{"$f":"+Input!C14","v":"CPU con “Neural Processing Unit” / “Ai Engine”"},{"$f":"+Input!D14","v":"No"},{"$f":"+LEFT(B6,2)","v":"No"},null,"Sì","Sì","Sì","Sì",null,"Sì","Sì","Sì","Sì","Sì","Sì","Sì","Sì","Sì","NO","Sì","NO","Sì","Sì","Sì","NO","Sì","Sì","NO","NO","Sì","Sì","Sì",null,"NO","Sì","Sì","NO","Sì","Sì","Sì",null,null,{"$f":"IF($C6=\"no\",1,IF($C6=E6,1,0))","v":1},{"$f":"IF($C6=\"no\",1,IF($C6=F6,1,0))","v":1},1,1,1,1,1,1,1,1,1,1,1,1,1,1,1,1,1,1,1,1,1,1,1,1,1,1,1,1,1,1,1,1,1,1]
[{"$f":"+Input!C15","v":"Lettore biometrico di impronte digitali integrato"},{"$f":"+Input!D15","v":"No"},"No",null,"Sì","Sì","Sì","Sì",null,"Sì","Sì","Sì","Sì","Sì","Sì","Sì","Sì","Sì","Sì","Sì","Sì","Sì","Sì","Sì","Sì","Sì","Sì","Sì","Sì","Sì","Sì","Sì",null,"Sì","Sì","Sì","Sì","Sì","Sì","Sì",null,null,{"$f":"IF($C7=\"no\",1,IF($C7=E7,1,0))","v":1},1,1,1,1,1,1,1,1,1,1,1,1,1,1,1,1,1,1,1,1,1,1,1,1,1,1,1,1,1,1,1,1,1,1,1]
[{"$f":"+Input!C16","v":"Webcam Integrata FHD IR"},{"$f":"+Input!D16","v":"No"},"No",null,"Sì","Sì","Sì","Sì",null,"Sì","Sì","Sì","Sì","Sì","Sì","Sì","Sì","Sì","Sì","Sì","Sì","Sì","Sì","Sì","Sì","Sì","Sì","Sì","Sì","Sì","Sì","Sì",null,"Sì","Sì","Sì","Sì","Sì","Sì","Sì",null,null,1,1,1,1,1,1,1,1,1,1,1,1,1,1,1,1,1,1,1,1,1,1,1,1,1,1,1,1,1,1,1,1,1,1,1,1]
{"$rows_left_out":32}
{"sheet":"Congelam_PC","index":5,"n_rows":38,"n_cols":7,"rows_kept":38,"cut":false,"hidden":true,"merged":[]}
[]
[null,"OE","PC","Concatena","Congelamento",null,"Selezionare 1 SOLO per i prodotti momentanemaente congelati."]
[null,"Bellucci S.p.A.",13,{"$f":"+Tabella2[[#This Row],[OE]]&Tabella2[[#This Row],[PC]]","v":"Bellucci S.p.A.13"}]
[null,"Bsistemi S.p.A.",13,{"$f":"+Tabella2[[#This Row],[OE]]&Tabella2[[#This Row],[PC]]","v":"Bsistemi S.p.A.13"}]
[null,"Converge S.r.l.",13,{"$f":"+Tabella2[[#This Row],[OE]]&Tabella2[[#This Row],[PC]]","v":"Converge S.r.l.13"}]
[null,"Eurome S.r.l.",13,{"$f":"+Tabella2[[#This Row],[OE]]&Tabella2[[#This Row],[PC]]","v":"Eurome S.r.l.13"}]
[null,"Hitech Distribuzione Informatica S.r.l.",13,{"$f":"+Tabella2[[#This Row],[OE]]&Tabella2[[#This Row],[PC]]","v":"Hitech Distribuzione Informatica S.r.l.13"}]
[null,"ITD Solutions S.p.A.",13,{"$f":"+Tabella2[[#This Row],[OE]]&Tabella2[[#This Row],[PC]]","v":"ITD Solutions S.p.A.13"}]
{"$rows_left_out":31}
{"sheet":"Config_Dispo","index":6,"n_rows":867,"n_cols":10,"rows_kept":867,"cut":false,"hidden":true,"merged":[]}
[null,{"$f":"D1&E1&F1&G1&I1","v":"Media8512Distribuzione Linux0"},null,{"$f":"+Input!D8","v":"Media"},{"$f":"VLOOKUP(Input!D9,Ana!D2:E4,2,FALSE)","v":8},{"$f":"VLOOKUP(Input!D10,Ana!F2:G4,2,FALSE)","v":512},{"$f":"VLOOKUP(Input!D11,Ana!H2:I4,2,FALSE)","v":"Distribuzione Linux"},null,{"$f":"+Input!D4","v":0}]
[]
[null,"Concatena","OE","CPU","RAM (GB)","SSD (GB)","Sistema Operativo","Si/No","PC","Config dispo"]
[null,{"$f":"C4&D4&E4&F4&G4&I4","v":"Bellucci S.p.A.Media8512Distribuzione Linux15\""},"Bellucci S.p.A.","Media",8,512,"Distribuzione Linux","SI","15\"",{"$f":"+IF(H4=\"NO\",0,1)","v":1}]
[null,{"$f":"C5&D5&E5&F5&G5&I5","v":"Bellucci S.p.A.Media8512Windows 11 Pro Education15\""},"Bellucci S.p.A.","Media",8,512,"Windows 11 Pro Education","SI","15\"",1]
[null,"Bellucci S.p.A.Media8512Windows 11 Pro15\"","Bellucci S.p.A.","Media",8,512,"Windows 11 Pro","SI","15\"",1]
[null,"Bellucci S.p.A.Media16512Distribuzione Linux15\"","Bellucci S.p.A.","Media",16,512,"Distribuzione Linux","SI","15\"",1]
[null,"Bellucci S.p.A.Media16512Windows 11 Pro Education15\"","Bellucci S.p.A.","Media",16,512,"Windows 11 Pro Education","SI","15\"",1]
{"$rows_left_out":860}
{"sheet":"Contatti_Fornitori","index":7,"n_rows":14,"n_cols":5,"rows_kept":14,"cut":false,"hidden":true,"merged":[]}
[]
[null,"OE","Nome e Cognome","e-mail","Tel"]
[null,"Bellucci S.p.A.","Roberto Santarelli","rsantarelli@gruppobellucci.it"]
[null,"Bsistemi S.p.A.","Stefania Scappaticci"," s.scappaticci@bsistemi.com"]
[null,"Converge S.r.l.","Massimo Tosti","m.tosti@converge.it"]
[null,"Eurome S.r.l.","Giorgio Marinelli","gestioneAQ@eurome.it"]
[null,"Hitech Distribuzione Informatica S.r.l.","Walter Pistone","w.pistone@htdi.it"]
[null,"ITD Solutions S.p.A.","Francesca Colozza","francesca.colozza@digitalvalue.it"]
{"$rows_left_out":7}
{"sheet":"Ana","index":8,"n_rows":16,"n_cols":22,"rows_kept":16,"cut":false,"hidden":true,"merged":[]}
["Prodotto_Princip","Sosten_Amb","CPU","RAM",null,"SSD",null,"Sist_Operat",null,"Sì/No","Sì/No/StessoProd","Monitor","Num","Scheda_Graf","Display","EspRAM","EspSSD",null,"Monitor",null,"Tendine","Valori"]
["15\"","Nessuna certificazione","Media",8,8,512,512,"Distribuzione Linux","Distribuzione Linux","No","No","No",2,"Integrata","HD",16,512,null,"No",null,8,8]
["14\"","Etichetta ISO di tipo I (UNI EN ISO 14024)","Superiore *","16 *",16,"1000 *",1000,"Windows 11 Pro *","Windows 11 Pro","Sì *","Sì *","Sì, da 23.6” *",3,"Discreta *","FHD *",32,1024,null,"Sì, da 23.6” *",null,"16 *",16]
["13\"","Certificazione TCO",null,null,null,null,null,"Windows 11 Pro Education *","Windows 11 Pro Education",null,"Sì, dello stesso produttore del PC *","Sì, da 27” *",4,null,null,64,null,null,"Sì, da 27” *",null,"Low","Low"]
[null,null,null,null,null,null,null,null,null,null,null,"Sì, da 23.6” dello stesso produttore del PC *",5,null,null,128,null,null,"Sì, da 23.6” dello stesso produttore del PC *",null,"Mid *","Mid"]
[null,null,null,null,null,null,null,null,null,null,null,"Sì, da 27” dello stesso produttore del PC *",null,null,null,null,null,null,"Sì, da 27” dello stesso produttore del PC *",null,"High *","High"]
[null,null,null,null,null,null,null,null,null,null,null,null,null,null,null,null,null,null,null,null,256,256]
[null,null,null,null,null,null,null,null,null,null,null,null,null,null,null,null,null,null,null,null,"512 *",512]
{"$rows_left_out":8}