{"text_format":"1","workbook":"xlsx","n_sheets":16,"sheets":["Server10 Lotto1 R630","Server10 Lotto1 R730xd","Server10 Lotto1 T630","RACK, Accessori e Servizi","Riepilogo","Server10 Lotto1 R630 2","Server10 Lotto1 R630 3","Server10 Lotto1 R730xd 2","Server10 Lotto1 R730xd 3","Codici","Processor","Memory","Operating System","HDD","PCI","Servizi Opzionali"],"not_rendered":{"charts":0,"images":10,"macros":1,"external_links":1,"defined_names":112,"comments":0,"pivot_tables":0},"unopened":[],"bounds":{"document_bytes":16777216,"sheet_cells":100000,"rows_first":2000,"rows_last":500,"rows_between":2000,"halvings":0,"cell_chars":16384,"cell_head_chars":4096},"cells_cut":0,"cells_raw":0,"read":"whole","date_system":"1900"}

{"sheet":"Server10 Lotto1 R630","index":0,"n_rows":147,"n_cols":8,"rows_kept":147,"cut":false,"hidden":false,"merged":[[71,8,74,10],[75,8,78,10],[135,1,135,4],[136,2,136,4],[138,1,138,4],[133,2,133,4],[117,1,117,4],[118,2,118,4],[120,1,120,4],[121,2,121,4],[123,1,123,4],[124,2,124,4],[126,1,126,4],[127,2,127,4],[129,1,129,4],[130,2,130,4],[147,1,147,4],[139,2,139,4],[141,1,141,4],[142,2,142,4],[144,1,144,4],[145,2,145,4],[132,1,132,4],[115,2,115,4],[99,1,99,4],[100,2,100,4],[102,1,102,4],[103,2,103,4],[105,1,105,4],[106,2,106,4],[108,1,108,4],[109,2,109,4],[111,1,111,4],[112,2,112,4],[114,1,114,4],[97,2,97,4],[78,1,78,4],[79,2,79,4],[81,1,81,4],[82,2,82,4],[84,1,84,4],[85,2,85,4],[87,1,87,4],[88,2,88,4],[90,1,90,4],[94,2,94,4],[96,1,96,4],[93,1,93,4],[75,2,75,4],[53,2,53,4],[55,1,55,4],[56,2,56,4],[58,1,58,4],[60,1,60,4],[61,2,61,4],[63,1,63,4],[64,2,64,4],[70,1,70,4],[71,2,71,4],[74,1,74,4],[52,1,52,4],[29,1,29,4],[30,2,30,4],[33,1,33,4],[34,2,34,4],[36,1,36,4],[39,1,39,4],[40,2,40,4],[42,1,42,4],[43,2,43,4],[49,1,49,4],[50,2,50,4],[27,2,27,4],[0,0,3,5],[4,0,4,4],[5,0,5,4],[10,0,11,5],[12,0,12,5],[18,2,18,4],[20,1,20,4],[21,2,21,4],[23,1,23,4],[24,2,24,4],[26,1,26,4]]}
[]
[]
[]
[]
["Server10 Lotto1 R630",null,null,null,null,null,null,"List Price *"]
[null,null,null,null,null,null,null,{"$f":"F17*C16","v":0}]
[]
[]
[]
[]
["Components: \nServer DELL PowerEdge R630 (1CPU Intel® Xeon® E5-2640 v4, 32GB RDIMM, 2xHDD 300GB 10K RPM SAS 12Gbps 2.5in)"]
[]
[]
[]
["PowerEdge R630","Category: Server",null,null,null,{"$f":"1806","v":1806}]
[null,"Quantity: ",null,null,null,{"$f":"SUM(F20:F148)","v":0}]
[null,null,null,null,null,{"$f":"SUM(F15:F16)","v":1806}]
[]
[null,"Base"]
[null,"PowerEdge R630 for Intel v4 CPUs, 8HDD",1,null,"[210-ACXS][329-BCZI]"]
[]
[null,"Configurazione dello chassis"]
[null,"Chassis with up to 8, 2.5\" Hard Drives, up to 2 PCIe Slots (With Optional Riser)",1,null,"[321-BBKJ]"]
[]
[null,"Processore"]
[null,"Intel Xeon E5-2640 v4 2.4GHz 25M Cache 8.0GT/s QPI Turbo HT 10C/20T (90W) Max Mem 2133MHz",1,null,"[338-BJDL]"]
[]
[null,"Processore aggiuntivo"]
[null,"No Additional Processor",{"$f":"VLOOKUP($B$29, CPU_A, 2, FALSE)","v":0},{"$f":"VLOOKUP($B$29, CPU_A, 3, FALSE)","v":""},{"$f":"VLOOKUP($B$29, CPU_A, 5, FALSE)","v":"[374-BBBX]"},{"$f":"VLOOKUP(B29, CPU_A, 12, FALSE)","v":""}]
[]
[null,"Processor Thermal Configuration"]
[null,"1 CPU up to 120W",1,null,"[370-ABWN][412-AAEE]"]
[null,{"$f":"VLOOKUP($B$29, CPU_A, 6, FALSE)","v":""},{"$f":"VLOOKUP($B$29, CPU_A, 7, FALSE)","v":""},null,{"$f":"VLOOKUP($B$29, CPU_A, 8, FALSE)","v":""}]
[]
[null,"Tipo di configurazione memoria"]
[null,"Performance Optimized",1,null,"[370-AAIP]"]
[]
[null,"Memoria Totale in GB",null,{"$f":"IF(('Server10 Lotto1 R630'!$D$12=0),\"\",'Server10 Lotto1 R630'!#REF!)","v":""}]
[null,32]
[]
[null,"Tipo e velocità della memoria DIMM"]
[null,"2400MT/s RDIMMs",1,null,"[370-ACPH]"]
[]
[null,"Capacità di memoria"]
[null,{"$f":"IF($B$29=\"No Additional Processor\",VLOOKUP($B$39, MEM_A1, 8, FALSE),VLOOKUP($B$39, MEM_A2, 8, FALSE))","v":"16GB RDIMM, 2400MT/s, Dual Rank, x8 Data Width"},{"$f":"IF($B$29=\"No Additional Processor\",VLOOKUP($B$39, MEM_A1, 9, FALSE),VLOOKUP($B$39, MEM_A2, 9, FALSE))","v":"2"},null,{"$f":"IF($B$29=\"No Additional Processor\",VLOOKUP($B$39, MEM_A1, 10, FALSE),VLOOKUP($B$39, MEM_A2, 10, FALSE))","v":"[370-ACNX]"}]
[]
[null,{"$f":"IF($B$29=\"No Additional Processor\",VLOOKUP($B$39, MEM_A1, 2, FALSE),VLOOKUP($B$39, MEM_A2, 2, FALSE))","v":""},{"$f":"IF($B$29=\"No Additional Processor\",VLOOKUP($B$39, MEM_A1, 3, FALSE),VLOOKUP($B$39, MEM_A2, 3, FALSE))","v":""},{"$f":"IF($B$29=\"No Additional Processor\",VLOOKUP($B$39, MEM_A1, 4, FALSE),VLOOKUP($B$39, MEM_A2, 4, FALSE))","v":""},{"$f":"IF($B$29=\"No Additional Processor\",VLOOKUP($B$39, MEM_A1, 6, FALSE),VLOOKUP($B$39, MEM_A2, 6, FALSE))","v":""},{"$f":"IF($B$29=\"No Additional Processor\",VLOOKUP($B$39, MEM_A1, 7, FALSE),VLOOKUP($B$39, MEM_A2, 7, FALSE))","v":""}]
[]
[null,{"$f":"IF($B$29=\"No Additional Processor\",VLOOKUP($B$39, MEM_A1, 11, FALSE),VLOOKUP($B$39, MEM_A2, 11, FALSE))","v":""},{"$f":"IF($B$29=\"No Additional Processor\",VLOOKUP($B$39, MEM_A1, 12, FALSE),VLOOKUP($B$39, MEM_A2, 12, FALSE))","v":""},{"$f":"IF($B$29=\"No Additional Processor\",VLOOKUP($B$39, MEM_A1, 13, FALSE),VLOOKUP($B$39, MEM_A2, 13, FALSE))","v":""},{"$f":"IF($B$29=\"No Additional Processor\",VLOOKUP($B$39, MEM_A1, 15, FALSE),VLOOKUP($B$39, MEM_A2, 15, FALSE))","v":""},{"$f":"IF($B$29=\"No Additional Processor\",VLOOKUP($B$39, MEM_A1, 16, FALSE),VLOOKUP($B$39, MEM_A2, 16, FALSE))","v":""}]
[]
[null,"Sistema operativo preinstallato"]
[null,"No Operating System",{"$f":"VLOOKUP($B$52, OS_A, 2, FALSE)","v":""},{"$f":"VLOOKUP($B$52, OS_A, 3, FALSE)","v":""},{"$f":"VLOOKUP($B$52, OS_A, 5, FALSE)","v":"[611-BBBF]"},{"$f":"VLOOKUP($B$52, OS_A, 6, FALSE)","v":""}]
[]
[null,"OS Media Kits"]
[null,"No Media Required",1,null,"[605-BBFN]"]
[]
[null,"Client Access Licenses"]
[null,{"$f":"VLOOKUP($B$52, OS_A, 7, FALSE)","v":"None"},null,{"$f":"VLOOKUP($B$52, OS_A, 9, FALSE)","v":""},{"$f":"VLOOKUP($B$52, OS_A, 11, FALSE)","v":""},{"$f":"VLOOKUP($B$52, OS_A, 12, FALSE)*C58","v":0}]
[]
[null,{"$f":"VLOOKUP($B$52, OS_A, 13, FALSE)","v":"None"},null,{"$f":"VLOOKUP($B$52, OS_A, 15, FALSE)","v":""},{"$f":"VLOOKUP($B$52, OS_A, 17, FALSE)","v":""},{"$f":"VLOOKUP($B$52, OS_A, 18, FALSE)*C60","v":0}]
[]
[null,"Controller RAID"]
[null,"PERC H330 RAID Controller",1,null,"[405-AAEF]"]
[]
[null,"Dischi rigidi"]
[null,"300GB 10K RPM SAS 12Gbps 2.5in Hot-plug Hard Drive",2,null,"[400-AJPK]"]
[]
[null,"300GB 10K RPM SAS 12Gbps 2.5in Hot-plug Hard Drive,CusKit",null,{"$f":"VLOOKUP($B$68, HDD_A,3, FALSE)","v":"10L1-HDD300GB"},{"$f":"VLOOKUP($B$68, HDD_A,5, FALSE)","v":"[400-AJOQ]"},{"$f":"VLOOKUP($B$68, HDD_A,6, FALSE)*C68","v":0}]
[]
[null,"1TB 7.2K RPM NLSAS 6Gbps 2.5in Hot-plug Hard Drive,13G,CusKit",null,{"$f":"VLOOKUP($B$70, HDD_A,3, FALSE)","v":"10L1-HDD1TB"},{"$f":"VLOOKUP($B$70, HDD_A,5, FALSE)","v":"[400-AEFF]"},{"$f":"VLOOKUP($B$70, HDD_A,6, FALSE)*C70","v":0}]
[]
[null,"Configurazione RAID HDD 300GB"]
[null,"C3 - RAID 1 for H330 (2 HDDs)",1,null,{"$f":"VLOOKUP($B$73,  RAID_A1, 2, FALSE)","v":"[780-BBJK]"}]
[null,"Hot Spare for 300GB HDD","No"]
[]
[null,"Configurazione RAID HDD 1TB"]
[null,"",1,null,{"$f":"VLOOKUP($B$77,  RAID_A2, 2, FALSE)","v":""}]
[null,"Hot Spare for 1TB HDD","No"]
[]
[null,"Impostazioni del BIOS per la gestione dell'alimentazione"]
[null,"Performance BIOS Setting",1,null,"[384-BBBL]"]
[]
[null,"Alimentatore"]
[null,"Dual, Hot-plug, Redundant Power Supply (1+1), 750W, Titanium, 200-240VAC",1,null,"[450-ADWT]"]
[]
[null,"Cavi di alimentazione"]
[null,"Rack Power Cord 2M (C13/C14 12A)",2,null,"[450-AADY]"]
[]
[null,"PCIe Riser"]
[null,{"$f":"VLOOKUP(B29, CPU_A, 9, FALSE)","v":"Riser with up to 1, x8 PCIe Slots + 1, x16 PCIe Slots for x8, 2 PCIe Chassis with 1 Processor"},{"$f":"VLOOKUP($B$29, CPU_A, 10, FALSE)","v":1},null,{"$f":"VLOOKUP($B$29, CPU_A, 11, FALSE)","v":"[330-BBCS]"}]
[]
[null,"TPM Module"]
[null,"PowerEdge Server FIPS TPM 2.0",1,null,"[461-AADM]"]
[]
[null,"Embedded Systems Management"]
[null,"iDrac8, Enterprise with Open Manage Essentials",1,null,"[385-BBHO][634-BBWU]"]
[]
[null,"Adattatore di rete"]
[null,"Broadcom 5720 QP 1Gb Network Daughter Card",1,null,"[540-BBBW]"]
[]
[null,"Additional Card for PCIe Slot 1 (Low Profile)"]
[null,"None",{"$f":"VLOOKUP($B$102,  PCI_A1, 2, FALSE)","v":""},{"$f":"VLOOKUP($B$102,  PCI_A1, 3, FALSE)","v":""},{"$f":"VLOOKUP($B$102,  PCI_A1, 5, FALSE)","v":""},{"$f":"VLOOKUP($B$102,  PCI_A1, 6, FALSE)","v":""}]
[]
[null,"Additional Card for PCIe Slot 2 (Full height)"]
[null,"None",{"$f":"VLOOKUP($B$105,  PCI_A2, 2, FALSE)","v":""},{"$f":"VLOOKUP($B$105,  PCI_A2, 3, FALSE)","v":""},{"$f":"VLOOKUP($B$105,  PCI_A2, 5, FALSE)","v":""},{"$f":"VLOOKUP($B$105,  PCI_A2, 6, FALSE)","v":""}]
[]
[null,"Pannello frontale"]
[null,"Bezel 8 Drive Chassis",1,null,"[325-BBII]"]
[]
[null,"Guide per rack"]
[null,"ReadyRails™ Sliding Rails Without Cable Management Arm",1,null,"[770-BBBC]"]
[]
[null,"Unità ottica interna"]
[null,"No Internal Optical Drive for 8 HDD Chassis",1,null,"[429-AAQN]"]
[]
[null,"Accessori Server"]
[null,"PowerEdge SFP+, 10GbE SR/SX, Optical Tranceiver, LC Connector, for Intel and Broadcom,CusKit",{"$f":"(VLOOKUP(B105,PCI_A2,8,FALSE))+((VLOOKUP(B102,PCI_A1,8,FALSE)))","v":0},null,"[407-BBQE]"]
[]
[null,"Sistema documentazione"]
[null,"Electronic System Documentation and OpenManage DVD Kit",1,null,"[343-BBDK]"]
[]
[null,"SHIPPING"]
[null,"R630 Shipping - 8 Drive Chassis, EMEA1 (English/French/German/Spanish/Russian/Hebrew)",1,null,"[340-AMIN]"]
[]
[null,"Order Information"]
[null,"PowerEdge Order - EMEA",1,null,"[800-11671]"]
[]
[null,"Base warranty"]
[null,"3Yr Basic Warranty - Next Business Day - Minimum Warranty",1,null,"[709-12767][709-12768]"]
[]
[null,"Servizi di assitenza"]
[null,"Dell Channel Order - Service Info only",1,null,"[710-31085]"]
[]
[null,"Aggiornamenti della garanzia"]
[null,"None",{"$f":"VLOOKUP($B$135,  SO_A1, 2, FALSE)","v":""},{"$f":"VLOOKUP($B$135,  SO_A1, 3, FALSE)","v":""},{"$f":"VLOOKUP($B$135,  SO_A1, 5, FALSE)","v":""},{"$f":"VLOOKUP($B$135,  SO_A1, 6, FALSE)","v":""}]
[]
[null,"Protezione dei dati - Keep Your Hard Drive "]
[null,"None",{"$f":"VLOOKUP($B$138,  SO_A2, 2, FALSE)","v":""},{"$f":"VLOOKUP($B$138,  SO_A2, 3, FALSE)","v":""},{"$f":"VLOOKUP($B$138,  SO_A2,5, FALSE)","v":""},{"$f":"VLOOKUP($B$138,  SO_A2, 6, FALSE)","v":""}]
[]
[null,"Servizi di Installazione"]
[null,"No Installation Service Selected",1,null,"[683-11870]"]
[]
[null,"Channel only - Support Extension"]
[null,"Channel 39M Basic Warranty - Next Business Day",1,null,"[723-28776]"]
[]
[null,"Warranty Upgrades - Non-Std/Local POS"]
[null,"CSTM CONSIP - 39M Onsite Labor Support for CRU for Servers with Basic Warranty",1,null,"[681-24467]"]

{"sheet":"Server10 Lotto1 R730xd","index":1,"n_rows":156,"n_cols":8,"rows_kept":156,"cut":false,"hidden":false,"merged":[[71,8,74,10],[75,8,78,10],[156,1,156,4],[103,2,103,4],[105,1,105,4],[106,2,106,4],[108,1,108,4],[109,2,109,4],[111,1,111,4],[112,2,112,4],[114,1,114,4],[148,2,148,4],[150,1,150,4],[151,2,151,4],[153,1,153,4],[154,2,154,4],[144,1,144,4],[145,2,145,4],[147,1,147,4],[135,1,135,4],[136,2,136,4],[138,1,138,4],[139,2,139,4],[141,1,141,4],[142,2,142,4],[133,2,133,4],[120,1,120,4],[121,2,121,4],[123,1,123,4],[124,2,124,4],[126,1,126,4],[127,2,127,4],[129,1,129,4],[130,2,130,4],[132,1,132,4],[118,2,118,4],[87,1,87,4],[88,2,88,4],[90,1,90,4],[94,2,94,4],[96,1,96,4],[97,2,97,4],[99,1,99,4],[100,2,100,4],[102,1,102,4],[115,2,115,4],[117,1,117,4],[93,1,93,4],[85,2,85,4],[63,1,63,4],[64,2,64,4],[70,1,70,4],[71,2,71,4],[74,1,74,4],[75,2,75,4],[78,1,78,4],[79,2,79,4],[81,1,81,4],[82,2,82,4],[84,1,84,4],[61,2,61,4],[40,2,40,4],[42,1,42,4],[43,2,43,4],[49,1,49,4],[50,2,50,4],[52,1,52,4],[53,2,53,4],[55,1,55,4],[56,2,56,4],[58,1,58,4],[60,1,60,4],[39,1,39,4],[20,1,20,4],[21,2,21,4],[23,1,23,4],[24,2,24,4],[26,1,26,4],[27,2,27,4],[29,1,29,4],[30,2,30,4],[33,1,33,4],[34,2,34,4],[36,1,36,4],[18,2,18,4],[0,0,3,5],[4,0,4,4],[5,0,5,4],[10,0,11,5],[12,0,12,5]]}
[]
[]
[]
[]
["Server10 Lotto1 R730xd",null,null,null,null,null,null,"List Price *"]
[null,null,null,null,null,null,null,{"$f":"F17*C16","v":0}]
[]
[]
[]
[]
["Components: \nServer DELL PowerEdge R730xd (1CPU Intel® Xeon® E5-2620 v4, 32GB RDIMM, 2xHDD 300GB 10K RPM SAS 12Gbps 2.5in)"]
[]
[]
[]
["PowerEdge R730xd","Category: Server",null,null,null,{"$f":"1728","v":1728}]
[null,"Quantity: ",null,null,null,{"$f":"SUM(F20:F157)","v":0}]
[null,null,null,null,null,{"$f":"SUM(F15:F16)","v":1728}]
[]
[null,"Base"]
[null,"PowerEdge R730xd for Intel v4 CPUs",1,null,"[210-ADBC][329-BCZK]"]
[]
[null,"Configurazione dello chassis"]
[null,"Chassis with up to 24, 2.5\" Hard Drives",1,null,"[350-BBFD]"]
[]
[null,"Processore"]
[null,"Intel Xeon E5-2620 v4 2.1GHz 20M Cache 8.0GT/s QPI Turbo HT 8C/16T (85W) Max Mem 2133MHz",1,null,"[338-BJCZ]"]
[]
[null,"Processore aggiuntivo"]
[null,"No Additional Processor",{"$f":"VLOOKUP($B$29, CPU_B, 2, FALSE)","v":0},{"$f":"VLOOKUP($B$29, CPU_B, 3, FALSE)","v":""},{"$f":"VLOOKUP($B$29, CPU_B, 5, FALSE)","v":"[374-BBBX]"},{"$f":"VLOOKUP(B29, CPU_B, 12, FALSE)","v":""}]
[]
[null,"Processor Thermal Configuration"]
[null,"1 CPU Standard",1,null,"[370-ABWF][374-BBHM][750-AAEL]"]
[null,{"$f":"VLOOKUP($B$29, CPU_B, 6, FALSE)","v":""},{"$f":"VLOOKUP($B$29, CPU_B, 7, FALSE)","v":""},null,{"$f":"VLOOKUP($B$29, CPU_B, 8, FALSE)","v":""}]
[]
[null,"Tipo di configurazione memoria"]
[null,"Performance Optimized",1,null,"[370-AAIP]"]
[]
[null,"Memoria Totale in GB",null,{"$f":"IF(('Server10 Lotto1 R730xd'!$D$12=0),\"\",'Server10 Lotto1 R730xd'!#REF!)","v":""}]
[null,32]
[]
[null,"Tipo e velocità della memoria DIMM"]
[null,"2400MT/s RDIMMs",1,null,"[370-ACPH]"]
[]
[null,"Capacità di memoria"]
[null,"16GB RDIMM, 2400MT/s, Dual Rank, x8 Data Width",{"$f":"IF($B$29=\"No Additional Processor\",VLOOKUP($B$39, MEM_B1, 9, FALSE),VLOOKUP($B$39, MEM_B2, 9, FALSE))","v":"2"},null,{"$f":"IF($B$29=\"No Additional Processor\",VLOOKUP($B$39, MEM_B1, 10, FALSE),VLOOKUP($B$39, MEM_B2, 10, FALSE))","v":"[370-ACNX]"}]
[]
[null,{"$f":"IF($B$29=\"No Additional Processor\",VLOOKUP($B$39, MEM_B1, 2, FALSE),VLOOKUP($B$39, MEM_B2, 2, FALSE))","v":""},{"$f":"IF($B$29=\"No Additional Processor\",VLOOKUP($B$39, MEM_B1, 3, FALSE),VLOOKUP($B$39, MEM_B2, 3, FALSE))","v":""},{"$f":"IF($B$29=\"No Additional Processor\",VLOOKUP($B$39, MEM_B1, 4, FALSE),VLOOKUP($B$39, MEM_B2, 4, FALSE))","v":""},{"$f":"IF($B$29=\"No Additional Processor\",VLOOKUP($B$39, MEM_B1, 6, FALSE),VLOOKUP($B$39, MEM_B2, 6, FALSE))","v":""},{"$f":"IF($B$29=\"No Additional Processor\",VLOOKUP($B$39, MEM_B1, 7, FALSE),VLOOKUP($B$39, MEM_B2, 7, FALSE))","v":""}]
[]
[null,{"$f":"IF($B$29=\"No Additional Processor\",VLOOKUP($B$39, MEM_B1, 11, FALSE),VLOOKUP($B$39, MEM_B2, 11, FALSE))","v":""},{"$f":"IF($B$29=\"No Additional Processor\",VLOOKUP($B$39, MEM_B1, 12, FALSE),VLOOKUP($B$39, MEM_B2, 12, FALSE))","v":""},{"$f":"IF($B$29=\"No Additional Processor\",VLOOKUP($B$39, MEM_B1, 13, FALSE),VLOOKUP($B$39, MEM_B2, 13, FALSE))","v":""},{"$f":"IF($B$29=\"No Additional Processor\",VLOOKUP($B$39, MEM_B1, 15, FALSE),VLOOKUP($B$39, MEM_B2, 15, FALSE))","v":""},{"$f":"IF($B$29=\"No Additional Processor\",VLOOKUP($B$39, MEM_B1, 16, FALSE),VLOOKUP($B$39, MEM_B2, 16, FALSE))","v":""}]
[]
[null,"Sistema operativo preinstallato"]
[null,"No Operating System",{"$f":"VLOOKUP($B$52, OS_B, 2, FALSE)","v":""},{"$f":"VLOOKUP($B$52, OS_B, 3, FALSE)","v":""},{"$f":"VLOOKUP($B$52, OS_B, 5, FALSE)","v":"[611-BBBF]"},{"$f":"VLOOKUP($B$52, OS_B, 6, FALSE)","v":""}]
[]
[null,"OS Media Kits"]
[null,"No Media Required",1,null,"[605-BBFN]"]
[]
[null,"Client Access Licenses"]
[null,{"$f":"VLOOKUP($B$52, OS_B, 7, FALSE)","v":"None"},null,{"$f":"VLOOKUP($B$52, OS_B, 9, FALSE)","v":""},{"$f":"VLOOKUP($B$52, OS_B, 11, FALSE)","v":""},{"$f":"VLOOKUP($B$52, OS_B, 12, FALSE)*C58","v":0}]
[]
[null,{"$f":"VLOOKUP($B$52, OS_B, 13, FALSE)","v":"None"},null,{"$f":"VLOOKUP($B$52, OS_B, 15, FALSE)","v":""},{"$f":"VLOOKUP($B$52, OS_B, 17, FALSE)","v":""},{"$f":"VLOOKUP($B$52, OS_B, 18, FALSE)*C60","v":0}]
[]
[null,"Controller RAID"]
[null,"PERC H330 RAID Controller",1,null,"[405-AAEF]"]
[]
[null,"Dischi rigidi"]
[null,"300GB 10K RPM SAS 12Gbps 2.5in Hot-plug Hard Drive",2,null,"[400-AJPK]"]
[]
[null,"300GB 10K RPM SAS 12Gbps 2.5in Hot-plug Hard Drive,CusKit",0,{"$f":"VLOOKUP($B$68, HDD_A,3, FALSE)","v":"10L1-HDD300GB"},{"$f":"VLOOKUP($B$68, HDD_A,5, FALSE)","v":"[400-AJOQ]"},{"$f":"VLOOKUP($B$68, HDD_A,6, FALSE)*C68","v":0}]
[]
[null,"1TB 7.2K RPM NLSAS 6Gbps 2.5in Hot-plug Hard Drive,13G,CusKit",0,{"$f":"VLOOKUP($B$70, HDD_A,3, FALSE)","v":"10L1-HDD1TB"},{"$f":"VLOOKUP($B$70, HDD_A,5, FALSE)","v":"[400-AEFF]"},{"$f":"VLOOKUP($B$70, HDD_A,6, FALSE)*C70","v":0}]
[]
[null,"Configurazione RAID HDD 300GB"]
[null,"C3 - RAID 1 for H330 (2 HDDs)",1,null,{"$f":"VLOOKUP($B$73,  RAID_B1, 2, FALSE)","v":"[780-BBJK]"}]
[null,"Hot Spare for 300GB HDD","No"]
[]
[null,"Configurazione RAID HDD 1TB"]
[null,"",1,null,{"$f":"VLOOKUP($B$77,  RAID_B2, 2, FALSE)","v":""}]
[null,"Hot Spare for 1TB HDD","No"]
[]
[null,"Impostazioni del BIOS per la gestione dell'alimentazione"]
[null,"Performance BIOS Setting",1,null,"[384-BBBL]"]
[]
[null,"Alimentatore"]
[null,"Dual, Hot-plug, Redundant Power Supply (1+1), 750W, Titanium, 200-240VAC",1,null,"[450-ADWT]"]
[]
[null,"Cavi di alimentazione"]
[null,"Rack Power Cord 2M (C13/C14 12A)",2,null,"[450-AADY]"]
[]
[null,"PCIe Riser"]
[null,"Risers with up to 4, x8 PCIe Slots + 2, x16 PCIe Slots",1,null,"[330-BBCO][330-BBCR]"]
[]
[null,"TPM Module"]
[null,"PowerEdge Server FIPS TPM 2.0",1,null,"[461-AADM]"]
[]
[null,"Embedded Systems Management"]
[null,"iDRAC8 Enterprise, integrated Dell Remote Access Controller, Enterprise",1,null,"[385-BBHO]"]
[]
[null,"Adattatore di rete"]
[null,"Broadcom 5720 QP 1Gb Network Daughter Card",1,null,"[540-BBBW]"]
[]
[null,"Additional Card for PCIe Slot 6 (Full height) (CPU 1)"]
[null,"None",{"$f":"VLOOKUP($B$102,  PCI_B1, 2, FALSE)","v":""},{"$f":"VLOOKUP($B$102,  PCI_B1, 3, FALSE)","v":""},{"$f":"VLOOKUP($B$102,  PCI_B1, 5, FALSE)","v":""},{"$f":"VLOOKUP($B$102,  PCI_B1, 6, FALSE)","v":""}]
[]
[null,"Additional Card for PCIe Slot 5 (Full height) (CPU 1)"]
[null,"None",{"$f":"VLOOKUP($B$105,  PCI_B2, 2, FALSE)","v":""},{"$f":"VLOOKUP($B$105,  PCI_B2, 3, FALSE)","v":""},{"$f":"VLOOKUP($B$105,  PCI_B2, 5, FALSE)","v":""},{"$f":"VLOOKUP($B$105,  PCI_B2, 6, FALSE)","v":""}]
[]
[null,"Additional Card for PCIe Slot 4 (Full height) (CPU 2)"]
[null,"None",{"$f":"IF(B108=\"Aggiungere Secondo Processore\",\"\",(VLOOKUP(B108,PCI_B3, 2, FALSE)))","v":""},{"$f":"IF(B108=\"Aggiungere Secondo Processore\",\"\",(VLOOKUP(B108,  PCI_B3, 3, FALSE)))","v":""},{"$f":"VLOOKUP($B$108,  PCI_B3, 5, FALSE)","v":""},{"$f":"VLOOKUP($B$108,  PCI_B3, 6, FALSE)","v":""}]
[null,"ù"]
[null,"Additional Card for PCIe Slot 3 (Low Profile) (CPU 2)"]
[null,"None",{"$f":"IF(B111=\"Aggiungere Secondo Processore\",\"\",(VLOOKUP(B111,PCI_B4, 2, FALSE)))","v":""},{"$f":"IF(B111=\"Aggiungere Secondo Processore\",\"\",(VLOOKUP(B111,  PCI_B4, 3, FALSE)))","v":""},{"$f":"VLOOKUP($B$111,  PCI_B4, 5, FALSE)","v":""},{"$f":"VLOOKUP($B$111,  PCI_B4, 6, FALSE)","v":""}]
[]
[null,"Additional Card for PCIe Slot 2 (Low Profile) (CPU 2)"]
[null,"None",{"$f":"IF(B114=\"Aggiungere Secondo Processore\",\"\",(VLOOKUP(B114,PCI_B5, 2, FALSE)))","v":""},{"$f":"IF(B114=\"Aggiungere Secondo Processore\",\"\",(VLOOKUP(B114,  PCI_B5, 3, FALSE)))","v":""},{"$f":"VLOOKUP($B$114,  PCI_B5, 5, FALSE)","v":""},{"$f":"VLOOKUP($B$114,  PCI_B5, 6, FALSE)","v":""}]
[]
[null,"Additional Card for PCIe Slot 1 (Low Profile) (CPU 2)"]
[null,"None",{"$f":"IF(B117=\"Aggiungere Secondo Processore\",\"\",(VLOOKUP(B117,PCI_B6, 2, FALSE)))","v":""},{"$f":"IF(B117=\"Aggiungere Secondo Processore\",\"\",(VLOOKUP(B117,  PCI_B6, 3, FALSE)))","v":""},{"$f":"VLOOKUP($B$117,  PCI_B5, 5, FALSE)","v":""},{"$f":"VLOOKUP($B$117,  PCI_B5, 6, FALSE)","v":""}]
[]
[null,"Pannello frontale"]
[null,"Bezel",1,null,"[350-BBEJ]"]
[]
[null,"Guide per rack"]
[null,"ReadyRails™ Sliding Rails Without Cable Management Arm",1,null,"[770-BBBQ]"]
[]
[null,"Server Accessories"]
[null,"PowerEdge SFP+, 10GbE SR/SX, Optical Tranceiver, LC Connector, for Intel and Broadcom,CusKit",{"$f":"(VLOOKUP(B117,PCI_A2,8,FALSE))+((VLOOKUP(B102,PCI_A1,8,FALSE)))","v":0},null,"[407-BBQE]"]
[]
[null,"System Documentation"]
[null,"Electronic System Documentation and OpenManage DVD Kit",1,null,"[631-AAJG]"]
[]
[null,"SHIPPING"]
[null,"PowerEdge R730xd Shipping EMEA1 (English/French/German/Spanish/Russian/Hebrew)",1,null,"[340-AMGS]"]
[]
[null,"Order Information"]
[null,"PowerEdge Order - EMEA",1,null,"[800-11671]"]
[]
[null,"Base warranty"]
[null,"3Yr Basic Warranty - Next Business Day - Minimum Warranty",1,null,"[709-12780][709-12781]"]
[]
[null,"Servizi di assitenza"]
[null,"Dell Channel Order - Service Info only",1,null,"[710-31085]"]
[]
[null,"Aggiornamenti della garanzia"]
[null,"None",{"$f":"VLOOKUP($B$144,  SO_B1,2, FALSE)","v":""},{"$f":"VLOOKUP($B$144,  SO_B1, 3, FALSE)","v":""},{"$f":"VLOOKUP($B$144,  SO_B1, 5, FALSE)","v":""},{"$f":"VLOOKUP($B$144,  SO_B1, 6, FALSE)","v":""}]
[]
[null,"Protezione dei dati - Keep Your Hard Drive "]
[null,"None",{"$f":"VLOOKUP($B$147,  SO_B2, 2, FALSE)","v":""},{"$f":"VLOOKUP($B$147,  SO_B2, 3, FALSE)","v":""},{"$f":"VLOOKUP($B$147,  SO_B2,5, FALSE)","v":""},{"$f":"VLOOKUP($B$147,  SO_B2, 6, FALSE)","v":""}]
[]
[null,"Servizi di Installazione"]
[null,"No Installation Service Selected",1,null,"[683-11870]"]
[]
[null,"Channel only - Support Extension"]
[null,"Channel 39M Basic Warranty - Next Business Day",1,null,"[723-28780]"]
[]
[null,"Warranty Upgrades - Non-Std/Local POS"]
[null,"CSTM CONSIP - 39M Onsite Labor Support for CRU for Servers with Basic Warranty",1,null,"[681-24467]"]

{"sheet":"Server10 Lotto1 T630","index":2,"n_rows":159,"n_cols":6,"rows_kept":159,"cut":false,"hidden":false,"merged":[[67,6,70,8],[71,6,74,8],[136,2,136,4],[118,1,118,4],[119,2,119,4],[121,1,121,4],[129,1,129,4],[130,2,130,4],[132,1,132,4],[133,2,133,4],[135,1,135,4],[122,2,122,4],[124,1,124,4],[125,2,125,4],[100,1,100,4],[101,2,101,4],[153,1,153,4],[154,2,154,4],[156,1,156,4],[157,2,157,4],[144,1,144,4],[145,2,145,4],[159,1,159,4],[78,2,78,4],[80,1,80,4],[104,2,104,4],[106,1,106,4],[107,2,107,4],[147,1,147,4],[148,2,148,4],[150,1,150,4],[151,2,151,4],[138,1,138,4],[139,2,139,4],[141,1,141,4],[142,2,142,4],[97,1,97,4],[98,2,98,4],[103,1,103,4],[116,2,116,4],[115,1,115,4],[109,1,109,4],[110,2,110,4],[112,1,112,4],[113,2,113,4],[86,1,86,4],[90,2,90,4],[92,1,92,4],[93,2,93,4],[74,1,74,4],[75,2,75,4],[77,1,77,4],[81,2,81,4],[83,1,83,4],[84,2,84,4],[89,1,89,4],[71,2,71,4],[49,2,49,4],[51,1,51,4],[52,2,52,4],[54,1,54,4],[56,1,56,4],[57,2,57,4],[59,1,59,4],[60,2,60,4],[66,1,66,4],[67,2,67,4],[70,1,70,4],[48,1,48,4],[25,1,25,4],[26,2,26,4],[29,1,29,4],[30,2,30,4],[32,1,32,4],[35,1,35,4],[36,2,36,4],[38,1,38,4],[39,2,39,4],[45,1,45,4],[46,2,46,4],[23,2,23,4],[0,0,3,5],[4,0,4,4],[5,0,5,4],[6,0,7,5],[8,0,8,5],[14,2,14,4],[16,1,16,4],[17,2,17,4],[19,1,19,4],[20,2,20,4],[22,1,22,4]]}
[]
[]
[]
[]
["Server10 Lotto1 T630",null,null,null,null,"List Price *"]
[null,null,null,null,null,{"$f":"F13*C12","v":0}]
["Components: \nServer DELL PowerEdge T630 (1CPU Intel® Xeon® E5-2640 v4, 32GB RDIMM, 2xHDD 300GB 10K RPM SAS 12Gbps 2.5in)"]
[]
[]
[]
["PowerEdge T630","Category: Server",null,null,null,{"$f":"2340","v":2340}]
[null,"Quantity: ",null,null,null,{"$f":"SUM(F16:F160)","v":0}]
[null,null,null,null,null,{"$f":"SUM(F11:F12)","v":2340}]
[]
[null,"Base"]
[null,"PowerEdge T630 for Intel v4 CPUs",1,null,"[210-ACWJ][329-BCZH]"]
[]
[null,"Configurazione dello chassis"]
[null,"Chassis with up to 32, 2.5\" Hard Drives, Tower Configuration",1,null,"[321-BBKC]"]
[]
[null,"Processore"]
[null,"Intel Xeon E5-2640 v4 2.4GHz 25M Cache 8.0GT/s QPI Turbo HT 10C/20T (90W) Max Mem 2133MHz",1,null,"[338-BJDL]"]
[]
[null,"Processore aggiuntivo"]
[null,"No Additional Processor",{"$f":"VLOOKUP($B$25, CPU_C, 2, FALSE)","v":0},{"$f":"VLOOKUP($B$25, CPU_C, 3, FALSE)","v":""},{"$f":"VLOOKUP($B$25, CPU_C, 5, FALSE)","v":"[374-BBBX]"},{"$f":"VLOOKUP(B25, CPU_C, 12, FALSE)","v":""}]
[]
[null,"Processor Thermal Configuration"]
[null,"1 CPU up to 105W",1,null,"[412-AADW]"]
[null,{"$f":"VLOOKUP($B$25, CPU_C, 6, FALSE)","v":""},{"$f":"VLOOKUP($B$25, CPU_C, 7, FALSE)","v":""},null,{"$f":"VLOOKUP($B$25, CPU_C, 8, FALSE)","v":""}]
[]
[null,"Tipo di configurazione memoria"]
[null,"Performance Optimized",1,null,"[370-AAIP]"]
[]
[null,"Total Memory in GB",null,{"$f":"IF(('Server10 Lotto1 T630'!$D$8=0),\"\",'Server10 Lotto1 T630'!#REF!)","v":""}]
[null,32]
[]
[null,"Tipo e velocità della memoria DIMM"]
[null,"2400MT/s RDIMMs",1,null,"[370-ACPH]"]
[]
[null,"Capacità di memoria"]
[null,"16GB RDIMM, 2400MT/s, Dual Rank, x8 Data Width",{"$f":"IF($B$25=\"No Additional Processor\",VLOOKUP($B$35, MEM_C1, 9, FALSE),VLOOKUP($B$35, MEM_C2, 9, FALSE))","v":"2"},null,"[370-ACNX]"]
[]
[null,{"$f":"IF($B$25=\"No Additional Processor\",VLOOKUP($B$35, MEM_C1, 2, FALSE),VLOOKUP($B$35, MEM_C2, 2, FALSE))","v":""},{"$f":"IF($B$25=\"No Additional Processor\",VLOOKUP($B$35, MEM_C1, 3, FALSE),VLOOKUP($B$35, MEM_C2, 3, FALSE))","v":""},{"$f":"IF($B$25=\"No Additional Processor\",VLOOKUP($B$35, MEM_C1, 4, FALSE),VLOOKUP($B$35, MEM_C2, 4, FALSE))","v":""},{"$f":"IF($B$25=\"No Additional Processor\",VLOOKUP($B$35, MEM_C1, 6, FALSE),VLOOKUP($B$35, MEM_C2, 6, FALSE))","v":""},{"$f":"IF($B$25=\"No Additional Processor\",VLOOKUP($B$35, MEM_C1, 7, FALSE),VLOOKUP($B$35, MEM_C2, 7, FALSE))","v":""}]
[]
[null,{"$f":"IF($B$25=\"No Additional Processor\",VLOOKUP($B$35, MEM_C1, 11, FALSE),VLOOKUP($B$35, MEM_C2, 11, FALSE))","v":""},{"$f":"IF($B$25=\"No Additional Processor\",VLOOKUP($B$35, MEM_C1, 12, FALSE),VLOOKUP($B$35, MEM_C2, 12, FALSE))","v":""},{"$f":"IF($B$25=\"No Additional Processor\",VLOOKUP($B$35, MEM_C1, 13, FALSE),VLOOKUP($B$35, MEM_C2, 13, FALSE))","v":""},{"$f":"IF($B$25=\"No Additional Processor\",VLOOKUP($B$35, MEM_C1, 15, FALSE),VLOOKUP($B$35, MEM_C2, 15, FALSE))","v":""},{"$f":"IF($B$25=\"No Additional Processor\",VLOOKUP($B$35, MEM_C1, 16, FALSE),VLOOKUP($B$35, MEM_C2, 16, FALSE))","v":""}]
[]
[null,"Sistema operativo preinstallato"]
[null,"No Operating System",{"$f":"VLOOKUP($B$48, OS_C, 2, FALSE)","v":""},{"$f":"VLOOKUP($B$48, OS_C, 3, FALSE)","v":""},{"$f":"VLOOKUP($B$48, OS_C, 5, FALSE)","v":"[611-BBBF]"},{"$f":"VLOOKUP($B$48, OS_C, 6, FALSE)","v":""}]
[]
[null,"OS Media Kits"]
[null,"No Media Required",1,null,"[605-BBFN]"]
[]
[null,"Client Access Licenses"]
[null,{"$f":"VLOOKUP($B$48, OS_C, 7, FALSE)","v":"None"},null,{"$f":"VLOOKUP($B$48, OS_C, 9, FALSE)","v":""},{"$f":"VLOOKUP($B$48, OS_C, 11, FALSE)","v":""},{"$f":"VLOOKUP($B$48, OS_C, 12, FALSE)*C54","v":0}]
[]
[null,{"$f":"VLOOKUP($B$48, OS_C, 13, FALSE)","v":"None"},null,{"$f":"VLOOKUP($B$48, OS_C, 15, FALSE)","v":""},{"$f":"VLOOKUP($B$48, OS_C, 17, FALSE)","v":""},{"$f":"VLOOKUP($B$48, OS_C, 18, FALSE)*C56","v":0}]
[]
[null,"Controller RAID"]
[null,"PERC H330 RAID Controller",1,null,"[405-AADS]"]
[]
[null,"Dischi rigidi"]
[null,"300GB 10K RPM SAS 12Gbps 2.5in Hot-plug Hard Drive",2,null,"[400-AJPK]"]
[]
[null,"300GB 10K RPM SAS 12Gbps 2.5in Hot-plug Hard Drive,CusKit",0,{"$f":"VLOOKUP($B$64, HDD_C,3, FALSE)","v":"10L1-HDD300GB-T"},{"$f":"VLOOKUP($B$64, HDD_C,5, FALSE)","v":"[400-AJOQ]"},{"$f":"VLOOKUP($B$64, HDD_C,6, FALSE)*C64","v":0}]
[]
[null,"1TB 7.2K RPM NLSAS 6Gbps 2.5in Hot-plug Hard Drive,13G,CusKit",0,{"$f":"VLOOKUP($B$66, HDD_C,3, FALSE)","v":"10L1-HDD1TB"},{"$f":"VLOOKUP($B$66, HDD_C,5, FALSE)","v":"[400-AEFF]"},{"$f":"VLOOKUP($B$66, HDD_C,6, FALSE)*C66","v":0}]
[]
[null,"Configurazione RAID HDD 300GB"]
[null,"C3 - RAID 1 for H330 (2 HDDs)",1,null,{"$f":"VLOOKUP($B$69,  RAID_C1, 2, FALSE)","v":"[780-BBJK]"}]
[null,"Hot Spare for 300GB HDD","No"]
[]
[null,"Configurazione RAID HDD 1TB"]
[null,"",1,null,{"$f":"VLOOKUP($B$73,  RAID_C2, 2, FALSE)","v":""}]
[null,"Hot Spare for 1TB HDD","No"]
[]
[null,"Impostazioni del BIOS per la gestione dell'alimentazione"]
[null,"Performance BIOS Setting",1,null,"[384-BBBL]"]
[]
[null,"Raffreddamento"]
[null,"Fresh Air Cooling",1,null,"[384-BBDW]"]
[]
[null,"Alimentatore"]
[null,"Dual, Hot-plug, Redundant Power Supply (1+1), 750W, Titanium, 200-240VAC",1,null,"[450-ADWT]"]
[]
[null,"Cavi di alimentazione"]
[null,"Italian Spare Power Cord 220V",2,null,"[450-AAYN]"]
[]
[null,"TPM Module"]
[null,"PowerEdge Server FIPS TPM 2.0",1,null,"[461-AADM]"]
[]
[null,"Embedded Systems Management"]
[null,"iDrac8, Enterprise",1,null,"[385-BBHO]"]
[]
[null,"Adattatore di rete aggiuntivo"]
[null,"On-Board LOM 1GBE (Dual Port for Towers, Quad Port for Racks and Blades)",1,null,"[542-BBBP]"]
[]
[null,"Broadcom 5720 DP 1Gb Network Interface Card",1,null,"[540-BBCX]"]
[]
[null,"Additional Card for PCIe Slot 1 (CPU 1)"]
[null,"None",{"$f":"VLOOKUP($B$100,  PCI_C1, 2, FALSE)","v":""},{"$f":"VLOOKUP($B$100,  PCI_C1, 3, FALSE)","v":""},{"$f":"VLOOKUP($B$100,  PCI_C1, 5, FALSE)","v":""},{"$f":"VLOOKUP($B$100,  PCI_C1, 6, FALSE)","v":""}]
[]
[null,"Additional Card for PCIe Slot 2 (CPU 1)"]
[null,"None",{"$f":"VLOOKUP($B$103,  PCI_C2, 2, FALSE)","v":""},{"$f":"VLOOKUP($B$103,  PCI_C2, 3, FALSE)","v":""},{"$f":"VLOOKUP($B$103,  PCI_C2, 5, FALSE)","v":""},{"$f":"VLOOKUP($B$103,  PCI_C2, 6, FALSE)","v":""}]
[]
[null,"Additional Card for PCIe Slot 3 (CPU 2)"]
[null,"None",{"$f":"IF(B106=\"Aggiungere Secondo Processore\",\"\",(VLOOKUP(B106,PCI_C3, 2, FALSE)))","v":""},{"$f":"IF(B106=\"Aggiungere Secondo Processore\",\"\",(VLOOKUP(B106,  PCI_C3, 3, FALSE)))","v":""},{"$f":"VLOOKUP($B$106,  PCI_C3, 5, FALSE)","v":""},{"$f":"VLOOKUP($B$106,  PCI_C3, 6, FALSE)","v":""}]
[]
[null,"Additional Card for PCIe Slot 4 (CPU 2)"]
[null,"None",{"$f":"IF(B109=\"Aggiungere Secondo Processore\",\"\",(VLOOKUP(B109,PCI_C4, 2, FALSE)))","v":""},{"$f":"IF(B109=\"Aggiungere Secondo Processore\",\"\",(VLOOKUP(B109,  PCI_C4, 3, FALSE)))","v":""},{"$f":"VLOOKUP($B$109,  PCI_C4, 5, FALSE)","v":""},{"$f":"VLOOKUP($B$109,  PCI_C4, 6, FALSE)","v":""}]
[]
[null,"Additional Card for PCIe Slot 5 (CPU 2)"]
[null,"None",{"$f":"IF(B112=\"Aggiungere Secondo Processore\",\"\",(VLOOKUP(B112,PCI_C4, 2, FALSE)))","v":""},{"$f":"IF(B112=\"Aggiungere Secondo Processore\",\"\",(VLOOKUP(B112,  PCI_C4, 3, FALSE)))","v":""},{"$f":"VLOOKUP($B$112,  PCI_C5, 5, FALSE)","v":""},{"$f":"VLOOKUP($B$112,  PCI_C5, 6, FALSE)","v":""}]
[]
[null,"Additional Card for PCIe Slot 6 (CPU 2)"]
[null,"None",{"$f":"IF(B115=\"Aggiungere Secondo Processore\",\"\",(VLOOKUP(B115,PCI_C4, 2, FALSE)))","v":""},{"$f":"IF(B115=\"Aggiungere Secondo Processore\",\"\",(VLOOKUP(B115,  PCI_C4, 3, FALSE)))","v":""},{"$f":"VLOOKUP($B$115,  PCI_C6, 5, FALSE)","v":""},{"$f":"VLOOKUP($B$115,  PCI_C6, 6, FALSE)","v":""}]
[]
[null,"Pannello frontale"]
[null,"Bezel",1,null,"[325-BBHK]"]
[]
[null,"Guide per rack"]
[null,"No Rack Rails, No Cable Management Arm, No Casters",1,null,"[770-BBCR]"]
[]
[null,"Unità ottica interna"]
[null,"No Internal Optical Drive, 2.5in Chassis",1,null,"[429-AAIQ][429-AAOJ]"]
[]
[null,"Accessori per server"]
[null,"Redundant Fan Option",1,null,"[750-AAFF]"]
[]
[null,"PowerEdge SFP+, 10GbE SR/SX, Optical Tranceiver, LC Connector, for Intel and Broadcom,CusKit",{"$f":"(VLOOKUP(B103,PCI_C2,8,FALSE))+((VLOOKUP(B100,PCI_C1,8,FALSE)))+((VLOOKUP(B106,PCI_C3,8,FALSE)))+((VLOOKUP(B109,PCI_C4,8,FALSE)))+((VLOOKUP(B112,PCI_C5,8,FALSE)))+((VLOOKUP(B115,PCI_C6,8,FALSE)))","v":{"$error":"#VALUE!"}},null,"[407-BBQE]"]
[]
[null,"System Documentation"]
[null,"Electronic System Documentation and OpenManage DVD Kit, PowerEdge T630",1,null,"[343-BBDE]"]
[]
[null,"SHIPPING"]
[null,"PowerEdge T630 Shipping EMEA1 (English/French/German/Spanish/Russian/Hebrew)",1,null,"[340-AMBT]"]
[]
[null,"Order Information"]
[null,"Enterprise Order - EMEA",1,null,"[800-11671]"]
[]
[null,"Base warranty"]
[null,"3Yr Basic Warranty - Next Business Day - Minimum Warranty",1,null,"[709-12798][709-12799]"]
[]
[null,"Servizi di assitenza"]
[null,"Dell Channel Order - Service Info only",1,null,"[710-31085]"]
[]
[null,"Aggiornamenti della garanzia"]
[null,"None",{"$f":"VLOOKUP($B$147,  SO_C1, 2, FALSE)","v":""},{"$f":"VLOOKUP($B$147,  SO_C1, 3, FALSE)","v":""},{"$f":"VLOOKUP($B$147,  SO_C1, 5, FALSE)","v":""},{"$f":"VLOOKUP($B$147,  SO_C1, 6, FALSE)","v":""}]
[]
[null,"Protezione dei dati - Keep Your Hard Drive "]
[null,"None",{"$f":"VLOOKUP($B$150,  SO_C2, 2, FALSE)","v":""},{"$f":"VLOOKUP($B$150,  SO_C2, 3, FALSE)","v":""},{"$f":"VLOOKUP($B$150,  SO_C2,5, FALSE)","v":""},{"$f":"VLOOKUP($B$150,  SO_C2, 6, FALSE)","v":""}]
[]
[null,"Servizi di Installazione"]
[null,"No Installation Service Selected",1,null,"[683-11870]"]
[]
[null,"Channel only - Support Extension"]
[null,"Channel 39M Basic Warranty - Next Business Day",1,null,"[723-28783]"]
[]
[null,"Warranty Upgrades - Non-Std/Local POS"]
[null,"CSTM CONSIP - 39M Onsite Labor Support for CRU for Servers with Basic Warranty",1,null,"[681-24467]"]

{"sheet":"RACK, Accessori e Servizi","index":3,"n_rows":76,"n_cols":17,"rows_kept":76,"cut":false,"hidden":false,"merged":[[0,3,0,8],[14,4,14,7],[17,4,17,7],[20,4,20,7],[47,2,47,6],[13,2,13,7],[22,2,22,7],[16,2,16,7],[19,2,19,7],[23,4,23,7],[11,13,23,17],[4,2,4,7],[6,2,6,7],[8,2,8,7],[11,12,23,12],[2,12,9,12],[9,4,9,7],[67,2,67,7],[71,2,71,7],[75,2,75,7],[66,2,66,4],[65,12,76,12]]}
[null,null,null,"Indicare il numero delle Opzioni"]
[]
[null,null,null,null,null,null,null,null,null,null,null,null,"SERVIZI"]
[null,null,{"$f":"IF(SRV_A+SRV_B+SRV_C>=1,\"Servizi Specialistici\",\"\")","v":""}]
[null,null,{"$f":"IF(SRV_A+SRV_B+SRV_C>=1,\"Servizio Specialistico di System and Network Management per sistema opertivo Windows, erogato on site. (GG/Uomo)\",\"\")","v":""},null,null,null,null,null,null,null,{"$f":"IF(J5>=1,\"10L1-SO-WIN\",\"\")","v":""}]
[]
[null,null,{"$f":"IF(SRV_A+SRV_B+SRV_C>=1,\"Servizio Specialistico di System and Network Management per sistema opertivo Linux, erogato on site. (GG/Uomo)\",\"\")","v":""},null,null,null,null,null,null,null,{"$f":"IF(J7>=1,\"10L1-SO-LINUX\",\"\")","v":""}]
[]
[null,null,{"$f":"IF((SRV_A+SRV_AA+SRV_AAA+SRV_B+SRV_BB+SRV_BBB+SRV_C)>=5,\"Servizi specialistici sistemistici per aggiornare e prevenire malfunzionamenti. \n(Minimo 5 Server)\",\"\")","v":""},null,null,null,null,null,null,null,{"$f":"IF(J9>=1,\"10L1-SO-PREV\",\"\")","v":""}]
[]
[]
[null,null,null,null,null,null,null,null,null,null,null,null,"SERVER RACK","In questo foglio deve essere indicata la quantità delle opzioni Hardware  e dei Servizi da acquistare.\n\nDi seguito è possibile configurare fino a 10 tipologie di armadio Rack a seconda della tipologia e del numero di Server inseriti al suo interno."]
[null,null,{"$f":"IF(SRV_A+SRV_B>=1,\"Rack (OpzRack)\",\"\")","v":""}]
[null,null,{"$f":"IF(SRV_A+SRV_B>=1,\"Tecnosteel: armadio Rack 19'' 42U ''Tecno SuperServer''\",\"\")","v":""},null,null,null,null,null,null,null,{"$f":"IF(J14>=1,\"10L1-RACK\",\"\")","v":""}]
[]
[null,null,{"$f":"IF(SRV_A+SRV_B>=1,\"KVM (OpzGUIRack)\",\"\")","v":""}]
[null,null,{"$f":"IF(SRV_A+SRV_B>=1,\"Tecnosteel: OneView 1U Rackmount Console 17'' with Italian Keyboard\",\"\")","v":""},null,null,null,null,null,null,null,{"$f":"IF(J17>=1,\"10L1-GUI\",\"\")","v":""}]
[]
[null,null,{"$f":"IF(SRV_A+SRV_B>=1,\"KVM Option (OpzSWGUIRack)\",\"\")","v":""}]
[null,null,{"$f":"IF(SRV_A+SRV_B>=1,\"Tecnosteel: 8-port remote KVM switch with one remote user\",\"\")","v":""},null,null,null,null,null,null,null,{"$f":"IF(J20>=1,\"10L1-KVMIP\",\"\")","v":""}]
[]
[null,null,{"$f":"IF(SRV_A+SRV_B>=1,\"Uninterrupted Power Supply (OpzUPS 3000VA)\",\"\")","v":""}]
[null,null,{"$f":"IF(SRV_A+SRV_B>=1,\"Riello - UPS MSR3000EVO 3000VA 2U Rackmount (SNMP+USB+RS232)\",\"\")","v":""},null,null,null,null,null,null,null,{"$f":"IF(J23>=1,\"10L1-UPS\",\"\")","v":""}]
[]
[]
[null,null,null,"Totale-"]
[null,null,null,"RACK A","RACK B","RACK C","RACK D","RACK E","RACK F","RACK G","RACK H","RACK I","RACK J"]
[null,null,{"$f":"J14","v":0},{"$f":"IF(H48>0,IF(C28-H48=0,0,C28-H48),0)","v":0},{"$f":"IF(I48>0,IF(D28-I48=0,0,D28-I48),0)","v":0},0,0,0,0,0,0,0,0]
[]
[]
[null,null,null,"Server Modello 1",null,null,{"$f":"SRV_A","v":0}]
[null,null,null,"Server Modello 2",null,null,{"$f":"SRV_AA","v":0}]
[null,null,null,"Server Modello 3",null,null,{"$f":"SRV_AAA","v":0}]
[null,null,null,"Server Modello 4",null,null,{"$f":"SRV_B","v":0}]
[null,null,null,"Server Modello 5",null,null,{"$f":"SRV_BB","v":0}]
[null,null,null,"Server Modello 6",null,null,{"$f":"SRV_BBB","v":0}]
[]
[null,null,null,null,null,null,null,{"$f":"SUM(H4:H9)+H11+H80*2+H82*2","v":0},0,0,0,0,0,0,0,0,0]
[]
[]
[]
[]
[]
[]
[]
[null,null,"Rack ancora da configurare",null,null,{"$f":"J14-H48-I48-J48-K48-L48-M48-N48-O48-P48-Q48","v":0}]
[]
[null,null,"Indicare il numero di rack per questa configurazione"]
[]
[null,null,null,null,"Totali","da inserire",null,{"$f":"IF(C28>0,\"RACK A\",\"\")","v":""},{"$f":"IF(D28>0,\"RACK B\",\"\")","v":""},{"$f":"IF(E28>0,\"RACK C\",\"\")","v":""},{"$f":"IF(F28>0,\"RACK D\",\"\")","v":""},{"$f":"IF(G28>0,\"RACK E\",\"\")","v":""},{"$f":"IF(H28>0,\"RACK F\",\"\")","v":""},{"$f":"IF(I28>0,\"RACK G\",\"\")","v":""},{"$f":"IF(J28>0,\"RACK H\",\"\")","v":""},{"$f":"IF(K28>0,\"RACK I\",\"\")","v":""},{"$f":"IF(L28>0,\"RACK J\",\"\")","v":""}]
[]
[null,null,"Server Lotto1 R630 Conf.1",null,{"$f":"G31","v":0},{"$f":"(E52-(H52*$H$48)-(I52*$I$48)-(J52*$J$48)-(K52*$K$48)-(L52*$L$48)-(M52*$M$48)-(N52*$N$48)-(O52*$O$48)-(P52*$P$48)-(Q52*$Q$48))","v":0}]
[null,null,{"$f":"IF(G32>0,\"Server Lotto1 R630 Conf.2\",\"\")","v":""},null,{"$f":"G32","v":0},{"$f":"(E53-(H53*$H$48)-(I53*$I$48)-(J53*$J$48)-(K53*$K$48)-(L53*$L$48)-(M53*$M$48)-(N53*$N$48)-(O53*$O$48)-(P53*$P$48)-(Q53*$Q$48))","v":0}]
[null,null,{"$f":"IF(G33>0,\"Server Lotto1 R630 Conf.3\",\"\")","v":""},null,0,0]
[null,null,{"$f":"IF(G34>0,\"Server Lotto1 R730xd Conf.1\",\"\")","v":""},null,0,0]
[null,null,{"$f":"IF(G35>0,\"Server Lotto1 R730xd Conf.2\",\"\")","v":""},null,0,0]
[null,null,{"$f":"IF(G36>0,\"Server Lotto1 R730xd Conf.3\",\"\")","v":""},null,0,0]
[]
[null,null,{"$f":"IF(J17>0,\"OpzGUIRack Disponibili\",\" \")","v":" "},null,{"$f":"J17","v":0},{"$f":"J17-H59*H48-I59*I48-J59*J48-K59*K48-L59*L48-M59*M48-N59*N48-O59*O48-P59*P48-Q59*Q48","v":0}]
[]
[null,null,{"$f":"IF(J20>0,\"OpzSWGUIRack Disponibili\",\" \")","v":" "},null,{"$f":"J20","v":0},{"$f":"J20-H61*H48-I61*I48-J61*J48-K61*K48-L61*L48-M61*M48-N61*N48-O61*O48-P61*P48-Q61*Q48","v":0}]
[]
[null,null,{"$f":"IF(J23>0,\"OpzUPS 3000VA Disponibili\",\" \")","v":" "},null,{"$f":"J23","v":0},{"$f":"J23-H63*H48-I63*I48-J63*J48-K63*K48-L63*L48-M63*M48-N63*N48-O63*O48-P63*P48-Q63*Q48","v":0}]
[]
[]
[null,null,null,null,null,null,null,null,null,null,null,null,"SERVER TOWER"]
[null,null,{"$f":"IF(SRV_C>=1,\"Uninterrupted Power Supply (UPS)\",\"\")","v":""}]
[null,null,{"$f":"IF(SRV_C>=1,\"Riello - UPS MSR3000EVO 3000VA Tower (SNMP+USB+RS232)\",\"\")","v":""},null,null,null,null,null,null,null,{"$f":"IF(J68>=1,\"10L1-UPS-T\",\"\")","v":""}]
[]
[]
[null,null,{"$f":"IF(SRV_C>=1,\"Keyboard Video Mouse\",\"\")","v":""}]
[null,null,{"$f":"IF(SRV_C>=1,\"Dell: Kit Monitor 19'' + Mouse + Keyboard\",\"\")","v":""},null,null,null,null,null,null,null,{"$f":"IF(J72>=1,\"10L1-GUI-T\",\"\")","v":""}]
[]
[]
[null,null,{"$f":"IF(SRV_C>=1,\"RDX\",\"\")","v":""}]
[null,null,{"$f":"IF(SRV_C>=1,\"Unità di backup RDX (esterno) + 3 cartucce da 500GB\",\"\")","v":""},null,null,null,null,null,null,null,{"$f":"IF(J76>=1,\"10L1-RDX\",\"\")","v":""}]

{"sheet":"Riepilogo","index":4,"n_rows":247,"n_cols":42,"rows_kept":247,"cut":false,"hidden":false,"merged":[[124,15,126,19],[127,15,129,19],[169,1,171,5],[172,1,174,5],[169,8,171,12],[172,8,174,12],[169,15,171,19],[172,15,174,19],[136,2,136,5],[136,9,136,12],[136,16,136,19],[135,2,135,5],[135,9,135,12],[135,16,135,19],[137,2,137,5],[137,9,137,12],[137,16,137,19],[139,2,139,5],[139,9,139,12],[139,16,139,19],[153,2,153,5],[154,2,154,5],[151,9,151,12],[152,9,152,12],[11,1,11,20],[7,1,7,3],[7,4,7,8],[7,9,7,10],[7,11,7,14],[7,15,7,16],[7,17,7,20],[9,1,9,3],[9,4,9,8],[9,9,9,10],[9,11,9,14],[9,15,9,16],[9,17,9,20],[222,1,222,2],[222,3,222,5],[224,1,224,3],[215,1,215,3],[217,1,217,2],[217,3,217,5],[219,1,219,3],[205,2,205,5],[206,2,206,5],[207,2,207,5],[208,2,208,5],[209,2,209,5],[210,2,210,5],[211,2,211,5],[212,2,212,5],[213,2,213,5],[153,9,153,12],[154,9,154,12],[177,3,178,18],[180,6,180,7],[182,6,182,7],[163,17,163,19],[156,1,156,3],[156,8,156,10],[156,15,156,17],[165,1,165,3],[165,8,165,10],[165,15,165,17],[160,1,160,3],[158,1,158,2],[181,6,181,7],[47,17,47,18],[47,19,47,20],[61,19,61,20],[196,1,196,3],[198,2,198,5],[199,2,199,5],[200,2,200,5],[201,2,201,5],[202,2,202,5],[151,16,151,19],[152,16,152,19],[153,16,153,19],[154,16,154,19],[76,2,76,5],[76,6,76,8],[76,9,76,16],[57,2,57,5],[77,1,77,16],[77,17,77,20],[78,1,78,16],[78,17,78,20],[71,2,71,5],[71,6,71,8],[71,9,71,16],[12,19,12,20],[13,1,13,20],[14,2,14,5],[14,6,14,8],[14,9,14,16],[14,17,14,18],[76,17,76,18],[76,19,76,20],[42,2,42,5],[42,6,42,8],[42,9,42,16],[42,17,42,18],[42,19,42,20],[43,2,43,5],[43,6,43,8],[43,9,43,16],[43,17,43,18],[43,19,43,20],[60,2,60,5],[60,6,60,8],[60,9,60,16],[60,17,60,18],[60,19,60,20],[61,2,61,5],[35,19,35,20],[35,2,35,5],[35,6,35,8],[15,19,15,20],[16,17,16,18],[16,19,16,20],[93,2,93,5],[0,17,1,20],[0,1,0,5],[0,6,0,14],[1,1,1,5],[1,6,1,7],[1,8,5,16],[2,1,2,5],[2,6,2,7],[3,1,3,5],[3,6,3,7],[4,1,4,7],[5,1,5,5],[5,6,5,7],[12,2,12,5],[12,6,12,8],[12,9,12,16],[12,17,12,18],[32,19,32,20],[33,2,33,5],[33,6,33,8],[33,9,33,16],[33,17,33,18],[33,19,33,20],[14,19,14,20],[58,19,58,20],[31,1,31,20],[35,17,35,18],[53,2,53,5],[53,6,53,8],[53,9,53,16],[53,17,53,18],[53,19,53,20],[36,2,36,5],[36,9,36,16],[36,17,36,18],[36,19,36,20],[36,6,36,8],[57,6,57,8],[57,9,57,16],[57,17,57,18],[57,19,57,20],[35,9,35,16],[15,2,15,5],[15,6,15,8],[15,9,15,16],[15,17,15,18],[58,2,58,5],[58,6,58,8],[58,9,58,16],[58,17,58,18],[56,6,56,8],[56,9,56,16],[56,17,56,18],[45,6,45,8],[45,9,45,16],[45,17,45,18],[54,2,54,5],[17,2,17,5],[17,6,17,8],[32,2,32,5],[32,6,32,8],[32,9,32,16],[32,17,32,18],[46,2,46,5],[17,9,17,16],[71,17,71,18],[71,19,71,20],[72,2,72,5],[72,6,72,8],[72,9,72,16],[72,17,72,18],[72,19,72,20],[73,2,73,5],[73,6,73,8],[73,9,73,16],[73,17,73,18],[73,19,73,20],[75,2,75,5],[75,6,75,8],[75,9,75,16],[75,17,75,18],[75,19,75,20],[63,19,63,20],[65,2,65,5],[65,6,65,8],[65,9,65,16],[65,17,65,18],[65,19,65,20],[66,17,66,18],[63,2,63,5],[63,6,63,8],[63,9,63,16],[63,17,63,18],[66,2,66,5],[66,6,66,8],[66,9,66,16],[74,2,74,5],[74,6,74,8],[74,9,74,16],[74,17,74,18],[74,19,74,20],[79,1,79,16],[79,17,79,20],[102,9,102,12],[103,9,103,12],[83,3,84,18],[87,1,87,3],[87,8,87,10],[87,15,87,17],[89,2,89,5],[89,9,89,12],[89,16,89,19],[90,2,90,5],[90,9,90,12],[90,16,90,19],[91,2,91,5],[91,9,91,12],[91,16,91,19],[94,2,94,5],[94,9,94,12],[94,16,94,19],[95,2,95,5],[95,9,95,12],[95,16,95,19],[102,2,102,5],[235,18,235,19],[235,2,235,3],[235,4,235,5],[235,6,235,7],[235,8,235,9],[235,10,235,11],[235,12,235,13],[113,15,113,16],[113,17,113,19],[118,15,118,16],[118,17,118,19],[120,1,120,3],[132,1,132,3],[132,8,132,10],[132,15,132,17],[134,2,134,5],[134,9,134,12],[134,16,134,19],[228,1,230,5],[231,1,233,5],[203,2,203,5],[204,2,204,5],[151,2,151,5],[152,2,152,5],[138,2,138,5],[138,9,138,12],[138,16,138,19],[109,9,109,12],[109,16,109,19],[108,2,108,5],[109,2,109,5],[108,16,108,19],[101,9,101,12],[103,2,103,5],[107,2,107,5],[102,16,102,19],[103,16,103,19],[106,16,106,19],[107,16,107,19],[106,9,106,12],[107,9,107,12],[108,9,108,12],[106,2,106,5],[105,9,105,12],[124,1,126,5],[127,1,129,5],[124,8,126,12],[127,8,129,12],[19,17,19,18],[19,19,19,20],[56,2,56,5],[238,3,239,18],[241,2,241,7],[241,14,241,19],[111,8,111,10],[111,1,111,3],[111,15,111,17],[113,3,113,5],[118,3,118,5],[113,1,113,2],[118,1,118,2],[120,8,120,10],[115,15,115,17],[113,8,113,9],[113,10,113,12],[118,8,118,9],[118,10,118,12],[115,1,115,3],[115,8,115,10],[235,14,235,15],[120,15,120,17],[235,16,235,17],[54,6,54,8],[54,9,54,16],[54,17,54,18],[242,2,245,7],[242,14,245,19],[16,2,16,5],[16,6,16,8],[16,9,16,16],[51,2,51,5],[51,6,51,8],[51,9,51,16],[18,2,18,5],[18,6,18,8],[18,9,18,16],[18,17,18,18],[18,19,18,20],[19,2,19,5],[27,2,27,5],[27,6,27,8],[27,9,27,16],[27,17,27,18],[27,19,27,20],[19,6,19,8],[19,9,19,16],[52,17,52,18],[52,19,52,20],[45,2,45,5],[56,19,56,20],[26,6,26,8],[26,9,26,16],[26,17,26,18],[26,19,26,20],[26,2,26,5],[37,2,37,5],[37,6,37,8],[37,9,37,16],[37,17,37,18],[37,19,37,20],[38,2,38,5],[38,6,38,8],[38,9,38,16],[38,17,38,18],[38,19,38,20],[55,2,55,5],[55,6,55,8],[55,9,55,16],[55,17,55,18],[55,19,55,20],[47,2,47,5],[47,6,47,8],[47,9,47,16],[54,19,54,20],[39,2,39,5],[39,6,39,8],[39,9,39,16],[39,17,39,18],[39,19,39,20],[40,2,40,5],[40,6,40,8],[40,9,40,16],[40,17,40,18],[40,19,40,20],[44,2,44,5],[44,6,44,8],[44,9,44,16],[44,17,44,18],[44,19,44,20],[41,2,41,5],[41,6,41,8],[41,9,41,16],[41,17,41,18],[41,19,41,20],[67,6,67,8],[67,9,67,16],[67,17,67,18],[45,19,45,20],[51,17,51,18],[51,19,51,20],[50,17,50,18],[50,19,50,20],[52,2,52,5],[52,6,52,8],[52,9,52,16],[49,1,49,20],[50,2,50,5],[50,6,50,8],[50,9,50,16],[46,6,46,8],[46,9,46,16],[46,17,46,18],[46,19,46,20],[48,2,48,5],[48,6,48,8],[48,9,48,16],[48,17,48,18],[48,19,48,20],[68,17,68,18],[68,19,68,20],[70,19,70,20],[59,2,59,5],[59,6,59,8],[59,9,59,16],[59,17,59,18],[59,19,59,20],[64,2,64,5],[64,6,64,8],[64,9,64,16],[69,2,69,5],[69,6,69,8],[69,9,69,16],[69,17,69,18],[62,1,62,20],[64,17,64,18],[64,19,64,20],[61,6,61,8],[61,9,61,16],[61,17,61,18],[69,19,69,20],[66,19,66,20],[67,2,67,5],[17,17,17,18],[17,19,17,20],[93,9,93,12],[93,16,93,19],[20,2,20,5],[20,6,20,8],[20,9,20,16],[20,17,20,18],[20,19,20,20],[21,2,21,5],[21,6,21,8],[21,9,21,16],[21,17,21,18],[21,19,21,20],[22,2,22,5],[22,6,22,8],[22,9,22,16],[22,17,22,18],[22,19,22,20],[23,2,23,5],[23,6,23,8],[30,9,30,16],[30,17,30,18],[23,9,23,16],[23,17,23,18],[23,19,23,20],[24,2,24,5],[24,6,24,8],[24,9,24,16],[24,17,24,18],[24,19,24,20],[28,2,28,5],[28,6,28,8],[28,9,28,16],[28,17,28,18],[28,19,28,20],[140,2,140,5],[140,9,140,12],[140,16,140,19],[141,2,141,5],[141,9,141,12],[141,16,141,19],[142,2,142,5],[142,9,142,12],[142,16,142,19],[143,2,143,5],[143,9,143,12],[143,16,143,19],[144,2,144,5],[144,9,144,12],[144,16,144,19],[145,2,145,5],[145,9,145,12],[145,16,145,19],[148,9,148,12],[148,16,148,19],[149,9,149,12],[149,16,149,19],[150,2,150,5],[150,9,150,12],[150,16,150,19],[146,2,146,5],[147,2,147,5],[148,2,148,5],[149,2,149,5],[92,2,92,5],[25,2,25,5],[25,6,25,8],[25,9,25,16],[25,17,25,18],[25,19,25,20],[96,2,96,5],[97,2,97,5],[98,2,98,5],[29,19,29,20],[30,19,30,20],[34,19,34,20],[92,9,92,12],[96,9,96,12],[97,9,97,12],[98,9,98,12],[67,19,67,20],[70,2,70,5],[70,6,70,8],[70,9,70,16],[70,17,70,18],[68,2,68,5],[68,6,68,8],[68,9,68,16],[92,16,92,19],[96,16,96,19],[97,16,97,19],[98,16,98,19],[99,16,99,19],[100,16,100,19],[101,16,101,19],[104,16,104,19],[105,16,105,19],[29,2,29,5],[29,6,29,8],[29,9,29,16],[29,17,29,18],[30,2,30,5],[30,6,30,8],[34,2,34,5],[34,6,34,8],[34,9,34,16],[34,17,34,18],[99,9,99,12],[100,9,100,12],[104,9,104,12],[160,8,160,10],[160,15,160,17],[163,1,163,2],[163,3,163,5],[163,8,163,9],[163,10,163,12],[163,15,163,16],[99,2,99,5],[100,2,100,5],[101,2,101,5],[104,2,104,5],[105,2,105,5],[158,3,158,5],[158,8,158,9],[158,10,158,12],[158,15,158,16],[158,17,158,19],[146,9,146,12],[146,16,146,19],[147,9,147,12],[147,16,147,19],[189,1,189,2],[190,1,190,2],[188,13,188,14],[186,13,186,14],[185,6,185,7],[184,13,184,14],[185,13,185,14],[183,6,183,7],[182,13,182,14],[183,13,183,14],[191,1,191,2],[192,1,192,2],[190,13,190,14],[191,13,191,14],[192,13,192,14],[180,13,180,14],[184,6,184,7],[186,6,186,7],[187,6,187,7],[189,6,189,7],[190,6,190,7],[191,6,191,7],[192,6,192,7],[181,13,181,14],[189,13,189,14],[188,6,188,7],[187,13,187,14],[181,1,181,2],[182,1,182,2],[183,1,183,2],[184,1,184,2],[185,1,185,2],[186,1,186,2],[188,1,188,2]]}
[null,"Amministrazione ",null,null,null,null,null,null,null,null,null,null,null,null,null,null,null,"CONFIGURATORE ELETTRONICO CONVENZIONE CONSIP \nSERVER 10 LOTTO 1",null,null,null,1]
[null,"N° Identificativo Ordine ",null,null,null,null,null,null,{"$f":"IF(G4=R80,\"Configurazione OK\",U4)","v":"Configurazione OK"},null,null,null,null,null,null,null,null,null,null,null,null,1]
[null,"Data Ordine",null,null,null,null,null,null,null,null,null,null,null,null,null,null,null,null,null,null,null,1]
[null,"Tot Ordine Portale CONSIP IVA incl.",null,null,null,null,null,null,null,null,null,null,null,null,null,null,null,null,null,null,"Nel \"Tot Ordine Portale CONSIP\" deve essere inserito l'importo totale risultante dall'ordinativo del portale CONSIP.\nQualora l'importo inserito corrisponde al valore ricalcolato dal configuratore viene attivato il pulsante \"Salva in formato PDF\" che permette di generare il file pdf da allegare all'ordinativo.",1]
[null,"LE CELLE IN GIALLO DEVO ESSERE COMPILATE OBBLIGATORIAMENTE",null,null,null,null,null,null,null,null,null,null,null,null,null,null,null,null,null,null,null,1]
[null,"Quantità Server Ordinati",null,null,null,null,{"$f":"IF(B33=\"\",0,B33)+IF(B15=\"\",0,B15)+IF(B51=\"\",0,B51)","v":0},null,null,null,null,null,null,null,null,null,null,null,null,"ver. 4.2",null,1]
[null,null,null,null,null,null,null,null,null,null,null,null,null,null,null,null,null,null,null,null,null,1]
[null,"Referente per la Consegna",null,null,null,null,null,null,null,"Telefono",null,null,null,null,null,"email",null,null,null,null,null,1]
[null,null,null,null,null,null,null,null,null,null,null,null,null,null,null,null,null,null,null,null,null,1]
[null,"Referente per l'installazione",null,null,null,null,null,null,null,"Telefono",null,null,null,null,null,"email",null,null,null,null,null,1]
[null,null,null,null,null,null,null,null,null,null,null,null,null,null,null,null,null,null,null,null,null,1]
[null,"ATTENZIONE: I CODICI PRODOTTO DELL'ORDINE CONSIP DEVONO ESSERE SPECULARI A QUELLI GENERATI DAL CONFIGURATORE.",null,null,null,null,null,null,null,null,null,null,null,null,null,null,null,null,null,null,null,1]
[null,"Qtà Totale Ordinata","Oggetto di fornitura",null,null,null,"Codice Prodotto",null,null,"Descrizione Sintetica (si faccia riferimento alla guida alla convenzione per la descrizione estesa e per le regole di acquisto delle opzioni)",null,null,null,null,null,null,null,"Costo Unitario",null,"Costo Complessivo",null,1]
[null,"SERVER PRESTAZIONALE (DELL POWEREDGE R630 V4)",null,null,null,null,null,null,null,null,null,null,null,null,null,null,null,null,null,null,null,{"$f":"IF(B15>=\"\",0,1)","v":0},null,"Server1","Server2","Server3"]
[null,{"$f":"IF(AE15>=1,AE15,\"\")","v":""},{"$f":"IF(AE15>0,(VLOOKUP(G15,COD_A,2,FALSE)),\"\")","v":""},null,null,null,{"$f":"IF(AE15>=1,W15,\"\")","v":""},null,null,{"$f":"IF(AE15>0,(VLOOKUP(G15,COD_A,5,FALSE)),\"\")","v":""},null,null,null,null,null,null,null,{"$f":"IF(AE15>0,(VLOOKUP(G15,COD_A,3,FALSE)),\"\")","v":""},null,{"$f":"IF(B15=\"\",\"\",R15*B15)","v":""},null,{"$f":"IF(B15>=\"\",0,1)","v":0},"10L1-R630-U",{"$f":"SRV_A","v":0},{"$f":"SRV_AA","v":0},{"$f":"SRV_AAA","v":0},null,null,null,null,{"$f":"SUM(X15:AD15)","v":0}]
[null,{"$f":"IF(AE16>=1,AE16,\"\")","v":""},"",null,null,null,{"$f":"IF(AE16>=1,W16,\"\")","v":""},null,null,"",null,null,null,null,null,null,null,"",null,{"$f":"IF(B16=\"\",\"\",R16*B16)","v":""},null,{"$f":"IF(B16>=\"\",0,1)","v":0},"10L1-CPU-P-U",{"$f":"'Server10 Lotto1 R630'!$C$29","v":0},{"$f":"'Server10 Lotto1 R630 2'!$C$29","v":0},{"$f":"'Server10 Lotto1 R630 3'!$C$29","v":0},null,{"$f":"X16*$X$15","v":0},{"$f":"Y16*$Y$15","v":0},{"$f":"Z16*$Z$15","v":0},{"$f":"SUM(AB16:AD16)","v":0}]
[null,{"$f":"IF(AE17>=1,AE17,\"\")","v":""},"",null,null,null,{"$f":"IF(AE17>=1,W17,\"\")","v":""},null,null,"",null,null,null,null,null,null,null,"",null,{"$f":"IF(B17=\"\",\"\",R17*B17)","v":""},null,0,"10L1-16GB-U",{"$f":"IF(MEM_A=\"\",0,MEM_A)","v":0},{"$f":"IF(MEM_AA=\"\",0,MEM_AA)","v":0},{"$f":"IF(MEM_AAA=\"\",0,MEM_AAA)","v":0},null,{"$f":"X17*$X$15","v":0},{"$f":"Y17*$Y$15","v":0},{"$f":"Z17*$Z$15","v":0},{"$f":"SUM(AB17:AD17)","v":0}]
[null,"","",null,null,null,"",null,null,"",null,null,null,null,null,null,null,"",null,"",null,0,"10L1-32GB-U",{"$f":"IF(MEM_A32=\"\",0,MEM_A32)","v":0},{"$f":"IF(MEM_AA32=\"\",0,MEM_AA32)","v":0},{"$f":"IF(MEM_AAA32=\"\",0,MEM_AAA32)","v":0},null,{"$f":"X18*$X$15","v":0},{"$f":"Y18*$Y$15","v":0},{"$f":"Z18*$Z$15","v":0},{"$f":"SUM(AB18:AD18)","v":0}]
[null,"","",null,null,null,"",null,null,"",null,null,null,null,null,null,null,"",null,"",null,0,"10L1-LAN1GB-LP",{"$f":"COUNTIF($AI$19:$AI$20,W19)","v":0},{"$f":"COUNTIF($AJ$19:$AJ$20,W19)","v":0},{"$f":"COUNTIF($AK$19:$AK$20,W19)","v":0},null,{"$f":"X19*$X$15","v":0},{"$f":"Y19*$Y$15","v":0},{"$f":"Z19*$Z$15","v":0},{"$f":"SUM(AB19:AD19)","v":0},null,null,"slot1",{"$f":"'Server10 Lotto1 R630'!$D$102","v":""},{"$f":"'Server10 Lotto1 R630 2'!$D$102","v":""},{"$f":"'Server10 Lotto1 R630 3'!$D$102","v":""}]
[null,"","",null,null,null,"",null,null,"",null,null,null,null,null,null,null,"",null,"",null,0,"10L1-LAN1GB",{"$f":"COUNTIF($AI$19:$AI$20,W20)","v":0},{"$f":"COUNTIF($AJ$19:$AJ$20,W20)","v":0},{"$f":"COUNTIF($AK$19:$AK$20,W20)","v":0},null,{"$f":"X20*$X$15","v":0},{"$f":"Y20*$Y$15","v":0},{"$f":"Z20*$Z$15","v":0},{"$f":"SUM(AB20:AD20)","v":0},null,null,"slot2",{"$f":"'Server10 Lotto1 R630'!$D$105","v":""},{"$f":"'Server10 Lotto1 R630 2'!$D$105","v":""},{"$f":"'Server10 Lotto1 R630 3'!$D$105","v":""}]
[null,"","",null,null,null,"",null,null,"",null,null,null,null,null,null,null,"",null,"",null,0,"10L1-LAN10GB-LP",0,0,0,null,{"$f":"X21*$X$15","v":0},{"$f":"Y21*$Y$15","v":0},{"$f":"Z21*$Z$15","v":0},{"$f":"SUM(AB21:AD21)","v":0}]
[null,"","",null,null,null,"",null,null,"",null,null,null,null,null,null,null,"",null,"",null,0,"10L1-LAN10GB",0,0,0,null,0,0,0,0]
[null,"","",null,null,null,"",null,null,{"$f":"IF(AE23>0,(VLOOKUP(G23,COD_A,5,FALSE)),\"\")","v":""},null,null,null,null,null,null,null,"",null,"",null,0,"10L1-CNA10-LP",0,0,0,null,0,0,0,0]
[null,"","",null,null,null,"",null,null,"",null,null,null,null,null,null,null,"",null,"",null,0,"10L1-CNA10",0,0,0,null,{"$f":"X24*$X$15","v":0},0,0,0]
[null,"","",null,null,null,"",null,null,"",null,null,null,null,null,null,null,"",null,"",null,0,"10L1-FC-LP-U",0,0,0,null,0,0,0,0]
[null,{"$f":"IF(AE26>=1,AE26,\"\")","v":""},"",null,null,null,{"$f":"IF(AE26>=1,W26,\"\")","v":""},null,null,"",null,null,null,null,null,null,null,"",null,"",null,0,"10L1-FC-U",0,0,0,null,0,0,0,0]
[null,"","",null,null,null,"",null,null,"",null,null,null,null,null,null,null,"",null,"",null,0,"10L1-HDD300GB",{"$f":"HD300_A","v":0},{"$f":"HD300_AA","v":0},{"$f":"HD300_AAA","v":0},null,{"$f":"X27*$X$15","v":0},{"$f":"Y27*$Y$15","v":0},{"$f":"Z27*$Z$15","v":0},{"$f":"SUM(AB27:AD27)","v":0}]
[null,"","",null,null,null,"",null,null,"",null,null,null,null,null,null,null,"",null,"",null,0,"10L1-HDD1TB",{"$f":"HD1000_A","v":0},{"$f":"HD1000_AA","v":0},{"$f":"HD1000_AAA","v":0},null,{"$f":"X28*$X$15","v":0},{"$f":"Y28*$Y$15","v":0},{"$f":"Z28*$Z$15","v":0},{"$f":"SUM(AB28:AD28)","v":0}]
[null,"","",null,null,null,"",null,null,"",null,null,null,null,null,null,null,"",null,"",null,0,"10L1-SO-12M-P",{"$f":"IF('Server10 Lotto1 R630'!$D$135=W29,'Server10 Lotto1 R630'!$C$135,0)","v":0},{"$f":"IF('Server10 Lotto1 R630 2'!$D$135=W29,'Server10 Lotto1 R630 2'!$C$135,0)","v":0},{"$f":"IF('Server10 Lotto1 R630 3'!$D$135=W29,'Server10 Lotto1 R630 3'!$C$135,0)","v":0},null,{"$f":"X29*$X$15","v":0},{"$f":"Y29*$Y$15","v":0},{"$f":"Z29*$Z$15","v":0},{"$f":"SUM(AB29:AD29)","v":0}]
[null,"","",null,null,null,"",null,null,"",null,null,null,null,null,null,null,"",null,"",null,0,"10L1-SO-24M-P",{"$f":"IF('Server10 Lotto1 R630'!$D$135=W30,'Server10 Lotto1 R630'!$C$135,0)","v":0},{"$f":"IF('Server10 Lotto1 R630 2'!$D$135=W30,'Server10 Lotto1 R630 2'!$C$135,0)","v":0},{"$f":"IF('Server10 Lotto1 R630 3'!$D$135=W30,'Server10 Lotto1 R630 3'!$C$135,0)","v":0},null,{"$f":"X30*$X$15","v":0},{"$f":"Y30*$Y$15","v":0},{"$f":"Z30*$Z$15","v":0},{"$f":"SUM(AB30:AD30)","v":0}]
[null,"","",null,null,null,"",null,null,"",null,null,null,null,null,null,null,"",null,"",null,0,"10L1-SO-HDD",{"$f":"IF('Server10 Lotto1 R630'!$D$138=W31,'Server10 Lotto1 R630'!$C$138,0)","v":0},{"$f":"IF('Server10 Lotto1 R630 2'!$D$138=W31,'Server10 Lotto1 R630 2'!$C$138,0)","v":0},{"$f":"IF('Server10 Lotto1 R630 3'!$D$138=W31,'Server10 Lotto1 R630 3'!$C$138,0)","v":0},null,{"$f":"X31*$X$15","v":0},{"$f":"Y31*$Y$15","v":0},{"$f":"Z31*$Z$15","v":0},{"$f":"SUM(AB31:AD31)","v":0},null,{"$f":"IF(X31=0,0,IF(X31+X30=2,5,IF(X31+X29=2,4,3)))","v":0},{"$f":"IF(Y31=0,0,IF(Y31+Y30=2,5,IF(Y31+Y29=2,4,3)))","v":0},{"$f":"IF(Z31=0,0,IF(Z31+Z30=2,5,IF(Z31+Z29=2,4,3)))","v":0},{"$f":"IF(AG31=5,$AJ$62,IF(AG31=4,$AI$62,IF(AG31=3,$AH$62,\"\")))","v":""},{"$f":"IF(AH31=5,$AJ$62,IF(AH31=4,$AI$62,IF(AH31=3,$AH$62,\"\")))","v":""},{"$f":"IF(AI31=5,$AJ$62,IF(AI31=4,$AI$62,IF(AI31=3,$AH$62,\"\")))","v":""}]
[null,"SERVER SCALBILE STORAGE (DELL POWEREDGE R730xd V4)",null,null,null,null,null,null,null,null,null,null,null,null,null,null,null,null,null,null,null,{"$f":"IF(B33>=\"\",0,1)","v":0},"R730","Server1","Server2","Server3"]
[null,{"$f":"IF(AE33>=1,AE33,\"\")","v":""},{"$f":"IF(AE33>0,(VLOOKUP(G33,COD_B,2,FALSE)),\"\")","v":""},null,null,null,{"$f":"IF(AE33>=1,W33,\"\")","v":""},null,null,{"$f":"IF(AE33>0,(VLOOKUP(G33,COD_B,5,FALSE)),\"\")","v":""},null,null,null,null,null,null,null,{"$f":"IF(AE33>0,(VLOOKUP(G33,COD_B,3,FALSE)),\"\")","v":""},null,{"$f":"IF(B33=\"\",\"\",R33*B33)","v":""},null,0,"10L1-R730xd-U",{"$f":"SRV_B","v":0},{"$f":"SRV_BB","v":0},{"$f":"SRV_BBB","v":0},null,null,null,null,{"$f":"SUM(X33:AD33)","v":0}]
[null,{"$f":"IF(AE34>=1,AE34,\"\")","v":""},"",null,null,null,{"$f":"IF(AE34>=1,W34,\"\")","v":""},null,null,"",null,null,null,null,null,null,null,"",null,"",null,0,"10L1-CPU-S-U",{"$f":"'Server10 Lotto1 R730xd'!$C$29","v":0},{"$f":"'Server10 Lotto1 R730xd 2'!$C$29","v":0},{"$f":"'Server10 Lotto1 R730xd 3'!$C$29","v":0},null,{"$f":"X34*$X$33","v":0},{"$f":"Y34*$Y$33","v":0},{"$f":"Z34*$Z$33","v":0},{"$f":"SUM(AB34:AD34)","v":0}]
[null,"","",null,null,null,"",null,null,"",null,null,null,null,null,null,null,"",null,{"$f":"IF(B35=\"\",\"\",R35*B35)","v":""},null,0,"10L1-16GB-U",{"$f":"IF(MEM_B=\"\",0,MEM_B)","v":0},{"$f":"IF(MEM_BB=\"\",0,MEM_BB)","v":0},{"$f":"IF(MEM_BBB=\"\",0,MEM_BBB)","v":0},null,{"$f":"X35*$X$33","v":0},{"$f":"Y35*$Y$33","v":0},{"$f":"Z35*$Z$33","v":0},{"$f":"SUM(AB35:AD35)","v":0}]
[null,"","",null,null,null,"",null,null,"",null,null,null,null,null,null,null,"",null,"",null,0,"10L1-32GB-U",{"$f":"IF(MEM_B32=\"\",0,MEM_B32)","v":0},{"$f":"IF(MEM_BB32=\"\",0,MEM_BB32)","v":0},{"$f":"IF(MEM_BBB32=\"\",0,MEM_BBB32)","v":0},null,0,0,0,{"$f":"SUM(AB36:AD36)","v":0}]
[null,"","",null,null,null,"",null,null,"",null,null,null,null,null,null,null,"",null,"",null,0,"10L1-LAN1GB-LP",{"$f":"COUNTIF($AI$37:$AI$42,W37)","v":0},{"$f":"COUNTIF($AJ$37:$AJ$42,W37)","v":0},{"$f":"COUNTIF($AK$37:$AK$42,W37)","v":0},null,{"$f":"X37*$X$33","v":0},{"$f":"Y37*$Y$33","v":0},{"$f":"Z37*$Z$33","v":0},{"$f":"SUM(AB37:AD37)","v":0},null,null,"slot1",{"$f":"'Server10 Lotto1 R730xd'!$D$102","v":""},{"$f":"'Server10 Lotto1 R730xd 2'!$D$102","v":""},{"$f":"'Server10 Lotto1 R730xd 3'!$D$102","v":""}]
[null,"","",null,null,null,"",null,null,"",null,null,null,null,null,null,null,"",null,"",null,0,"10L1-LAN1GB",{"$f":"COUNTIF($AI$37:$AI$42,W38)","v":0},{"$f":"COUNTIF($AJ$37:$AJ$42,W38)","v":0},{"$f":"COUNTIF($AK$37:$AK$42,W38)","v":0},null,{"$f":"X38*$X$33","v":0},{"$f":"Y38*$Y$33","v":0},{"$f":"Z38*$Z$33","v":0},{"$f":"SUM(AB38:AD38)","v":0},null,null,"slot2",{"$f":"'Server10 Lotto1 R730xd'!$D$105","v":""},{"$f":"'Server10 Lotto1 R730xd 2'!$D$105","v":""},{"$f":"'Server10 Lotto1 R730xd 3'!$D$105","v":""}]
[null,"","",null,null,null,"",null,null,"",null,null,null,null,null,null,null,"",null,"",null,0,"10L1-LAN10GB-LP",0,0,0,null,0,0,0,0,null,null,"slot3",{"$f":"'Server10 Lotto1 R730xd'!D108","v":""},{"$f":"'Server10 Lotto1 R730xd 2'!D108","v":""},{"$f":"'Server10 Lotto1 R730xd 3'!D108","v":""}]
[null,"","",null,null,null,"",null,null,"",null,null,null,null,null,null,null,"",null,"",null,0,"10L1-LAN10GB",0,0,0,null,0,0,0,0,null,null,"slot4",{"$f":"'Server10 Lotto1 R730xd'!D111","v":""},{"$f":"'Server10 Lotto1 R730xd 2'!D111","v":""},{"$f":"'Server10 Lotto1 R730xd 3'!D111","v":""}]
[null,"","",null,null,null,"",null,null,"",null,null,null,null,null,null,null,"",null,"",null,0,"10L1-CNA10-LP",0,0,0,null,0,0,0,0,null,null,"slot5",{"$f":"'Server10 Lotto1 R730xd'!D114","v":""},{"$f":"'Server10 Lotto1 R730xd 2'!D114","v":""},{"$f":"'Server10 Lotto1 R730xd 3'!D114","v":""}]
[null,"","",null,null,null,"",null,null,"",null,null,null,null,null,null,null,"",null,"",null,0,"10L1-CNA10",0,0,0,null,0,0,0,0,null,null,"slot6",{"$f":"'Server10 Lotto1 R730xd'!D117","v":""},{"$f":"'Server10 Lotto1 R730xd 2'!D117","v":""},{"$f":"'Server10 Lotto1 R730xd 3'!D117","v":""}]
[null,"","",null,null,null,"",null,null,"",null,null,null,null,null,null,null,"",null,{"$f":"IF(B43=\"\",\"\",R43*B43)","v":""},null,0,"10L1-FC-LP-U",0,0,0,null,0,0,0,0]
[null,"","",null,null,null,"",null,null,"",null,null,null,null,null,null,null,"",null,"",null,0,"10L1-FC-U",0,0,0,null,0,0,0,0]
[null,"","",null,null,null,"",null,null,"",null,null,null,null,null,null,null,"",null,{"$f":"IF(B45=\"\",\"\",R45*B45)","v":""},null,0,"10L1-HDD300GB",{"$f":"HD300_B","v":0},{"$f":"HD300_BB","v":0},{"$f":"HD300_BBB","v":0},null,{"$f":"X45*$X$33","v":0},{"$f":"Y45*$Y$33","v":0},{"$f":"Z45*$Z$33","v":0},{"$f":"SUM(AB45:AD45)","v":0}]
[null,"","",null,null,null,"",null,null,"",null,null,null,null,null,null,null,"",null,"",null,0,"10L1-HDD1TB",{"$f":"HD1000_B","v":0},{"$f":"HD1000_BB","v":0},{"$f":"HD1000_BBB","v":0},null,{"$f":"X46*$X$33","v":0},{"$f":"Y46*$Y$33","v":0},{"$f":"Z46*$Z$33","v":0},{"$f":"SUM(AB46:AD46)","v":0}]
[null,"","",null,null,null,"",null,null,"",null,null,null,null,null,null,null,"",null,{"$f":"IF(B47=\"\",\"\",R47*B47)","v":""},null,0,"10L1-SO-12M-S",{"$f":"IF('Server10 Lotto1 R730xd'!$D$144=W47,'Server10 Lotto1 R730xd'!$C$144,0)","v":0},{"$f":"IF('Server10 Lotto1 R730xd 2'!$D$144=W47,'Server10 Lotto1 R730xd 2'!$C$144,0)","v":0},{"$f":"IF('Server10 Lotto1 R730xd 3'!$D$144=W47,'Server10 Lotto1 R730xd 3'!$C$144,0)","v":0},null,{"$f":"X47*$X$33","v":0},{"$f":"Y47*$Y$33","v":0},{"$f":"Z47*$Z$33","v":0},{"$f":"SUM(AB47:AD47)","v":0}]
[null,"","",null,null,null,"",null,null,"",null,null,null,null,null,null,null,"",null,"",null,0,"10L1-SO-24M-S",{"$f":"IF('Server10 Lotto1 R730xd'!$D$144=W48,'Server10 Lotto1 R730xd'!$C$144,0)","v":0},{"$f":"IF('Server10 Lotto1 R730xd 2'!$D$144=W48,'Server10 Lotto1 R730xd 2'!$C$144,0)","v":0},{"$f":"IF('Server10 Lotto1 R730xd 3'!$D$144=W48,'Server10 Lotto1 R730xd 3'!$C$144,0)","v":0},null,0,0,0,0,null,"R730 1 HDDr"]
[null,"","",null,null,null,"",null,null,"",null,null,null,null,null,null,null,"",null,"",null,0,"10L1-SO-HDD",{"$f":"IF('Server10 Lotto1 R730xd'!$D$147=W49,'Server10 Lotto1 R730xd'!$C$147,0)","v":0},{"$f":"IF('Server10 Lotto1 R730xd 2'!$D$147=W49,'Server10 Lotto1 R730xd 2'!$C$147,0)","v":0},{"$f":"IF('Server10 Lotto1 R730xd 3'!$D$147=W49,'Server10 Lotto1 R730xd 3'!$C$147,0)","v":0},null,0,0,0,0,null,{"$f":"IF(X49=0,0,IF(X49+X48=2,5,IF(X49+X47=2,4,3)))","v":0},{"$f":"IF(Y49=0,0,IF(Y49+Y48=2,5,IF(Y49+Y47=2,4,3)))","v":0},0,{"$f":"IF(AG49=5,$AJ$62,IF(AG49=4,$AI$62,IF(AG49=3,$AH$62,\"\")))","v":""},{"$f":"IF(AH49=5,$AJ$62,IF(AH49=4,$AI$62,IF(AH49=3,$AH$62,\"\")))","v":""},{"$f":"IF(AI49=5,$AJ$62,IF(AI49=4,$AI$62,IF(AI49=3,$AH$62,\"\")))","v":""}]
[null,"SERVER TOWER (DELL POWEREDGE T630 V4)",null,null,null,null,null,null,null,null,null,null,null,null,null,null,null,null,null,null,null,{"$f":"IF(B51>=\"\",0,1)","v":0}]
[null,{"$f":"IF(AE51>=1,AE51,\"\")","v":""},{"$f":"IF(AE51>0,(VLOOKUP(G51,COD_C,2,FALSE)),\"\")","v":""},null,null,null,{"$f":"IF(AE51>=1,W51,\"\")","v":""},null,null,{"$f":"IF(AE51>0,(VLOOKUP(G51,COD_C,5,FALSE)),\"\")","v":""},null,null,null,null,null,null,null,{"$f":"IF(AE51>0,(VLOOKUP(G51,COD_C,3,FALSE)),\"\")","v":""},null,{"$f":"IF(B51=\"\",\"\",R51*B51)","v":""},null,0,"10L1-T630-U",{"$f":"SRV_C","v":0},null,null,null,null,null,null,{"$f":"SUM(X51:AD51)","v":0}]
[null,{"$f":"IF(AE52>=1,AE52,\"\")","v":""},"",null,null,null,{"$f":"IF(AE52>=1,W52,\"\")","v":""},null,null,"",null,null,null,null,null,null,null,"",null,{"$f":"IF(B52=\"\",\"\",R52*B52)","v":""},null,0,"10L1-CPU-T-U",{"$f":"'Server10 Lotto1 T630'!$C$25","v":0},null,null,null,{"$f":"X52*$X$51","v":0},null,null,{"$f":"SUM(AB52:AD52)","v":0}]
[null,"","",null,null,null,"",null,null,"",null,null,null,null,null,null,null,"",null,{"$f":"IF(B53=\"\",\"\",R53*B53)","v":""},null,0,"10L1-16GB-U",{"$f":"IF(MEM_C=\"\",0,MEM_C)","v":0},null,null,null,{"$f":"X53*$X$51","v":0},null,null,{"$f":"SUM(AB53:AD53)","v":0}]
[null,"","",null,null,null,"",null,null,"",null,null,null,null,null,null,null,"",null,"",null,0,"10L1-32GB-U",{"$f":"IF(MEM_C32=\"\",0,MEM_C32)","v":0},null,null,null,0,null,null,0]
[null,"","",null,null,null,"",null,null,"",null,null,null,null,null,null,null,"",null,"",null,0,"10L1-LAN1GB",{"$f":"COUNTIF($AI$55:$AI$60,W55)","v":0},null,null,null,{"$f":"X55*$X$51","v":0},null,null,0,null,null,"slot1",{"$f":"'Server10 Lotto1 T630'!$D$100","v":""}]
[null,"","",null,null,null,"",null,null,"",null,null,null,null,null,null,null,"",null,"",null,0,"10L1-LAN10GB",{"$f":"COUNTIF($AI$55:$AI$60,W56)","v":0},null,null,null,{"$f":"X56*$X$51","v":0},null,null,0,null,null,"slot2",{"$f":"'Server10 Lotto1 T630'!$D$103","v":""}]
[null,"","",null,null,null,"",null,null,"",null,null,null,null,null,null,null,"",null,"",null,0,"10L1-FC-U",0,null,null,null,0,null,null,0,null,null,"slot3",{"$f":"'Server10 Lotto1 T630'!$D$106","v":""}]
[null,"","",null,null,null,"",null,null,"",null,null,null,null,null,null,null,"",null,"",null,0,"10L1-HDD300GB-T",{"$f":"HD300_C","v":0},null,null,null,0,null,null,0,null,null,"slot4",{"$f":"'Server10 Lotto1 T630'!$D$109","v":""}]
[null,"","",null,null,null,"",null,null,"",null,null,null,null,null,null,null,"",null,"",null,0,"10L1-HDD1TB",{"$f":"HD1000_c","v":0},null,null,null,0,null,null,0,null,null,"slot5",{"$f":"'Server10 Lotto1 T630'!$D$112","v":""}]
[null,"","",null,null,null,"",null,null,"",null,null,null,null,null,null,null,"",null,"",null,0,"10L1-SO-12M-T",{"$f":"IF('Server10 Lotto1 T630'!$D$147=W60,'Server10 Lotto1 T630'!$C$147,0)","v":0},null,null,null,0,null,null,0,null,null,"slot6",{"$f":"'Server10 Lotto1 T630'!$D$115","v":""}]
[null,"","",null,null,null,"",null,null,"",null,null,null,null,null,null,null,"",null,"",null,0,"10L1-SO-24M-T",{"$f":"IF('Server10 Lotto1 T630'!$D$147=W61,'Server10 Lotto1 T630'!$C$147,0)","v":0},null,null,null,0,null,null,0]
[null,"","",null,null,null,"",null,null,"",null,null,null,null,null,null,null,"",null,"",null,0,"10L1-SO-HDD",{"$f":"IF('Server10 Lotto1 T630'!$D$150=W62,'Server10 Lotto1 T630'!$C$150,0)","v":0},{"$f":"IF(X62=0,0,IF(X61+X62=2,5,IF(X62+X60=2,4,3)))","v":0},null,null,0,null,null,0,{"$f":"IF(Y62=5,$AJ$62,IF(Y62=4,$AI$62,IF(Y62=3,$AH$62,\"\")))","v":""},null,"10L1-SO-HDD3","10L1-SO-HDD4","10L1-SO-HDD5"]
[null,"OPZIONI COMUNI",null,null,null,null,null,null,null,null,null,null,null,null,null,null,null,null,null,null,null,1,null,"R630","R630 1","R630 2","R730xd","R730xd 1","R730xd 2","T630",null,null,null,null,null,null,null,null,"R630","R730xd","T630"]
[null,{"$f":"IF(AP64=0,\"\",AP64)","v":""},{"$f":"IF(AP64=\"\",\"\",(VLOOKUP(G64,COD_A,2,FALSE)))","v":""},null,null,null,{"$f":"IF(AP64>0,\"10L1-WIN\",\"\")","v":""},null,null,{"$f":"IF(AP64>0,(VLOOKUP(G64,COD_A,5,FALSE)),\"\")","v":""},null,null,null,null,null,null,null,{"$f":"IF(AP64>0,(VLOOKUP(G64,COD_A,3,FALSE)),\"\")","v":""},null,{"$f":"IF(B64=\"\",\"\",R64*B64)","v":""},null,0,"10L1-WIN",{"$f":"IF('Server10 Lotto1 R630'!$D$52=W64,1,0)","v":0},{"$f":"IF('Server10 Lotto1 R630 2'!$D$52=W64,1,0)","v":0},{"$f":"IF('Server10 Lotto1 R630 3'!$D$52=W64,1,0)","v":0},{"$f":"IF('Server10 Lotto1 R730xd'!$D$52=W64,1,0)","v":0},{"$f":"IF('Server10 Lotto1 R730xd 2'!$D$52=W64,1,0)","v":0},{"$f":"IF('Server10 Lotto1 R730xd 3'!$D$52=W64,1,0)","v":0},{"$f":"IF('Server10 Lotto1 T630'!$D$48=W64,1,0)","v":0},null,{"$f":"X64*$X$15","v":0},{"$f":"Y64*$Y$15","v":0},{"$f":"Z64*$Z$15","v":0},{"$f":"AA64*$X$33","v":0},{"$f":"AB64*$Y$33","v":0},{"$f":"AC64*$Z$33","v":0},{"$f":"AD64*$X$51","v":0},{"$f":"SUM(X64:Z64)","v":0},{"$f":"SUM(AA64:AC64)","v":0},{"$f":"AD64","v":0},{"$f":"SUM(AF64:AL64)","v":0}]
[null,{"$f":"IF(AP65=0,\"\",AP65)","v":""},{"$f":"IF(AP65=\"\",\"\",(VLOOKUP(G65,COD_A,2,FALSE)))","v":""},null,null,null,{"$f":"IF(AP65>0,\"10L1-LINUX\",\"\")","v":""},null,null,{"$f":"IF(AP65>0,(VLOOKUP(G65,COD_A,5,FALSE)),\"\")","v":""},null,null,null,null,null,null,null,{"$f":"IF(AP65>0,(VLOOKUP(G65,COD_A,3,FALSE)),\"\")","v":""},null,{"$f":"IF(B65=\"\",\"\",R65*B65)","v":""},null,0,"10L1-LINUX",{"$f":"IF('Server10 Lotto1 R630'!$D$52=W65,1,0)","v":0},{"$f":"IF('Server10 Lotto1 R630 2'!$D$52=W65,1,0)","v":0},{"$f":"IF('Server10 Lotto1 R630 3'!$D$52=\"10L1-LINUX\",1,0)","v":0},{"$f":"IF('Server10 Lotto1 R730xd'!$D$52=W65,1,0)","v":0},{"$f":"IF('Server10 Lotto1 R730xd 2'!$D$52=W65,1,0)","v":0},{"$f":"IF('Server10 Lotto1 R730xd 3'!$D$52=W65,1,0)","v":0},{"$f":"IF('Server10 Lotto1 T630'!$D$48=W65,1,0)","v":0},null,{"$f":"X65*$X$15","v":0},{"$f":"Y65*$Y$15","v":0},{"$f":"Z65*$Z$15","v":0},{"$f":"AA65*$X$33","v":0},{"$f":"AB65*$Y$33","v":0},{"$f":"AC65*$Z$33","v":0},{"$f":"AD65*$X$51","v":0},{"$f":"SUM(X65:Z65)","v":0},{"$f":"SUM(AA65:AC65)","v":0},{"$f":"AD65","v":0},{"$f":"SUM(AF65:AL65)","v":0}]
[null,{"$f":"IF(AP66=0,\"\",AP66)","v":""},{"$f":"IF(AP66=\"\",\"\",(VLOOKUP(G66,COD_A,2,FALSE)))","v":""},null,null,null,{"$f":"IF(AP66>0,\"10L1-CALUSER\",\"\")","v":""},null,null,{"$f":"IF(AP66>0,(VLOOKUP(G66,COD_A,5,FALSE)),\"\")","v":""},null,null,null,null,null,null,null,{"$f":"IF(AP66>0,(VLOOKUP(G66,COD_A,3,FALSE)),\"\")","v":""},null,"",null,0,"10L1-CALUSER",{"$f":"'Server10 Lotto1 R630'!$C$58","v":0},{"$f":"'Server10 Lotto1 R630 2'!$C$58","v":0},{"$f":"'Server10 Lotto1 R630 3'!$C$58","v":0},{"$f":"'Server10 Lotto1 R730xd'!$C$58","v":0},{"$f":"'Server10 Lotto1 R730xd 2'!$C$58","v":0},{"$f":"'Server10 Lotto1 R730xd 3'!$C$58","v":0},{"$f":"'Server10 Lotto1 T630'!$C$54","v":0},null,{"$f":"X66*$X$15","v":0},{"$f":"Y66*$Y$15","v":0},{"$f":"Z66*$Z$15","v":0},0,0,0,{"$f":"AD66*$X$51","v":0},0,0,0,0]
[null,{"$f":"IF(AP67=0,\"\",AP67)","v":""},{"$f":"IF(AP67=\"\",\"\",(VLOOKUP(G67,COD_A,2,FALSE)))","v":""},null,null,null,{"$f":"IF(AP67>0,\"10L1-CALDEV\",\"\")","v":""},null,null,{"$f":"IF(AP67>0,(VLOOKUP(G67,COD_A,5,FALSE)),\"\")","v":""},null,null,null,null,null,null,null,{"$f":"IF(AP67>0,(VLOOKUP(G67,COD_A,3,FALSE)),\"\")","v":""},null,"",null,0,"10L1-CALDEV",{"$f":"'Server10 Lotto1 R630'!$C$60","v":0},{"$f":"'Server10 Lotto1 R630 2'!$C$60","v":0},{"$f":"'Server10 Lotto1 R630 3'!$C$60","v":0},{"$f":"'Server10 Lotto1 R730xd'!$C$60","v":0},{"$f":"'Server10 Lotto1 R730xd 2'!$C$60","v":0},{"$f":"'Server10 Lotto1 R730xd 3'!$C$60","v":0},{"$f":"'Server10 Lotto1 T630'!$C$56","v":0},null,{"$f":"X67*$X$15","v":0},{"$f":"Y67*$Y$15","v":0},{"$f":"Z67*$Z$15","v":0},0,0,0,{"$f":"AD67*$X$51","v":0},0,0,0,0]
[null,{"$f":"IF('RACK, Accessori e Servizi'!J14=0,\"\",'RACK, Accessori e Servizi'!J14)","v":""},{"$f":"IF(B68>0,(VLOOKUP(G68,COD_A,2,FALSE)),\"\")","v":""},null,null,null,{"$f":"IF('RACK, Accessori e Servizi'!J14>0,'RACK, Accessori e Servizi'!K14,\"\")","v":""},null,null,{"$f":"IF(B68>0,(VLOOKUP(G68,COD_A,5,FALSE)),\"\")","v":""},null,null,null,null,null,null,null,{"$f":"IF(B68>0,(VLOOKUP(G68,COD_A,3,FALSE)),\"\")","v":""},null,{"$f":"IF(B68=\"\",\"\",R68*B68)","v":""},null,0]
[null,{"$f":"IF('RACK, Accessori e Servizi'!J17=0,\"\",'RACK, Accessori e Servizi'!J17)","v":""},"",null,null,null,{"$f":"IF('RACK, Accessori e Servizi'!J17>0,'RACK, Accessori e Servizi'!K17,\"\")","v":""},null,null,"",null,null,null,null,null,null,null,"",null,{"$f":"IF(B69=\"\",\"\",R69*B69)","v":""},null,0]
[null,{"$f":"IF('RACK, Accessori e Servizi'!J20=0,\"\",'RACK, Accessori e Servizi'!J20)","v":""},"",null,null,null,{"$f":"IF('RACK, Accessori e Servizi'!J20>0,'RACK, Accessori e Servizi'!K20,\"\")","v":""},null,null,"",null,null,null,null,null,null,null,"",null,"",null,0]
[null,{"$f":"IF('RACK, Accessori e Servizi'!J23=0,\"\",'RACK, Accessori e Servizi'!J23)","v":""},"",null,null,null,{"$f":"IF('RACK, Accessori e Servizi'!J23>0,'RACK, Accessori e Servizi'!K23,\"\")","v":""},null,null,"",null,null,null,null,null,null,null,"",null,"",null,0]
[null,{"$f":"IF('RACK, Accessori e Servizi'!J68=0,\"\",'RACK, Accessori e Servizi'!J68)","v":""},{"$f":"IF(B72>0,(VLOOKUP(G72,COD_C,2,FALSE)),\"\")","v":""},null,null,null,{"$f":"IF('RACK, Accessori e Servizi'!J68>0,'RACK, Accessori e Servizi'!K68,\"\")","v":""},null,null,{"$f":"IF(B72>0,(VLOOKUP(G72,COD_C,5,FALSE)),\"\")","v":""},null,null,null,null,null,null,null,{"$f":"IF(B72>0,(VLOOKUP(G72,COD_C,3,FALSE)),\"\")","v":""},null,"",null,0]
[null,{"$f":"IF('RACK, Accessori e Servizi'!J72=0,\"\",'RACK, Accessori e Servizi'!J72)","v":""},"",null,null,null,{"$f":"IF('RACK, Accessori e Servizi'!J72>0,'RACK, Accessori e Servizi'!K72,\"\")","v":""},null,null,"",null,null,null,null,null,null,null,"",null,"",null,0]
[null,{"$f":"IF('RACK, Accessori e Servizi'!J76=0,\"\",'RACK, Accessori e Servizi'!J76)","v":""},"",null,null,null,{"$f":"IF('RACK, Accessori e Servizi'!J76>0,'RACK, Accessori e Servizi'!K76,\"\")","v":""},null,null,"",null,null,null,null,null,null,null,"",null,"",null,0]
[null,{"$f":"IF('RACK, Accessori e Servizi'!J5=0,\"\",'RACK, Accessori e Servizi'!J5)","v":""},"",null,null,null,{"$f":"IF('RACK, Accessori e Servizi'!J5>0,'RACK, Accessori e Servizi'!K5,\"\")","v":""},null,null,"",null,null,null,null,null,null,null,"",null,"",null,0]
[null,{"$f":"IF('RACK, Accessori e Servizi'!J7=0,\"\",'RACK, Accessori e Servizi'!J7)","v":""},"",null,null,null,{"$f":"IF('RACK, Accessori e Servizi'!J7>0,'RACK, Accessori e Servizi'!K7,\"\")","v":""},null,null,"",null,null,null,null,null,null,null,"",null,"",null,0]
[null,{"$f":"IF('RACK, Accessori e Servizi'!J9=0,\"\",'RACK, Accessori e Servizi'!J9)","v":""},"",null,null,null,{"$f":"IF('RACK, Accessori e Servizi'!J9>0,'RACK, Accessori e Servizi'!K9,\"\")","v":""},null,null,"",null,null,null,null,null,null,null,"",null,"",null,0]
[null,"I.V.A.",null,null,null,null,null,null,null,null,null,null,null,null,null,null,null,{"$f":"R79*22%","v":0},null,null,null,1]
[null,"TOTALE COSTO (I.V.A. Esclusa)",null,null,null,null,null,null,null,null,null,null,null,null,null,null,null,{"$f":"SUM(T15:U77)","v":0},null,null,null,1]
[null,"TOTALE ORDINE",null,null,null,null,null,null,null,null,null,null,null,null,null,null,null,{"$f":"SUM(R78:U79)","v":0},null,null,null,1]
[null,null,null,null,null,null,null,null,null,null,null,null,null,null,null,null,null,null,null,null,null,1]
[null,null,null,null,null,null,null,null,null,null,null,null,null,null,null,null,null,null,null,null,null,1]
[null,null,null,null,null,null,null,null,null,null,null,null,null,null,null,null,null,null,null,null,null,1]
[null,null,null,{"$f":"IF(G6>0,\"DETTAGLIO CONFIGURAZIONI SERVER LOTTO 1 \",\"\")","v":""},null,null,null,null,null,null,null,null,null,null,null,null,null,null,null,null,null,1]
[null,null,null,null,null,null,null,null,null,null,null,null,null,null,null,null,null,null,null,null,null,1]
[null,null,null,null,null,null,null,null,null,null,null,null,null,null,null,null,null,null,null,null,null,1]
[null,null,null,null,null,null,null,null,null,null,null,null,null,null,null,null,null,null,null,null,null,{"$f":"IF($B$15>=\"\",0,1)","v":0}]
[null,"PowerEdge R630 Conf.1",null,null,{"$f":"SRV_A","v":0},"Server",null,null,"PowerEdge R630 Conf.2",null,null,{"$f":"SRV_AA","v":0},"Server",null,null,"PowerEdge R630 Conf.3",null,null,{"$f":"SRV_AAA","v":0},"Server",null,{"$f":"IF($B$15>=\"\",0,1)","v":0}]
[null,null,null,null,null,null,null,null,null,null,null,null,null,null,null,null,null,null,null,null,null,0]
[null,{"$f":"IF(SRV_A>0,\"1\",\"-\")","v":"-"},{"$f":"IF(B90=\"-\",\"-\",CONCATENATE(MID($C$15,1,21),\" - \",$G$15))","v":"-"},null,null,null,null,null,{"$f":"IF(SRV_AA>0,\"1\",\"-\")","v":"-"},{"$f":"IF(I90=\"-\",\"-\",CONCATENATE(MID($C$15,1,21),\" - \",$G$15))","v":"-"},null,null,null,null,null,{"$f":"IF(SRV_AAA>0,\"1\",\"-\")","v":"-"},{"$f":"IF(P90=\"-\",\"-\",CONCATENATE(MID($C$15,1,21),\" - \",$G$15))","v":"-"},null,null,null,null,0]
[null,{"$f":"IF(X16=0,\"-\",X16)","v":"-"},{"$f":"IF(B91=\"-\",\"-\",CONCATENATE(MID($C$16,1,21),\" - \",$G$16))","v":"-"},null,null,null,null,null,{"$f":"IF(Y16=0,\"-\",Y16)","v":"-"},{"$f":"IF(I91=\"-\",\"-\",CONCATENATE(MID(C16,1,21),\" - \",G16))","v":"-"},null,null,null,null,null,{"$f":"IF(Z16=0,\"-\",Z16)","v":"-"},{"$f":"IF(P91=\"-\",\"-\",CONCATENATE(MID(C16,1,21),\" - \",G16))","v":"-"},null,null,null,null,{"$f":"IF(V16=0,0,1)","v":0}]
[null,"-",{"$f":"IF(B92=\"-\",\"-\",CONCATENATE(MID($C$17,1,21),\" - \",$G$17))","v":"-"},null,null,null,null,null,"-","-",null,null,null,null,null,"-","-",null,null,null,null,{"$f":"IF(V17=0,0,1)","v":0}]
[null,"-",{"$f":"IF(B93=\"-\",\"-\",CONCATENATE(MID($C$18,1,21),\" - \",$G$18))","v":"-"},null,null,null,null,null,"-","-",null,null,null,null,null,"-","-",null,null,null,null,0]
[null,"-",{"$f":"IF(B94=\"-\",\"-\",CONCATENATE(MID(C19,1,21),\" - \",G19))","v":"-"},null,null,null,null,null,"-","-",null,null,null,null,null,"-","-",null,null,null,null,0]
[null,"-","-",null,null,null,null,null,"-","-",null,null,null,null,null,"-","-",null,null,null,null,0]
[null,"-","-",null,null,null,null,null,"-","-",null,null,null,null,null,"-","-",null,null,null,null,0]
[null,"-","-",null,null,null,null,null,"-","-",null,null,null,null,null,"-","-",null,null,null,null,0]
[null,"-","-",null,null,null,null,null,"-","-",null,null,null,null,null,"-","-",null,null,null,null,0]
[null,"-","-",null,null,null,null,null,"-","-",null,null,null,null,null,"-","-",null,null,null,null,0]
[null,"-","-",null,null,null,null,null,"-","-",null,null,null,null,null,"-","-",null,null,null,null,0]
[null,"-","-",null,null,null,null,null,"-","-",null,null,null,null,null,"-","-",null,null,null,null,0]
[null,"-","-",null,null,null,null,null,"-","-",null,null,null,null,null,"-","-",null,null,null,null,0]
[null,"-","-",null,null,null,null,null,"-","-",null,null,null,null,null,"-","-",null,null,null,null,0]
[null,"-","-",null,null,null,null,null,"-","-",null,null,null,null,null,"-","-",null,null,null,null,0]
[null,"-","-",null,null,null,null,null,"-","-",null,null,null,null,null,"-","-",null,null,null,null,0]
[null,"-",{"$f":"IF(B106=\"-\",\"-\",CONCATENATE(MID(C31,1,21),\" - \",AJ31))","v":"-"},null,null,null,null,null,"-",{"$f":"IF(I106=\"-\",\"-\",CONCATENATE(MID(C31,1,21),\" - \",AK31))","v":"-"},null,null,null,null,null,"-",{"$f":"IF(P106=\"-\",\"-\",CONCATENATE(MID(C31,1,21),\" - \",AL31))","v":"-"},null,null,null,null,0]
[null,{"$f":"IF(X64=0,\"-\",X64)","v":"-"},{"$f":"IF(B107=\"-\",\"-\",CONCATENATE(MID(C64,1,21),\" - \",G64))","v":"-"},null,null,null,null,null,{"$f":"IF(Y64=0,\"-\",Y64)","v":"-"},{"$f":"IF(I107=\"-\",\"-\",CONCATENATE(MID(C64,1,21),\" - \",G64))","v":"-"},null,null,null,null,null,{"$f":"IF(Z64=0,\"-\",Z64)","v":"-"},{"$f":"IF(P107=\"-\",\"-\",CONCATENATE(MID(C64,1,21),\" - \",G64))","v":"-"},null,null,null,null,{"$f":"IF(AM64=0,0,1)","v":0}]
[null,{"$f":"IF(X65=0,\"-\",X65)","v":"-"},{"$f":"IF(B108=\"-\",\"-\",CONCATENATE(MID(C65,1,21),\" - \",G65))","v":"-"},null,null,null,null,null,{"$f":"IF(Y65=0,\"-\",Y65)","v":"-"},{"$f":"IF(I108=\"-\",\"-\",CONCATENATE(MID(C65,1,21),\" - \",G65))","v":"-"},null,null,null,null,null,{"$f":"IF(Z65=0,\"-\",Z65)","v":"-"},{"$f":"IF(P108=\"-\",\"-\",CONCATENATE(MID(C65,1,21),\" - \",G65))","v":"-"},null,null,null,null,{"$f":"IF(AM65=0,0,1)","v":0}]
[null,{"$f":"IF(X66=0,\"-\",X66)","v":"-"},{"$f":"IF(B109=\"-\",\"-\",CONCATENATE(MID(C66,1,21),\" - \",G66))","v":"-"},null,null,null,null,null,"-","-",null,null,null,null,null,"-","-",null,null,null,null,0]
[null,{"$f":"IF(X67=0,\"-\",X67)","v":"-"},{"$f":"IF(B110=\"-\",\"-\",CONCATENATE(MID(C67,1,21),\" - \",G67))","v":"-"},null,null,null,null,null,"-","-",null,null,null,null,null,"-","-",null,null,null,null,0]
[null,null,null,null,null,null,null,null,null,null,null,null,null,null,null,null,null,null,null,null,null,{"$f":"IF($B$15>=\"\",0,1)","v":0}]
[null,"Configurazione RAID",null,null,null,null,null,null,"Configurazione RAID",null,null,null,null,null,null,"Configurazione RAID",null,null,null,null,null,0]
[null,null,null,null,null,null,null,null,null,null,null,null,null,null,null,null,null,null,null,null,null,0]
[null,{"$f":"IF(X15=0,\"\",\"HDD 300 GB\")","v":""},null,{"$f":"IF(X15=0,\"\",'Server10 Lotto1 R630'!$B$73)","v":""},null,null,null,null,{"$f":"IF(Y15=0,\"\",\"HDD 300 GB\")","v":""},null,{"$f":"IF(Y15=0,\"\",'Server10 Lotto1 R630 2'!$B$73)","v":""},null,null,null,null,{"$f":"IF(Z15=0,\"\",\"HDD 300 GB\")","v":""},null,{"$f":"IF(Z15=0,\"\",'Server10 Lotto1 R630 3'!$B$73)","v":""},null,null,null,0]
[null,null,null,null,null,null,null,null,null,null,null,null,null,null,null,null,null,null,null,null,null,0]
[null,{"$f":"IF(X15=0,\"\",\"Hot spare HDD 300 GB\")","v":""},null,null,null,{"$f":"IF(X15=0,\"\",'Server10 Lotto1 R630'!$C$74)","v":""},null,null,{"$f":"IF(Y15=0,\"\",\"Hot spare HDD 300 GB\")","v":""},null,null,null,{"$f":"IF(Y15=0,\"\",'Server10 Lotto1 R630 2'!$C$74)","v":""},null,null,{"$f":"IF(Z15=0,\"\",\"Hot spare HDD 300 GB\")","v":""},null,null,null,{"$f":"IF(Z15=0,\"\",'Server10 Lotto1 R630 3'!$C$74)","v":""},null,0]
[null,null,null,null,null,null,null,null,null,null,null,null,null,null,null,null,null,null,null,null,null,0]
[null,null,null,null,null,null,null,null,null,null,null,null,null,null,null,null,null,null,null,null,null,0]
[null,{"$f":"IF(X28=0,\"\",\"HDD 1000 GB\")","v":""},null,{"$f":"IF(X28=0,\"\",'Server10 Lotto1 R630'!$B$77)","v":""},null,null,null,null,{"$f":"IF(Y28=0,\"\",\"HDD 1000 GB\")","v":""},null,{"$f":"IF(Y28=0,\"\",'Server10 Lotto1 R630 2'!$B$77)","v":""},null,null,null,null,{"$f":"IF(Z28=0,\"\",\"HDD 1000 GB\")","v":""},null,{"$f":"IF(Z28=0,\"\",'Server10 Lotto1 R630 2'!$B$77)","v":""},null,null,null,0]
[null,null,null,null,null,null,null,null,null,null,null,null,null,null,null,null,null,null,null,null,null,0]
[null,{"$f":"IF(X28=0,\"\",\"Hot spare HDD 1000 GB\")","v":""},null,null,null,{"$f":"IF(X28=0,\"\",'Server10 Lotto1 R630'!$C$78)","v":""},null,null,{"$f":"IF(Y28=0,\"\",\"Hot spare HDD 1000 GB\")","v":""},null,null,null,{"$f":"IF(Y28=0,\"\",'Server10 Lotto1 R630 2'!$C$78)","v":""},null,null,{"$f":"IF(Z28=0,\"\",\"Hot spare HDD 1000 GB\")","v":""},null,null,null,{"$f":"IF(Z28=0,\"\",'Server10 Lotto1 R630 2'!$C$78)","v":""},null,0]
[null,null,null,null,null,null,null,null,null,null,null,null,null,null,null,null,null,null,null,null,null,0]
[null,null,null,null,null,null,null,null,null,null,null,null,null,null,null,null,null,null,null,null,null,0]
[null,"Note RAID",null,null,null,null,null,null,"Note RAID",null,null,null,null,null,null,"Note RAID",null,null,null,null,null,0]
[null,{"$f":"IF('Server10 Lotto1 R630'!$I$72=0,\"\",'Server10 Lotto1 R630'!$I$72)","v":""},null,null,null,null,null,null,{"$f":"IF('Server10 Lotto1 R630 2'!$I$72=0,\"\",'Server10 Lotto1 R630 2'!$I$72)","v":""},null,null,null,null,null,null,{"$f":"IF('Server10 Lotto1 R630 3'!$I$72=0,\"\",'Server10 Lotto1 R630 3'!$I$72)","v":""},null,null,null,null,null,0]
[null,null,null,null,null,null,null,null,null,null,null,null,null,null,null,null,null,null,null,null,null,0]
[null,null,null,null,null,null,null,null,null,null,null,null,null,null,null,null,null,null,null,null,null,0]
[null,{"$f":"IF('Server10 Lotto1 R630'!$I$76=0,\"\",'Server10 Lotto1 R630'!$I$76)","v":""},null,null,null,null,null,null,{"$f":"IF('Server10 Lotto1 R630 2'!$I$76=0,\"\",'Server10 Lotto1 R630 2'!$I$76)","v":""},null,null,null,null,null,null,{"$f":"IF('Server10 Lotto1 R630 3'!$I$76=0,\"\",'Server10 Lotto1 R630 3'!$I$76)","v":""},null,null,null,null,null,0]
[null,null,null,null,null,null,null,null,null,null,null,null,null,null,null,null,null,null,null,null,null,0]
[null,null,null,null,null,null,null,null,null,null,null,null,null,null,null,null,null,null,null,null,null,0]
[null,null,null,null,null,null,null,null,null,null,null,null,null,null,null,null,null,null,null,null,null,0]
[null,null,null,null,null,null,null,null,null,null,null,null,null,null,null,null,null,null,null,null,null,{"$f":"IF($B$33>=\"\",0,1)","v":0}]
[null,"PowerEdge 730xd Conf.1",null,null,{"$f":"SRV_B","v":0},"Server",null,null,"PowerEdge 730xd Conf.2",null,null,{"$f":"SRV_BB","v":0},"Server",null,null,"PowerEdge 730xd Conf.3",null,null,{"$f":"SRV_BBB","v":0},"Server",null,{"$f":"IF($B$33>=\"\",0,1)","v":0}]
[null,null,null,null,null,null,null,null,null,null,null,null,null,null,null,null,null,null,null,null,null,0]
[null,{"$f":"IF(SRV_B>0,\"1\",\"-\")","v":"-"},{"$f":"IF(B135=\"-\",\"-\",CONCATENATE(MID(C33,1,24),\" - \",G33))","v":"-"},null,null,null,null,null,{"$f":"IF(SRV_BB>0,\"1\",\"-\")","v":"-"},{"$f":"IF(I135=\"-\",\"-\",CONCATENATE(MID(C33,1,24),\" - \",G33))","v":"-"},null,null,null,null,null,{"$f":"IF(SRV_BBB>0,\"1\",\"-\")","v":"-"},{"$f":"IF(P135=\"-\",\"-\",CONCATENATE(MID(C33,1,24),\" - \",G33))","v":"-"},null,null,null,null,0]
[null,{"$f":"IF(X34=0,\"-\",X34)","v":"-"},"-",null,null,null,null,null,{"$f":"IF(Y34=0,\"-\",Y34)","v":"-"},"-",null,null,null,null,null,{"$f":"IF(Z34=0,\"-\",Z34)","v":"-"},"-",null,null,null,null,{"$f":"IF(V34=0,0,1)","v":0}]
[null,"-","-",null,null,null,null,null,"-","-",null,null,null,null,null,"-","-",null,null,null,null,{"$f":"IF(V35=0,0,1)","v":0}]
[null,"-","-",null,null,null,null,null,"-","-",null,null,null,null,null,"-","-",null,null,null,null,0]
[null,"-","-",null,null,null,null,null,"-","-",null,null,null,null,null,"-","-",null,null,null,null,0]
[null,"-","-",null,null,null,null,null,"-","-",null,null,null,null,null,"-","-",null,null,null,null,0]
[null,"-","-",null,null,null,null,null,"-","-",null,null,null,null,null,"-","-",null,null,null,null,0]
[null,"-","-",null,null,null,null,null,"-","-",null,null,null,null,null,"-","-",null,null,null,null,0]
[null,"-","-",null,null,null,null,null,"-","-",null,null,null,null,null,"-","-",null,null,null,null,0]
[null,"-","-",null,null,null,null,null,"-","-",null,null,null,null,null,"-","-",null,null,null,null,0]
[null,"-","-",null,null,null,null,null,"-","-",null,null,null,null,null,"-","-",null,null,null,null,0]
[null,"-","-",null,null,null,null,null,"-","-",null,null,null,null,null,"-","-",null,null,null,null,0]
[null,"-","-",null,null,null,null,null,"-","-",null,null,null,null,null,"-","-",null,null,null,null,0]
[null,"-","-",null,null,null,null,null,"-","-",null,null,null,null,null,"-","-",null,null,null,null,0]
[null,"-","-",null,null,null,null,null,"-","-",null,null,null,null,null,"-","-",null,null,null,null,0]
[null,"-","-",null,null,null,null,null,"-","-",null,null,null,null,null,"-","-",null,null,null,null,0]
[null,"-",{"$f":"IF(B151=\"-\",\"-\",CONCATENATE(MID(C49,1,24),\" - \",AJ49))","v":"-"},null,null,null,null,null,"-",{"$f":"IF(I151=\"-\",\"-\",CONCATENATE(MID(C49,1,24),\" - \",AK49))","v":"-"},null,null,null,null,null,"-",{"$f":"IF(P151=\"-\",\"-\",CONCATENATE(MID(C49,1,24),\" - \",AL49))","v":"-"},null,null,null,null,0]
[null,{"$f":"IF(AA64=0,\"-\",AA64)","v":"-"},{"$f":"IF(B152=\"-\",\"-\",CONCATENATE(MID(C64,1,21),\" - \",G64))","v":"-"},null,null,null,null,null,{"$f":"IF(AB64=0,\"-\",AB64)","v":"-"},{"$f":"IF(I152=\"-\",\"-\",CONCATENATE(MID(C64,1,21),\" - \",G64))","v":"-"},null,null,null,null,null,{"$f":"IF(AC64=0,\"-\",AC64)","v":"-"},{"$f":"IF(P152=\"-\",\"-\",CONCATENATE(MID(C64,1,21),\" - \",G64))","v":"-"},null,null,null,null,{"$f":"IF(AN64=0,0,1)","v":0}]
[null,{"$f":"IF(AA65=0,\"-\",AA65)","v":"-"},{"$f":"IF(B153=\"-\",\"-\",CONCATENATE(MID(C65,1,21),\" - \",G65))","v":"-"},null,null,null,null,null,{"$f":"IF(AB65=0,\"-\",AB65)","v":"-"},{"$f":"IF(I153=\"-\",\"-\",CONCATENATE(MID(C65,1,21),\" - \",G65))","v":"-"},null,null,null,null,null,{"$f":"IF(AC65=0,\"-\",AC65)","v":"-"},{"$f":"IF(P153=\"-\",\"-\",CONCATENATE(MID(C65,1,21),\" - \",G65))","v":"-"},null,null,null,null,{"$f":"IF(AN65=0,0,1)","v":0}]
[null,"-","-",null,null,null,null,null,"-","-",null,null,null,null,null,"-","-",null,null,null,null,0]
[null,"-","-",null,null,null,null,null,"-","-",null,null,null,null,null,"-","-",null,null,null,null,0]
[null,null,null,null,null,null,null,null,null,null,null,null,null,null,null,null,null,null,null,null,null,{"$f":"IF($B$33>=\"\",0,1)","v":0}]
[null,"Configurazione RAID",null,null,null,null,null,null,"Configurazione RAID",null,null,null,null,null,null,"Configurazione RAID",null,null,null,null,null,{"$f":"IF($B$33>=\"\",0,1)","v":0}]
[null,null,null,null,null,null,null,null,null,null,null,null,null,null,null,null,null,null,null,null,null,0]
[null,{"$f":"IF(X33=0,\"\",\"HDD 300 GB\")","v":""},null,{"$f":"IF(X33=0,\"\",'Server10 Lotto1 R730xd'!$B$73)","v":""},null,null,null,null,{"$f":"IF(Y33=0,\"\",\"HDD 300 GB\")","v":""},null,{"$f":"IF(Y33=0,\"\",'Server10 Lotto1 R730xd 2'!$B$73)","v":""},null,null,null,null,{"$f":"IF(Z33=0,\"\",\"HDD 300 GB\")","v":""},null,{"$f":"IF(Z33=0,\"\",'Server10 Lotto1 R730xd 3'!$B$73)","v":""},null,null,null,0]
[null,null,null,null,null,null,null,null,null,null,null,null,null,null,null,null,null,null,null,null,null,0]
[null,{"$f":"IF(X33=0,\"\",\"Hot spare HDD 300 GB\")","v":""},null,null,null,{"$f":"IF(X33=0,\"\",'Server10 Lotto1 R730xd'!$C$74)","v":""},null,null,{"$f":"IF(Y33=0,\"\",\"Hot spare HDD 300 GB\")","v":""},null,null,null,{"$f":"IF(Y33=0,\"\",'Server10 Lotto1 R730xd 2'!$C$74)","v":""},null,null,{"$f":"IF(Z33=0,\"\",\"Hot spare HDD 300 GB\")","v":""},null,null,null,{"$f":"IF(Z33=0,\"\",'Server10 Lotto1 R730xd 3'!$C$74)","v":""},null,0]
[null,null,null,null,null,null,null,null,null,null,null,null,null,null,null,null,null,null,null,null,null,0]
[null,null,null,null,null,null,null,null,null,null,null,null,null,null,null,null,null,null,null,null,null,0]
[null,{"$f":"IF(X46=0,\"\",\"HDD 1000 GB\")","v":""},null,{"$f":"IF(X46=0,\"\",'Server10 Lotto1 R730xd'!$B$77)","v":""},null,null,null,null,{"$f":"IF(Y46=0,\"\",\"HDD 1000 GB\")","v":""},null,{"$f":"IF(Y46=0,\"\",'Server10 Lotto1 R730xd 2'!$B$77)","v":""},null,null,null,null,{"$f":"IF(Z46=0,\"\",\"HDD 1000 GB\")","v":""},null,{"$f":"IF(Z46=0,\"\",'Server10 Lotto1 R730xd 3'!$B$77)","v":""},null,null,null,0]
[null,null,null,null,null,null,null,null,null,null,null,null,null,null,null,null,null,null,null,null,null,0]
[null,{"$f":"IF(X46=0,\"\",\"Hot spare HDD 1000 GB\")","v":""},null,null,null,{"$f":"IF(X46=0,\"\",'Server10 Lotto1 R730xd'!$C$78)","v":""},null,null,{"$f":"IF(Y46=0,\"\",\"Hot spare HDD 1000 GB\")","v":""},null,null,null,{"$f":"IF(Y46=0,\"\",'Server10 Lotto1 R730xd 2'!$C$78)","v":""},null,null,{"$f":"IF(Z46=0,\"\",\"Hot spare HDD 1000 GB\")","v":""},null,null,null,{"$f":"IF(Z46=0,\"\",'Server10 Lotto1 R730xd 3'!$C$78)","v":""},null,0]
[null,null,null,null,null,null,null,null,null,null,null,null,null,null,null,null,null,null,null,null,null,0]
[null,null,null,null,null,null,null,null,null,null,null,null,null,null,null,null,null,null,null,null,null,0]
[null,"Note RAID",null,null,null,null,null,null,"Note RAID",null,null,null,null,null,null,"Note RAID",null,null,null,null,null,0]
[null,{"$f":"IF('Server10 Lotto1 R730xd'!$I$72=0,\"\",'Server10 Lotto1 R730xd'!$I$72)","v":""},null,null,null,null,null,null,{"$f":"IF('Server10 Lotto1 R730xd 2'!$I$72=0,\"\",'Server10 Lotto1 R730xd 2'!$I$72)","v":""},null,null,null,null,null,null,{"$f":"IF('Server10 Lotto1 R730xd 3'!$I$72=0,\"\",'Server10 Lotto1 R730xd 3'!$I$72)","v":""},null,null,null,null,null,0]
[null,null,null,null,null,null,null,null,null,null,null,null,null,null,null,null,null,null,null,null,null,0]
[null,null,null,null,null,null,null,null,null,null,null,null,null,null,null,null,null,null,null,null,null,0]
[null,{"$f":"IF('Server10 Lotto1 R730xd'!$I$76=0,\"\",'Server10 Lotto1 R730xd'!$I$76)","v":""},null,null,null,null,null,null,{"$f":"IF('Server10 Lotto1 R730xd 2'!$I$76=0,\"\",'Server10 Lotto1 R730xd 2'!$I$76)","v":""},null,null,null,null,null,null,{"$f":"IF('Server10 Lotto1 R730xd 3'!$I$76=0,\"\",'Server10 Lotto1 R730xd 3'!$I$76)","v":""},null,null,null,null,null,0]
[null,null,null,null,null,null,null,null,null,null,null,null,null,null,null,null,null,null,null,null,null,0]
[null,null,null,null,null,null,null,null,null,null,null,null,null,null,null,null,null,null,null,null,null,0]
[null,null,null,null,null,null,null,null,null,null,null,null,null,null,null,null,null,null,null,null,null,0]
[null,null,null,null,null,null,null,null,null,null,null,null,null,null,null,null,null,null,null,null,null,{"$f":"IF($D$178=\"\",0,1)","v":0}]
[null,null,null,{"$f":"IF('RACK, Accessori e Servizi'!H48>=1,\"DETTAGLIO CONFIGURAZIONE ARMADI RACK\",\"\")","v":""},null,null,null,null,null,null,null,null,null,null,null,null,null,null,null,null,null,{"$f":"IF($D$178=\"\",0,1)","v":0}]
[null,null,null,null,null,null,null,null,null,null,null,null,null,null,null,null,null,null,null,null,null,0]
[null,null,null,null,null,null,null,null,null,null,null,null,null,null,null,null,null,null,null,null,null,0]
[null,null,null,{"$f":"CONCATENATE('RACK, Accessori e Servizi'!H50,\"\nQty: \",'RACK, Accessori e Servizi'!H48)","v":"\nQty: "},{"$f":"CONCATENATE('RACK, Accessori e Servizi'!I50,\"\nQty: \",'RACK, Accessori e Servizi'!I48)","v":"\nQty: "},{"$f":"CONCATENATE('RACK, Accessori e Servizi'!J50,\"\nQty: \",'RACK, Accessori e Servizi'!J48)","v":"\nQty: "},{"$f":"CONCATENATE('RACK, Accessori e Servizi'!K50,\"\nQty: \",'RACK, Accessori e Servizi'!K48)","v":"\nQty: "},null,{"$f":"CONCATENATE('RACK, Accessori e Servizi'!L50,\"\nQty: \",'RACK, Accessori e Servizi'!L48)","v":"\nQty: "},{"$f":"CONCATENATE('RACK, Accessori e Servizi'!M50,\"\nQty: \",'RACK, Accessori e Servizi'!M48)","v":"\nQty: "},{"$f":"CONCATENATE('RACK, Accessori e Servizi'!N50,\"\nQty: \",'RACK, Accessori e Servizi'!N48)","v":"\nQty: "},{"$f":"CONCATENATE('RACK, Accessori e Servizi'!O50,\"\nQty: \",'RACK, Accessori e Servizi'!O48)","v":"\nQty: "},{"$f":"CONCATENATE('RACK, Accessori e Servizi'!P50,\"\nQty: \",'RACK, Accessori e Servizi'!P48)","v":"\nQty: "},{"$f":"CONCATENATE('RACK, Accessori e Servizi'!Q50,\"\nQty: \",'RACK, Accessori e Servizi'!Q48)","v":"\nQty: "},null,null,null,null,null,null,null,0]
[null,"R630 Conf.1",null,{"$f":"'RACK, Accessori e Servizi'!H52","v":0},{"$f":"'RACK, Accessori e Servizi'!I52","v":0},{"$f":"'RACK, Accessori e Servizi'!J52","v":0},{"$f":"'RACK, Accessori e Servizi'!K52","v":0},null,{"$f":"'RACK, Accessori e Servizi'!L52","v":0},{"$f":"'RACK, Accessori e Servizi'!M52","v":0},{"$f":"'RACK, Accessori e Servizi'!N52","v":0},{"$f":"'RACK, Accessori e Servizi'!O52","v":0},{"$f":"'RACK, Accessori e Servizi'!P52","v":0},{"$f":"'RACK, Accessori e Servizi'!Q52","v":0},null,null,null,null,null,null,null,0]
[null,"R630 Conf.2",null,{"$f":"'RACK, Accessori e Servizi'!H53","v":0},{"$f":"'RACK, Accessori e Servizi'!I53","v":0},{"$f":"'RACK, Accessori e Servizi'!J53","v":0},{"$f":"'RACK, Accessori e Servizi'!K53","v":0},null,{"$f":"'RACK, Accessori e Servizi'!L53","v":0},{"$f":"'RACK, Accessori e Servizi'!M53","v":0},{"$f":"'RACK, Accessori e Servizi'!N53","v":0},{"$f":"'RACK, Accessori e Servizi'!O53","v":0},{"$f":"'RACK, Accessori e Servizi'!P53","v":0},{"$f":"'RACK, Accessori e Servizi'!Q53","v":0},null,null,null,null,null,null,null,0]
[null,"R630 Conf.3",null,{"$f":"'RACK, Accessori e Servizi'!H54","v":0},{"$f":"'RACK, Accessori e Servizi'!I54","v":0},{"$f":"'RACK, Accessori e Servizi'!J54","v":0},{"$f":"'RACK, Accessori e Servizi'!K54","v":0},null,{"$f":"'RACK, Accessori e Servizi'!L54","v":0},{"$f":"'RACK, Accessori e Servizi'!M54","v":0},{"$f":"'RACK, Accessori e Servizi'!N54","v":0},{"$f":"'RACK, Accessori e Servizi'!O54","v":0},{"$f":"'RACK, Accessori e Servizi'!P54","v":0},{"$f":"'RACK, Accessori e Servizi'!Q54","v":0},null,null,null,null,null,null,null,0]
[null,"R730xd Conf.1",null,{"$f":"'RACK, Accessori e Servizi'!H55","v":0},{"$f":"'RACK, Accessori e Servizi'!I55","v":0},{"$f":"'RACK, Accessori e Servizi'!J55","v":0},{"$f":"'RACK, Accessori e Servizi'!K55","v":0},null,{"$f":"'RACK, Accessori e Servizi'!L55","v":0},{"$f":"'RACK, Accessori e Servizi'!M55","v":0},{"$f":"'RACK, Accessori e Servizi'!N55","v":0},{"$f":"'RACK, Accessori e Servizi'!O55","v":0},{"$f":"'RACK, Accessori e Servizi'!P55","v":0},{"$f":"'RACK, Accessori e Servizi'!Q55","v":0},null,null,null,null,null,null,null,0]
[null,"R730xd Conf.2",null,{"$f":"'RACK, Accessori e Servizi'!H56","v":0},{"$f":"'RACK, Accessori e Servizi'!I56","v":0},{"$f":"'RACK, Accessori e Servizi'!J56","v":0},{"$f":"'RACK, Accessori e Servizi'!K56","v":0},null,{"$f":"'RACK, Accessori e Servizi'!L56","v":0},{"$f":"'RACK, Accessori e Servizi'!M56","v":0},{"$f":"'RACK, Accessori e Servizi'!N56","v":0},{"$f":"'RACK, Accessori e Servizi'!O56","v":0},{"$f":"'RACK, Accessori e Servizi'!P56","v":0},{"$f":"'RACK, Accessori e Servizi'!Q56","v":0},null,null,null,null,null,null,null,0]
[null,"R730xd Conf.3",null,{"$f":"'RACK, Accessori e Servizi'!H57","v":0},{"$f":"'RACK, Accessori e Servizi'!I57","v":0},{"$f":"'RACK, Accessori e Servizi'!J57","v":0},{"$f":"'RACK, Accessori e Servizi'!K57","v":0},null,{"$f":"'RACK, Accessori e Servizi'!L57","v":0},{"$f":"'RACK, Accessori e Servizi'!M57","v":0},{"$f":"'RACK, Accessori e Servizi'!N57","v":0},{"$f":"'RACK, Accessori e Servizi'!O57","v":0},{"$f":"'RACK, Accessori e Servizi'!P57","v":0},{"$f":"'RACK, Accessori e Servizi'!Q57","v":0},null,null,null,null,null,null,null,0]
[null,null,null,{"$f":"'RACK, Accessori e Servizi'!H58","v":0},{"$f":"'RACK, Accessori e Servizi'!I58","v":0},{"$f":"'RACK, Accessori e Servizi'!J58","v":0},{"$f":"'RACK, Accessori e Servizi'!K58","v":0},null,{"$f":"'RACK, Accessori e Servizi'!L58","v":0},{"$f":"'RACK, Accessori e Servizi'!M58","v":0},{"$f":"'RACK, Accessori e Servizi'!N58","v":0},{"$f":"'RACK, Accessori e Servizi'!O58","v":0},{"$f":"'RACK, Accessori e Servizi'!P58","v":0},{"$f":"'RACK, Accessori e Servizi'!Q58","v":0}]
[null,"OpzGUIRack",null,{"$f":"'RACK, Accessori e Servizi'!H59","v":0},{"$f":"'RACK, Accessori e Servizi'!I59","v":0},{"$f":"'RACK, Accessori e Servizi'!J59","v":0},{"$f":"'RACK, Accessori e Servizi'!K59","v":0},null,{"$f":"'RACK, Accessori e Servizi'!L59","v":0},{"$f":"'RACK, Accessori e Servizi'!M59","v":0},{"$f":"'RACK, Accessori e Servizi'!N59","v":0},{"$f":"'RACK, Accessori e Servizi'!O59","v":0},{"$f":"'RACK, Accessori e Servizi'!P59","v":0},{"$f":"'RACK, Accessori e Servizi'!Q59","v":0},null,null,null,null,null,null,null,0]
[null,null,null,{"$f":"'RACK, Accessori e Servizi'!H60","v":0},{"$f":"'RACK, Accessori e Servizi'!I60","v":0},{"$f":"'RACK, Accessori e Servizi'!J60","v":0},{"$f":"'RACK, Accessori e Servizi'!K60","v":0},null,{"$f":"'RACK, Accessori e Servizi'!L60","v":0},{"$f":"'RACK, Accessori e Servizi'!M60","v":0},{"$f":"'RACK, Accessori e Servizi'!N60","v":0},{"$f":"'RACK, Accessori e Servizi'!O60","v":0},{"$f":"'RACK, Accessori e Servizi'!P60","v":0},{"$f":"'RACK, Accessori e Servizi'!Q60","v":0}]
[null,"OpzSWGUIRack",0,{"$f":"'RACK, Accessori e Servizi'!H61","v":0},{"$f":"'RACK, Accessori e Servizi'!I61","v":0},{"$f":"'RACK, Accessori e Servizi'!J61","v":0},{"$f":"'RACK, Accessori e Servizi'!K61","v":0},null,{"$f":"'RACK, Accessori e Servizi'!L61","v":0},{"$f":"'RACK, Accessori e Servizi'!M61","v":0},{"$f":"'RACK, Accessori e Servizi'!N61","v":0},{"$f":"'RACK, Accessori e Servizi'!O61","v":0},{"$f":"'RACK, Accessori e Servizi'!P61","v":0},{"$f":"'RACK, Accessori e Servizi'!Q61","v":0},null,null,null,null,null,null,null,0]
[null,null,null,{"$f":"'RACK, Accessori e Servizi'!H62","v":0},{"$f":"'RACK, Accessori e Servizi'!I62","v":0},{"$f":"'RACK, Accessori e Servizi'!J62","v":0},{"$f":"'RACK, Accessori e Servizi'!K62","v":0},null,{"$f":"'RACK, Accessori e Servizi'!L62","v":0},{"$f":"'RACK, Accessori e Servizi'!M62","v":0},{"$f":"'RACK, Accessori e Servizi'!N62","v":0},{"$f":"'RACK, Accessori e Servizi'!O62","v":0},{"$f":"'RACK, Accessori e Servizi'!P62","v":0},{"$f":"'RACK, Accessori e Servizi'!Q62","v":0}]
[null,"OpzUPS 3000VA",0,{"$f":"'RACK, Accessori e Servizi'!H63","v":0},{"$f":"'RACK, Accessori e Servizi'!I63","v":0},{"$f":"'RACK, Accessori e Servizi'!J63","v":0},{"$f":"'RACK, Accessori e Servizi'!K63","v":0},null,{"$f":"'RACK, Accessori e Servizi'!L63","v":0},{"$f":"'RACK, Accessori e Servizi'!M63","v":0},{"$f":"'RACK, Accessori e Servizi'!N63","v":0},{"$f":"'RACK, Accessori e Servizi'!O63","v":0},{"$f":"'RACK, Accessori e Servizi'!P63","v":0},{"$f":"'RACK, Accessori e Servizi'!Q63","v":0},null,null,null,null,null,null,null,0]
[null,null,null,null,null,null,null,null,null,null,null,null,null,null,null,null,null,null,null,null,null,0]
[null,null,null,null,null,null,null,null,null,null,null,null,null,null,null,null,null,null,null,null,null,0]
[null,null,null,null,null,null,null,null,null,null,null,null,null,null,null,null,null,null,null,null,null,{"$f":"IF($B$51>=\"\",0,1)","v":0}]
[null,"PowerEdge T630 Conf.1",null,null,{"$f":"SRV_C","v":0},"Server",null,null,null,null,null,null,null,null,null,null,null,null,null,null,null,{"$f":"IF($B$51>=\"\",0,1)","v":0}]
[null,null,null,null,null,null,null,null,null,null,null,null,null,null,null,null,null,null,null,null,null,0]
[null,{"$f":"IF(SRV_C>0,\"1\",\"-\")","v":"-"},{"$f":"IF(B199=\"-\",\"-\",CONCATENATE(MID(C51,1,24),\" - \",G51))","v":"-"},null,null,null,null,null,null,null,null,null,null,null,null,null,null,null,null,null,null,0]
[null,{"$f":"IF(X52=0,\"-\",X52)","v":"-"},"-",null,null,null,null,null,null,null,null,null,null,null,null,null,null,null,null,null,null,{"$f":"IF(V52=0,0,1)","v":0}]
[null,"-","-",null,null,null,null,null,null,null,null,null,null,null,null,null,null,null,null,null,null,0]
[null,"-","-",null,null,null,null,null,null,null,null,null,null,null,null,null,null,null,null,null,null,0]
[null,"-","-",null,null,null,null,null,null,null,null,null,null,null,null,null,null,null,null,null,null,0]
[null,"-","-",null,null,null,null,null,null,null,null,null,null,null,null,null,null,null,null,null,null,0]
[null,"-","-",null,null,null,null,null,null,null,null,null,null,null,null,null,null,null,null,null,null,0]
[null,"-","-",null,null,null,null,null,null,null,null,null,null,null,null,null,null,null,null,null,null,0]
[null,"-","-",null,null,null,null,null,null,null,null,null,null,null,null,null,null,null,null,null,null,0]
[null,"-","-",null,null,null,null,null,null,null,null,null,null,null,null,null,null,null,null,null,null,0]
[null,"-","-",null,null,null,null,null,null,null,null,null,null,null,null,null,null,null,null,null,null,0]
[null,"-",{"$f":"IF(B210=\"-\",\"-\",CONCATENATE(MID(C62,1,24),\" - \",AF62))","v":"-"},null,null,null,null,null,null,null,null,null,null,null,null,null,null,null,null,null,null,0]
[null,{"$f":"IF(AD64=0,\"-\",AD64)","v":"-"},{"$f":"IF(B211=\"-\",\"-\",CONCATENATE(MID(C64,1,24),\" - \",G64))","v":"-"},null,null,null,null,null,null,null,null,null,null,null,null,null,null,null,null,null,null,{"$f":"IF(AO64=0,0,1)","v":0}]
[null,{"$f":"IF(AD65=0,\"-\",AD65)","v":"-"},{"$f":"IF(B212=\"-\",\"-\",CONCATENATE(MID(C65,1,24),\" - \",G65))","v":"-"},null,null,null,null,null,null,null,null,null,null,null,null,null,null,null,null,null,null,{"$f":"IF(AO65=0,0,1)","v":0}]
[null,{"$f":"IF(AD66=0,\"-\",AD66)","v":"-"},{"$f":"IF(B213=\"-\",\"-\",CONCATENATE(MID(C66,1,24),\" - \",G66))","v":"-"},null,null,null,null,null,null,null,null,null,null,null,null,null,null,null,null,null,null,{"$f":"IF(AO66=0,0,1)","v":0}]
[null,{"$f":"IF(AD67=0,\"-\",AD67)","v":"-"},{"$f":"IF(B214=\"-\",\"-\",CONCATENATE(MID(C67,1,24),\" - \",G67))","v":"-"},null,null,null,null,null,null,null,null,null,null,null,null,null,null,null,null,null,null,{"$f":"IF(AO67=0,0,1)","v":0}]
[null,null,null,null,null,null,null,null,null,null,null,null,null,null,null,null,null,null,null,null,null,{"$f":"IF($B$51>=\"\",0,1)","v":0}]
[null,"Configurazione RAID",null,null,null,null,null,null,null,null,null,null,null,null,null,null,null,null,null,null,null,{"$f":"IF($B$51>=\"\",0,1)","v":0}]
[null,null,null,null,null,null,null,null,null,null,null,null,null,null,null,null,null,null,null,null,null,0]
[null,{"$f":"IF(X51=0,\"\",\"HDD 300 GB\")","v":""},null,{"$f":"IF(X51=0,\"\",'Server10 Lotto1 T630'!$B$69)","v":""},null,null,null,null,null,null,null,null,null,null,null,null,null,null,null,null,null,0]
[null,null,null,null,null,null,null,null,null,null,null,null,null,null,null,null,null,null,null,null,null,0]
[null,{"$f":"IF(X51=0,\"\",\"Hot spare HDD 300 GB\")","v":""},null,null,null,{"$f":"IF(X51=0,\"\",'Server10 Lotto1 T630'!$C$70)","v":""},null,null,null,null,null,null,null,null,null,null,null,null,null,null,null,0]
[null,null,null,null,null,null,null,null,null,null,null,null,null,null,null,null,null,null,null,null,null,0]
[null,null,null,null,null,null,null,null,null,null,null,null,null,null,null,null,null,null,null,null,null,0]
[null,{"$f":"IF(X59=0,\"\",\"HDD 1000 GB\")","v":""},null,{"$f":"IF(X59=0,\"\",'Server10 Lotto1 T630'!$B$73)","v":""},null,null,null,null,null,null,null,null,null,null,null,null,null,null,null,null,null,0]
[null,null,null,null,null,null,null,null,null,null,null,null,null,null,null,null,null,null,null,null,null,0]
[null,{"$f":"IF(X59=0,\"\",\"Hot spare HDD 1000 GB\")","v":""},null,null,null,{"$f":"IF(X59=0,\"\",'Server10 Lotto1 T630'!$C$74)","v":""},null,null,null,null,null,null,null,null,null,null,null,null,null,null,null,0]
[null,null,null,null,null,null,null,null,null,null,null,null,null,null,null,null,null,null,null,null,null,0]
[null,null,null,null,null,null,null,null,null,null,null,null,null,null,null,null,null,null,null,null,null,0]
[null,"Note RAID",null,null,null,null,null,null,null,null,null,null,null,null,null,null,null,null,null,null,null,0]
[null,{"$f":"IF('Server10 Lotto1 T630'!G68=0,\"\",'Server10 Lotto1 T630'!G68)","v":""},null,null,null,null,null,null,null,null,null,null,null,null,null,null,null,null,null,null,null,0]
[null,null,null,null,null,null,null,null,null,null,null,null,null,null,null,null,null,null,null,null,null,0]
[null,null,null,null,null,null,null,null,null,null,null,null,null,null,null,null,null,null,null,null,null,0]
[null,{"$f":"IF('Server10 Lotto1 T630'!G72=0,\"\",'Server10 Lotto1 T630'!G72)","v":""},null,null,null,null,null,null,null,null,null,null,null,null,null,null,null,null,null,null,null,0]
[null,null,null,null,null,null,null,null,null,null,null,null,null,null,null,null,null,null,null,null,null,0]
[null,null,null,null,null,null,null,null,null,null,null,null,null,null,null,null,null,null,null,null,null,0]
[null,null,null,null,null,null,null,null,null,null,null,null,null,null,null,null,null,null,null,null,null,0]
[null,null,null,null,null,null,null,null,null,null,null,null,null,null,null,null,null,null,null,null,null,1]
[null,null,null,null,null,null,null,null,null,null,null,null,null,null,null,null,null,null,null,null,null,1]
[null,null,null,{"$f":"MID(C236,13,5)","v":""},null,{"$f":"MID(E236,13,5)","v":""},null,"",null,"",null,"",null,"",null,"",null,"",null,"",null,1]
[null,null,null,"AREA RISERVATA AL FORNITORE",null,null,null,null,null,null,null,null,null,null,null,null,null,null,null,null,null,1]
[null,null,null,null,null,null,null,null,null,null,null,null,null,null,null,null,null,null,null,null,null,1]
[null,null,null,null,null,null,null,null,null,null,null,null,null,null,null,null,null,null,null,null,null,1]
[null,null,"VERIFICA STAGING",null,null,null,null,null,null,null,null,null,null,null,"VERIFICA INSTALLATORE",null,null,null,null,null,null,1]
[null,null,null,null,null,null,null,null,null,null,null,null,null,null,null,null,null,null,null,null,null,1]
[null,null,null,null,null,null,null,null,null,null,null,null,null,null,null,null,null,null,null,null,null,1]
[null,null,null,null,null,null,null,null,null,null,null,null,null,null,null,null,null,null,null,null,null,1]
[null,null,null,null,null,null,null,null,null,null,null,null,null,null,null,null,null,null,null,null,null,1]
[null,null,null,null,null,null,null,null,null,null,null,null,null,null,null,null,null,null,null,null,null,1]

{"sheet":"Server10 Lotto1 R630 2","index":5,"n_rows":147,"n_cols":8,"rows_kept":147,"cut":false,"hidden":false,"merged":[[71,8,74,10],[75,8,78,10],[141,1,141,4],[142,2,142,4],[144,1,144,4],[124,2,124,4],[108,1,108,4],[109,2,109,4],[111,1,111,4],[112,2,112,4],[114,1,114,4],[115,2,115,4],[117,1,117,4],[118,2,118,4],[120,1,120,4],[121,2,121,4],[145,2,145,4],[147,1,147,4],[139,2,139,4],[126,1,126,4],[127,2,127,4],[129,1,129,4],[130,2,130,4],[132,1,132,4],[133,2,133,4],[135,1,135,4],[136,2,136,4],[138,1,138,4],[123,1,123,4],[106,2,106,4],[87,1,87,4],[88,2,88,4],[90,1,90,4],[94,2,94,4],[96,1,96,4],[97,2,97,4],[99,1,99,4],[100,2,100,4],[102,1,102,4],[103,2,103,4],[105,1,105,4],[93,1,93,4],[85,2,85,4],[63,1,63,4],[64,2,64,4],[70,1,70,4],[71,2,71,4],[74,1,74,4],[75,2,75,4],[78,1,78,4],[79,2,79,4],[81,1,81,4],[82,2,82,4],[84,1,84,4],[61,2,61,4],[40,2,40,4],[42,1,42,4],[43,2,43,4],[49,1,49,4],[50,2,50,4],[52,1,52,4],[53,2,53,4],[55,1,55,4],[56,2,56,4],[58,1,58,4],[60,1,60,4],[39,1,39,4],[20,1,20,4],[21,2,21,4],[23,1,23,4],[24,2,24,4],[26,1,26,4],[27,2,27,4],[29,1,29,4],[30,2,30,4],[33,1,33,4],[34,2,34,4],[36,1,36,4],[18,2,18,4],[0,0,3,5],[4,0,4,4],[5,0,5,4],[10,0,11,5],[12,0,12,5]]}
[]
[]
[]
[]
["Server10 Lotto1 R630",null,null,null,null,null,null,"List Price *"]
[null,null,null,null,null,null,null,{"$f":"F17*C16","v":0}]
[]
[]
[]
[]
["Components: \nServer DELL PowerEdge R630 (1CPU Intel® Xeon® E5-2640 v4, 32GB RDIMM, 2xHDD 300GB 10K RPM SAS 12Gbps 2.5in)"]
[]
[]
[]
["PowerEdge R630","Category: Server",null,null,null,{"$f":"1806","v":1806}]
[null,"Quantity: ",null,null,null,{"$f":"SUM(F20:F148)","v":0}]
[null,null,null,null,null,{"$f":"SUM(F15:F16)","v":1806}]
[]
[null,"Base"]
[null,"PowerEdge R630 for Intel v4 CPUs, 8HDD",1,null,"[210-ACXS][329-BCZI]"]
[]
[null,"Configurazione dello chassis"]
[null,"Chassis with up to 8, 2.5\" Hard Drives, up to 2 PCIe Slots (With Optional Riser)",1,null,"[321-BBKJ]"]
[]
[null,"Processore"]
[null,"Intel Xeon E5-2640 v4 2.4GHz 25M Cache 8.0GT/s QPI Turbo HT 10C/20T (90W) Max Mem 2133MHz",1,null,"[338-BJDL]"]
[]
[null,"Processore aggiuntivo"]
[null,"No Additional Processor",{"$f":"VLOOKUP($B$29, CPU_A, 2, FALSE)","v":0},{"$f":"VLOOKUP($B$29, CPU_A, 3, FALSE)","v":""},{"$f":"VLOOKUP($B$29, CPU_A, 5, FALSE)","v":"[374-BBBX]"},{"$f":"VLOOKUP(B29, CPU_A, 12, FALSE)","v":""}]
[]
[null,"Processor Thermal Configuration"]
[null,"1 CPU up to 120W",1,null,"[370-ABWN][412-AAEE]"]
[null,{"$f":"VLOOKUP($B$29, CPU_A, 6, FALSE)","v":""},{"$f":"VLOOKUP($B$29, CPU_A, 7, FALSE)","v":""},null,{"$f":"VLOOKUP($B$29, CPU_A, 8, FALSE)","v":""}]
[]
[null,"Tipo di configurazione memoria"]
[null,"Performance Optimized",1,null,"[370-AAIP]"]
[]
[null,"Memoria Totale in GB",null,{"$f":"IF(('Server10 Lotto1 R630'!$D$12=0),\"\",'Server10 Lotto1 R630'!#REF!)","v":""}]
[null,32]
[]
[null,"Tipo e velocità della memoria DIMM"]
[null,"2400MT/s RDIMMs",1,null,"[370-ACPH]"]
[]
[null,"Capacità di memoria"]
[null,{"$f":"IF($B$29=\"No Additional Processor\",VLOOKUP($B$39, MEM_A1, 8, FALSE),VLOOKUP($B$39, MEM_A2, 8, FALSE))","v":"16GB RDIMM, 2400MT/s, Dual Rank, x8 Data Width"},{"$f":"IF($B$29=\"No Additional Processor\",VLOOKUP($B$39, MEM_A1, 9, FALSE),VLOOKUP($B$39, MEM_A2, 9, FALSE))","v":"2"},null,{"$f":"IF($B$29=\"No Additional Processor\",VLOOKUP($B$39, MEM_A1, 10, FALSE),VLOOKUP($B$39, MEM_A2, 10, FALSE))","v":"[370-ACNX]"}]
[]
[null,{"$f":"IF($B$29=\"No Additional Processor\",VLOOKUP($B$39, MEM_A1, 2, FALSE),VLOOKUP($B$39, MEM_A2, 2, FALSE))","v":""},{"$f":"IF($B$29=\"No Additional Processor\",VLOOKUP($B$39, MEM_A1, 3, FALSE),VLOOKUP($B$39, MEM_A2, 3, FALSE))","v":""},{"$f":"IF($B$29=\"No Additional Processor\",VLOOKUP($B$39, MEM_A1, 4, FALSE),VLOOKUP($B$39, MEM_A2, 4, FALSE))","v":""},{"$f":"IF($B$29=\"No Additional Processor\",VLOOKUP($B$39, MEM_A1, 6, FALSE),VLOOKUP($B$39, MEM_A2, 6, FALSE))","v":""},{"$f":"IF($B$29=\"No Additional Processor\",VLOOKUP($B$39, MEM_A1, 7, FALSE),VLOOKUP($B$39, MEM_A2, 7, FALSE))","v":""}]
[]
[null,{"$f":"IF($B$29=\"No Additional Processor\",VLOOKUP($B$39, MEM_A1, 11, FALSE),VLOOKUP($B$39, MEM_A2, 11, FALSE))","v":""},{"$f":"IF($B$29=\"No Additional Processor\",VLOOKUP($B$39, MEM_A1, 12, FALSE),VLOOKUP($B$39, MEM_A2, 12, FALSE))","v":""},{"$f":"IF($B$29=\"No Additional Processor\",VLOOKUP($B$39, MEM_A1, 13, FALSE),VLOOKUP($B$39, MEM_A2, 13, FALSE))","v":""},{"$f":"IF($B$29=\"No Additional Processor\",VLOOKUP($B$39, MEM_A1, 15, FALSE),VLOOKUP($B$39, MEM_A2, 15, FALSE))","v":""},{"$f":"IF($B$29=\"No Additional Processor\",VLOOKUP($B$39, MEM_A1, 16, FALSE),VLOOKUP($B$39, MEM_A2, 16, FALSE))","v":""}]
[]
[null,"Sistema operativo preinstallato"]
[null,"No Operating System",{"$f":"VLOOKUP($B$52, OS_A, 2, FALSE)","v":""},{"$f":"VLOOKUP($B$52, OS_A, 3, FALSE)","v":""},{"$f":"VLOOKUP($B$52, OS_A, 5, FALSE)","v":"[611-BBBF]"},{"$f":"VLOOKUP($B$52, OS_A, 6, FALSE)","v":""}]
[]
[null,"OS Media Kits"]
[null,"No Media Required",1,null,"[605-BBFN]"]
[]
[null,"Client Access Licenses"]
[null,{"$f":"VLOOKUP($B$52, OS_A, 7, FALSE)","v":"None"},null,{"$f":"VLOOKUP($B$52, OS_A, 9, FALSE)","v":""},{"$f":"VLOOKUP($B$52, OS_A, 11, FALSE)","v":""},{"$f":"VLOOKUP($B$52, OS_A, 12, FALSE)*C58","v":0}]
[]
[null,{"$f":"VLOOKUP($B$52, OS_A, 13, FALSE)","v":"None"},null,{"$f":"VLOOKUP($B$52, OS_A, 15, FALSE)","v":""},{"$f":"VLOOKUP($B$52, OS_A, 17, FALSE)","v":""},{"$f":"VLOOKUP($B$52, OS_A, 18, FALSE)*C60","v":0}]
[]
[null,"Controller RAID"]
[null,"PERC H330 RAID Controller",1,null,"[405-AAEF]"]
[]
[null,"Dischi rigidi"]
[null,"300GB 10K RPM SAS 12Gbps 2.5in Hot-plug Hard Drive",2,null,"[400-AJPK]"]
[]
[null,"300GB 10K RPM SAS 12Gbps 2.5in Hot-plug Hard Drive,CusKit",null,{"$f":"VLOOKUP($B$68, HDD_A,3, FALSE)","v":"10L1-HDD300GB"},{"$f":"VLOOKUP($B$68, HDD_A,5, FALSE)","v":"[400-AJOQ]"},{"$f":"VLOOKUP($B$68, HDD_A,6, FALSE)*C68","v":0}]
[]
[null,"1TB 7.2K RPM NLSAS 6Gbps 2.5in Hot-plug Hard Drive,13G,CusKit",null,{"$f":"VLOOKUP($B$70, HDD_A,3, FALSE)","v":"10L1-HDD1TB"},{"$f":"VLOOKUP($B$70, HDD_A,5, FALSE)","v":"[400-AEFF]"},{"$f":"VLOOKUP($B$70, HDD_A,6, FALSE)*C70","v":0}]
[]
[null,"Configurazione RAID HDD 300GB"]
[null,"C3 - RAID 1 for H330 (2 HDDs)",1,null,{"$f":"VLOOKUP($B$73,  RAID_AA1, 2, FALSE)","v":"[780-BBJK]"}]
[null,"Hot Spare for 300GB HDD","No"]
[]
[null,"Configurazione RAID HDD 1TB"]
[null,"",1,null,{"$f":"VLOOKUP($B$77,  RAID_AA2, 2, FALSE)","v":""}]
[null,"Hot Spare for 1TB HDD","No"]
[]
[null,"Impostazioni del BIOS per la gestione dell'alimentazione"]
[null,"Performance BIOS Setting",1,null,"[384-BBBL]"]
[]
[null,"Alimentatore"]
[null,"Dual, Hot-plug, Redundant Power Supply (1+1), 750W, Titanium, 200-240VAC",1,null,"[450-ADWT]"]
[]
[null,"Cavi di alimentazione"]
[null,"Rack Power Cord 2M (C13/C14 12A)",2,null,"[450-AADY]"]
[]
[null,"PCIe Riser"]
[null,{"$f":"VLOOKUP(B29, CPU_A, 9, FALSE)","v":"Riser with up to 1, x8 PCIe Slots + 1, x16 PCIe Slots for x8, 2 PCIe Chassis with 1 Processor"},{"$f":"VLOOKUP($B$29, CPU_A, 10, FALSE)","v":1},null,{"$f":"VLOOKUP($B$29, CPU_A, 11, FALSE)","v":"[330-BBCS]"}]
[]
[null,"TPM Module"]
[null,"PowerEdge Server FIPS TPM 2.0",1,null,"[461-AADM]"]
[]
[null,"Embedded Systems Management"]
[null,"iDrac8, Enterprise with Open Manage Essentials",1,null,"[385-BBHO][634-BBWU]"]
[]
[null,"Adattatore di rete"]
[null,"Broadcom 5720 QP 1Gb Network Daughter Card",1,null,"[540-BBBW]"]
[]
[null,"Additional Card for PCIe Slot 1 (Low Profile)"]
[null,"None",{"$f":"VLOOKUP($B$102,  PCI_A1, 2, FALSE)","v":""},{"$f":"VLOOKUP($B$102,  PCI_A1, 3, FALSE)","v":""},{"$f":"VLOOKUP($B$102,  PCI_A1, 5, FALSE)","v":""},{"$f":"VLOOKUP($B$102,  PCI_A1, 6, FALSE)","v":""}]
[]
[null,"Additional Card for PCIe Slot 2 (Full height)"]
[null,"None",{"$f":"VLOOKUP($B$105,  PCI_A2, 2, FALSE)","v":""},{"$f":"VLOOKUP($B$105,  PCI_A2, 3, FALSE)","v":""},{"$f":"VLOOKUP($B$105,  PCI_A2, 5, FALSE)","v":""},{"$f":"VLOOKUP($B$105,  PCI_A2, 6, FALSE)","v":""}]
[]
[null,"Pannello frontale"]
[null,"Bezel 8 Drive Chassis",1,null,"[325-BBII]"]
[]
[null,"Guide per rack"]
[null,"ReadyRails™ Sliding Rails Without Cable Management Arm",1,null,"[770-BBBC]"]
[]
[null,"Unità ottica interna"]
[null,"No Internal Optical Drive for 8 HDD Chassis",1,null,"[429-AAQN]"]
[]
[null,"Accessori Server"]
[null,"PowerEdge SFP+, 10GbE SR/SX, Optical Tranceiver, LC Connector, for Intel and Broadcom,CusKit",{"$f":"(VLOOKUP(B105,PCI_A2,8,FALSE))+((VLOOKUP(B102,PCI_A1,8,FALSE)))","v":0},null,"[407-BBQE]"]
[]
[null,"Sistema documentazione"]
[null,"Electronic System Documentation and OpenManage DVD Kit",1,null,"[343-BBDK]"]
[]
[null,"SHIPPING"]
[null,"R630 Shipping - 8 Drive Chassis, EMEA1 (English/French/German/Spanish/Russian/Hebrew)",1,null,"[340-AMIN]"]
[]
[null,"Order Information"]
[null,"PowerEdge Order - EMEA",1,null,"[800-11671]"]
[]
[null,"Base warranty"]
[null,"3Yr Basic Warranty - Next Business Day - Minimum Warranty",1,null,"[709-12767][709-12768]"]
[]
[null,"Servizi di assitenza"]
[null,"Dell Channel Order - Service Info only",1,null,"[710-31085]"]
[]
[null,"Aggiornamenti della garanzia"]
[null,"None",{"$f":"VLOOKUP($B$135,  SO_A1, 2, FALSE)","v":""},{"$f":"VLOOKUP($B$135,  SO_A1, 3, FALSE)","v":""},{"$f":"VLOOKUP($B$135,  SO_A1, 5, FALSE)","v":""},{"$f":"VLOOKUP($B$135,  SO_A1, 6, FALSE)","v":""}]
[]
[null,"Protezione dei dati - Keep Your Hard Drive "]
[null,"None",{"$f":"VLOOKUP($B$138,  SO_A2, 2, FALSE)","v":""},{"$f":"VLOOKUP($B$138,  SO_A2, 3, FALSE)","v":""},{"$f":"VLOOKUP($B$138,  SO_A2,5, FALSE)","v":""},{"$f":"VLOOKUP($B$138,  SO_A2, 6, FALSE)","v":""}]
[]
[null,"Servizi di Installazione"]
[null,"No Installation Service Selected",1,null,"[683-11870]"]
[]
[null,"Channel only - Support Extension"]
[null,"Channel 39M Basic Warranty - Next Business Day",1,null,"[723-28776]"]
[]
[null,"Warranty Upgrades - Non-Std/Local POS"]
[null,"CSTM CONSIP - 39M Onsite Labor Support for CRU for Servers with Basic Warranty",1,null,"[681-24467]"]

{"sheet":"Server10 Lotto1 R630 3","index":6,"n_rows":147,"n_cols":8,"rows_kept":147,"cut":false,"hidden":false,"merged":[[71,8,74,10],[75,8,78,10],[141,1,141,4],[142,2,142,4],[144,1,144,4],[124,2,124,4],[108,1,108,4],[109,2,109,4],[111,1,111,4],[112,2,112,4],[114,1,114,4],[115,2,115,4],[117,1,117,4],[118,2,118,4],[120,1,120,4],[121,2,121,4],[145,2,145,4],[147,1,147,4],[139,2,139,4],[126,1,126,4],[127,2,127,4],[129,1,129,4],[130,2,130,4],[132,1,132,4],[133,2,133,4],[135,1,135,4],[136,2,136,4],[138,1,138,4],[123,1,123,4],[106,2,106,4],[87,1,87,4],[88,2,88,4],[90,1,90,4],[94,2,94,4],[96,1,96,4],[97,2,97,4],[99,1,99,4],[100,2,100,4],[102,1,102,4],[103,2,103,4],[105,1,105,4],[93,1,93,4],[85,2,85,4],[63,1,63,4],[64,2,64,4],[70,1,70,4],[71,2,71,4],[74,1,74,4],[75,2,75,4],[78,1,78,4],[79,2,79,4],[81,1,81,4],[82,2,82,4],[84,1,84,4],[61,2,61,4],[40,2,40,4],[42,1,42,4],[43,2,43,4],[49,1,49,4],[50,2,50,4],[52,1,52,4],[53,2,53,4],[55,1,55,4],[56,2,56,4],[58,1,58,4],[60,1,60,4],[39,1,39,4],[20,1,20,4],[21,2,21,4],[23,1,23,4],[24,2,24,4],[26,1,26,4],[27,2,27,4],[29,1,29,4],[30,2,30,4],[33,1,33,4],[34,2,34,4],[36,1,36,4],[18,2,18,4],[0,0,3,5],[4,0,4,4],[5,0,5,4],[10,0,11,5],[12,0,12,5]]}
[]
[]
[]
[]
["Server10 Lotto1 R630",null,null,null,null,null,null,"List Price *"]
[null,null,null,null,null,null,null,{"$f":"F17*C16","v":0}]
[]
[]
[]
[]
["Components: \nServer DELL PowerEdge R630 (1CPU Intel® Xeon® E5-2640 v4, 32GB RDIMM, 2xHDD 300GB 10K RPM SAS 12Gbps 2.5in)"]
[]
[]
[]
["PowerEdge R630","Category: Server",null,null,null,{"$f":"1806","v":1806}]
[null,"Quantity: ",null,null,null,{"$f":"SUM(F20:F148)","v":0}]
[null,null,null,null,null,{"$f":"SUM(F15:F16)","v":1806}]
[]
[null,"Base"]
[null,"PowerEdge R630 for Intel v4 CPUs, 8HDD",1,null,"[210-ACXS][329-BCZI]"]
[]
[null,"Configurazione dello chassis"]
[null,"Chassis with up to 8, 2.5\" Hard Drives, up to 2 PCIe Slots (With Optional Riser)",1,null,"[321-BBKJ]"]
[]
[null,"Processore"]
[null,"Intel Xeon E5-2640 v4 2.4GHz 25M Cache 8.0GT/s QPI Turbo HT 10C/20T (90W) Max Mem 2133MHz",1,null,"[338-BJDL]"]
[]
[null,"Processore aggiuntivo"]
[null,"No Additional Processor",{"$f":"VLOOKUP($B$29, CPU_A, 2, FALSE)","v":0},{"$f":"VLOOKUP($B$29, CPU_A, 3, FALSE)","v":""},{"$f":"VLOOKUP($B$29, CPU_A, 5, FALSE)","v":"[374-BBBX]"},{"$f":"VLOOKUP(B29, CPU_A, 12, FALSE)","v":""}]
[]
[null,"Processor Thermal Configuration"]
[null,"1 CPU up to 120W",1,null,"[370-ABWN][412-AAEE]"]
[null,{"$f":"VLOOKUP($B$29, CPU_A, 6, FALSE)","v":""},{"$f":"VLOOKUP($B$29, CPU_A, 7, FALSE)","v":""},null,{"$f":"VLOOKUP($B$29, CPU_A, 8, FALSE)","v":""}]
[]
[null,"Tipo di configurazione memoria"]
[null,"Performance Optimized",1,null,"[370-AAIP]"]
[]
[null,"Memoria Totale in GB",null,{"$f":"IF(('Server10 Lotto1 R630'!$D$12=0),\"\",'Server10 Lotto1 R630'!#REF!)","v":""}]
[null,32]
[]
[null,"Tipo e velocità della memoria DIMM"]
[null,"2400MT/s RDIMMs",1,null,"[370-ACPH]"]
[]
[null,"Capacità di memoria"]
[null,{"$f":"IF($B$29=\"No Additional Processor\",VLOOKUP($B$39, MEM_A1, 8, FALSE),VLOOKUP($B$39, MEM_A2, 8, FALSE))","v":"16GB RDIMM, 2400MT/s, Dual Rank, x8 Data Width"},{"$f":"IF($B$29=\"No Additional Processor\",VLOOKUP($B$39, MEM_A1, 9, FALSE),VLOOKUP($B$39, MEM_A2, 9, FALSE))","v":"2"},null,{"$f":"IF($B$29=\"No Additional Processor\",VLOOKUP($B$39, MEM_A1, 10, FALSE),VLOOKUP($B$39, MEM_A2, 10, FALSE))","v":"[370-ACNX]"}]
[]
[null,{"$f":"IF($B$29=\"No Additional Processor\",VLOOKUP($B$39, MEM_A1, 2, FALSE),VLOOKUP($B$39, MEM_A2, 2, FALSE))","v":""},{"$f":"IF($B$29=\"No Additional Processor\",VLOOKUP($B$39, MEM_A1, 3, FALSE),VLOOKUP($B$39, MEM_A2, 3, FALSE))","v":""},{"$f":"IF($B$29=\"No Additional Processor\",VLOOKUP($B$39, MEM_A1, 4, FALSE),VLOOKUP($B$39, MEM_A2, 4, FALSE))","v":""},{"$f":"IF($B$29=\"No Additional Processor\",VLOOKUP($B$39, MEM_A1, 6, FALSE),VLOOKUP($B$39, MEM_A2, 6, FALSE))","v":""},{"$f":"IF($B$29=\"No Additional Processor\",VLOOKUP($B$39, MEM_A1, 7, FALSE),VLOOKUP($B$39, MEM_A2, 7, FALSE))","v":""}]
[]
[null,{"$f":"IF($B$29=\"No Additional Processor\",VLOOKUP($B$39, MEM_A1, 11, FALSE),VLOOKUP($B$39, MEM_A2, 11, FALSE))","v":""},{"$f":"IF($B$29=\"No Additional Processor\",VLOOKUP($B$39, MEM_A1, 12, FALSE),VLOOKUP($B$39, MEM_A2, 12, FALSE))","v":""},{"$f":"IF($B$29=\"No Additional Processor\",VLOOKUP($B$39, MEM_A1, 13, FALSE),VLOOKUP($B$39, MEM_A2, 13, FALSE))","v":""},{"$f":"IF($B$29=\"No Additional Processor\",VLOOKUP($B$39, MEM_A1, 15, FALSE),VLOOKUP($B$39, MEM_A2, 15, FALSE))","v":""},{"$f":"IF($B$29=\"No Additional Processor\",VLOOKUP($B$39, MEM_A1, 16, FALSE),VLOOKUP($B$39, MEM_A2, 16, FALSE))","v":""}]
[]
[null,"Sistema operativo preinstallato"]
[null,"No Operating System",{"$f":"VLOOKUP($B$52, OS_A, 2, FALSE)","v":""},{"$f":"VLOOKUP($B$52, OS_A, 3, FALSE)","v":""},{"$f":"VLOOKUP($B$52, OS_A, 5, FALSE)","v":"[611-BBBF]"},{"$f":"VLOOKUP($B$52, OS_A, 6, FALSE)","v":""}]
[]
[null,"OS Media Kits"]
[null,"No Media Required",1,null,"[605-BBFN]"]
[]
[null,"Client Access Licenses"]
[null,{"$f":"VLOOKUP($B$52, OS_A, 7, FALSE)","v":"None"},null,{"$f":"VLOOKUP($B$52, OS_A, 9, FALSE)","v":""},{"$f":"VLOOKUP($B$52, OS_A, 11, FALSE)","v":""},{"$f":"VLOOKUP($B$52, OS_A, 12, FALSE)*C58","v":0}]
[]
[null,{"$f":"VLOOKUP($B$52, OS_A, 13, FALSE)","v":"None"},null,{"$f":"VLOOKUP($B$52, OS_A, 15, FALSE)","v":""},{"$f":"VLOOKUP($B$52, OS_A, 17, FALSE)","v":""},{"$f":"VLOOKUP($B$52, OS_A, 18, FALSE)*C60","v":0}]
[]
[null,"Controller RAID"]
[null,"PERC H330 RAID Controller",1,null,"[405-AAEF]"]
[]
[null,"Dischi rigidi"]
[null,"300GB 10K RPM SAS 12Gbps 2.5in Hot-plug Hard Drive",2,null,"[400-AJPK]"]
[]
[null,"300GB 10K RPM SAS 12Gbps 2.5in Hot-plug Hard Drive,CusKit",null,{"$f":"VLOOKUP($B$68, HDD_A,3, FALSE)","v":"10L1-HDD300GB"},{"$f":"VLOOKUP($B$68, HDD_A,5, FALSE)","v":"[400-AJOQ]"},{"$f":"VLOOKUP($B$68, HDD_A,6, FALSE)*C68","v":0}]
[]
[null,"1TB 7.2K RPM NLSAS 6Gbps 2.5in Hot-plug Hard Drive,13G,CusKit",null,{"$f":"VLOOKUP($B$70, HDD_A,3, FALSE)","v":"10L1-HDD1TB"},{"$f":"VLOOKUP($B$70, HDD_A,5, FALSE)","v":"[400-AEFF]"},{"$f":"VLOOKUP($B$70, HDD_A,6, FALSE)*C70","v":0}]
[]
[null,"Configurazione RAID HDD 300GB"]
[null,"C3 - RAID 1 for H330 (2 HDDs)",1,null,{"$f":"VLOOKUP($B$73,  RAID_AAA1, 2, FALSE)","v":"[780-BBJK]"}]
[null,"Hot Spare for 300GB HDD","No"]
[]
[null,"Configurazione RAID HDD 1TB"]
[null,"",1,null,{"$f":"VLOOKUP($B$77,  RAID_AAA2, 2, FALSE)","v":""}]
[null,"Hot Spare for 1TB HDD","No"]
[]
[null,"Impostazioni del BIOS per la gestione dell'alimentazione"]
[null,"Performance BIOS Setting",1,null,"[384-BBBL]"]
[]
[null,"Alimentatore"]
[null,"Dual, Hot-plug, Redundant Power Supply (1+1), 750W, Titanium, 200-240VAC",1,null,"[450-ADWT]"]
[]
[null,"Cavi di alimentazione"]
[null,"Rack Power Cord 2M (C13/C14 12A)",2,null,"[450-AADY]"]
[]
[null,"PCIe Riser"]
[null,{"$f":"VLOOKUP(B29, CPU_A, 9, FALSE)","v":"Riser with up to 1, x8 PCIe Slots + 1, x16 PCIe Slots for x8, 2 PCIe Chassis with 1 Processor"},{"$f":"VLOOKUP($B$29, CPU_A, 10, FALSE)","v":1},null,{"$f":"VLOOKUP($B$29, CPU_A, 11, FALSE)","v":"[330-BBCS]"}]
[]
[null,"TPM Module"]
[null,"PowerEdge Server FIPS TPM 2.0",1,null,"[461-AADM]"]
[]
[null,"Embedded Systems Management"]
[null,"iDrac8, Enterprise with Open Manage Essentials",1,null,"[385-BBHO][634-BBWU]"]
[]
[null,"Adattatore di rete"]
[null,"Broadcom 5720 QP 1Gb Network Daughter Card",1,null,"[540-BBBW]"]
[]
[null,"Additional Card for PCIe Slot 1 (Low Profile)"]
[null,"None",{"$f":"VLOOKUP($B$102,  PCI_A1, 2, FALSE)","v":""},{"$f":"VLOOKUP($B$102,  PCI_A1, 3, FALSE)","v":""},{"$f":"VLOOKUP($B$102,  PCI_A1, 5, FALSE)","v":""},{"$f":"VLOOKUP($B$102,  PCI_A1, 6, FALSE)","v":""}]
[]
[null,"Additional Card for PCIe Slot 2 (Full height)"]
[null,"None",{"$f":"VLOOKUP($B$105,  PCI_A2, 2, FALSE)","v":""},{"$f":"VLOOKUP($B$105,  PCI_A2, 3, FALSE)","v":""},{"$f":"VLOOKUP($B$105,  PCI_A2, 5, FALSE)","v":""},{"$f":"VLOOKUP($B$105,  PCI_A2, 6, FALSE)","v":""}]
[]
[null,"Pannello frontale"]
[null,"Bezel 8 Drive Chassis",1,null,"[325-BBII]"]
[]
[null,"Guide per rack"]
[null,"ReadyRails™ Sliding Rails Without Cable Management Arm",1,null,"[770-BBBC]"]
[]
[null,"Unità ottica interna"]
[null,"No Internal Optical Drive for 8 HDD Chassis",1,null,"[429-AAQN]"]
[]
[null,"Accessori Server"]
[null,"PowerEdge SFP+, 10GbE SR/SX, Optical Tranceiver, LC Connector, for Intel and Broadcom,CusKit",{"$f":"(VLOOKUP(B105,PCI_A2,8,FALSE))+((VLOOKUP(B102,PCI_A1,8,FALSE)))","v":0},null,"[407-BBQE]"]
[]
[null,"Sistema documentazione"]
[null,"Electronic System Documentation and OpenManage DVD Kit",1,null,"[343-BBDK]"]
[]
[null,"SHIPPING"]
[null,"R630 Shipping - 8 Drive Chassis, EMEA1 (English/French/German/Spanish/Russian/Hebrew)",1,null,"[340-AMIN]"]
[]
[null,"Order Information"]
[null,"PowerEdge Order - EMEA",1,null,"[800-11671]"]
[]
[null,"Base warranty"]
[null,"3Yr Basic Warranty - Next Business Day - Minimum Warranty",1,null,"[709-12767][709-12768]"]
[]
[null,"Servizi di assitenza"]
[null,"Dell Channel Order - Service Info only",1,null,"[710-31085]"]
[]
[null,"Aggiornamenti della garanzia"]
[null,"None",{"$f":"VLOOKUP($B$135,  SO_A1, 2, FALSE)","v":""},{"$f":"VLOOKUP($B$135,  SO_A1, 3, FALSE)","v":""},{"$f":"VLOOKUP($B$135,  SO_A1, 5, FALSE)","v":""},{"$f":"VLOOKUP($B$135,  SO_A1, 6, FALSE)","v":""}]
[]
[null,"Protezione dei dati - Keep Your Hard Drive "]
[null,"None",{"$f":"VLOOKUP($B$138,  SO_A2, 2, FALSE)","v":""},{"$f":"VLOOKUP($B$138,  SO_A2, 3, FALSE)","v":""},{"$f":"VLOOKUP($B$138,  SO_A2,5, FALSE)","v":""},{"$f":"VLOOKUP($B$138,  SO_A2, 6, FALSE)","v":""}]
[]
[null,"Servizi di Installazione"]
[null,"No Installation Service Selected",1,null,"[683-11870]"]
[]
[null,"Channel only - Support Extension"]
[null,"Channel 39M Basic Warranty - Next Business Day",1,null,"[723-28776]"]
[]
[null,"Warranty Upgrades - Non-Std/Local POS"]
[null,"CSTM CONSIP - 39M Onsite Labor Support for CRU for Servers with Basic Warranty",1,null,"[681-24467]"]

{"sheet":"Server10 Lotto1 R730xd 2","index":7,"n_rows":156,"n_cols":8,"rows_kept":156,"cut":false,"hidden":false,"merged":[[71,8,74,10],[75,8,78,10],[27,2,27,4],[0,0,3,5],[4,0,4,4],[5,0,5,4],[10,0,11,5],[12,0,12,5],[18,2,18,4],[20,1,20,4],[21,2,21,4],[23,1,23,4],[24,2,24,4],[26,1,26,4],[52,1,52,4],[29,1,29,4],[30,2,30,4],[33,1,33,4],[34,2,34,4],[36,1,36,4],[39,1,39,4],[40,2,40,4],[42,1,42,4],[43,2,43,4],[49,1,49,4],[50,2,50,4],[75,2,75,4],[53,2,53,4],[55,1,55,4],[56,2,56,4],[58,1,58,4],[60,1,60,4],[61,2,61,4],[63,1,63,4],[64,2,64,4],[70,1,70,4],[71,2,71,4],[74,1,74,4],[97,2,97,4],[78,1,78,4],[79,2,79,4],[81,1,81,4],[82,2,82,4],[84,1,84,4],[85,2,85,4],[87,1,87,4],[88,2,88,4],[90,1,90,4],[94,2,94,4],[96,1,96,4],[93,1,93,4],[115,2,115,4],[99,1,99,4],[100,2,100,4],[102,1,102,4],[103,2,103,4],[105,1,105,4],[106,2,106,4],[108,1,108,4],[109,2,109,4],[111,1,111,4],[112,2,112,4],[114,1,114,4],[133,2,133,4],[117,1,117,4],[118,2,118,4],[120,1,120,4],[121,2,121,4],[123,1,123,4],[124,2,124,4],[126,1,126,4],[127,2,127,4],[129,1,129,4],[130,2,130,4],[132,1,132,4],[148,2,148,4],[135,1,135,4],[136,2,136,4],[138,1,138,4],[139,2,139,4],[141,1,141,4],[142,2,142,4],[144,1,144,4],[145,2,145,4],[147,1,147,4],[150,1,150,4],[151,2,151,4],[153,1,153,4],[154,2,154,4],[156,1,156,4]]}
[]
[]
[]
[]
["Server10 Lotto1 R730xd",null,null,null,null,null,null,"List Price *"]
[null,null,null,null,null,null,null,{"$f":"F17*C16","v":0}]
[]
[]
[]
[]
["Components: \nServer DELL PowerEdge R730xd (1CPU Intel® Xeon® E5-2620 v4, 32GB RDIMM, 2xHDD 300GB 10K RPM SAS 12Gbps 2.5in)"]
[]
[]
[]
["PowerEdge R730xd","Category: Server",null,null,null,{"$f":"1728","v":1728}]
[null,"Quantity: ",null,null,null,{"$f":"SUM(F20:F157)","v":0}]
[null,null,null,null,null,{"$f":"SUM(F15:F16)","v":1728}]
[]
[null,"Base"]
[null,"PowerEdge R730xd for Intel v4 CPUs",1,null,"[210-ADBC][329-BCZK]"]
[]
[null,"Configurazione dello chassis"]
[null,"Chassis with up to 24, 2.5\" Hard Drives",1,null,"[350-BBFD]"]
[]
[null,"Processore"]
[null,"Intel Xeon E5-2620 v4 2.1GHz 20M Cache 8.0GT/s QPI Turbo HT 8C/16T (85W) Max Mem 2133MHz",1,null,"[338-BJCZ]"]
[]
[null,"Processore aggiuntivo"]
[null,"No Additional Processor",{"$f":"VLOOKUP($B$29, CPU_B, 2, FALSE)","v":0},{"$f":"VLOOKUP($B$29, CPU_B, 3, FALSE)","v":""},{"$f":"VLOOKUP($B$29, CPU_B, 5, FALSE)","v":"[374-BBBX]"},{"$f":"VLOOKUP(B29, CPU_B, 12, FALSE)","v":""}]
[]
[null,"Processor Thermal Configuration"]
[null,"1 CPU Standard",1,null,"[370-ABWF][374-BBHM][750-AAEL]"]
[null,{"$f":"VLOOKUP($B$29, CPU_B, 6, FALSE)","v":""},{"$f":"VLOOKUP($B$29, CPU_B, 7, FALSE)","v":""},null,{"$f":"VLOOKUP($B$29, CPU_B, 8, FALSE)","v":""}]
[]
[null,"Tipo di configurazione memoria"]
[null,"Performance Optimized",1,null,"[370-AAIP]"]
[]
[null,"Memoria Totale in GB",null,{"$f":"IF(('Server10 Lotto1 R730xd'!$D$12=0),\"\",'Server10 Lotto1 R730xd'!#REF!)","v":""}]
[null,32]
[]
[null,"Tipo e velocità della memoria DIMM"]
[null,"2400MT/s RDIMMs",1,null,"[370-ACPH]"]
[]
[null,"Capacità di memoria"]
[null,"16GB RDIMM, 2400MT/s, Dual Rank, x8 Data Width",{"$f":"IF($B$29=\"No Additional Processor\",VLOOKUP($B$39, MEM_B1, 9, FALSE),VLOOKUP($B$39, MEM_B2, 9, FALSE))","v":"2"},null,{"$f":"IF($B$29=\"No Additional Processor\",VLOOKUP($B$39, MEM_B1, 10, FALSE),VLOOKUP($B$39, MEM_B2, 10, FALSE))","v":"[370-ACNX]"}]
[]
[null,{"$f":"IF($B$29=\"No Additional Processor\",VLOOKUP($B$39, MEM_B1, 2, FALSE),VLOOKUP($B$39, MEM_B2, 2, FALSE))","v":""},{"$f":"IF($B$29=\"No Additional Processor\",VLOOKUP($B$39, MEM_B1, 3, FALSE),VLOOKUP($B$39, MEM_B2, 3, FALSE))","v":""},{"$f":"IF($B$29=\"No Additional Processor\",VLOOKUP($B$39, MEM_B1, 4, FALSE),VLOOKUP($B$39, MEM_B2, 4, FALSE))","v":""},{"$f":"IF($B$29=\"No Additional Processor\",VLOOKUP($B$39, MEM_B1, 6, FALSE),VLOOKUP($B$39, MEM_B2, 6, FALSE))","v":""},{"$f":"IF($B$29=\"No Additional Processor\",VLOOKUP($B$39, MEM_B1, 7, FALSE),VLOOKUP($B$39, MEM_B2, 7, FALSE))","v":""}]
[]
[null,{"$f":"IF($B$29=\"No Additional Processor\",VLOOKUP($B$39, MEM_B1, 11, FALSE),VLOOKUP($B$39, MEM_B2, 11, FALSE))","v":""},{"$f":"IF($B$29=\"No Additional Processor\",VLOOKUP($B$39, MEM_B1, 12, FALSE),VLOOKUP($B$39, MEM_B2, 12, FALSE))","v":""},{"$f":"IF($B$29=\"No Additional Processor\",VLOOKUP($B$39, MEM_B1, 13, FALSE),VLOOKUP($B$39, MEM_B2, 13, FALSE))","v":""},{"$f":"IF($B$29=\"No Additional Processor\",VLOOKUP($B$39, MEM_B1, 15, FALSE),VLOOKUP($B$39, MEM_B2, 15, FALSE))","v":""},{"$f":"IF($B$29=\"No Additional Processor\",VLOOKUP($B$39, MEM_B1, 16, FALSE),VLOOKUP($B$39, MEM_B2, 16, FALSE))","v":""}]
[]
[null,"Sistema operativo preinstallato"]
[null,"No Operating System",{"$f":"VLOOKUP($B$52, OS_B, 2, FALSE)","v":""},{"$f":"VLOOKUP($B$52, OS_B, 3, FALSE)","v":""},{"$f":"VLOOKUP($B$52, OS_B, 5, FALSE)","v":"[611-BBBF]"},{"$f":"VLOOKUP($B$52, OS_B, 6, FALSE)","v":""}]
[]
[null,"OS Media Kits"]
[null,"No Media Required",1,null,"[605-BBFN]"]
[]
[null,"Client Access Licenses"]
[null,{"$f":"VLOOKUP($B$52, OS_B, 7, FALSE)","v":"None"},null,{"$f":"VLOOKUP($B$52, OS_B, 9, FALSE)","v":""},{"$f":"VLOOKUP($B$52, OS_B, 11, FALSE)","v":""},{"$f":"VLOOKUP($B$52, OS_B, 12, FALSE)*C58","v":0}]
[]
[null,{"$f":"VLOOKUP($B$52, OS_B, 13, FALSE)","v":"None"},null,{"$f":"VLOOKUP($B$52, OS_B, 15, FALSE)","v":""},{"$f":"VLOOKUP($B$52, OS_B, 17, FALSE)","v":""},{"$f":"VLOOKUP($B$52, OS_B, 18, FALSE)*C60","v":0}]
[]
[null,"Controller RAID"]
[null,"PERC H330 RAID Controller",1,null,"[405-AAEF]"]
[]
[null,"Dischi rigidi"]
[null,"300GB 10K RPM SAS 12Gbps 2.5in Hot-plug Hard Drive",2,null,"[400-AJPK]"]
[]
[null,"300GB 10K RPM SAS 12Gbps 2.5in Hot-plug Hard Drive,CusKit",null,{"$f":"VLOOKUP($B$68, HDD_A,3, FALSE)","v":"10L1-HDD300GB"},{"$f":"VLOOKUP($B$68, HDD_A,5, FALSE)","v":"[400-AJOQ]"},{"$f":"VLOOKUP($B$68, HDD_A,6, FALSE)*C68","v":0}]
[]
[null,"1TB 7.2K RPM NLSAS 6Gbps 2.5in Hot-plug Hard Drive,13G,CusKit",null,{"$f":"VLOOKUP($B$70, HDD_A,3, FALSE)","v":"10L1-HDD1TB"},{"$f":"VLOOKUP($B$70, HDD_A,5, FALSE)","v":"[400-AEFF]"},{"$f":"VLOOKUP($B$70, HDD_A,6, FALSE)*C70","v":0}]
[]
[null,"Configurazione RAID HDD 300GB"]
[null,"C3 - RAID 1 for H330 (2 HDDs)",1,null,{"$f":"VLOOKUP($B$73,  RAID_BB1, 2, FALSE)","v":"[780-BBJK]"}]
[null,"Hot Spare for 300GB HDD","No"]
[]
[null,"Configurazione RAID HDD 1TB"]
[null,"",1,null,{"$f":"VLOOKUP($B$77,  RAID_BB2, 2, FALSE)","v":""}]
[null,"Hot Spare for 1TB HDD","No"]
[]
[null,"Impostazioni del BIOS per la gestione dell'alimentazione"]
[null,"Performance BIOS Setting",1,null,"[384-BBBL]"]
[]
[null,"Alimentatore"]
[null,"Dual, Hot-plug, Redundant Power Supply (1+1), 750W, Titanium, 200-240VAC",1,null,"[450-ADWT]"]
[]
[null,"Cavi di alimentazione"]
[null,"Rack Power Cord 2M (C13/C14 12A)",2,null,"[450-AADY]"]
[]
[null,"PCIe Riser"]
[null,"Risers with up to 4, x8 PCIe Slots + 2, x16 PCIe Slots",1,null,"[330-BBCO][330-BBCR]"]
[]
[null,"TPM Module"]
[null,"PowerEdge Server FIPS TPM 2.0",1,null,"[461-AADM]"]
[]
[null,"Embedded Systems Management"]
[null,"iDRAC8 Enterprise, integrated Dell Remote Access Controller, Enterprise",1,null,"[385-BBHO]"]
[]
[null,"Adattatore di rete"]
[null,"Broadcom 5720 QP 1Gb Network Daughter Card",1,null,"[540-BBBW]"]
[]
[null,"Additional Card for PCIe Slot 6 (Full height) (CPU 1)"]
[null,"None",{"$f":"VLOOKUP($B$102,  PCI_B1, 2, FALSE)","v":""},{"$f":"VLOOKUP($B$102,  PCI_B1, 3, FALSE)","v":""},{"$f":"VLOOKUP($B$102,  PCI_B1, 5, FALSE)","v":""},{"$f":"VLOOKUP($B$102,  PCI_B1, 6, FALSE)","v":""}]
[]
[null,"Additional Card for PCIe Slot 5 (Full height) (CPU 1)"]
[null,"None",{"$f":"VLOOKUP($B$105,  PCI_B2, 2, FALSE)","v":""},{"$f":"VLOOKUP($B$105,  PCI_B2, 3, FALSE)","v":""},{"$f":"VLOOKUP($B$105,  PCI_B2, 5, FALSE)","v":""},{"$f":"VLOOKUP($B$105,  PCI_B2, 6, FALSE)","v":""}]
[]
[null,"Additional Card for PCIe Slot 4 (Full height) (CPU 2)"]
[null,"None",{"$f":"IF(B108=\"Aggiungere Secondo Processore\",\"\",(VLOOKUP(B108,PCI_B3, 2, FALSE)))","v":""},{"$f":"IF(B108=\"Aggiungere Secondo Processore\",\"\",(VLOOKUP(B108,  PCI_B3, 3, FALSE)))","v":""},{"$f":"VLOOKUP($B$108,  PCI_B3, 5, FALSE)","v":""},{"$f":"VLOOKUP($B$108,  PCI_B3, 6, FALSE)","v":""}]
[]
[null,"Additional Card for PCIe Slot 3 (Low Profile) (CPU 2)"]
[null,"None",{"$f":"IF(B111=\"Aggiungere Secondo Processore\",\"\",(VLOOKUP(B111,PCI_B4, 2, FALSE)))","v":""},{"$f":"IF(B111=\"Aggiungere Secondo Processore\",\"\",(VLOOKUP(B111,  PCI_B4, 3, FALSE)))","v":""},{"$f":"VLOOKUP($B$111,  PCI_B4, 5, FALSE)","v":""},{"$f":"VLOOKUP($B$111,  PCI_B4, 6, FALSE)","v":""}]
[]
[null,"Additional Card for PCIe Slot 2 (Low Profile) (CPU 2)"]
[null,"None",{"$f":"IF(B114=\"Aggiungere Secondo Processore\",\"\",(VLOOKUP(B114,PCI_B5, 2, FALSE)))","v":""},{"$f":"IF(B114=\"Aggiungere Secondo Processore\",\"\",(VLOOKUP(B114,  PCI_B5, 3, FALSE)))","v":""},{"$f":"VLOOKUP($B$114,  PCI_B5, 5, FALSE)","v":""},{"$f":"VLOOKUP($B$114,  PCI_B5, 6, FALSE)","v":""}]
[]
[null,"Additional Card for PCIe Slot 1 (Low Profile) (CPU 2)"]
[null,"None",{"$f":"IF(B117=\"Aggiungere Secondo Processore\",\"\",(VLOOKUP(B117,PCI_B6, 2, FALSE)))","v":""},{"$f":"IF(B117=\"Aggiungere Secondo Processore\",\"\",(VLOOKUP(B117,  PCI_B6, 3, FALSE)))","v":""},{"$f":"VLOOKUP($B$117,  PCI_B5, 5, FALSE)","v":""},{"$f":"VLOOKUP($B$117,  PCI_B5, 6, FALSE)","v":""}]
[]
[null,"Pannello frontale"]
[null,"Bezel",1,null,"[350-BBEJ]"]
[]
[null,"Guide per rack"]
[null,"ReadyRails™ Sliding Rails Without Cable Management Arm",1,null,"[770-BBBQ]"]
[]
[null,"Server Accessories"]
[null,"PowerEdge SFP+, 10GbE SR/SX, Optical Tranceiver, LC Connector, for Intel and Broadcom,CusKit",{"$f":"(VLOOKUP(B117,PCI_A2,8,FALSE))+((VLOOKUP(B102,PCI_A1,8,FALSE)))","v":0},null,"[407-BBQE]"]
[]
[null,"System Documentation"]
[null,"Electronic System Documentation and OpenManage DVD Kit",1,null,"[631-AAJG]"]
[]
[null,"SHIPPING"]
[null,"PowerEdge R730xd Shipping EMEA1 (English/French/German/Spanish/Russian/Hebrew)",1,null,"[340-AMGS]"]
[]
[null,"Order Information"]
[null,"PowerEdge Order - EMEA",1,null,"[800-11671]"]
[]
[null,"Base warranty"]
[null,"3Yr Basic Warranty - Next Business Day - Minimum Warranty",1,null,"[709-12780][709-12781]"]
[]
[null,"Servizi di assitenza"]
[null,"Dell Channel Order - Service Info only",1,null,"[710-31085]"]
[]
[null,"Aggiornamenti della garanzia"]
[null,"None",{"$f":"VLOOKUP($B$144,  SO_B1,2, FALSE)","v":""},{"$f":"VLOOKUP($B$144,  SO_B1, 3, FALSE)","v":""},{"$f":"VLOOKUP($B$144,  SO_B1, 5, FALSE)","v":""},{"$f":"VLOOKUP($B$144,  SO_B1, 6, FALSE)","v":""}]
[]
[null,"Protezione dei dati - Keep Your Hard Drive "]
[null,"None",{"$f":"VLOOKUP($B$147,  SO_BB2, 2, FALSE)","v":""},{"$f":"VLOOKUP($B$147,  SO_BB2, 3, FALSE)","v":""},{"$f":"VLOOKUP($B$147,  SO_BB2,5, FALSE)","v":""},{"$f":"VLOOKUP($B$147,  SO_BB2, 6, FALSE)","v":""}]
[]
[null,"Servizi di Installazione"]
[null,"No Installation Service Selected",1,null,"[683-11870]"]
[]
[null,"Channel only - Support Extension"]
[null,"Channel 39M Basic Warranty - Next Business Day",1,null,"[723-28780]"]
[]
[null,"Warranty Upgrades - Non-Std/Local POS"]
[null,"CSTM CONSIP - 39M Onsite Labor Support for CRU for Servers with Basic Warranty",1,null,"[681-24467]"]

{"sheet":"Server10 Lotto1 R730xd 3","index":8,"n_rows":156,"n_cols":8,"rows_kept":156,"cut":false,"hidden":false,"merged":[[71,8,74,10],[75,8,78,10],[27,2,27,4],[0,0,3,5],[4,0,4,4],[5,0,5,4],[10,0,11,5],[12,0,12,5],[18,2,18,4],[20,1,20,4],[21,2,21,4],[23,1,23,4],[24,2,24,4],[26,1,26,4],[52,1,52,4],[29,1,29,4],[30,2,30,4],[33,1,33,4],[34,2,34,4],[36,1,36,4],[39,1,39,4],[40,2,40,4],[42,1,42,4],[43,2,43,4],[49,1,49,4],[50,2,50,4],[75,2,75,4],[53,2,53,4],[55,1,55,4],[56,2,56,4],[58,1,58,4],[60,1,60,4],[61,2,61,4],[63,1,63,4],[64,2,64,4],[70,1,70,4],[71,2,71,4],[74,1,74,4],[97,2,97,4],[78,1,78,4],[79,2,79,4],[81,1,81,4],[82,2,82,4],[84,1,84,4],[85,2,85,4],[87,1,87,4],[88,2,88,4],[90,1,90,4],[94,2,94,4],[96,1,96,4],[93,1,93,4],[115,2,115,4],[99,1,99,4],[100,2,100,4],[102,1,102,4],[103,2,103,4],[105,1,105,4],[106,2,106,4],[108,1,108,4],[109,2,109,4],[111,1,111,4],[112,2,112,4],[114,1,114,4],[133,2,133,4],[117,1,117,4],[118,2,118,4],[120,1,120,4],[121,2,121,4],[123,1,123,4],[124,2,124,4],[126,1,126,4],[127,2,127,4],[129,1,129,4],[130,2,130,4],[132,1,132,4],[148,2,148,4],[135,1,135,4],[136,2,136,4],[138,1,138,4],[139,2,139,4],[141,1,141,4],[142,2,142,4],[144,1,144,4],[145,2,145,4],[147,1,147,4],[150,1,150,4],[151,2,151,4],[153,1,153,4],[154,2,154,4],[156,1,156,4]]}
[]
[]
[]
[]
["Server10 Lotto1 R730xd",null,null,null,null,null,null,"List Price *"]
[null,null,null,null,null,null,null,{"$f":"F17*C16","v":0}]
[]
[]
[]
[]
["Components: \nServer DELL PowerEdge R730xd (1CPU Intel® Xeon® E5-2620 v4, 32GB RDIMM, 2xHDD 300GB 10K RPM SAS 12Gbps 2.5in)"]
[]
[]
[]
["PowerEdge R730xd","Category: Server",null,null,null,{"$f":"1728","v":1728}]
[null,"Quantity: ",null,null,null,{"$f":"SUM(F20:F157)","v":0}]
[null,null,null,null,null,{"$f":"SUM(F15:F16)","v":1728}]
[]
[null,"Base"]
[null,"PowerEdge R730xd for Intel v4 CPUs",1,null,"[210-ADBC][329-BCZK]"]
[]
[null,"Configurazione dello chassis"]
[null,"Chassis with up to 24, 2.5\" Hard Drives",1,null,"[350-BBFD]"]
[]
[null,"Processore"]
[null,"Intel Xeon E5-2620 v4 2.1GHz 20M Cache 8.0GT/s QPI Turbo HT 8C/16T (85W) Max Mem 2133MHz",1,null,"[338-BJCZ]"]
[]
[null,"Processore aggiuntivo"]
[null,"No Additional Processor",{"$f":"VLOOKUP($B$29, CPU_B, 2, FALSE)","v":0},{"$f":"VLOOKUP($B$29, CPU_B, 3, FALSE)","v":""},{"$f":"VLOOKUP($B$29, CPU_B, 5, FALSE)","v":"[374-BBBX]"},{"$f":"VLOOKUP(B29, CPU_B, 12, FALSE)","v":""}]
[]
[null,"Processor Thermal Configuration"]
[null,"1 CPU Standard",1,null,"[370-ABWF][374-BBHM][750-AAEL]"]
[null,{"$f":"VLOOKUP($B$29, CPU_B, 6, FALSE)","v":""},{"$f":"VLOOKUP($B$29, CPU_B, 7, FALSE)","v":""},null,{"$f":"VLOOKUP($B$29, CPU_B, 8, FALSE)","v":""}]
[]
[null,"Tipo di configurazione memoria"]
[null,"Performance Optimized",1,null,"[370-AAIP]"]
[]
[null,"Memoria Totale in GB",null,{"$f":"IF(('Server10 Lotto1 R730xd'!$D$12=0),\"\",'Server10 Lotto1 R730xd'!#REF!)","v":""}]
[null,32]
[]
[null,"Tipo e velocità della memoria DIMM"]
[null,"2400MT/s RDIMMs",1,null,"[370-ACPH]"]
[]
[null,"Capacità di memoria"]
[null,"16GB RDIMM, 2400MT/s, Dual Rank, x8 Data Width",{"$f":"IF($B$29=\"No Additional Processor\",VLOOKUP($B$39, MEM_B1, 9, FALSE),VLOOKUP($B$39, MEM_B2, 9, FALSE))","v":"2"},null,{"$f":"IF($B$29=\"No Additional Processor\",VLOOKUP($B$39, MEM_B1, 10, FALSE),VLOOKUP($B$39, MEM_B2, 10, FALSE))","v":"[370-ACNX]"}]
[]
[null,{"$f":"IF($B$29=\"No Additional Processor\",VLOOKUP($B$39, MEM_B1, 2, FALSE),VLOOKUP($B$39, MEM_B2, 2, FALSE))","v":""},{"$f":"IF($B$29=\"No Additional Processor\",VLOOKUP($B$39, MEM_B1, 3, FALSE),VLOOKUP($B$39, MEM_B2, 3, FALSE))","v":""},{"$f":"IF($B$29=\"No Additional Processor\",VLOOKUP($B$39, MEM_B1, 4, FALSE),VLOOKUP($B$39, MEM_B2, 4, FALSE))","v":""},{"$f":"IF($B$29=\"No Additional Processor\",VLOOKUP($B$39, MEM_B1, 6, FALSE),VLOOKUP($B$39, MEM_B2, 6, FALSE))","v":""},{"$f":"IF($B$29=\"No Additional Processor\",VLOOKUP($B$39, MEM_B1, 7, FALSE),VLOOKUP($B$39, MEM_B2, 7, FALSE))","v":""}]
[]
[null,{"$f":"IF($B$29=\"No Additional Processor\",VLOOKUP($B$39, MEM_B1, 11, FALSE),VLOOKUP($B$39, MEM_B2, 11, FALSE))","v":""},{"$f":"IF($B$29=\"No Additional Processor\",VLOOKUP($B$39, MEM_B1, 12, FALSE),VLOOKUP($B$39, MEM_B2, 12, FALSE))","v":""},{"$f":"IF($B$29=\"No Additional Processor\",VLOOKUP($B$39, MEM_B1, 13, FALSE),VLOOKUP($B$39, MEM_B2, 13, FALSE))","v":""},{"$f":"IF($B$29=\"No Additional Processor\",VLOOKUP($B$39, MEM_B1, 15, FALSE),VLOOKUP($B$39, MEM_B2, 15, FALSE))","v":""},{"$f":"IF($B$29=\"No Additional Processor\",VLOOKUP($B$39, MEM_B1, 16, FALSE),VLOOKUP($B$39, MEM_B2, 16, FALSE))","v":""}]
[]
[null,"Sistema operativo preinstallato"]
[null,"No Operating System",{"$f":"VLOOKUP($B$52, OS_B, 2, FALSE)","v":""},{"$f":"VLOOKUP($B$52, OS_B, 3, FALSE)","v":""},{"$f":"VLOOKUP($B$52, OS_B, 5, FALSE)","v":"[611-BBBF]"},{"$f":"VLOOKUP($B$52, OS_B, 6, FALSE)","v":""}]
[]
[null,"OS Media Kits"]
[null,"No Media Required",1,null,"[605-BBFN]"]
[]
[null,"Client Access Licenses"]
[null,{"$f":"VLOOKUP($B$52, OS_B, 7, FALSE)","v":"None"},null,{"$f":"VLOOKUP($B$52, OS_B, 9, FALSE)","v":""},{"$f":"VLOOKUP($B$52, OS_B, 11, FALSE)","v":""},{"$f":"VLOOKUP($B$52, OS_B, 12, FALSE)*C58","v":0}]
[]
[null,{"$f":"VLOOKUP($B$52, OS_B, 13, FALSE)","v":"None"},null,{"$f":"VLOOKUP($B$52, OS_B, 15, FALSE)","v":""},{"$f":"VLOOKUP($B$52, OS_B, 17, FALSE)","v":""},{"$f":"VLOOKUP($B$52, OS_B, 18, FALSE)*C60","v":0}]
[]
[null,"Controller RAID"]
[null,"PERC H330 RAID Controller",1,null,"[405-AAEF]"]
[]
[null,"Dischi rigidi"]
[null,"300GB 10K RPM SAS 12Gbps 2.5in Hot-plug Hard Drive",2,null,"[400-AJPK]"]
[]
[null,"300GB 10K RPM SAS 12Gbps 2.5in Hot-plug Hard Drive,CusKit",0,{"$f":"VLOOKUP($B$68, HDD_A,3, FALSE)","v":"10L1-HDD300GB"},{"$f":"VLOOKUP($B$68, HDD_A,5, FALSE)","v":"[400-AJOQ]"},{"$f":"VLOOKUP($B$68, HDD_A,6, FALSE)*C68","v":0}]
[]
[null,"1TB 7.2K RPM NLSAS 6Gbps 2.5in Hot-plug Hard Drive,13G,CusKit",0,{"$f":"VLOOKUP($B$70, HDD_A,3, FALSE)","v":"10L1-HDD1TB"},{"$f":"VLOOKUP($B$70, HDD_A,5, FALSE)","v":"[400-AEFF]"},{"$f":"VLOOKUP($B$70, HDD_A,6, FALSE)*C70","v":0}]
[]
[null,"Configurazione RAID HDD 300GB"]
[null,"C3 - RAID 1 for H330 (2 HDDs)",1,null,{"$f":"VLOOKUP($B$73,  RAID_BBB1, 2, FALSE)","v":"[780-BBJK]"}]
[null,"Hot Spare for 300GB HDD","No"]
[]
[null,"Configurazione RAID HDD 1TB"]
[null,"",1,null,{"$f":"VLOOKUP($B$77,  RAID_BBB2, 2, FALSE)","v":""}]
[null,"Hot Spare for 1TB HDD","No"]
[]
[null,"Impostazioni del BIOS per la gestione dell'alimentazione"]
[null,"Performance BIOS Setting",1,null,"[384-BBBL]"]
[]
[null,"Alimentatore"]
[null,"Dual, Hot-plug, Redundant Power Supply (1+1), 750W, Titanium, 200-240VAC",1,null,"[450-ADWT]"]
[]
[null,"Cavi di alimentazione"]
[null,"Rack Power Cord 2M (C13/C14 12A)",2,null,"[450-AADY]"]
[]
[null,"PCIe Riser"]
[null,"Risers with up to 4, x8 PCIe Slots + 2, x16 PCIe Slots",1,null,"[330-BBCO][330-BBCR]"]
[]
[null,"TPM Module"]
[null,"PowerEdge Server FIPS TPM 2.0",1,null,"[461-AADM]"]
[]
[null,"Embedded Systems Management"]
[null,"iDRAC8 Enterprise, integrated Dell Remote Access Controller, Enterprise",1,null,"[385-BBHO]"]
[]
[null,"Adattatore di rete"]
[null,"Broadcom 5720 QP 1Gb Network Daughter Card",1,null,"[540-BBBW]"]
[]
[null,"Additional Card for PCIe Slot 6 (Full height) (CPU 1)"]
[null,"None",{"$f":"VLOOKUP($B$102,  PCI_B1, 2, FALSE)","v":""},{"$f":"VLOOKUP($B$102,  PCI_B1, 3, FALSE)","v":""},{"$f":"VLOOKUP($B$102,  PCI_B1, 5, FALSE)","v":""},{"$f":"VLOOKUP($B$102,  PCI_B1, 6, FALSE)","v":""}]
[]
[null,"Additional Card for PCIe Slot 5 (Full height) (CPU 1)"]
[null,"None",{"$f":"VLOOKUP($B$105,  PCI_B2, 2, FALSE)","v":""},{"$f":"VLOOKUP($B$105,  PCI_B2, 3, FALSE)","v":""},{"$f":"VLOOKUP($B$105,  PCI_B2, 5, FALSE)","v":""},{"$f":"VLOOKUP($B$105,  PCI_B2, 6, FALSE)","v":""}]
[]
[null,"Additional Card for PCIe Slot 4 (Full height) (CPU 2)"]
[null,"None",{"$f":"IF(B108=\"Aggiungere Secondo Processore\",\"\",(VLOOKUP(B108,PCI_B3, 2, FALSE)))","v":""},{"$f":"IF(B108=\"Aggiungere Secondo Processore\",\"\",(VLOOKUP(B108,  PCI_B3, 3, FALSE)))","v":""},{"$f":"VLOOKUP($B$108,  PCI_B3, 5, FALSE)","v":""},{"$f":"VLOOKUP($B$108,  PCI_B3, 6, FALSE)","v":""}]
[]
[null,"Additional Card for PCIe Slot 3 (Low Profile) (CPU 2)"]
[null,"None",{"$f":"IF(B111=\"Aggiungere Secondo Processore\",\"\",(VLOOKUP(B111,PCI_B4, 2, FALSE)))","v":""},{"$f":"IF(B111=\"Aggiungere Secondo Processore\",\"\",(VLOOKUP(B111,  PCI_B4, 3, FALSE)))","v":""},{"$f":"VLOOKUP($B$111,  PCI_B4, 5, FALSE)","v":""},{"$f":"VLOOKUP($B$111,  PCI_B4, 6, FALSE)","v":""}]
[]
[null,"Additional Card for PCIe Slot 2 (Low Profile) (CPU 2)"]
[null,"None",{"$f":"IF(B114=\"Aggiungere Secondo Processore\",\"\",(VLOOKUP(B114,PCI_B5, 2, FALSE)))","v":""},{"$f":"IF(B114=\"Aggiungere Secondo Processore\",\"\",(VLOOKUP(B114,  PCI_B5, 3, FALSE)))","v":""},{"$f":"VLOOKUP($B$114,  PCI_B5, 5, FALSE)","v":""},{"$f":"VLOOKUP($B$114,  PCI_B5, 6, FALSE)","v":""}]
[]
[null,"Additional Card for PCIe Slot 1 (Low Profile) (CPU 2)"]
[null,"None",{"$f":"IF(B117=\"Aggiungere Secondo Processore\",\"\",(VLOOKUP(B117,PCI_B6, 2, FALSE)))","v":""},{"$f":"IF(B117=\"Aggiungere Secondo Processore\",\"\",(VLOOKUP(B117,  PCI_B6, 3, FALSE)))","v":""},{"$f":"VLOOKUP($B$117,  PCI_B5, 5, FALSE)","v":""},{"$f":"VLOOKUP($B$117,  PCI_B5, 6, FALSE)","v":""}]
[]
[null,"Pannello frontale"]
[null,"Bezel",1,null,"[350-BBEJ]"]
[]
[null,"Guide per rack"]
[null,"ReadyRails™ Sliding Rails Without Cable Management Arm",1,null,"[770-BBBQ]"]
[]
[null,"Server Accessories"]
[null,"PowerEdge SFP+, 10GbE SR/SX, Optical Tranceiver, LC Connector, for Intel and Broadcom,CusKit",{"$f":"(VLOOKUP(B117,PCI_A2,8,FALSE))+((VLOOKUP(B102,PCI_A1,8,FALSE)))","v":0},null,"[407-BBQE]"]
[]
[null,"System Documentation"]
[null,"Electronic System Documentation and OpenManage DVD Kit",1,null,"[631-AAJG]"]
[]
[null,"SHIPPING"]
[null,"PowerEdge R730xd Shipping EMEA1 (English/French/German/Spanish/Russian/Hebrew)",1,null,"[340-AMGS]"]
[]
[null,"Order Information"]
[null,"PowerEdge Order - EMEA",1,null,"[800-11671]"]
[]
[null,"Base warranty"]
[null,"3Yr Basic Warranty - Next Business Day - Minimum Warranty",1,null,"[709-12780][709-12781]"]
[]
[null,"Servizi di assitenza"]
[null,"Dell Channel Order - Service Info only",1,null,"[710-31085]"]
[]
[null,"Aggiornamenti della garanzia"]
[null,"None",{"$f":"VLOOKUP($B$144,  SO_B1,2, FALSE)","v":""},{"$f":"VLOOKUP($B$144,  SO_B1, 3, FALSE)","v":""},{"$f":"VLOOKUP($B$144,  SO_B1, 5, FALSE)","v":""},{"$f":"VLOOKUP($B$144,  SO_B1, 6, FALSE)","v":""}]
[]
[null,"Protezione dei dati - Keep Your Hard Drive "]
[null,"None",{"$f":"VLOOKUP($B$147,  SO_BBB2, 2, FALSE)","v":""},{"$f":"VLOOKUP($B$147,  SO_BBB2, 3, FALSE)","v":""},{"$f":"VLOOKUP($B$147,  SO_BBB2,5, FALSE)","v":""},{"$f":"VLOOKUP($B$147,  SO_BBB2, 6, FALSE)","v":""}]
[]
[null,"Servizi di Installazione"]
[null,"No Installation Service Selected",1,null,"[683-11870]"]
[]
[null,"Channel only - Support Extension"]
[null,"Channel 39M Basic Warranty - Next Business Day",1,null,"[723-28780]"]
[]
[null,"Warranty Upgrades - Non-Std/Local POS"]
[null,"CSTM CONSIP - 39M Onsite Labor Support for CRU for Servers with Basic Warranty",1,null,"[681-24467]"]

{"sheet":"Codici","index":9,"n_rows":150,"n_cols":6,"rows_kept":150,"cut":false,"hidden":true,"merged":[[94,2,97,2],[144,1,147,1],[144,2,147,2],[109,0,111,0],[109,1,111,1],[136,0,138,0],[136,1,138,1],[136,2,138,2],[120,1,121,1],[56,0,57,0],[54,1,55,1],[54,0,55,0],[56,1,57,1],[106,0,107,0],[106,1,107,1],[59,0,61,0],[59,1,61,1],[94,1,97,1],[68,1,69,1],[104,0,105,0],[104,1,105,1],[70,1,71,1],[72,1,73,1],[74,1,75,1],[24,0,25,0],[24,1,25,1],[44,1,47,1],[44,2,47,2],[20,0,21,0],[20,1,21,1],[22,0,23,0],[22,1,23,1],[9,0,11,0],[9,1,11,1],[18,0,19,0],[18,1,19,1],[4,0,5,0],[4,1,5,1],[6,0,7,0],[6,1,7,1]]}
["Codici"]
["10L1-R630-U","Server prestazionale",1806,1,"Server DELL PowerEdge R630 V4\n(1CPU Intel® Xeon® E5-2640 v4, 32GB RDIMM, 2xHDD 300GB 10K RPM SAS 12Gbps 2.5in)"]
[{"$f":"\"\"","v":""},{"$f":"\"\"","v":""},{"$f":"\"\"","v":""},{"$f":"\"\"","v":""},{"$f":"\"\"","v":""}]
["10L1-WIN","OpzWinServ1",505,1,"WIN SERVER 2012 R2 Standard\n(Kit Windows Server 2012 R2, Standard Edition, 2 Socket, 2VM, ROK, COA + Media)"]
["10L1-CALDEV","OpzDeviceCal",25,1,"MS Windows Srv 2012 CAL 1 DEV\n(1-pack of Windows Server 2012 Device CALs (Standard or Datacenter))"]
[null,null,null,1,"CS_Consip9_Windows Server CAL 2012 Italian 1pk DSP OEI 1 Clt Device CAL"]
["10L1-CALUSER","OpzUserCal",25,1,"MS Windows Srv 2012 CAL 1 USR\n(1-pack of Windows Server 2012 User CALs (Standard or Datacenter))"]
[null,null,null,1,"CS_Consip9_Windows Server CAL 2012 Italian 1pk DSP OEI 1 Clt User CAL"]
["10L1-LINUX","OpzOpenSource",45,null,"DVD Linux Centos 7.x"]
["10L1-CPU-P-U","Opz1P",800,1,"Intel Xeon Processor E5-2640 V4\n(Intel Xeon E5-2640 v4 2.4GHz 25M Cache 8.0GT/s QPI Turbo HT 10C/20T)"]
[null,null,null,1,"R630 PCIe Riser for up to 2, x16 PCIe Slots for x8, 2 PCIe Chassis with 2 Processors,CusKit"]
[null,null,null,1,"Kit - 120W Heatsink for PowerEdge R630"]
["10L1-16GB-U","OpzRam16",160,1,"Kit Upgrade Ram 16GB V4\n(16GB RDIMM, 2400MT/s, Dual Rank, x8 Data Width,CusKit)"]
["10L1-32GB-U","OpzRam32",320,1,"Kit Upgrade Ram 32GB V4\n(32GB RDIMM, 2400MT/s, Dual Rank, x4 Data Width,CusKit)"]
["10L1-32GB-L","OpzRam32",320,1,"Kit Upgrade Ram 32GB"]
["10L1-64GB-U","OpzRam64",644,1,"Kit Upgrade Ram 64GB V4"]
["10L1-LAN1GB-LP","OpzGigabit",35,1,"Scheda Lan Gigabit Low\n(Broadcom 5720 DP 1Gb Network Interface Card, Low Profile,CusKit)"]
["10L1-LAN1GB","OpzGigabit",35,1,"Scheda Lan Gigabit Full\n(Broadcom 5720 DP 1Gb Network Interface Card,Full Height,CusKit)"]
["10L1-LAN10GB-LP","OpzGigabit 10GB",417,1,"QLogic 57810 Dual Port 10Gb Low\n(QLogic 57810 Dual Port 10Gb Direct Attach/SFP+ Low Profile Network Adapter,CusKit)"]
[null,null,null,2,"PowerEdge SFP+, 10GbE SR/SX, Optical Tranceiver, LC Connector, for Intel and Broadcom,CusKit"]
["10L1-LAN10GB","OpzGigabit 10GB",417,1,"QLogic 57810 Dual Port 10Gb Full\n(QLogic 57810 Dual Port 10Gb Direct Attach/SFP+ Network Adapter,Full Height,CusKit)"]
[null,null,null,2,"PowerEdge SFP+, 10GbE SR/SX, Optical Tranceiver, LC Connector, for Intel and Broadcom,CusKit"]
["10L1-CNA10-LP","OpzGigabit 10GB CNA",774,1,"QLogic 57810 Dual Port 10Gb CNA Low\n(QLogic 57810 Dual Port 10Gb Direct Attach/SFP+ (CNA), Low Profile,CusKit)"]
[null,null,null,2,"PowerEdge SFP+, 10GbE SR/SX, Optical Tranceiver, LC Connector, for Intel and Broadcom,CusKit"]
["10L1-CNA10","OpzGigabit 10GB CNA",774,1,"QLogic 57810 DualPort 10GbCNA Full\n(QLogic 57810 Dual Port 10Gb Direct Attach/SFP+ (CNA),Full Height,CusKit)"]
[null,null,null,2,"PowerEdge SFP+, 10GbE SR/SX, Optical Tranceiver, LC Connector, for Intel and Broadcom,CusKit"]
["10L1-HDD300GB","OpzStorage300",140,1,"HDD 300GB SAS\n(300GB 10K RPM SAS 12Gbps 2.5in Hot-plug Hard Drive,CusKit)"]
["10L1-HDD1TB","OpzStorage1Tb",296,1,"HDD 1TB NLSAS\n(1TB 7.2K RPM NLSAS 6Gbps 2.5in Hot-plug Hard Drive,13G,CusKit)"]
["10L1-FC-LP-U","OpzFibreChannel",940,1,"QLogic 2562 DP Low\n(Qlogic 2562 Dual Channel 8Gb Optical Fibre Channel HBA PCIe, Low Profile,CusKit)"]
["10L1-FC-U","OpzFibreChannel",940,1,"QLogic 2562 DP Full\n(QLogic 2562, Dual Port 8Gb Optical Fibre Channel HBA,Full Height,CusKit)"]
[]
[]
["10L1-UPS","OpzUPS 3000VA",422,1,"UPS MSR 3000 VA"]
[]
["10L1-GUI","OpzGUIRack",461,1,"Console KVM per rack"]
["10L1-KVMIP","OpzSWGUIRack",550,1,"KVM Switch IP per GUI con cavi"]
[]
[]
[]
["10L1-RACK","OpzRack",497,null,"Armadio Rack 42U"]
[]
["10L1-SO-WIN","ServOpzSysManWindows",193,1,"System-Network Mng. svc Windows"]
["10L1-SO-LINUX","ServOpzSysManOS",193,1,"System-Network Mng. svc Linux"]
["10L1-SO-PREV","Manutenzione Preventiva",193,1,"Servizi di manutenzione Preventiva"]
["10L1-SO-HDD","Hard-Disk retention",150,1,"Servizio HDD Retention"]
[null,null,null,1,"Servizio HDD Retention 36 mesi"]
[null,null,null,1,"Servizio HDD Retention 48 mesi"]
[null,null,null,1,"Servizio HDD Retention 60 mesi"]
["10L1-SO-12M-P","OpzEstensione12",175,1,"Estensione garanzia 12 mesi Agg."]
["10L1-SO-24M-P","OpzEstensione24",350,1,"Estensione garanzia 24 mesi Agg."]
[]
["10L1-R730xd-U","Server scalabile storage",1728,1,"DELL PowerEdge R730xd V4\n(1CPU Intel® Xeon® E5-2620 v4, 32GB RDIMM, 2xHDD 300GB 10K RPM SAS 12Gbps 2.5in)"]
[{"$f":"\"\"","v":""},{"$f":"\"\"","v":""},{"$f":"\"\"","v":""},{"$f":"\"\"","v":""},{"$f":"\"\"","v":""}]
["10L1-WIN","OpzWinServ1",505,1,"WIN SERVER 2012 R2 Standard\n(Kit Windows Server 2012 R2, Standard Edition, 2 Socket, 2VM, ROK, COA + Media)"]
["10L1-CALDEV","OpzDeviceCal",25,1,"MS Windows Srv 2012 CAL 1 DEV"]
[null,null,null,1,"CS_Consip9_Windows Server CAL 2012 Italian 1pk DSP OEI 1 Clt Device CAL"]
["10L1-CALUSER","OpzUserCal",25,1,"MS Windows Srv 2012 CAL 1 USR"]
[null,null,null,1,"CS_Consip9_Windows Server CAL 2012 Italian 1pk DSP OEI 1 Clt User CAL"]
["10L1-LINUX","OpzOpenSource",45,1,"DVD Linux Centos 7.x"]
["10L1-CPU-S-U","Opz1P",500,1,"Intel Xeon Processor E5-2620 V4\n(Intel Xeon E5-2620 v4  2.1GHz,20M Cache,8.0GT/s QPI,Turbo,HT,8C/16T)"]
[null,null,null,1,"Kit - 2U CPU Heatsink for PowerEdge R730 without GPU, or PowerEdge R730x"]
[]
["10L1-16GB-U","OpzRam16",160,1,"Kit Upgrade Ram 16GB V4\n(16GB RDIMM, 2400MT/s, Dual Rank, x8 Data Width,CusKit)"]
["10L1-32GB-U","OpzRam32",320,1,"Kit Upgrade Ram 32GB V4\n(32GB RDIMM, 2400MT/s, Dual Rank, x4 Data Width,CusKit)"]
["10L1-32GB-L","OpzRam32",320,1,"Kit Upgrade Ram 32GB"]
["10L1-64GB-U","OpzRam64",644,1,"Kit Upgrade Ram 64GB V4"]
["10L1-LAN1GB-LP","OpzGigabit",35,1,"Scheda Lan Gigabit Low\n(Broadcom 5720 DP 1Gb Network Interface Card, Low Profile,CusKit)"]
["10L1-LAN1GB","OpzGigabit",35,1,"Scheda Lan Gigabit Full\n(Broadcom 5720 DP 1Gb Network Interface Card,Full Height,CusKit)"]
["10L1-LAN10GB-LP","OpzGigabit 10GB",417,1,"QLogic 57810 Dual Port 10Gb Low\n(QLogic 57810 Dual Port 10Gb Direct Attach/SFP+ Low Profile Network Adapter,CusKit)"]
[null,null,null,2,"PowerEdge SFP+, 10GbE SR/SX, Optical Tranceiver, LC Connector, for Intel and Broadcom,CusKit"]
["10L1-LAN10GB","OpzGigabit 10GB",417,1,"QLogic 57810 Dual Port 10Gb Full\n(QLogic 57810 Dual Port 10Gb Direct Attach/SFP+ Network Adapter,Full Height,CusKit)"]
[null,null,null,2,"PowerEdge SFP+, 10GbE SR/SX, Optical Tranceiver, LC Connector, for Intel and Broadcom,CusKit"]
["10L1-CNA10-LP","OpzGigabit 10GB CNA",774,1,"QLogic 57810 Dual Port 10Gb CNA Low\n(QLogic 57810 Dual Port 10Gb Direct Attach/SFP+ (CNA), Low Profile,CusKit)"]
[null,null,null,2,"PowerEdge SFP+, 10GbE SR/SX, Optical Tranceiver, LC Connector, for Intel and Broadcom,CusKit"]
["10L1-CNA10","OpzGigabit 10GB CNA",774,1,"QLogic 57810 DualPort 10GbCNA Full\n(QLogic 57810 Dual Port 10Gb Direct Attach/SFP+ (CNA),Full Height,CusKit)"]
[null,null,null,2,"PowerEdge SFP+, 10GbE SR/SX, Optical Tranceiver, LC Connector, for Intel and Broadcom,CusKit"]
["10L1-HDD300GB","OpzStorage300",140,1,"HDD 300GB SAS\n(300GB 10K RPM SAS 12Gbps 2.5in Hot-plug Hard Drive,CusKit)"]
["10L1-HDD1TB","OpzStorage1Tb",296,1,"HDD 1TB NLSAS\n(1TB 7.2K RPM NLSAS 6Gbps 2.5in Hot-plug Hard Drive,13G,CusKit)"]
["10L1-FC-LP-U","OpzFibreChannel",940,1,"QLogic 2562 DP Low\n(Qlogic 2562 Dual Channel 8Gb Optical Fibre Channel HBA PCIe, Low Profile,CusKit)"]
["10L1-FC-U","OpzFibreChannel",940,1,"QLogic 2562 DP Full\n(QLogic 2562, Dual Port 8Gb Optical Fibre Channel HBA,Full Height,CusKit)"]
[]
[]
["10L1-UPS","OpzUPS 3000VA",422,1,"UPS MSR 3000 VA"]
[]
["10L1-GUI","OpzGUIRack",461,1,"Console KVM per rack"]
["10L1-KVMIP","OpzSWGUIRack",550,1,"KVM Switch IP per GUI con cavi"]
[]
[]
[]
["10L1-RACK","OpzRack",497,null,"Armadio Rack 42U"]
[]
["10L1-SO-WIN","ServOpzSysManWindows",193,1,"System-Network Mng. svc Windows"]
["10L1-SO-LINUX","ServOpzSysManOS",193,1,"System-Network Mng. svc Linux"]
["10L1-SO-PREV","Manutenzione Preventiva",193,1,"Servizi di manutenzione Preventiva"]
["10L1-SO-HDD","Hard-Disk retention",150,1,"Servizio HDD Retention"]
[null,null,null,1,"Servizio HDD Retention 36 mesi"]
[null,null,null,1,"Servizio HDD Retention 48 mesi"]
[null,null,null,1,"Servizio HDD Retention 60 mesi"]
["10L1-SO-12M-S","OpzEstensione12",175,1,"Estensione garanzia 12 mesi Agg."]
["10L1-SO-24M-S","OpzEstensione24",350,1,"Estensione garanzia 24 mesi Agg."]
[]
["10L1-T630-U","Server Tower",2340,1,"DELL PowerEdge T630 V4\n(1CPU Intel® Xeon® E5-2640 v4, 32GB RDIMM, 2xHDD 300GB 10K RPM SAS 12Gbps 2.5in)"]
[{"$f":"\"\"","v":""},{"$f":"\"\"","v":""},{"$f":"\"\"","v":""},{"$f":"\"\"","v":""},{"$f":"\"\"","v":""}]
["10L1-WIN","OpzWinServ1",505,1,"WIN SERVER 2012 R2 Standard\n(Kit Windows Server 2012 R2, Standard Edition, 2 Socket, 2VM, ROK, COA + Media)","1-pack of Windows Server 2012 Device CALs (Standard or Datacenter)"]
["10L1-CALUSER","OpzUserCal",25,1,"MS Windows Srv 2012 CAL 1 DEV\n(1-pack of Windows Server 2012 Device CALs (Standard or Datacenter))"]
[null,null,null,1,"CS_Consip9_Windows Server CAL 2012 Italian 1pk DSP OEI 1 Clt Device CAL"]
["10L1-CALDEV","OpzDeviceCal",25,1,"MS Windows Srv 2012 CAL 1 USR\n(1-pack of Windows Server 2012 User CALs (Standard or Datacenter))"]
[null,null,null,1,"CS_Consip9_Windows Server CAL 2012 Italian 1pk DSP OEI 1 Clt User CAL"]
["10L1-LINUX","OpzOpenSource",45,null,"DVD Linux Centos 7.x"]
["10L1-CPU-T-U","Opz1P",800,1,"Intel Xeon Processor E5-2640 V4\n(Intel Xeon E5-2640 v4 2.4GHz 25M Cache 8.0GT/s QPI Turbo HT 10C/20T)"]
[null,null,null,1,"Kit - 105W Heatsink for T630"]
[]
["10L1-16GB-U","OpzRam16",160,1,"Kit Upgrade Ram 16GB V4\n(16GB RDIMM, 2400MT/s, Dual Rank, x8 Data Width,CusKit)"]
["10L1-32GB-U","OpzRam32",320,1,"Kit Upgrade Ram 32GB V4\n(32GB RDIMM, 2400MT/s, Dual Rank, x4 Data Width,CusKit)"]
["10L1-32GB-L","OpzRam32",320,1,"Kit Upgrade Ram 32GB"]
["10L1-64GB-U","OpzRam64",644,1,"Kit Upgrade Ram 64GB V4"]
[]
["10L1-LAN1GB","OpzGigabit",35,1,"Scheda Lan Gigabit Full\n(Broadcom 5720 DP 1Gb Network Interface Card,Full Height,CusKit)"]
[]
[]
["10L1-LAN10GB","OpzGigabit 10GB",417,1,"QLogic 57810 Dual Port 10Gb Full\n(QLogic 57810 Dual Port 10Gb Direct Attach/SFP+ Network Adapter,Full Height,CusKit)"]
[null,null,null,2,"PowerEdge SFP+, 10GbE SR/SX, Optical Tranceiver, LC Connector, for Intel and Broadcom,CusKit"]
[]
[]
[]
[]
["10L1-HDD300GB-T","OpzStorage300",91,1,"HDD 300GB SAS\n(300GB 10K RPM SAS 12Gbps 2.5in Hot-plug Hard Drive,CusKit)"]
["10L1-HDD1TB","OpzStorage1Tb",296,1,"HDD 1TB NLSAS\n(1TB 7.2K RPM NLSAS 6Gbps 2.5in Hot-plug Hard Drive,13G,CusKit)"]
[]
["10L1-FC-U","OpzFibreChannel",940,1,"QLogic 2562 DP Full\n(QLogic 2562, Dual Port 8Gb Optical Fibre Channel HBA,Full Height,CusKit)"]
["10L1-RDX","OpzRDX",365,1,"RDX USB External + 3 Tape 500GB"]
[]
["10L1-UPS-T","OpzUPS 3000VA",407,1,"UPS MSR 3000 VA"]
[]
[]
[]
["10L1-GUI-T","OpzGUIDesk",96,1,"KIT Monitor 19\" + Mouse + Keyboard"]
[null,null,null,1,"Mice : Dell USB Dual Tone Mouse - Grey - 2 button & Scrollwheel - kit"]
[null,null,null,1,"Dell 19 Monitor | E1916H - 47cm(18.5\") Black ITL"]
[]
[]
["10L1-SO-WIN","ServOpzSysManWindows",193,1,"System-Network Mng. svc Windows"]
["10L1-SO-LINUX","ServOpzSysManOS",193,1,"System-Network Mng. svc Linux"]
["10L1-SO-PREV","Manutenzione Preventiva",193,1,"Servizi di manutenzione Preventiva"]
["10L1-SO-HDD","Hard-Disk retention",150,1,"Servizio HDD Retention"]
[null,null,null,1,"Servizio HDD Retention 36 mesi"]
[null,null,null,1,"Servizio HDD Retention 48 mesi"]
[null,null,null,1,"Servizio HDD Retention 60 mesi"]
["10L1-SO-12M-T","OpzEstensione12",175,1,"Estensione garanzia 12 mesi Agg."]
["10L1-SO-24M-T","OpzEstensione24",350,1,"Estensione garanzia 24 mesi Agg."]

{"sheet":"Processor","index":10,"n_rows":12,"n_cols":12,"rows_kept":12,"cut":false,"hidden":true,"merged":[]}
["Additional Processor"]
["Server R630",null,"CPU-A"]
["No Additional Processor",0,{"$f":"\"\"","v":""},null,"[374-BBBX]",{"$f":"\"\"","v":""},{"$f":"\"\"","v":""},{"$f":"\"\"","v":""},"Riser with up to 1, x8 PCIe Slots + 1, x16 PCIe Slots for x8, 2 PCIe Chassis with 1 Processor",1,"[330-BBCS]",{"$f":"\"\"","v":""}]
["Intel Xeon E5-2640 v4 2.4GHz,25M Cache,8.0GT/s QPI,Turbo,HT,10C/20T (90W) Max Mem 2133MHz,processor only,Cust Kit",1,"10L1-CPU-P-U","S10L1-R630-CPU","[338-BJET]","Kit - 120W Heatsink for PowerEdge R630",1,"[412-AAFB]","R630 PCIe Riser for up to 2, x16 PCIe Slots for x8, 2 PCIe Chassis with 2 Processors,CusKit",1,"[330-BBCM]",800]
[]
["Server R730xd",null,"CPU-B"]
["No Additional Processor",0,{"$f":"\"\"","v":""},null,"[374-BBBX]",{"$f":"\"\"","v":""},{"$f":"\"\"","v":""},{"$f":"\"\"","v":""},null,null,null,{"$f":"\"\"","v":""}]
["Intel Xeon E5-2620 v4 2.1GHz,20M Cache,8.0GT/s QPI,Turbo,HT,8C/16T (85W) Max Mem 2133MHz, processor only,Cust Kit",1,"10L1-CPU-S-U","S10L1-R730xd-CPU","[338-BJEU]","Kit - 2U CPU Heatsink for PowerEdge R730 without GPU, or PowerEdge R730x",1,"[412-AAFW]",null,null,null,500]
[]
["Server T630",null,"CPU-C"]
["No Additional Processor",0,{"$f":"\"\"","v":""},null,"[374-BBBX]",{"$f":"\"\"","v":""},{"$f":"\"\"","v":""},{"$f":"\"\"","v":""},null,null,null,{"$f":"\"\"","v":""}]
["Intel Xeon E5-2640 v4 2.4GHz,25M Cache,8.0GT/s QPI,Turbo,HT,10C/20T (90W) Max Mem 2133MHz,processor only,Cust Kit",1,"10L1-CPU-T-U","S10L1-T630-CPU","[338-BJET]","Kit - 105W Heatsink for T630",1,"[412-AADU]",null,null,null,800]

{"sheet":"Memory","index":11,"n_rows":71,"n_cols":16,"rows_kept":71,"cut":false,"hidden":true,"merged":[]}
[null,"Total Memory"]
[]
[null,"16GB RDIMM, 2400MT/s, Dual Rank, x8 Data Width,CusKit",1,"10L1-16GB-U","S10L1-R630-16GB","A8711887",160]
[null,"32GB LRDIMM, 2133 MT/s, Quad Rank, x4 Data Width,CusKit",1,"10L1-32GB-U","S10L1-R630-32GB","A8711888",320]
[null,"32GB RDIMM, 2400MT/s, Dual Rank, x4 Data Width,CusKit",1,"10L1-32GB-L","S10L1-R630-32GB-L","370-ABUL",320]
[null,"64GB LRDIMM, 2133 MT/s, Quad Rank, x4 Data Width,CusKit",1,"10L1-64GB","S10L1-R630-64GB","A8451131",644]
[]
[]
["1CPU","MEMORY A"]
[32,{"$f":"\"\"","v":""},{"$f":"\"\"","v":""},{"$f":"\"\"","v":""},{"$f":"\"\"","v":""},{"$f":"\"\"","v":""},{"$f":"\"\"","v":""},"16GB RDIMM, 2400MT/s, Dual Rank, x8 Data Width","2","[370-ACNX]",{"$f":"\"\"","v":""},{"$f":"\"\"","v":""},{"$f":"\"\"","v":""},{"$f":"\"\"","v":""},{"$f":"\"\"","v":""},{"$f":"\"\"","v":""}]
[64,"16GB RDIMM, 2400MT/s, Dual Rank, x8 Data Width,CusKit",2,"10L1-16GB-U","S10L1-R630-16GB","A8711887",{"$f":"$G$3*C11","v":320},"16GB RDIMM, 2400MT/s, Dual Rank, x8 Data Width","2","[370-ACNX]",{"$f":"\"\"","v":""},{"$f":"\"\"","v":""},{"$f":"\"\"","v":""},{"$f":"\"\"","v":""},{"$f":"\"\"","v":""},{"$f":"\"\"","v":""}]
[80,"16GB RDIMM, 2400MT/s, Dual Rank, x8 Data Width,CusKit",3,"10L1-16GB-U","S10L1-R630-16GB","A8711887",{"$f":"$G$3*C12","v":480},"16GB RDIMM, 2400MT/s, Dual Rank, x8 Data Width",2,"[370-ACNX]",{"$f":"\"\"","v":""},{"$f":"\"\"","v":""},{"$f":"\"\"","v":""},{"$f":"\"\"","v":""},{"$f":"\"\"","v":""},{"$f":"\"\"","v":""}]
[96,"16GB RDIMM, 2400MT/s, Dual Rank, x8 Data Width,CusKit",4,"10L1-16GB-U","S10L1-R630-16GB","A8711887",{"$f":"$G$3*C13","v":640},"16GB RDIMM, 2400MT/s, Dual Rank, x8 Data Width",2,"[370-ACNX]",{"$f":"\"\"","v":""},{"$f":"\"\"","v":""},{"$f":"\"\"","v":""},{"$f":"\"\"","v":""},{"$f":"\"\"","v":""},{"$f":"\"\"","v":""}]
[128,"16GB RDIMM, 2400MT/s, Dual Rank, x8 Data Width,CusKit",6,"10L1-16GB-U","S10L1-R630-16GB","A8711887",{"$f":"$G$3*C14","v":960},"16GB RDIMM, 2400MT/s, Dual Rank, x8 Data Width","2","[370-ACNX]",{"$f":"\"\"","v":""},{"$f":"\"\"","v":""},{"$f":"\"\"","v":""},{"$f":"\"\"","v":""},{"$f":"\"\"","v":""},{"$f":"\"\"","v":""}]
[160,"16GB RDIMM, 2400MT/s, Dual Rank, x8 Data Width,CusKit",8,"10L1-16GB-U","S10L1-R630-16GB","A8711887",1280,"16GB RDIMM, 2400MT/s, Dual Rank, x8 Data Width","2","[370-ACNX]",{"$f":"\"\"","v":""},{"$f":"\"\"","v":""},{"$f":"\"\"","v":""},{"$f":"\"\"","v":""},{"$f":"\"\"","v":""},{"$f":"\"\"","v":""}]
[192,"16GB RDIMM, 2400MT/s, Dual Rank, x8 Data Width,CusKit",10,"10L1-16GB-U","S10L1-R630-16GB","A8711887",1600,"16GB RDIMM, 2400MT/s, Dual Rank, x8 Data Width","2","[370-ACNX]",{"$f":"\"\"","v":""},{"$f":"\"\"","v":""},{"$f":"\"\"","v":""},{"$f":"\"\"","v":""},{"$f":"\"\"","v":""},{"$f":"\"\"","v":""}]
[256,"16GB RDIMM, 2400MT/s, Dual Rank, x8 Data Width,CusKit",6,"10L1-16GB-U","S10L1-R630-16GB","A8711887",960,"16GB RDIMM, 2400MT/s, Dual Rank, x8 Data Width","2","[370-ACNX]","32GB RDIMM, 2400MT/s, Dual Rank, x4 Data Width,CusKit",4,"10L1-32GB-U","S10L1-R630-32GB","A8711888",{"$f":"$G$4*L17","v":1280}]
["2CPU"]
[32,{"$f":"\"\"","v":""},{"$f":"\"\"","v":""},{"$f":"\"\"","v":""},{"$f":"\"\"","v":""},{"$f":"\"\"","v":""},{"$f":"\"\"","v":""},"16GB RDIMM, 2400MT/s, Dual Rank, x8 Data Width","2","[370-ACNX]",{"$f":"\"\"","v":""},{"$f":"\"\"","v":""},{"$f":"\"\"","v":""},{"$f":"\"\"","v":""},{"$f":"\"\"","v":""},{"$f":"\"\"","v":""}]
[64,"16GB RDIMM, 2400MT/s, Dual Rank, x8 Data Width,CusKit",2,"10L1-16GB-U","S10L1-R630-16GB","A8711887",{"$f":"$G$3*C20","v":320},"16GB RDIMM, 2400MT/s, Dual Rank, x8 Data Width","2","[370-ACNX]",{"$f":"\"\"","v":""},{"$f":"\"\"","v":""},{"$f":"\"\"","v":""},{"$f":"\"\"","v":""},{"$f":"\"\"","v":""},{"$f":"\"\"","v":""}]
[80,"16GB RDIMM, 2400MT/s, Dual Rank, x8 Data Width,CusKit",3,"10L1-16GB-U","S10L1-R630-16GB","A8711887",{"$f":"$G$3*C21","v":480},"16GB RDIMM, 2400MT/s, Dual Rank, x8 Data Width",2,"[370-ACNX]",{"$f":"\"\"","v":""},{"$f":"\"\"","v":""},{"$f":"\"\"","v":""},{"$f":"\"\"","v":""},{"$f":"\"\"","v":""},{"$f":"\"\"","v":""}]
[96,"16GB RDIMM, 2400MT/s, Dual Rank, x8 Data Width,CusKit",4,"10L1-16GB-U","S10L1-R630-16GB","A8711887",{"$f":"$G$3*C22","v":640},"16GB RDIMM, 2400MT/s, Dual Rank, x8 Data Width",2,"[370-ACNX]",{"$f":"\"\"","v":""},{"$f":"\"\"","v":""},{"$f":"\"\"","v":""},{"$f":"\"\"","v":""},{"$f":"\"\"","v":""},{"$f":"\"\"","v":""}]
[128,"16GB RDIMM, 2400MT/s, Dual Rank, x8 Data Width,CusKit",6,"10L1-16GB-U","S10L1-R630-16GB","A8711887",960,"16GB RDIMM, 2400MT/s, Dual Rank, x8 Data Width","2","[370-ACNX]",{"$f":"\"\"","v":""},{"$f":"\"\"","v":""},{"$f":"\"\"","v":""},{"$f":"\"\"","v":""},{"$f":"\"\"","v":""},{"$f":"\"\"","v":""}]
[160,"16GB RDIMM, 2400MT/s, Dual Rank, x8 Data Width,CusKit",8,"10L1-16GB-U","S10L1-R630-16GB","A8711887",1280,"16GB RDIMM, 2400MT/s, Dual Rank, x8 Data Width","2","[370-ACNX]",{"$f":"\"\"","v":""},{"$f":"\"\"","v":""},{"$f":"\"\"","v":""},{"$f":"\"\"","v":""},{"$f":"\"\"","v":""},{"$f":"\"\"","v":""}]
[192,"16GB RDIMM, 2400MT/s, Dual Rank, x8 Data Width,CusKit",10,"10L1-16GB-U","S10L1-R630-16GB","A8711887",1600,"16GB RDIMM, 2400MT/s, Dual Rank, x8 Data Width","2","[370-ACNX]",{"$f":"\"\"","v":""},{"$f":"\"\"","v":""},{"$f":"\"\"","v":""},{"$f":"\"\"","v":""},{"$f":"\"\"","v":""},{"$f":"\"\"","v":""}]
[256,"16GB RDIMM, 2400MT/s, Dual Rank, x8 Data Width,CusKit",14,"10L1-16GB-U","S10L1-R630-16GB","A8711887",2240,"16GB RDIMM, 2400MT/s, Dual Rank, x8 Data Width","2","[370-ACNX]",{"$f":"\"\"","v":""},{"$f":"\"\"","v":""},{"$f":"\"\"","v":""},{"$f":"\"\"","v":""},{"$f":"\"\"","v":""},{"$f":"\"\"","v":""}]
[320,"16GB RDIMM, 2400MT/s, Dual Rank, x8 Data Width,CusKit",18,"10L1-16GB-U","S10L1-R630-16GB","A8711887",{"$f":"$G$3*C27","v":2880},"16GB RDIMM, 2400MT/s, Dual Rank, x8 Data Width","2","[370-ACNX]",{"$f":"\"\"","v":""},{"$f":"\"\"","v":""},{"$f":"\"\"","v":""},{"$f":"\"\"","v":""},{"$f":"\"\"","v":""},{"$f":"\"\"","v":""}]
[384,"16GB RDIMM, 2400MT/s, Dual Rank, x8 Data Width,CusKit",22,"10L1-16GB-U","S10L1-R630-16GB","A8711887",3520,"16GB RDIMM, 2400MT/s, Dual Rank, x8 Data Width","2","[370-ACNX]",{"$f":"\"\"","v":""},{"$f":"\"\"","v":""},{"$f":"\"\"","v":""},{"$f":"\"\"","v":""},{"$f":"\"\"","v":""},{"$f":"\"\"","v":""}]
[512,"16GB RDIMM, 2400MT/s, Dual Rank, x8 Data Width,CusKit",14,"10L1-16GB-U","S10L1-R630-16GB","A8711887",{"$f":"$G$3*C29","v":2240},"16GB RDIMM, 2400MT/s, Dual Rank, x8 Data Width","2","[370-ACNX]","32GB RDIMM, 2400MT/s, Dual Rank, x4 Data Width,CusKit",8,"10L1-32GB-U","S10L1-R630-32GB","A8711888",{"$f":"$G$4*L29","v":2560}]
[]
[]
["1CPU","MEMORY B"]
[32,{"$f":"\"\"","v":""},{"$f":"\"\"","v":""},{"$f":"\"\"","v":""},{"$f":"\"\"","v":""},{"$f":"\"\"","v":""},{"$f":"\"\"","v":""},"16GB RDIMM, 2400MT/s, Dual Rank, x8 Data Width","2","[370-ACNX]",{"$f":"\"\"","v":""},{"$f":"\"\"","v":""},{"$f":"\"\"","v":""},{"$f":"\"\"","v":""},{"$f":"\"\"","v":""},{"$f":"\"\"","v":""}]
[64,"16GB RDIMM, 2400MT/s, Dual Rank, x8 Data Width,CusKit",2,"10L1-16GB-U","S10L1-R730xd-16GB","A8711887",{"$f":"$G$3*C34","v":320},"16GB RDIMM, 2400MT/s, Dual Rank, x8 Data Width","2","[370-ACNX]",{"$f":"\"\"","v":""},{"$f":"\"\"","v":""},{"$f":"\"\"","v":""},{"$f":"\"\"","v":""},{"$f":"\"\"","v":""},{"$f":"\"\"","v":""}]
[96,"16GB RDIMM, 2400MT/s, Dual Rank, x8 Data Width,CusKit",4,"10L1-16GB-U","S10L1-R630-16GB","A8711887",{"$f":"$G$3*C35","v":640},"16GB RDIMM, 2400MT/s, Dual Rank, x8 Data Width",2,"[370-ACNX]",{"$f":"\"\"","v":""},{"$f":"\"\"","v":""},{"$f":"\"\"","v":""},{"$f":"\"\"","v":""},{"$f":"\"\"","v":""},{"$f":"\"\"","v":""}]
[128,"16GB RDIMM, 2400MT/s, Dual Rank, x8 Data Width,CusKit",6,"10L1-16GB-U","S10L1-R730xd-16GB","A8711887",{"$f":"$G$3*C36","v":960},"16GB RDIMM, 2400MT/s, Dual Rank, x8 Data Width","2","[370-ACNX]",{"$f":"\"\"","v":""},{"$f":"\"\"","v":""},{"$f":"\"\"","v":""},{"$f":"\"\"","v":""},{"$f":"\"\"","v":""},{"$f":"\"\"","v":""}]
[160,"16GB RDIMM, 2400MT/s, Dual Rank, x8 Data Width,CusKit",8,"10L1-16GB-U","S10L1-R730xd-16GB","A8711887",1280,"16GB RDIMM, 2400MT/s, Dual Rank, x8 Data Width","2","[370-ACNX]",{"$f":"\"\"","v":""},{"$f":"\"\"","v":""},{"$f":"\"\"","v":""},{"$f":"\"\"","v":""},{"$f":"\"\"","v":""},{"$f":"\"\"","v":""}]
[192,"16GB RDIMM, 2400MT/s, Dual Rank, x8 Data Width,CusKit",10,"10L1-16GB-U","S10L1-R730xd-16GB","A8711887",1600,"16GB RDIMM, 2400MT/s, Dual Rank, x8 Data Width","2","[370-ACNX]",{"$f":"\"\"","v":""},{"$f":"\"\"","v":""},{"$f":"\"\"","v":""},{"$f":"\"\"","v":""},{"$f":"\"\"","v":""},{"$f":"\"\"","v":""}]
[256,"16GB RDIMM, 2400MT/s, Dual Rank, x8 Data Width,CusKit",6,"10L1-16GB-U","S10L1-R730xd-16GB","A8711887",960,"16GB RDIMM, 2400MT/s, Dual Rank, x8 Data Width","2","[370-ACNX]","32GB RDIMM, 2400MT/s, Dual Rank, x4 Data Width,CusKit",4,"10L1-32GB-U","S10L1-R730xd-32GB","A8711888",{"$f":"$G$4*L39","v":1280}]
["2CPU"]
[32,{"$f":"\"\"","v":""},{"$f":"\"\"","v":""},{"$f":"\"\"","v":""},{"$f":"\"\"","v":""},{"$f":"\"\"","v":""},{"$f":"\"\"","v":""},"16GB RDIMM, 2400MT/s, Dual Rank, x8 Data Width","2","[370-ACNX]",{"$f":"\"\"","v":""},{"$f":"\"\"","v":""},{"$f":"\"\"","v":""},{"$f":"\"\"","v":""},{"$f":"\"\"","v":""},{"$f":"\"\"","v":""}]
[64,"16GB RDIMM, 2400MT/s, Dual Rank, x8 Data Width,CusKit",2,"10L1-16GB-U","S10L1-R730xd-16GB","A8711887",{"$f":"$G$3*C42","v":320},"16GB RDIMM, 2400MT/s, Dual Rank, x8 Data Width","2","[370-ACNX]",{"$f":"\"\"","v":""},{"$f":"\"\"","v":""},{"$f":"\"\"","v":""},{"$f":"\"\"","v":""},{"$f":"\"\"","v":""},{"$f":"\"\"","v":""}]
[96,"16GB RDIMM, 2400MT/s, Dual Rank, x8 Data Width,CusKit",4,"10L1-16GB-U","S10L1-R630-16GB","A8711887",{"$f":"$G$3*C43","v":640},"16GB RDIMM, 2400MT/s, Dual Rank, x8 Data Width",2,"[370-ACNX]",{"$f":"\"\"","v":""},{"$f":"\"\"","v":""},{"$f":"\"\"","v":""},{"$f":"\"\"","v":""},{"$f":"\"\"","v":""},{"$f":"\"\"","v":""}]
[128,"16GB RDIMM, 2400MT/s, Dual Rank, x8 Data Width,CusKit",6,"10L1-16GB-U","S10L1-R730xd-16GB","A8711887",960,"16GB RDIMM, 2400MT/s, Dual Rank, x8 Data Width","2","[370-ACNX]",{"$f":"\"\"","v":""},{"$f":"\"\"","v":""},{"$f":"\"\"","v":""},{"$f":"\"\"","v":""},{"$f":"\"\"","v":""},{"$f":"\"\"","v":""}]
[160,"16GB RDIMM, 2400MT/s, Dual Rank, x8 Data Width,CusKit",8,"10L1-16GB-U","S10L1-R730xd-16GB","A8711887",1280,"16GB RDIMM, 2400MT/s, Dual Rank, x8 Data Width","2","[370-ACNX]",{"$f":"\"\"","v":""},{"$f":"\"\"","v":""},{"$f":"\"\"","v":""},{"$f":"\"\"","v":""},{"$f":"\"\"","v":""},{"$f":"\"\"","v":""}]
[192,"16GB RDIMM, 2400MT/s, Dual Rank, x8 Data Width,CusKit",10,"10L1-16GB-U","S10L1-R730xd-16GB","A8711887",1600,"16GB RDIMM, 2400MT/s, Dual Rank, x8 Data Width","2","[370-ACNX]",{"$f":"\"\"","v":""},{"$f":"\"\"","v":""},{"$f":"\"\"","v":""},{"$f":"\"\"","v":""},{"$f":"\"\"","v":""},{"$f":"\"\"","v":""}]
[256,"16GB RDIMM, 2400MT/s, Dual Rank, x8 Data Width,CusKit",14,"10L1-16GB-U","S10L1-R730xd-16GB","A8711887",2240,"16GB RDIMM, 2400MT/s, Dual Rank, x8 Data Width","2","[370-ACNX]",{"$f":"\"\"","v":""},{"$f":"\"\"","v":""},{"$f":"\"\"","v":""},{"$f":"\"\"","v":""},{"$f":"\"\"","v":""},{"$f":"\"\"","v":""}]
[320,"16GB RDIMM, 2400MT/s, Dual Rank, x8 Data Width,CusKit",18,"10L1-16GB-U","S10L1-R730xd-16GB","A8711887",2880,"16GB RDIMM, 2400MT/s, Dual Rank, x8 Data Width","2","[370-ACNX]",{"$f":"\"\"","v":""},{"$f":"\"\"","v":""},{"$f":"\"\"","v":""},{"$f":"\"\"","v":""},{"$f":"\"\"","v":""},{"$f":"\"\"","v":""}]
[384,"16GB RDIMM, 2400MT/s, Dual Rank, x8 Data Width,CusKit",22,"10L1-16GB-U","S10L1-R730xd-16GB","A8711887",3520,"16GB RDIMM, 2400MT/s, Dual Rank, x8 Data Width","2","[370-ACNX]",{"$f":"\"\"","v":""},{"$f":"\"\"","v":""},{"$f":"\"\"","v":""},{"$f":"\"\"","v":""},{"$f":"\"\"","v":""},{"$f":"\"\"","v":""}]
[512,"16GB RDIMM, 2400MT/s, Dual Rank, x8 Data Width,CusKit",14,"10L1-16GB-U","S10L1-R730xd-16GB","A8711887",2240,"16GB RDIMM, 2400MT/s, Dual Rank, x8 Data Width","2","[370-ACNX]","32GB RDIMM, 2400MT/s, Dual Rank, x4 Data Width,CusKit",8,"10L1-32GB-U","S10L1-R730xd-32GB","A8711888",{"$f":"$G$4*L50","v":2560}]
[]
[]
["1CPU","MEMORY C"]
[32,{"$f":"\"\"","v":""},{"$f":"\"\"","v":""},{"$f":"\"\"","v":""},{"$f":"\"\"","v":""},{"$f":"\"\"","v":""},{"$f":"\"\"","v":""},"16GB RDIMM, 2400MT/s, Dual Rank, x8 Data Width","2","[370-ACNX]",{"$f":"\"\"","v":""},{"$f":"\"\"","v":""},{"$f":"\"\"","v":""},{"$f":"\"\"","v":""},{"$f":"\"\"","v":""},{"$f":"\"\"","v":""}]
[64,"16GB RDIMM, 2400MT/s, Dual Rank, x8 Data Width,CusKit",2,"10L1-16GB-U","S10L1-T630-16GB","A8711887",{"$f":"$G$3*C55","v":320},"16GB RDIMM, 2400MT/s, Dual Rank, x8 Data Width","2","[370-ACNX]",{"$f":"\"\"","v":""},{"$f":"\"\"","v":""},{"$f":"\"\"","v":""},{"$f":"\"\"","v":""},{"$f":"\"\"","v":""},{"$f":"\"\"","v":""}]
[96,"16GB RDIMM, 2400MT/s, Dual Rank, x8 Data Width,CusKit",4,"10L1-16GB-U","S10L1-R630-16GB","A8711887",{"$f":"$G$3*C56","v":640},"16GB RDIMM, 2400MT/s, Dual Rank, x8 Data Width",2,"[370-ACNX]",{"$f":"\"\"","v":""},{"$f":"\"\"","v":""},{"$f":"\"\"","v":""},{"$f":"\"\"","v":""},{"$f":"\"\"","v":""},{"$f":"\"\"","v":""}]
[128,"16GB RDIMM, 2400MT/s, Dual Rank, x8 Data Width,CusKit",6,"10L1-16GB-U","S10L1-T630-16GB","A8711887",{"$f":"$G$3*C57","v":960},"16GB RDIMM, 2400MT/s, Dual Rank, x8 Data Width","2","[370-ACNX]",{"$f":"\"\"","v":""},{"$f":"\"\"","v":""},{"$f":"\"\"","v":""},{"$f":"\"\"","v":""},{"$f":"\"\"","v":""},{"$f":"\"\"","v":""}]
[160,"16GB RDIMM, 2400MT/s, Dual Rank, x8 Data Width,CusKit",8,"10L1-16GB-U","S10L1-T630-16GB","A8711887",1280,"16GB RDIMM, 2400MT/s, Dual Rank, x8 Data Width","2","[370-ACNX]",{"$f":"\"\"","v":""},{"$f":"\"\"","v":""},{"$f":"\"\"","v":""},{"$f":"\"\"","v":""},{"$f":"\"\"","v":""},{"$f":"\"\"","v":""}]
[192,"16GB RDIMM, 2400MT/s, Dual Rank, x8 Data Width,CusKit",10,"10L1-16GB-U","S10L1-T630-16GB","A8711887",1600,"16GB RDIMM, 2400MT/s, Dual Rank, x8 Data Width","2","[370-ACNX]",{"$f":"\"\"","v":""},{"$f":"\"\"","v":""},{"$f":"\"\"","v":""},{"$f":"\"\"","v":""},{"$f":"\"\"","v":""},{"$f":"\"\"","v":""}]
[256,"16GB RDIMM, 2400MT/s, Dual Rank, x8 Data Width,CusKit",6,"10L1-16GB-U","S10L1-T630-16GB","A8711887",960,"16GB RDIMM, 2400MT/s, Dual Rank, x8 Data Width","2","[370-ACNX]","32GB RDIMM, 2400MT/s, Dual Rank, x4 Data Width,CusKit",4,"10L1-32GB-U","S10L1-T630-32GB","A8711888",{"$f":"$G$4*L60","v":1280}]
["2CPU"]
[32,{"$f":"\"\"","v":""},{"$f":"\"\"","v":""},{"$f":"\"\"","v":""},{"$f":"\"\"","v":""},{"$f":"\"\"","v":""},{"$f":"\"\"","v":""},"16GB RDIMM, 2400MT/s, Dual Rank, x8 Data Width","2","[370-ACNX]",{"$f":"\"\"","v":""},{"$f":"\"\"","v":""},{"$f":"\"\"","v":""},{"$f":"\"\"","v":""},{"$f":"\"\"","v":""},{"$f":"\"\"","v":""}]
[64,"16GB RDIMM, 2400MT/s, Dual Rank, x8 Data Width,CusKit",2,"10L1-16GB-U","S10L1-T630-16GB","A8711887",{"$f":"$G$3*C63","v":320},"16GB RDIMM, 2400MT/s, Dual Rank, x8 Data Width","2","[370-ACNX]",{"$f":"\"\"","v":""},{"$f":"\"\"","v":""},{"$f":"\"\"","v":""},{"$f":"\"\"","v":""},{"$f":"\"\"","v":""},{"$f":"\"\"","v":""}]
[96,"16GB RDIMM, 2400MT/s, Dual Rank, x8 Data Width,CusKit",4,"10L1-16GB-U","S10L1-R630-16GB","A8711887",{"$f":"$G$3*C64","v":640},"16GB RDIMM, 2400MT/s, Dual Rank, x8 Data Width",2,"[370-ACNX]",{"$f":"\"\"","v":""},{"$f":"\"\"","v":""},{"$f":"\"\"","v":""},{"$f":"\"\"","v":""},{"$f":"\"\"","v":""},{"$f":"\"\"","v":""}]
[128,"16GB RDIMM, 2400MT/s, Dual Rank, x8 Data Width,CusKit",6,"10L1-16GB-U","S10L1-T630-16GB","A8711887",960,"16GB RDIMM, 2400MT/s, Dual Rank, x8 Data Width","2","[370-ACNX]",{"$f":"\"\"","v":""},{"$f":"\"\"","v":""},{"$f":"\"\"","v":""},{"$f":"\"\"","v":""},{"$f":"\"\"","v":""},{"$f":"\"\"","v":""}]
[160,"16GB RDIMM, 2400MT/s, Dual Rank, x8 Data Width,CusKit",8,"10L1-16GB-U","S10L1-T630-16GB","A8711887",1280,"16GB RDIMM, 2400MT/s, Dual Rank, x8 Data Width","2","[370-ACNX]",{"$f":"\"\"","v":""},{"$f":"\"\"","v":""},{"$f":"\"\"","v":""},{"$f":"\"\"","v":""},{"$f":"\"\"","v":""},{"$f":"\"\"","v":""}]
[192,"16GB RDIMM, 2400MT/s, Dual Rank, x8 Data Width,CusKit",10,"10L1-16GB-U","S10L1-T630-16GB","A8711887",1600,"16GB RDIMM, 2400MT/s, Dual Rank, x8 Data Width","2","[370-ACNX]",{"$f":"\"\"","v":""},{"$f":"\"\"","v":""},{"$f":"\"\"","v":""},{"$f":"\"\"","v":""},{"$f":"\"\"","v":""},{"$f":"\"\"","v":""}]
[256,"16GB RDIMM, 2400MT/s, Dual Rank, x8 Data Width,CusKit",14,"10L1-16GB-U","S10L1-T630-16GB","A8711887",2240,"16GB RDIMM, 2400MT/s, Dual Rank, x8 Data Width","2","[370-ACNX]",{"$f":"\"\"","v":""},{"$f":"\"\"","v":""},{"$f":"\"\"","v":""},{"$f":"\"\"","v":""},{"$f":"\"\"","v":""},{"$f":"\"\"","v":""}]
[320,"16GB RDIMM, 2400MT/s, Dual Rank, x8 Data Width,CusKit",18,"10L1-16GB-U","S10L1-T630-16GB","A8711887",2880,"16GB RDIMM, 2400MT/s, Dual Rank, x8 Data Width","2","[370-ACNX]",{"$f":"\"\"","v":""},{"$f":"\"\"","v":""},{"$f":"\"\"","v":""},{"$f":"\"\"","v":""},{"$f":"\"\"","v":""},{"$f":"\"\"","v":""}]
[384,"16GB RDIMM, 2400MT/s, Dual Rank, x8 Data Width,CusKit",22,"10L1-16GB-U","S10L1-T630-16GB","A8711887",3520,"16GB RDIMM, 2400MT/s, Dual Rank, x8 Data Width","2","[370-ACNX]",{"$f":"\"\"","v":""},{"$f":"\"\"","v":""},{"$f":"\"\"","v":""},{"$f":"\"\"","v":""},{"$f":"\"\"","v":""},{"$f":"\"\"","v":""}]
[512,"16GB RDIMM, 2400MT/s, Dual Rank, x8 Data Width,CusKit",14,"10L1-16GB-U","S10L1-T630-16GB","A8711887",2240,"16GB RDIMM, 2400MT/s, Dual Rank, x8 Data Width","2","[370-ACNX]","32GB RDIMM, 2400MT/s, Dual Rank, x4 Data Width,CusKit",8,"10L1-32GB-U","S10L1-T630-32GB","A8711888",{"$f":"$G$4*L71","v":2560}]

{"sheet":"Operating System","index":12,"n_rows":17,"n_cols":18,"rows_kept":17,"cut":false,"hidden":true,"merged":[[0,1,0,2]]}
["Operating System"]
["R630"]
["No Operating System",{"$f":"\"\"","v":""},{"$f":"\"\"","v":""},{"$f":"\"\"","v":""},"[611-BBBF]",{"$f":"\"\"","v":""},"None",{"$f":"\"\"","v":""},{"$f":"\"\"","v":""},{"$f":"\"\"","v":""},{"$f":"\"\"","v":""},null,"None",{"$f":"\"\"","v":""},{"$f":"\"\"","v":""},{"$f":"\"\"","v":""},{"$f":"\"\"","v":""}]
["Kit Windows Server 2012 R2, Standard Edition, 2 Socket, 2VM, ROK, COA + Media",1,"10L1-WIN","S10L1-R630-WIN","[638-BBBD]",505,"1-pack of Windows Server 2012 User CALs (Standard or Datacenter)",1,"10L1-CALUSER","S10L1-R630-USR","[618-10778]",25,"1-pack of Windows Server 2012 Device CALs (Standard or Datacenter)",1,"10L1-CALDEV","S10L1-R630-DEV","[618-10777]",25]
["CentOS 7.0",1,"10L1-LINUX","S10L1-R630-LINUX",{"$f":"\"\"","v":""},45,"None",{"$f":"\"\"","v":""},{"$f":"\"\"","v":""},{"$f":"\"\"","v":""},{"$f":"\"\"","v":""},null,"None",{"$f":"\"\"","v":""},{"$f":"\"\"","v":""},{"$f":"\"\"","v":""},{"$f":"\"\"","v":""}]
[]
[]
["R730xd"]
["No Operating System",{"$f":"\"\"","v":""},{"$f":"\"\"","v":""},{"$f":"\"\"","v":""},"[611-BBBF]",{"$f":"\"\"","v":""},"None",{"$f":"\"\"","v":""},{"$f":"\"\"","v":""},{"$f":"\"\"","v":""},{"$f":"\"\"","v":""},null,"None",{"$f":"\"\"","v":""},{"$f":"\"\"","v":""},{"$f":"\"\"","v":""},{"$f":"\"\"","v":""}]
["Kit Windows Server 2012 R2, Standard Edition, 2 Socket, 2VM, ROK, COA + Media",1,"10L1-WIN","S10L1-R730xd-WIN","[638-BBBD]",505,"1-pack of Windows Server 2012 User CALs (Standard or Datacenter)",1,"10L1-CALUSER","S10L1-R730xd-USR","[618-10778]",25,"1-pack of Windows Server 2012 Device CALs (Standard or Datacenter)",1,"10L1-CALDEV","S10L1-R730xd-DEV","[618-10777]",25]
["CentOS 7.0",1,"10L1-LINUX","S10L1-R730xd-LINUX",{"$f":"\"\"","v":""},45,"None",{"$f":"\"\"","v":""},{"$f":"\"\"","v":""},{"$f":"\"\"","v":""},{"$f":"\"\"","v":""},null,"None",{"$f":"\"\"","v":""},{"$f":"\"\"","v":""},{"$f":"\"\"","v":""},{"$f":"\"\"","v":""}]
[]
[]
["T630"]
["No Operating System",{"$f":"\"\"","v":""},{"$f":"\"\"","v":""},{"$f":"\"\"","v":""},"[611-BBBF]",{"$f":"\"\"","v":""},"None",{"$f":"\"\"","v":""},{"$f":"\"\"","v":""},{"$f":"\"\"","v":""},{"$f":"\"\"","v":""},null,"None",{"$f":"\"\"","v":""},{"$f":"\"\"","v":""},{"$f":"\"\"","v":""},{"$f":"\"\"","v":""}]
["Kit Windows Server 2012 R2, Standard Edition, 2 Socket, 2VM, ROK, COA + Media",1,"10L1-WIN","S10L1-T630-WIN","[638-BBBD]",505,"1-pack of Windows Server 2012 User CALs (Standard or Datacenter)",1,"10L1-CALUSER","S10L1-T630-USR","[618-10778]",25,"1-pack of Windows Server 2012 Device CALs (Standard or Datacenter)",1,"10L1-CALDEV","S10L1-T630-DEV","[618-10777]",25]
["CentOS 7.0",1,"10L1-LINUX","S10L1-T630-LINUX",{"$f":"\"\"","v":""},45,"None",{"$f":"\"\"","v":""},{"$f":"\"\"","v":""},{"$f":"\"\"","v":""},{"$f":"\"\"","v":""},null,"None",{"$f":"\"\"","v":""},{"$f":"\"\"","v":""},{"$f":"\"\"","v":""},{"$f":"\"\"","v":""}]

{"sheet":"HDD","index":13,"n_rows":215,"n_cols":15,"rows_kept":215,"cut":false,"hidden":true,"merged":[]}
["Hard Drives"]
["R630"]
["300GB 10K RPM SAS 12Gbps 2.5in Hot-plug Hard Drive,CusKit",null,"10L1-HDD300GB","S10L1-R630-HDD300","[400-AJOQ]",140]
["1TB 7.2K RPM NLSAS 6Gbps 2.5in Hot-plug Hard Drive,13G,CusKit",null,"10L1-HDD1TB","S10L1-R630-HDD1000","[400-AEFF]",296]
[null,"R630 ","R630 1","R630 2"]
["HDD max",8,8,8]
["HDD 300GB Base",2,2,2,"Hot Spare for 300GB HDD",{"$f":"'Server10 Lotto1 R630'!$C$74","v":"No"},{"$f":"IF(F7=\"Yes\",1,0)","v":0},{"$f":"'Server10 Lotto1 R630 2'!$C$74","v":"No"},{"$f":"IF(H7=\"Yes\",1,0)","v":0},{"$f":"'Server10 Lotto1 R630 3'!$C$74","v":"No"},{"$f":"IF(J7=\"Yes\",1,0)","v":0}]
["HDD 300GB Selected",{"$f":"'Server10 Lotto1 R630'!$C$68","v":0},{"$f":"'Server10 Lotto1 R630 2'!$C$68","v":0},{"$f":"'Server10 Lotto1 R630 2'!$C$68","v":0}]
["300GB 10K RPM SAS 12Gbps 2.5in Hot-plug Hard Drive,CusKit",0,0,0]
[null,1,1,1]
[null,2,2,2]
[null,3,3,3]
[null,4,4,4]
[null,5,5,5]
[null,6,6,6]
["HDD max",8,8,8]
["HDD 300GB",{"$f":"B7+B8","v":2},{"$f":"C7+C8","v":2},2]
["HDD 1TB Selected",{"$f":"'Server10 Lotto1 R630'!$C$70","v":0},{"$f":"'Server10 Lotto1 R630 2'!$C$70","v":0},{"$f":"'Server10 Lotto1 R630 3'!$C$70","v":0},"Hot Spare for 1TB HDD",{"$f":"'Server10 Lotto1 R630'!$C$78","v":"No"},{"$f":"IF(F18=\"Yes\",1,0)","v":0},{"$f":"'Server10 Lotto1 R630 2'!$C$78","v":"No"},{"$f":"IF(H18=\"Yes\",1,0)","v":0},{"$f":"'Server10 Lotto1 R630 3'!$C$78","v":"No"},{"$f":"IF(J18=\"Yes\",1,0)","v":0}]
["1TB 7.2K RPM NLSAS 6Gbps 2.5in Hot-plug Hard Drive,13G,CusKit",{"$f":"B$6-B$7-B$8","v":6},{"$f":"C$6-C$7-C$8","v":6},6]
[null,{"$f":"IF(B19-1<1,0,B19-1)","v":5},5,5]
[null,4,4,4]
[null,3,3,3]
[null,2,2,2]
[null,1,1,1]
[null,0,0,0]
[null,0]
[null,0]
[]
["Hot Spare","Yes"]
[null,"No"]
[]
["RAID Configuration",null,null,"HDD 300GB R630",null,"HDD 1TB R630",null,"HDD 300GB R630 2",null,"HDD 1TB R630 2",null,"HDD 300GB R630 3",null,"HDD 1TB R630 3"]
["RAID Personalizzato",{"$f":"IF($B$134<=8,0,\"\")","v":0},"[780-BBJC]","RAID Personalizzato","[780-BBJC]","RAID Personalizzato","[780-BBJC]","RAID Personalizzato","[780-BBJC]","RAID Personalizzato","[780-BBJC]","RAID Personalizzato","[780-BBJC]","RAID Personalizzato","[780-BBJC]"]
["C10 - Unconfigured RAID for H330 (1-8 HDDs)",1,"[780-BBJD] ",{"$f":"IF($G$7=0,A34,\"\")","v":"C10 - Unconfigured RAID for H330 (1-8 HDDs)"},{"$f":"IF($G$7=0,C34,\"\")","v":"[780-BBJD] "},{"$f":"IF($G$18=0,A34,\"\")","v":"C10 - Unconfigured RAID for H330 (1-8 HDDs)"},{"$f":"IF($G$18=0,C34,\"\")","v":"[780-BBJD] "},{"$f":"IF(I7=0,$A$34,\"\")","v":"C10 - Unconfigured RAID for H330 (1-8 HDDs)"},{"$f":"IF(I7=0,$C$34,\"\")","v":"[780-BBJD] "},{"$f":"IF(I18=0,$A$34,\"\")","v":"C10 - Unconfigured RAID for H330 (1-8 HDDs)"},{"$f":"IF(I18=0,$C$34,\"\")","v":"[780-BBJD] "},{"$f":"IF(K7=0,$A$34,\"\")","v":"C10 - Unconfigured RAID for H330 (1-8 HDDs)"},{"$f":"IF(K7=0,$C$34,\"\")","v":"[780-BBJD] "},{"$f":"IF(K18=0,$A$34,\"\")","v":"C10 - Unconfigured RAID for H330 (1-8 HDDs)"},{"$f":"IF(K18=0,$C$34,\"\")","v":"[780-BBJD] "}]
["C2 - RAID 0 for H330 (1-8 HDDs)",1,"[780-BBJF]",{"$f":"IF($G$7=0,A35,\"\")","v":"C2 - RAID 0 for H330 (1-8 HDDs)"},{"$f":"IF($G$7=0,C35,\"\")","v":"[780-BBJF]"},{"$f":"IF($G$18=0,A35,\"\")","v":"C2 - RAID 0 for H330 (1-8 HDDs)"},{"$f":"IF($G$18=0,C35,\"\")","v":"[780-BBJF]"},{"$f":"IF(I7=0,$A$35,\"\")","v":"C2 - RAID 0 for H330 (1-8 HDDs)"},{"$f":"IF(I7=0,$C$35,\"\")","v":"[780-BBJF]"},{"$f":"IF(I18=0,$A$35,\"\")","v":"C2 - RAID 0 for H330 (1-8 HDDs)"},{"$f":"IF(I18=0,$C$35,\"\")","v":"[780-BBJF]"},{"$f":"IF(K7=0,$A$35,\"\")","v":"C2 - RAID 0 for H330 (1-8 HDDs)"},{"$f":"IF(K7=0,$C$35,\"\")","v":"[780-BBJF]"},{"$f":"IF(K18=0,$A$35,\"\")","v":"C2 - RAID 0 for H330 (1-8 HDDs)"},{"$f":"IF(K18=0,$C$35,\"\")","v":"[780-BBJF]"}]
["C3 - RAID 1 for H330 (2 HDDs)",1,"[780-BBJK]",{"$f":"IF($B$7+$B$8-$G$7=2,A36,\"\")","v":"C3 - RAID 1 for H330 (2 HDDs)"},{"$f":"IF($B$7+$B$8-$G$7=2,C36,\"\")","v":"[780-BBJK]"},{"$f":"IF($B$18-$G$18=2,A36,\"\")","v":""},{"$f":"IF($B$18-$G$18=2,C36,\"\")","v":""},{"$f":"IF($C$7+$C$8-I7=2,$A$36,\"\")","v":"C3 - RAID 1 for H330 (2 HDDs)"},{"$f":"IF($C$7+$C$8-I7=2,$C$36,\"\")","v":"[780-BBJK]"},{"$f":"IF($C$18-I18=2,A36,\"\")","v":""},{"$f":"IF($C$18-I18=2,$C$36,\"\")","v":""},{"$f":"IF($C$7+$C$8-K7=2,$A$36,\"\")","v":"C3 - RAID 1 for H330 (2 HDDs)"},{"$f":"IF($C$7+$C$8-K7=2,$C$36,\"\")","v":"[780-BBJK]"},{"$f":"IF($C$18-M18=2,E36,\"\")","v":""},{"$f":"IF($D$18-K18=2,$C$36,\"\")","v":""}]
["C4 - RAID 5 for H330 (3-8 HDDs)",1,"[780-BBJL]",{"$f":"IF($B$7+$B$8-$G$7>=3,A37,\"\")","v":""},{"$f":"IF($B$7+$B$8-$G$7>=3,C37,\"\")","v":""},{"$f":"IF($B$18-$G$18>=3,A37,\"\")","v":""},{"$f":"IF($B$18-$G$18>=3,C37,\"\")","v":""},{"$f":"IF($C$7+$C$8-I7>=3,$A$37,\"\")","v":""},{"$f":"IF($C$7+$C$8-I7>=3,$C$37,\"\")","v":""},{"$f":"IF($C$18-I18>=3,$A$37,\"\")","v":""},{"$f":"IF($C$18-I18>=3,$C$37,\"\")","v":""},{"$f":"IF($D$7+$D$8-K7>=3,$A$37,\"\")","v":""},{"$f":"IF($D$7+$D$8-K7>=3,$C$37,\"\")","v":""},{"$f":"IF($D$18-K18>=3,$A$37,\"\")","v":""},{"$f":"IF($D$18-K18>=3,$C$37,\"\")","v":""}]
["C6 - RAID 10 forH330 (4-8 HDDs in pairs) ",1,"[780-BBJN]",{"$f":"IF($B$7+$B$8-$G$7=4,A38,\"\")","v":""},{"$f":"IF($B$7+$B$8-$G$7=4,C38,\"\")","v":""},{"$f":"IF($B$18-$G$18=4,A38,\"\")","v":""},{"$f":"IF($B$18-$G$18=4,C38,\"\")","v":""},{"$f":"IF($C$7+$C$8-I7=4,$A$38,\"\")","v":""},{"$f":"IF($C$7+$C$8-I7=4,$C$38,\"\")","v":""},{"$f":"IF($C$18-I18=4,$A$38,\"\")","v":""},{"$f":"IF($C$18-I18=4,$C$38,\"\")","v":""},{"$f":"IF($D$7+$D$8-K7=4,$A$38,\"\")","v":""},{"$f":"IF($D$7+$D$8-K7=4,$C$38,\"\")","v":""},{"$f":"IF($D$18-K18=4,$A$38,\"\")","v":""},{"$f":"IF($D$18-K18=4,$C$38,\"\")","v":""}]
["C7 - RAID 1+RAID 1 for H330 (2 + 2 HDDs) ",1,"[780-BBJO]",{"$f":"IF($B$7+$B$8-$G$7=4,A39,\"\")","v":""},{"$f":"IF($B$7+$B$8-$G$7=4,C39,\"\")","v":""},{"$f":"IF($B$18-$G$18=4,A39,\"\")","v":""},{"$f":"IF($B$18-$G$18=4,C39,\"\")","v":""},{"$f":"IF($C$7+$C$8-I7=4,$A$39,\"\")","v":""},{"$f":"IF($C$7+$C$8-I7=4,$C$39,\"\")","v":""},{"$f":"IF($C$18-I18=4,A39,\"\")","v":""},{"$f":"IF($C$18-I18=4,$C$39,\"\")","v":""},{"$f":"IF($D$7+$D$8-K7=4,$A$39,\"\")","v":""},{"$f":"IF($D$7+$D$8-K7=4,$C$39,\"\")","v":""},{"$f":"IF($D$18-K18=4,A39,\"\")","v":""},{"$f":"IF($D$18-K18=4,$C$39,\"\")","v":""}]
["C8 - RAID 1+RAID 5 for H330 (2 + 3-8 HDDs)",1,"[780-BBJP]",{"$f":"IF($B$7+$B$8-$G$7>=5,A40,\"\")","v":""},{"$f":"IF($B$7+$B$8-$G$7>=5,C40,\"\")","v":""},{"$f":"IF($B$18-$G$18>=5,A40,\"\")","v":""},{"$f":"IF($B$18-$G$18>=5,C40,\"\")","v":""},{"$f":"IF($C$7+$C$8-I7>=5,$A$40,\"\")","v":""},{"$f":"IF($C$7+$C$8-I7>=5,$C$40,\"\")","v":""},{"$f":"IF($C$18-I18>=5,$A$40,\"\")","v":""},{"$f":"IF($C$18-I18>=5,$C$40,\"\")","v":""},{"$f":"IF($D$7+$D$8-K7>=5,$A$40,\"\")","v":""},{"$f":"IF($D$7+$D$8-K7>=5,$C$40,\"\")","v":""},{"$f":"IF($D$18-K18>=5,$A$40,\"\")","v":""},{"$f":"IF($D$18-K18>=5,$C$40,\"\")","v":""}]
["C9 - RAID 1+RAID 10 for H330 (2 + 4 HDDs in pairs) ",1,"[780-BBJQ] ",{"$f":"IF($B$7+$B$8-$G$7=6,A41,\"\")","v":""},{"$f":"IF($B$7+$B$8-$G$7=6,C41,\"\")","v":""},{"$f":"IF($B$18-$G$18=6,A41,\"\")","v":""},{"$f":"IF($B$18-$G$18=6,C41,\"\")","v":""},{"$f":"IF($C$7+$C$8-I7=6,$A$41,\"\")","v":""},{"$f":"IF($C$7+$C$8-I7=6,$C$41,\"\")","v":""},{"$f":"IF($C$18-I18=6,A41,\"\")","v":""},{"$f":"IF($C$18-I18=6,$C$41,\"\")","v":""},{"$f":"IF($D$7+$D$8-M7=6,$A$41,\"\")","v":""},{"$f":"IF($D$7+$D$8-M7=6,$C$41,\"\")","v":""},{"$f":"IF($D$18-K18=6,A41,\"\")","v":""},{"$f":"IF($D$18-K18=6,$C$41,\"\")","v":""}]
[]
["R730xd"]
["300GB 10K RPM SAS 12Gbps 2.5in Hot-plug Hard Drive,CusKit",null,"10L1-HDD300GB","S10L1-R730xd-HDD300","[400-AJOQ]",140]
["1TB 7.2K RPM NLSAS 6Gbps 2.5in Hot-plug Hard Drive,13G,CusKit",null,"10L1-HDD1TB","S10L1-R730xd-HDD1000","[400-AEFF]",296]
[null,{"$f":"'Server10 Lotto1 R730xd'!$C$74","v":"No"},{"$f":"'Server10 Lotto1 R730xd 2'!$C$74","v":"No"},{"$f":"'Server10 Lotto1 R730xd 3'!$C$74","v":"No"}]
["HDD max",24,24,24]
["HDD 300GB Base",2,2,2]
["Hot Spare for 300GB HDD",{"$f":"IF(B46=\"Yes\",1,0)","v":0},{"$f":"IF(C46=\"Yes\",1,0)","v":0},{"$f":"IF(D46=\"Yes\",1,0)","v":0}]
["HDD 300GB Selected",{"$f":"'Server10 Lotto1 R730xd'!$C$68","v":0},{"$f":"'Server10 Lotto1 R730xd 2'!$C$68","v":0},{"$f":"'Server10 Lotto1 R730xd 3'!$C$68","v":0}]
["300GB 10K RPM SAS 12Gbps 2.5in Hot-plug Hard Drive,CusKit",0,0,0]
[null,1,1,1]
[null,2,2,2]
[null,3,3,3]
[null,4,4,4]
[null,5,5,5]
[null,6,6,6]
[null,7,7,7]
[null,8,8,8]
[null,9,9,9]
[null,10,10,10]
[null,11,11,11]
[null,12,12,12]
[null,13,13,13]
[null,14,14,14]
[null,15,15,15]
[null,16,16,16]
[null,17,17,17]
[null,18,18,18]
[null,19,19,19]
[null,20,20,20]
[null,21,21,21]
[null,22,22,22]
[]
[]
[]
[]
[]
[]
[null,{"$f":"'Server10 Lotto1 R730xd'!$C$78","v":"No"},{"$f":"'Server10 Lotto1 R730xd 2'!$C$78","v":"No"},{"$f":"'Server10 Lotto1 R730xd 3'!$C$78","v":"No"}]
["HDD max",24,24,24]
["HDD 300GB",{"$f":"B48+B50","v":2},{"$f":"C48+C50","v":2},{"$f":"D48+D50","v":2}]
["Hot Spare for 1TB HDD",{"$f":"IF(B80=\"Yes\",1,0)","v":0},{"$f":"IF(C80=\"Yes\",1,0)","v":0},{"$f":"IF(D80=\"Yes\",1,0)","v":0}]
["HDD 1TB Selected",{"$f":"'Server10 Lotto1 R730xd'!$C$70","v":0},{"$f":"'Server10 Lotto1 R730xd 2'!$C$70","v":0},{"$f":"'Server10 Lotto1 R730xd 3'!$C$70","v":0}]
["1TB 7.2K RPM NLSAS 6Gbps 2.5in Hot-plug Hard Drive,13G,CusKit",{"$f":"$B$81-$B$82-$B$84","v":22},{"$f":"$C$81-$C$82-$C$84","v":22},{"$f":"$D$81-$D$82-$D$84","v":22}]
[null,{"$f":"IF(B85-1<1,0,B85-1)","v":21},21,{"$f":"IF(D85-1<1,0,D85-1)","v":21}]
[null,20,20,{"$f":"IF(D86-1<1,0,D86-1)","v":20}]
[null,19,19,{"$f":"IF(D87-1<1,0,D87-1)","v":19}]
[null,18,18,{"$f":"IF(D88-1<1,0,D88-1)","v":18}]
[null,17,17,{"$f":"IF(D89-1<1,0,D89-1)","v":17}]
[null,16,16,{"$f":"IF(D90-1<1,0,D90-1)","v":16}]
[null,15,15,{"$f":"IF(D91-1<1,0,D91-1)","v":15}]
[null,14,14,{"$f":"IF(D92-1<1,0,D92-1)","v":14}]
[null,{"$f":"IF(B93-1<1,0,B93-1)","v":13},13,{"$f":"IF(D93-1<1,0,D93-1)","v":13}]
[null,12,12,{"$f":"IF(D94-1<1,0,D94-1)","v":12}]
[null,11,11,{"$f":"IF(D95-1<1,0,D95-1)","v":11}]
[null,10,10,{"$f":"IF(D96-1<1,0,D96-1)","v":10}]
[null,9,9,{"$f":"IF(D97-1<1,0,D97-1)","v":9}]
[null,8,8,{"$f":"IF(D98-1<1,0,D98-1)","v":8}]
[null,7,7,{"$f":"IF(D99-1<1,0,D99-1)","v":7}]
[null,6,6,{"$f":"IF(D100-1<1,0,D100-1)","v":6}]
[null,5,5,{"$f":"IF(D101-1<1,0,D101-1)","v":5}]
[null,4,4,{"$f":"IF(D102-1<1,0,D102-1)","v":4}]
[null,3,3,{"$f":"IF(D103-1<1,0,D103-1)","v":3}]
[null,2,2,{"$f":"IF(D104-1<1,0,D104-1)","v":2}]
[null,1,1,{"$f":"IF(D105-1<1,0,D105-1)","v":1}]
[null,0,0,{"$f":"IF(D106-1<1,0,D106-1)","v":0}]
[]
[]
[]
[]
[]
[]
[]
[]
[]
["RAID Configuration",null,null,"HDD 300GB R730xd",null,"HDD 1TB R730xd",null,"HDD 300GB R730xd 2",null,"HDD 1TB R730xd 2",null,"HDD 300GB R730xd 3",null,"HDD 1TB R730xd 3"]
["RAID Personalizzato",{"$f":"IF($B$134<=8,0,\"\")","v":0},"[780-BBJC]","RAID Personalizzato","[780-BBJC]","RAID Personalizzato","[780-BBJC]","RAID Personalizzato","[780-BBJC]","RAID Personalizzato","[780-BBJC]","RAID Personalizzato","[780-BBJC]","RAID Personalizzato","[780-BBJC]"]
["C10 - Unconfigured RAID for H330 (1-8 HDDs)",1,"[780-BBJD] ",{"$f":"IF($B$49=0,A119,\"\")","v":"C10 - Unconfigured RAID for H330 (1-8 HDDs)"},{"$f":"IF($B$49=0,C119,\"\")","v":"[780-BBJD] "},{"$f":"IF($B$83=0,A119,\"\")","v":"C10 - Unconfigured RAID for H330 (1-8 HDDs)"},{"$f":"IF($B$83=0,C119,\"\")","v":"[780-BBJD] "},{"$f":"IF($C$49=0,A119,\"\")","v":"C10 - Unconfigured RAID for H330 (1-8 HDDs)"},{"$f":"IF($C$49=0,C119,\"\")","v":"[780-BBJD] "},{"$f":"IF($C$83=0,A119,\"\")","v":"C10 - Unconfigured RAID for H330 (1-8 HDDs)"},{"$f":"IF($C$83=0,C119,\"\")","v":"[780-BBJD] "},{"$f":"IF($D$49=0,A119,\"\")","v":"C10 - Unconfigured RAID for H330 (1-8 HDDs)"},{"$f":"IF($D$49=0,C119,\"\")","v":"[780-BBJD] "},{"$f":"IF($D$83=0,A119,\"\")","v":"C10 - Unconfigured RAID for H330 (1-8 HDDs)"},{"$f":"IF($D$83=0,C119,\"\")","v":"[780-BBJD] "}]
["C2 - RAID 0 for H330 (1-8 HDDs)",1,"[780-BBJF]",{"$f":"IF($B$49=0,A120,\"\")","v":"C2 - RAID 0 for H330 (1-8 HDDs)"},{"$f":"IF($B$49=0,C120,\"\")","v":"[780-BBJF]"},{"$f":"IF($B$83=0,A120,\"\")","v":"C2 - RAID 0 for H330 (1-8 HDDs)"},{"$f":"IF($B$83=0,C120,\"\")","v":"[780-BBJF]"},{"$f":"IF($C$49=0,A120,\"\")","v":"C2 - RAID 0 for H330 (1-8 HDDs)"},{"$f":"IF($C$49=0,C120,\"\")","v":"[780-BBJF]"},{"$f":"IF($C$83=0,A120,\"\")","v":"C2 - RAID 0 for H330 (1-8 HDDs)"},{"$f":"IF($C$83=0,C120,\"\")","v":"[780-BBJF]"},{"$f":"IF($D$49=0,A120,\"\")","v":"C2 - RAID 0 for H330 (1-8 HDDs)"},{"$f":"IF($D$49=0,C120,\"\")","v":"[780-BBJF]"},{"$f":"IF($D$83=0,A120,\"\")","v":"C2 - RAID 0 for H330 (1-8 HDDs)"},{"$f":"IF($D$83=0,C120,\"\")","v":"[780-BBJF]"}]
["C3 - RAID 1 for H330 (2 HDDs)",1,"[780-BBJK]",{"$f":"IF($B$48+$B$50-$B$49=2,A121,\"\")","v":"C3 - RAID 1 for H330 (2 HDDs)"},{"$f":"IF($B$48+$B$50-$B$49=2,C121,\"\")","v":"[780-BBJK]"},{"$f":"IF($B$84-$B$83=2,A121,\"\")","v":""},{"$f":"IF($B$84-$B$83=2,C121,\"\")","v":""},{"$f":"IF($C$48+$C$50-$C$49=2,A121,\"\")","v":"C3 - RAID 1 for H330 (2 HDDs)"},{"$f":"IF($C$48+$C$50-$C$49=2,C121,\"\")","v":"[780-BBJK]"},{"$f":"IF($C$84-$C$83=2,A121,\"\")","v":""},{"$f":"IF($C$84-$C$83=2,C121,\"\")","v":""},{"$f":"IF($D$48+$D$50-$D$49=2,A121,\"\")","v":"C3 - RAID 1 for H330 (2 HDDs)"},{"$f":"IF($D$48+$D$50-$D$49=2,C121,\"\")","v":"[780-BBJK]"},{"$f":"IF($D$84-$D$83=2,A121,\"\")","v":""},{"$f":"IF($D$84-$D$83=2,C121,\"\")","v":""}]
["C4 - RAID 5 for H330 (3-8 HDDs)",1,"[780-BBJL]",{"$f":"IF($B$48+$B$50-$B$49>=3,A122,\"\")","v":""},{"$f":"IF($B$48+$B$50-$B$49>=3,C122,\"\")","v":""},{"$f":"IF($B$84-$B$83>=3,A122,\"\")","v":""},{"$f":"IF($B$84-$B$83>=3,C122,\"\")","v":""},{"$f":"IF($C$48+$C$50-$C$49>=3,A122,\"\")","v":""},{"$f":"IF($C$48+$C$50-$C$49>=3,C122,\"\")","v":""},{"$f":"IF($C$84-$C$83>=3,A122,\"\")","v":""},{"$f":"IF($C$84-$C$83>=3,C122,\"\")","v":""},{"$f":"IF($D$48+$D$50-$D$49>=3,A122,\"\")","v":""},{"$f":"IF($D$48+$D$50-$D$49>=3,C122,\"\")","v":""},{"$f":"IF($D$84-$D$83>=3,A122,\"\")","v":""},{"$f":"IF($D$84-$D$83>=3,C122,\"\")","v":""}]
["C6 - RAID 10 forH330 (4-8 HDDs in pairs) ",1,"[780-BBJN]",{"$f":"IF($B$48+$B$50-$B$49=4,A123,\"\")","v":""},{"$f":"IF($B$48+$B$50-$B$49=4,C123,\"\")","v":""},{"$f":"IF($B$84-$B$83=4,A123,\"\")","v":""},{"$f":"IF($B$84-$B$83=4,C123,\"\")","v":""},{"$f":"IF($C$48+$C$50-$C$49=4,A123,\"\")","v":""},{"$f":"IF($C$48+$C$50-$C$49=4,C123,\"\")","v":""},{"$f":"IF($C$84-$C$83=4,A123,\"\")","v":""},{"$f":"IF($C$84-$C$83=4,C123,\"\")","v":""},{"$f":"IF($D$48+$D$50-$D$49=4,A123,\"\")","v":""},{"$f":"IF($D$48+$D$50-$D$49=4,C123,\"\")","v":""},{"$f":"IF($D$84-$D$83=4,A123,\"\")","v":""},{"$f":"IF($D$84-$D$83=4,C123,\"\")","v":""}]
["C7 - RAID 1+RAID 1 for H330 (2 + 2 HDDs) ",1,"[780-BBJO]",{"$f":"IF($B$48+$B$50-$B$49=4,A124,\"\")","v":""},{"$f":"IF($B$48+$B$50-$B$49=4,C124,\"\")","v":""},{"$f":"IF($B$84-$B$83=4,A124,\"\")","v":""},{"$f":"IF($B$84-$B$83=4,C124,\"\")","v":""},{"$f":"IF($C$48+$C$50-$C$49=4,A124,\"\")","v":""},{"$f":"IF($C$48+$C$50-$C$49=4,C124,\"\")","v":""},{"$f":"IF($C$84-$C$83=4,A124,\"\")","v":""},{"$f":"IF($C$84-$C$83=4,C124,\"\")","v":""},{"$f":"IF($D$48+$D$50-$D$49=4,A124,\"\")","v":""},{"$f":"IF($D$48+$D$50-$D$49=4,C124,\"\")","v":""},{"$f":"IF($D$84-$D$83=4,A124,\"\")","v":""},{"$f":"IF($D$84-$D$83=4,C124,\"\")","v":""}]
["C8 - RAID 1+RAID 5 for H330 (2 + 3-8 HDDs)",1,"[780-BBJP]",{"$f":"IF($B$48+$B$50-$B$49>=5,A125,\"\")","v":""},{"$f":"IF($B$48+$B$50-$B$49>=5,C125,\"\")","v":""},{"$f":"IF($B$84-$B$83>=5,A125,\"\")","v":""},{"$f":"IF($B$84-$B$83>=5,C125,\"\")","v":""},{"$f":"IF($C$48+$C$50-$C$49>=5,A125,\"\")","v":""},{"$f":"IF($C$48+$C$50-$C$49>=5,C125,\"\")","v":""},{"$f":"IF($C$84-$C$83>=5,A125,\"\")","v":""},{"$f":"IF($C$84-$C$83>=5,C125,\"\")","v":""},{"$f":"IF($D$48+$D$50-$D$49>=5,A125,\"\")","v":""},{"$f":"IF($D$48+$D$50-$D$49>=5,C125,\"\")","v":""},{"$f":"IF($D$84-$D$83>=5,A125,\"\")","v":""},{"$f":"IF($D$84-$D$83>=5,C125,\"\")","v":""}]
["C9 - RAID 1+RAID 10 for H330 (2 + 4 HDDs in pairs) ",1,"[780-BBJQ] ",{"$f":"IF($B$48+$B$50-$B$49=6,A126,\"\")","v":""},{"$f":"IF($B$48+$B$50-$B$49=6,C126,\"\")","v":""},{"$f":"IF($B$84-$B$83=6,A126,\"\")","v":""},{"$f":"IF($B$84-$B$83=6,C126,\"\")","v":""},{"$f":"IF($C$48+$C$50-$C$49=6,A126,\"\")","v":""},{"$f":"IF($C$48+$C$50-$C$49=6,C126,\"\")","v":""},{"$f":"IF($C$84-$C$83=6,A126,\"\")","v":""},{"$f":"IF($C$84-$C$83=6,C126,\"\")","v":""},{"$f":"IF($D$48+$D$50-$D$49=6,A126,\"\")","v":""},{"$f":"IF($D$48+$D$50-$D$49=6,C126,\"\")","v":""},{"$f":"IF($D$84-$D$83=6,A126,\"\")","v":""},{"$f":"IF($D$84-$D$83=6,C126,\"\")","v":""}]
[]
[]
[]
[]
[]
[]
["T630"]
["300GB 10K RPM SAS 12Gbps 2.5in Hot-plug Hard Drive,CusKit",null,"10L1-HDD300GB-T","S10L1-T630-HDD300","[400-AJOQ]",91]
["1TB 7.2K RPM NLSAS 6Gbps 2.5in Hot-plug Hard Drive,13G,CusKit",null,"10L1-HDD1TB","S10L1-T630-HDD1000","[400-AEFF]",296]
[]
["HDD max",32]
["HDD 300GB Base",2]
["HDD 300GB Selected",{"$f":"'Server10 Lotto1 T630'!C64","v":0}]
["300GB 10K RPM SAS 12Gbps 2.5in Hot-plug Hard Drive,CusKit",0,null,"Hot Spare for 300GB HDD",{"$f":"'Server10 Lotto1 T630'!C70","v":"No"},{"$f":"IF(E140=\"Yes\",1,0)","v":0}]
[null,1]
[null,2]
[null,3]
[null,4]
[null,5]
[null,6]
[null,7]
[null,8]
[null,9]
[null,10]
[null,11]
[null,12]
[null,13]
[null,14]
[null,15]
[null,16]
[null,17]
[null,18]
[null,19]
[null,20]
[null,21]
[null,22]
[null,23]
[null,24]
[null,25]
[null,26]
[null,27]
[null,28]
[null,29]
[null,30]
["HDD max",32]
["HDD 300GB",{"$f":"B138+B139","v":2}]
["HDD 1TB Selected",{"$f":"'Server10 Lotto1 T630'!C66","v":0},null,"Hot Spare for 1TB HDD",{"$f":"'Server10 Lotto1 T630'!C74","v":"No"},{"$f":"IF(E173=\"Yes\",1,0)","v":0}]
["1TB 7.2K RPM NLSAS 6Gbps 2.5in Hot-plug Hard Drive,13G,CusKit",{"$f":"$B$171-$B$172-$B$173","v":30}]
[null,{"$f":"IF(B174-1<1,0,B174-1)","v":29}]
[null,28]
[null,27]
[null,26]
[null,25]
[null,24]
[null,23]
[null,22]
[null,{"$f":"IF(B182-1<1,0,B182-1)","v":21}]
[null,20]
[null,19]
[null,18]
[null,17]
[null,16]
[null,15]
[null,14]
[null,13]
[null,12]
[null,11]
[null,10]
[null,9]
[null,8]
[null,7]
[null,6]
[null,5]
[null,4]
[null,3]
[null,2]
[null,1]
[null,0]
[]
["RAID Configuration",null,null,"HDD 300GB",null,"HDD 1TB"]
["RAID Personalizzato",{"$f":"IF($B$134<=8,0,\"\")","v":0},"[780-BBJC]","RAID Personalizzato","[780-BBJC]","RAID Personalizzato","[780-BBJC]"]
["C10 - Unconfigured RAID for H330 (1-8 HDDs)",1,"[780-BBJD] ",{"$f":"IF($F$140=0,A208,\"\")","v":"C10 - Unconfigured RAID for H330 (1-8 HDDs)"},{"$f":"IF($F$140=0,C208,\"\")","v":"[780-BBJD] "},{"$f":"IF($F$173=0,A208,\"\")","v":"C10 - Unconfigured RAID for H330 (1-8 HDDs)"},{"$f":"IF($F$173=0,C208,\"\")","v":"[780-BBJD] "}]
["C2 - RAID 0 for H330 (1-8 HDDs)",1,"[780-BBJF]",{"$f":"IF($F$140=0,A209,\"\")","v":"C2 - RAID 0 for H330 (1-8 HDDs)"},{"$f":"IF($F$140=0,C209,\"\")","v":"[780-BBJF]"},{"$f":"IF($F$173=0,A209,\"\")","v":"C2 - RAID 0 for H330 (1-8 HDDs)"},{"$f":"IF($F$173=0,C209,\"\")","v":"[780-BBJF]"}]
["C3 - RAID 1 for H330 (2 HDDs)",1,"[780-BBJK]",{"$f":"IF($B$138+$B$139-$F$140=2,A210,\"\")","v":"C3 - RAID 1 for H330 (2 HDDs)"},{"$f":"IF($B$138+$B$139-$F$140=2,C210,\"\")","v":"[780-BBJK]"},{"$f":"IF($B$173-$F$173=2,A210,\"\")","v":""},{"$f":"IF($B$173-$F$173=2,C210,\"\")","v":""}]
["C4 - RAID 5 for H330 (3-8 HDDs)",1,"[780-BBJL]",{"$f":"IF($B$138+$B$139-$F$140>=3,A211,\"\")","v":""},{"$f":"IF($B$138+$B$139-$F$140>=3,C211,\"\")","v":""},{"$f":"IF($B$173-$F$173>=3,A211,\"\")","v":""},{"$f":"IF($B$173-$F$173>=3,C211,\"\")","v":""}]
["C6 - RAID 10 forH330 (4-8 HDDs in pairs) ",1,"[780-BBJN]",{"$f":"IF($B$138+$B$139-$F$140=4,A212,\"\")","v":""},{"$f":"IF($B$138+$B$139-$F$140=4,C212,\"\")","v":""},{"$f":"IF($B$173-$F$173=4,A212,\"\")","v":""},{"$f":"IF($B$173-$F$173=4,C212,\"\")","v":""}]
["C7 - RAID 1+RAID 1 for H330 (2 + 2 HDDs) ",1,"[780-BBJO]",{"$f":"IF($B$138+$B$139-$F$140=4,A213,\"\")","v":""},{"$f":"IF($B$138+$B$139-$F$140=4,C213,\"\")","v":""},{"$f":"IF($B$173-$F$173=4,A213,\"\")","v":""},{"$f":"IF($B$173-$F$173=4,C213,\"\")","v":""}]
["C8 - RAID 1+RAID 5 for H330 (2 + 3-8 HDDs)",1,"[780-BBJP]",{"$f":"IF($B$138+$B$139-$F$140>=5,A214,\"\")","v":""},{"$f":"IF($B$138+$B$139-$F$140>=5,C214,\"\")","v":""},{"$f":"IF($B$173-$F$173>=5,A214,\"\")","v":""},{"$f":"IF($B$173-$F$173>=5,C214,\"\")","v":""}]
["C9 - RAID 1+RAID 10 for H330 (2 + 4 HDDs in pairs) ",1,"[780-BBJQ] ",{"$f":"IF($B$138+$B$139-$F$140=6,A215,\"\")","v":""},{"$f":"IF($B$138+$B$139-$F$140=6,C215,\"\")","v":""},{"$f":"IF($B$173-$F$173=6,A215,\"\")","v":""},{"$f":"IF($B$173-$F$173=6,C215,\"\")","v":""}]

{"sheet":"PCI","index":14,"n_rows":116,"n_cols":10,"rows_kept":116,"cut":false,"hidden":true,"merged":[]}
["Additional Card for PCIe Slot 1 (Low Profile)"]
["R630"]
["None",{"$f":"\"\"","v":""},{"$f":"\"\"","v":""},{"$f":"\"\"","v":""},{"$f":"\"\"","v":""},{"$f":"\"\"","v":""},{"$f":"\"\"","v":""},0,{"$f":"\"\"","v":""}]
["Broadcom 5720 DP 1Gb Network Interface Card, Low Profile,CusKit",1,"10L1-LAN1GB-LP","S10L1-R630-LAN1-LP","[540-BBGW]",35,"",0,""]
["QLogic 57810 Dual Port 10Gb Direct Attach/SFP+ Converged Network Adapter (CNA), Low Profile,CusKit",1,"10L1-CNA10-LP","S10L1-R630-CNA10-LP","[540-BBCV]",774,"PowerEdge SFP+, 10GbE SR/SX, Optical Tranceiver, LC Connector, for Intel and Broadcom,CusKit",2,"[407-BBOK]"]
["Qlogic 2562 Dual Channel 8Gb Optical Fibre Channel HBA PCIe, Low Profile,CusKit",1,"10L1-FC-LP-U","S10L1-R630-FC-LP-U","[406-BBEL]",940,null,0,""]
["QLogic 57810 Dual Port 10Gb Direct Attach/SFP+ Low Profile Network Adapter,CusKit",1,"10L1-LAN10GB-LP","S10L1-R630-LAN10-LP","[540-BBDX]",417,"PowerEdge SFP+, 10GbE SR/SX, Optical Tranceiver, LC Connector, for Intel and Broadcom,CusKit",2,"[407-BBOK]"]
[]
["Additional Card for PCIe Slot 2 (Full height)"]
["R630"]
["None",{"$f":"\"\"","v":""},{"$f":"\"\"","v":""},{"$f":"\"\"","v":""},{"$f":"\"\"","v":""},{"$f":"\"\"","v":""},{"$f":"\"\"","v":""},0,{"$f":"\"\"","v":""}]
["Broadcom 5720 DP 1Gb Network Interface Card,Full Height,CusKit",1,"10L1-LAN1GB","S10L1-R630-LAN1","[540-BBGY]",35,"",0,""]
["QLogic 57810 Dual Port 10Gb Direct Attach/SFP+ Converged Network Adapter (CNA),Full Height,CusKit",1,"10L1-CNA10","S10L1-R630-CNA10","[540-BBCV]",774,"PowerEdge SFP+, 10GbE SR/SX, Optical Tranceiver, LC Connector, for Intel and Broadcom,CusKit",2,"[407-BBOK]"]
["QLogic 2562, Dual Port 8Gb Optical Fibre Channel HBA,Full Height,CusKit",1,"10L1-FC-U","S10L1-R630-FC-U","[406-BBEK]",940,null,0,""]
["QLogic 57810 Dual Port 10Gb Direct Attach/SFP+ Network Adapter,Full Height,CusKit",1,"10L1-LAN10GB","S10L1-R630-LAN10","[540-BBGS]",417,"PowerEdge SFP+, 10GbE SR/SX, Optical Tranceiver, LC Connector, for Intel and Broadcom,CusKit",2,"[407-BBOK]"]
[]
[]
["Additional Card for PCIe Slot 6 (Full height) (CPU 1)"]
["R730xd"]
["None",{"$f":"\"\"","v":""},{"$f":"\"\"","v":""},{"$f":"\"\"","v":""},{"$f":"\"\"","v":""},{"$f":"\"\"","v":""},{"$f":"\"\"","v":""},0,{"$f":"\"\"","v":""}]
["Broadcom 5720 DP 1Gb Network Interface Card,Full Height,CusKit",1,"10L1-LAN1GB","S10L1-R730xd-LAN1","[540-BBGY]",35,"",0,""]
["QLogic 57810 Dual Port 10Gb Direct Attach/SFP+ Converged Network Adapter (CNA),Full Height,CusKit",1,"10L1-CNA10","S10L1-R730xd-CNA10","[540-BBCV]",774,"PowerEdge SFP+, 10GbE SR/SX, Optical Tranceiver, LC Connector, for Intel and Broadcom,CusKit",2,"[407-BBOK]"]
["QLogic 2562, Dual Port 8Gb Optical Fibre Channel HBA,Full Height,CusKit",1,"10L1-FC-U","S10L1-R730xd-FC","[406-BBEK]",940,null,0,""]
["QLogic 57810 Dual Port 10Gb Direct Attach/SFP+ Network Adapter,Full Height,CusKit",1,"10L1-LAN10GB","S10L1-R730xd-LAN10","[540-BBGS]",417,"PowerEdge SFP+, 10GbE SR/SX, Optical Tranceiver, LC Connector, for Intel and Broadcom,CusKit",2,"[407-BBOK]"]
[]
["Additional Card for PCIe Slot 5 (Full height) (CPU 1)"]
["R730xd"]
["None",{"$f":"\"\"","v":""},{"$f":"\"\"","v":""},{"$f":"\"\"","v":""},{"$f":"\"\"","v":""},{"$f":"\"\"","v":""},{"$f":"\"\"","v":""},0,{"$f":"\"\"","v":""}]
["Broadcom 5720 DP 1Gb Network Interface Card,Full Height,CusKit",1,"10L1-LAN1GB","S10L1-R730xd-LAN1","[540-BBGY]",35,"",0,""]
["QLogic 57810 Dual Port 10Gb Direct Attach/SFP+ Converged Network Adapter (CNA),Full Height,CusKit",1,"10L1-CNA10","S10L1-R730xd-CNA10","[540-BBCV]",774,"PowerEdge SFP+, 10GbE SR/SX, Optical Tranceiver, LC Connector, for Intel and Broadcom,CusKit",2,"[407-BBOK]"]
["QLogic 2562, Dual Port 8Gb Optical Fibre Channel HBA,Full Height,CusKit",1,"10L1-FC-U","S10L1-R730xd-FC-U","[406-BBEK]",940,null,0,""]
["QLogic 57810 Dual Port 10Gb Direct Attach/SFP+ Network Adapter,Full Height,CusKit",1,"10L1-LAN10GB","S10L1-R730xd-LAN10","[540-BBGS]",417,"PowerEdge SFP+, 10GbE SR/SX, Optical Tranceiver, LC Connector, for Intel and Broadcom,CusKit",2,"[407-BBOK]"]
[]
["Additional Card for PCIe Slot 4 (Full height) (CPU 1)"]
["R730xd"]
["None",{"$f":"\"\"","v":""},{"$f":"\"\"","v":""},{"$f":"\"\"","v":""},{"$f":"\"\"","v":""},{"$f":"\"\"","v":""},"Aggiungere Secondo Processore",{"$f":"\"\"","v":""},0,{"$f":"\"\"","v":""}]
["Broadcom 5720 DP 1Gb Network Interface Card,Full Height,CusKit",1,"10L1-LAN1GB","S10L1-R730xd-LAN1","[540-BBGY]",35,"Aggiungere Secondo Processore",{"$f":"\"\"","v":""},0,""]
["QLogic 57810 Dual Port 10Gb Direct Attach/SFP+ Converged Network Adapter (CNA),Full Height,CusKit",1,"10L1-CNA10","S10L1-R730xd-CNA10","[540-BBCV]",774,"Aggiungere Secondo Processore","PowerEdge SFP+, 10GbE SR/SX, Optical Tranceiver, LC Connector, for Intel and Broadcom,CusKit",2,"[407-BBOK]"]
["QLogic 2562, Dual Port 8Gb Optical Fibre Channel HBA,Full Height,CusKit",1,"10L1-FC-U","S10L1-R730xd-FC-U","[406-BBEK]",940,"Aggiungere Secondo Processore",{"$f":"\"\"","v":""},0,{"$f":"\"\"","v":""}]
["QLogic 57810 Dual Port 10Gb Direct Attach/SFP+ Network Adapter,Full Height,CusKit",1,"10L1-LAN10GB","S10L1-R730xd-LAN10","[540-BBGS]",417,"Aggiungere Secondo Processore","PowerEdge SFP+, 10GbE SR/SX, Optical Tranceiver, LC Connector, for Intel and Broadcom,CusKit",2,"[407-BBOK]"]
[]
["Additional Card for PCIe Slot 3 (Low Profile) (CPU 2)"]
["R730xd"]
["None",{"$f":"\"\"","v":""},{"$f":"\"\"","v":""},{"$f":"\"\"","v":""},{"$f":"\"\"","v":""},{"$f":"\"\"","v":""},"Aggiungere Secondo Processore",{"$f":"\"\"","v":""},0,{"$f":"\"\"","v":""}]
["Broadcom 5720 DP 1Gb Network Interface Card, Low Profile,CusKit",1,"10L1-LAN1GB-LP","S10L1-R730xd-LAN1-LP","[540-BBGW]",35,"Aggiungere Secondo Processore","",0,""]
["QLogic 57810 Dual Port 10Gb Direct Attach/SFP+ Converged Network Adapter (CNA), Low Profile,CusKit",1,"10L1-CNA10-LP","S10L1-R730xd-CNA10-LP","[540-BBCV]",774,"Aggiungere Secondo Processore","PowerEdge SFP+, 10GbE SR/SX, Optical Tranceiver, LC Connector, for Intel and Broadcom,CusKit",2,"[407-BBOK]"]
["Qlogic 2562 Dual Channel 8Gb Optical Fibre Channel HBA PCIe, Low Profile,CusKit",1,"10L1-FC-LP-U","S10L1-R730xd-FC-LP-U","[406-BBEL]",940,"Aggiungere Secondo Processore",null,0,""]
["QLogic 57810 Dual Port 10Gb Direct Attach/SFP+ Low Profile Network Adapter,CusKit",1,"10L1-LAN10GB-LP","S10L1-R730xd-LAN10-LP","[540-BBDX]",417,"Aggiungere Secondo Processore","PowerEdge SFP+, 10GbE SR/SX, Optical Tranceiver, LC Connector, for Intel and Broadcom,CusKit",2,"[407-BBOK]"]
[]
["Additional Card for PCIe Slot 2 (Low Profile) (CPU 2)"]
["R730xd"]
["None",{"$f":"\"\"","v":""},{"$f":"\"\"","v":""},{"$f":"\"\"","v":""},{"$f":"\"\"","v":""},{"$f":"\"\"","v":""},"Aggiungere Secondo Processore",{"$f":"\"\"","v":""},0,{"$f":"\"\"","v":""}]
["Broadcom 5720 DP 1Gb Network Interface Card, Low Profile,CusKit",1,"10L1-LAN1GB-LP","S10L1-R730xd-LAN1-LP","[540-BBGW]",35,"Aggiungere Secondo Processore","",0,""]
["QLogic 57810 Dual Port 10Gb Direct Attach/SFP+ Converged Network Adapter (CNA), Low Profile,CusKit",1,"10L1-CNA10-LP","S10L1-R730xd-CNA10-LP","[540-BBCV]",774,"Aggiungere Secondo Processore","PowerEdge SFP+, 10GbE SR/SX, Optical Tranceiver, LC Connector, for Intel and Broadcom,CusKit",2,"[407-BBOK]"]
["Qlogic 2562 Dual Channel 8Gb Optical Fibre Channel HBA PCIe, Low Profile,CusKit",1,"10L1-FC-LP-U","S10L1-R730xd-FC-LP-U","[406-BBEL]",940,"Aggiungere Secondo Processore",null,0,""]
["QLogic 57810 Dual Port 10Gb Direct Attach/SFP+ Low Profile Network Adapter,CusKit",1,"10L1-LAN10GB-LP","S10L1-R730xd-LAN10-LP","[540-BBDX]",417,"Aggiungere Secondo Processore","PowerEdge SFP+, 10GbE SR/SX, Optical Tranceiver, LC Connector, for Intel and Broadcom,CusKit",2,"[407-BBOK]"]
[]
["Additional Card for PCIe Slot 1 (Low Profile) (CPU 2)"]
["R730xd"]
["None",{"$f":"\"\"","v":""},{"$f":"\"\"","v":""},{"$f":"\"\"","v":""},{"$f":"\"\"","v":""},{"$f":"\"\"","v":""},"Aggiungere Secondo Processore",{"$f":"\"\"","v":""},0,{"$f":"\"\"","v":""}]
["Broadcom 5720 DP 1Gb Network Interface Card, Low Profile,CusKit",1,"10L1-LAN1GB-LP","S10L1-R730xd-LAN1-LP","[540-BBGW]",35,"Aggiungere Secondo Processore","",0,""]
["QLogic 57810 Dual Port 10Gb Direct Attach/SFP+ Converged Network Adapter (CNA), Low Profile,CusKit",1,"10L1-CNA10-LP","S10L1-R730xd-CNA10-LP","[540-BBCV]",774,"Aggiungere Secondo Processore","PowerEdge SFP+, 10GbE SR/SX, Optical Tranceiver, LC Connector, for Intel and Broadcom,CusKit",2,"[407-BBOK]"]
["Qlogic 2562 Dual Channel 8Gb Optical Fibre Channel HBA PCIe, Low Profile,CusKit",1,"10L1-FC-LP-U","S10L1-R730xd-FC-LP-U","[406-BBEL]",940,"Aggiungere Secondo Processore",null,0,""]
["QLogic 57810 Dual Port 10Gb Direct Attach/SFP+ Low Profile Network Adapter,CusKit",1,"10L1-LAN10GB-LP","S10L1-R730xd-LAN10-LP","[540-BBDX]",417,"Aggiungere Secondo Processore","PowerEdge SFP+, 10GbE SR/SX, Optical Tranceiver, LC Connector, for Intel and Broadcom,CusKit",2,"[407-BBOK]"]
[]
[]
["Additional Card for PCIe Slot 1 (Full height) (CPU1)"]
["T630"]
["None",{"$f":"\"\"","v":""},{"$f":"\"\"","v":""},{"$f":"\"\"","v":""},{"$f":"\"\"","v":""},{"$f":"\"\"","v":""},"Aggiungere Secondo Processore",{"$f":"\"\"","v":""},0,{"$f":"\"\"","v":""}]
["Broadcom 5720 DP 1Gb Network Interface Card,Full Height,CusKit",1,"10L1-LAN1GB","S10L1-T630-LAN1","[540-BBGY]",35,"Aggiungere Secondo Processore","",0,""]
["QLogic 2562, Dual Port 8Gb Optical Fibre Channel HBA,Full Height,CusKit",1,"10L1-FC-U","S10L1-T630-FC-U","[406-BBEK]",940,"Aggiungere Secondo Processore",null,0,""]
["QLogic 57810 Dual Port 10Gb Direct Attach/SFP+ Network Adapter,Full Height,CusKit",1,"10L1-LAN10GB","S10L1-T630-LAN10","[540-BBGS]",417,"Aggiungere Secondo Processore","PowerEdge SFP+, 10GbE SR/SX, Optical Tranceiver, LC Connector, for Intel and Broadcom,CusKit",2,"[407-BBOK]"]
[]
[]
["Additional Card for PCIe Slot 2 (Full height) (CPU1)"]
["T630"]
["None",{"$f":"\"\"","v":""},{"$f":"\"\"","v":""},{"$f":"\"\"","v":""},{"$f":"\"\"","v":""},{"$f":"\"\"","v":""},"Aggiungere Secondo Processore",{"$f":"\"\"","v":""},0,{"$f":"\"\"","v":""}]
["Broadcom 5720 DP 1Gb Network Interface Card,Full Height,CusKit",1,"10L1-LAN1GB","S10L1-T630-LAN1","[540-BBGY]",35,"Aggiungere Secondo Processore","",0,""]
["QLogic 2562, Dual Port 8Gb Optical Fibre Channel HBA,Full Height,CusKit",1,"10L1-FC-U","S10L1-T630-FC-U","[406-BBEK]",940,"Aggiungere Secondo Processore",null,0,""]
["QLogic 57810 Dual Port 10Gb Direct Attach/SFP+ Network Adapter,Full Height,CusKit",1,"10L1-LAN10GB","S10L1-T630-LAN10","[540-BBGS]",417,"Aggiungere Secondo Processore","PowerEdge SFP+, 10GbE SR/SX, Optical Tranceiver, LC Connector, for Intel and Broadcom,CusKit",2,"[407-BBOK]"]
[]
[]
["Additional Card for PCIe Slot 3 (Full height) (CPU2)"]
["T630"]
["None",{"$f":"\"\"","v":""},{"$f":"\"\"","v":""},{"$f":"\"\"","v":""},{"$f":"\"\"","v":""},{"$f":"\"\"","v":""},"Aggiungere Secondo Processore",{"$f":"\"\"","v":""},0,{"$f":"\"\"","v":""}]
["Broadcom 5720 DP 1Gb Network Interface Card,Full Height,CusKit",1,"10L1-LAN1GB","S10L1-T630-LAN1","[540-BBGY]",35,"Aggiungere Secondo Processore","",0,""]
["QLogic 2562, Dual Port 8Gb Optical Fibre Channel HBA,Full Height,CusKit",1,"10L1-FC-U","S10L1-R630-FC-U","[406-BBEK]",940,"Aggiungere Secondo Processore",null,0,""]
["QLogic 57810 Dual Port 10Gb Direct Attach/SFP+ Network Adapter,Full Height,CusKit",1,"10L1-LAN10GB","S10L1-T630-LAN10","[540-BBGS]",417,"Aggiungere Secondo Processore","PowerEdge SFP+, 10GbE SR/SX, Optical Tranceiver, LC Connector, for Intel and Broadcom,CusKit",2,"[407-BBOK]"]
[]
[]
["Additional Card for PCIe Slot 4 (Full height) (CPU2)"]
["T630"]
["None",{"$f":"\"\"","v":""},{"$f":"\"\"","v":""},{"$f":"\"\"","v":""},{"$f":"\"\"","v":""},{"$f":"\"\"","v":""},"Aggiungere Secondo Processore",{"$f":"\"\"","v":""},0,{"$f":"\"\"","v":""}]
["Broadcom 5720 DP 1Gb Network Interface Card,Full Height,CusKit",1,"10L1-LAN1GB","S10L1-T630-LAN1","[540-BBGY]",35,"Aggiungere Secondo Processore","",0,""]
["QLogic 2562, Dual Port 8Gb Optical Fibre Channel HBA,Full Height,CusKit",1,"10L1-FC-U","S10L1-R630-FC-U","[406-BBEK]",940,"Aggiungere Secondo Processore",null,0,""]
["QLogic 57810 Dual Port 10Gb Direct Attach/SFP+ Network Adapter,Full Height,CusKit",1,"10L1-LAN10GB","S10L1-T630-LAN10","[540-BBGS]",417,"Aggiungere Secondo Processore","PowerEdge SFP+, 10GbE SR/SX, Optical Tranceiver, LC Connector, for Intel and Broadcom,CusKit",2,"[407-BBOK]"]
[]
[]
[]
["Additional Card for PCIe Slot 5 (Full height) (CPU2)"]
["T630"]
["None",{"$f":"\"\"","v":""},{"$f":"\"\"","v":""},{"$f":"\"\"","v":""},{"$f":"\"\"","v":""},{"$f":"\"\"","v":""},"Aggiungere Secondo Processore",{"$f":"\"\"","v":""},0,{"$f":"\"\"","v":""}]
["Broadcom 5720 DP 1Gb Network Interface Card,Full Height,CusKit",1,"10L1-LAN1GB","S10L1-T630-LAN1","[540-BBGY]",35,"Aggiungere Secondo Processore","",0,""]
["QLogic 2562, Dual Port 8Gb Optical Fibre Channel HBA,Full Height,CusKit",1,"10L1-FC-U","S10L1-R630-FC-U","[406-BBEK]",940,"Aggiungere Secondo Processore",null,0,""]
["QLogic 57810 Dual Port 10Gb Direct Attach/SFP+ Network Adapter,Full Height,CusKit",1,"10L1-LAN10GB","S10L1-T630-LAN10","[540-BBGS]",417,"Aggiungere Secondo Processore","PowerEdge SFP+, 10GbE SR/SX, Optical Tranceiver, LC Connector, for Intel and Broadcom,CusKit",2,"[407-BBOK]"]
[]
[]
["Additional Card for PCIe Slot 6 (Full height) (CPU2)"]
["T630"]
["None",{"$f":"\"\"","v":""},{"$f":"\"\"","v":""},{"$f":"\"\"","v":""},{"$f":"\"\"","v":""},{"$f":"\"\"","v":""},"Aggiungere Secondo Processore",{"$f":"\"\"","v":""},0,{"$f":"\"\"","v":""}]
["Broadcom 5720 DP 1Gb Network Interface Card,Full Height,CusKit",1,"10L1-LAN1GB","S10L1-T630-LAN1","[540-BBGY]",35,"Aggiungere Secondo Processore","",0,""]
["QLogic 2562, Dual Port 8Gb Optical Fibre Channel HBA,Full Height,CusKit",1,"10L1-FC-U","S10L1-T630-FC-U","[406-BBEK]",940,"Aggiungere Secondo Processore",null,0,""]
["QLogic 57810 Dual Port 10Gb Direct Attach/SFP+ Network Adapter,Full Height,CusKit",1,"10L1-LAN10GB","S10L1-T630-LAN10","[540-BBGS]",417,"Aggiungere Secondo Processore","PowerEdge SFP+, 10GbE SR/SX, Optical Tranceiver, LC Connector, for Intel and Broadcom,CusKit",2,"[407-BBOK]"]
[]
[]
["Aggiungere Secondo Processore"]

{"sheet":"Servizi Opzionali","index":15,"n_rows":81,"n_cols":13,"rows_kept":81,"cut":false,"hidden":true,"merged":[]}
["Warranty Upgrades",null,null,null,null,null,"Protezione dei dati - Keep Your Hard Drive "]
["R630"]
["None",{"$f":"\"\"","v":""},{"$f":"\"\"","v":""},{"$f":"\"\"","v":""},{"$f":"\"\"","v":""},{"$f":"\"\"","v":""},null,null,{"$f":"IF(($A$22=$A$12),\"\",IF($A$8=$A$3,I13,IF($A$8=$A$4,I14,IF($A$8=$A$5,I15))))","v":""},{"$f":"IF(($A$22=$A$12),\"\",IF($A$8=$A$3,J13,IF($A$8=$A$4,J14,IF($A$8=$A$5,J15))))","v":""},{"$f":"IF(($A$22=$A$12),\"\",IF($A$8=$A$3,K13,IF($A$8=$A$4,K14,IF($A$8=$A$5,K15))))","v":""},{"$f":"IF(($A$22=$A$12),\"\",IF($A$8=$A$3,L13,IF($A$8=$A$4,L14,IF($A$8=$A$5,L15))))","v":""},{"$f":"IF(($A$22=$A$12),\"\",IF($A$8=$A$3,M13,IF($A$8=$A$4,M14,IF($A$8=$A$5,M15))))","v":""}]
["4Yr Warranty upgrade ",1,"10L1-SO-12M-P","S10L1-R630-S-12M",{"$f":"\"\"","v":""},175]
["5Yr Warranty upgrade ",1,"10L1-SO-24M-P","S10L1-R630-S-24M",{"$f":"\"\"","v":""},350]
[]
["Estensione Garanzia Selezionata"]
[{"$f":"'Server10 Lotto1 R630'!$B$135","v":"None"},null,"R630"]
[{"$f":"'Server10 Lotto1 R630 2'!$B$135","v":"None"},null,"R630 2"]
[{"$f":"'Server10 Lotto1 R630 3'!$B$135","v":"None"},null,"R630 3"]
[]
["None",{"$f":"\"\"","v":""},{"$f":"\"\"","v":""},{"$f":"\"\"","v":""},{"$f":"\"\"","v":""},{"$f":"\"\"","v":""},null,"None"]
[{"$f":"IF($A$8=$A$3,H13,IF($A$8=$A$4,H14,IF($A$8=$A$5,H15)))","v":"3Yr Data Protection - Keep Your Hard Drive"},1,"10L1-SO-HDD","S10L1-R630-S-HDD",{"$f":"IF($A$8=$A$3,L13,IF($A$8=$A$4,L14,IF($A$8=$A$5,L15)))","v":"[733-10057]"},150,null,"3Yr Data Protection - Keep Your Hard Drive",1,"10L1-SO-HDD","S10L1-R630-S-HDD","[733-10057]",150]
["None",{"$f":"\"\"","v":""},{"$f":"\"\"","v":""},{"$f":"\"\"","v":""},{"$f":"\"\"","v":""},{"$f":"\"\"","v":""},null,"4Yr Data Protection - Keep Your Hard Drive",{"$f":"I13","v":1},{"$f":"J13","v":"10L1-SO-HDD"},{"$f":"K13","v":"S10L1-R630-S-HDD"},"[733-10058]",{"$f":"M13","v":150}]
[{"$f":"IF(A9=A3,H13,IF(A9=A4,H14,IF(A9=A5,H15)))","v":"3Yr Data Protection - Keep Your Hard Drive"},1,"10L1-SO-HDD","S10L1-R730xd-S-HDD",{"$f":"IF(A9=A3,L13,IF(A9=A4,L14,IF(A9=A5,L15)))","v":"[733-10057]"},150,null,"5Yr Data Protection - Keep Your Hard Drive",{"$f":"I13","v":1},{"$f":"J13","v":"10L1-SO-HDD"},{"$f":"K13","v":"S10L1-R630-S-HDD"},"[733-10059]",{"$f":"M13","v":150}]
["None",{"$f":"\"\"","v":""},{"$f":"\"\"","v":""},{"$f":"\"\"","v":""},{"$f":"\"\"","v":""},{"$f":"\"\"","v":""}]
[{"$f":"IF(A10=A3,H13,IF(A10=A4,H14,IF(A10=A5,H15)))","v":"3Yr Data Protection - Keep Your Hard Drive"},1,"10L1-SO-HDD","S10L1-R730xd-S-HDD",{"$f":"IF(A10=A3,L13,IF(A10=A4,L14,IF(A10=A5,L15)))","v":"[733-10057]"},150]
[]
[]
[]
["Protezione dei dati Selezionata"]
[{"$f":"'Server10 Lotto1 R630'!B138","v":"None"}]
[]
["Servizio Specialistico di System and Network Management per sistema opertivo Windows, erogato on site.",1,"10L1-SO-WIN","S10L1-R630-S-WIN",null,193]
["Servizio Specialistico di System and Network Management per sistema opertivo Linux, erogato on site.",1,"10L1-SO-LINUX","S10L1-R630-S-LINUX",null,193]
[]
["None",{"$f":"\"\"","v":""},{"$f":"\"\"","v":""},{"$f":"\"\"","v":""},{"$f":"\"\"","v":""},{"$f":"\"\"","v":""}]
[{"$f":"IF('Server10 Lotto1 R630'!$C$16>=5,H28,\"None\")","v":"None"},{"$f":"IF('Server10 Lotto1 R630'!$C$16>=5,I28,\"\")","v":""},{"$f":"IF('Server10 Lotto1 R630'!$C$16>=5,J28,\"\")","v":""},{"$f":"IF('Server10 Lotto1 R630'!$C$16>=5,K28,\"\")","v":""},{"$f":"IF('Server10 Lotto1 R630'!$C$16>=5,L28,\"\")","v":""},{"$f":"IF('Server10 Lotto1 R630'!$C$16>=5,M28,\"\")","v":""},null,"Servizi di manutenzione preventiva",1,"10L1-SO-PREV","S10L1-T630-S-PREV",null,193]
[]
["Warranty Upgrades",null,null,null,null,null,"Protezione dei dati - Keep Your Hard Drive "]
["R730xd"]
["None",{"$f":"\"\"","v":""},{"$f":"\"\"","v":""},{"$f":"\"\"","v":""},{"$f":"\"\"","v":""},{"$f":"\"\"","v":""},null,null,{"$f":"IF(($A$22=$A$12),\"\",IF($A$8=$A$3,I42,IF($A$8=$A$4,I43,IF($A$8=$A$5,I44))))","v":""},{"$f":"IF(($A$22=$A$12),\"\",IF($A$8=$A$3,J42,IF($A$8=$A$4,J43,IF($A$8=$A$5,J44))))","v":""},{"$f":"IF(($A$22=$A$12),\"\",IF($A$8=$A$3,K42,IF($A$8=$A$4,K43,IF($A$8=$A$5,K44))))","v":""},{"$f":"IF(($A$22=$A$12),\"\",IF($A$8=$A$3,L42,IF($A$8=$A$4,L43,IF($A$8=$A$5,L44))))","v":""},{"$f":"IF(($A$22=$A$12),\"\",IF($A$8=$A$3,M42,IF($A$8=$A$4,M43,IF($A$8=$A$5,M44))))","v":""}]
["4Yr Warranty upgrade ",1,"10L1-SO-12M-S","S10L1-R730xd-S-12M",{"$f":"\"\"","v":""},175]
["5Yr Warranty upgrade ",1,"10L1-SO-24M-S","S10L1-R730xd-S-24M",{"$f":"\"\"","v":""},350]
[]
["Estensione Garanzia Selezionata"]
[{"$f":"'Server10 Lotto1 R730xd'!$B$144","v":"None"},null,"R730xd"]
[{"$f":"'Server10 Lotto1 R730xd 2'!$B$144","v":"None"},null,"R730xd 2"]
[{"$f":"'Server10 Lotto1 R730xd 3'!$B$144","v":"None"},null,"R730xd 3"]
[]
["None",{"$f":"\"\"","v":""},{"$f":"\"\"","v":""},{"$f":"\"\"","v":""},{"$f":"\"\"","v":""},{"$f":"\"\"","v":""},null,"None"]
[{"$f":"IF($A$37=$A$32,H42,IF($A$37=$A$33,H43,IF($A$37=$A$34,H44)))","v":"3Yr Data Protection - Keep Your Hard Drive"},1,"10L1-SO-HDD","S10L1-R730xd-S-HDD",{"$f":"IF($A$37=$A$32,L42,IF($A$37=$A$33,L43,IF($A$37=$A$34,L44)))","v":"[733-10057]"},150,null,"3Yr Data Protection - Keep Your Hard Drive",1,"10L1-SO-HDD","S10L1-R730xd-S-HDD","[733-10057]",150]
["None",{"$f":"\"\"","v":""},{"$f":"\"\"","v":""},{"$f":"\"\"","v":""},{"$f":"\"\"","v":""},{"$f":"\"\"","v":""},null,"4Yr Data Protection - Keep Your Hard Drive",{"$f":"I42","v":1},{"$f":"J42","v":"10L1-SO-HDD"},{"$f":"K42","v":"S10L1-R730xd-S-HDD"},"[733-10058]",{"$f":"M42","v":150}]
[{"$f":"IF(A38=A32,H42,IF(A38=A33,H43,IF(A38=A34,H44)))","v":"3Yr Data Protection - Keep Your Hard Drive"},1,"10L1-SO-HDD","S10L1-R730xd-S-HDD",{"$f":"IF(A38=A32,L42,IF(A38=A33,L43,IF(A38=A34,L44)))","v":"[733-10057]"},150,null,"5Yr Data Protection - Keep Your Hard Drive",{"$f":"I42","v":1},{"$f":"J42","v":"10L1-SO-HDD"},{"$f":"K42","v":"S10L1-R730xd-S-HDD"},"[733-10059]",{"$f":"M42","v":150}]
["None",{"$f":"\"\"","v":""},{"$f":"\"\"","v":""},{"$f":"\"\"","v":""},{"$f":"\"\"","v":""},{"$f":"\"\"","v":""}]
[{"$f":"IF(A39=A32,H42,IF(A39=A33,H43,IF(A39=A34,H44)))","v":"3Yr Data Protection - Keep Your Hard Drive"},1,"10L1-SO-HDD","S10L1-R730xd-S-HDD",{"$f":"IF(A39=A32,L42,IF(A39=A33,L43,IF(A39=A34,L44)))","v":"[733-10057]"},150]
[]
[]
[]
["Protezione dei dati Selezionata"]
[{"$f":"'Server10 Lotto1 R730xd'!B147","v":"None"}]
[]
["Servizio Specialistico di System and Network Management per sistema opertivo Windows, erogato on site.",1,"10L1-SO-WIN","S10L1-R730xd-S-WIN",null,193]
["Servizio Specialistico di System and Network Management per sistema opertivo Linux, erogato on site.",1,"10L1-SO-LINUX","S10L1-R730xd-S-LINUX",null,193]
[]
["None",{"$f":"\"\"","v":""},{"$f":"\"\"","v":""},{"$f":"\"\"","v":""},{"$f":"\"\"","v":""},{"$f":"\"\"","v":""}]
[{"$f":"IF('Server10 Lotto1 R730xd'!$C$16>=5,H57,\"None\")","v":"None"},{"$f":"IF('Server10 Lotto1 R730xd'!$C$16>=5,I57,\"\")","v":""},{"$f":"IF('Server10 Lotto1 R730xd'!$C$16>=5,J57,\"\")","v":""},{"$f":"IF('Server10 Lotto1 R730xd'!$C$16>=5,K57,\"\")","v":""},{"$f":"IF('Server10 Lotto1 R730xd'!$C$16>=5,L57,\"\")","v":""},{"$f":"IF('Server10 Lotto1 R730xd'!$C$16>=5,M57,\"\")","v":""},null,"Servizi di manutenzione preventiva",1,"10L1-SO-PREV","S10L1-R730xd-S-PREV",null,193]
[]
[]
["Warranty Upgrades",null,null,null,null,null,"Protezione dei dati - Keep Your Hard Drive "]
["T630"]
["None",{"$f":"\"\"","v":""},{"$f":"\"\"","v":""},{"$f":"\"\"","v":""},{"$f":"\"\"","v":""},{"$f":"\"\"","v":""},null,null,{"$f":"IF(($A$22=$A$12),\"\",IF($A$8=$A$3,I70,IF($A$8=$A$4,I71,IF($A$8=$A$5,I72))))","v":""},{"$f":"IF(($A$22=$A$12),\"\",IF($A$8=$A$3,J70,IF($A$8=$A$4,J71,IF($A$8=$A$5,J72))))","v":""},{"$f":"IF(($A$22=$A$12),\"\",IF($A$8=$A$3,K70,IF($A$8=$A$4,K71,IF($A$8=$A$5,K72))))","v":""},{"$f":"IF(($A$22=$A$12),\"\",IF($A$8=$A$3,L70,IF($A$8=$A$4,L71,IF($A$8=$A$5,L72))))","v":""},{"$f":"IF(($A$22=$A$12),\"\",IF($A$8=$A$3,M70,IF($A$8=$A$4,M71,IF($A$8=$A$5,M72))))","v":""}]
["4Yr Warranty upgrade ",1,"10L1-SO-12M-T","S10L1-T630-S-12M",{"$f":"\"\"","v":""},175]
["5Yr Warranty upgrade ",1,"10L1-SO-24M-T","S10L1-T630-S-24M",{"$f":"\"\"","v":""},350]
[]
["Estensione Garanzia Selezionata"]
[{"$f":"'Server10 Lotto1 T630'!B147","v":"None"}]
[]
["None",{"$f":"\"\"","v":""},{"$f":"\"\"","v":""},{"$f":"\"\"","v":""},{"$f":"\"\"","v":""},{"$f":"\"\"","v":""},null,"None"]
[{"$f":"IF($A$67=$A$62,H70,IF($A$67=$A$63,H71,IF($A$67=$A$64,H72)))","v":"3Yr Data Protection - Keep Your Hard Drive"},1,"10L1-SO-HDD","S10L1-T630-S-HDD",{"$f":"IF($A$67=$A$62,L70,IF($A$67=$A$63,L71,IF($A$67=$A$64,L72)))","v":"[733-10057]"},150,null,"3Yr Data Protection - Keep Your Hard Drive",1,"10L1-SO-HDD","S10L1-T630-S-HDD","[733-10057]",150]
[null,null,null,null,null,null,null,"4Yr Data Protection - Keep Your Hard Drive",{"$f":"I70","v":1},{"$f":"J70","v":"10L1-SO-HDD"},{"$f":"K70","v":"S10L1-T630-S-HDD"},"[733-10058]",{"$f":"M70","v":150}]
[null,null,null,null,null,null,null,"5Yr Data Protection - Keep Your Hard Drive",{"$f":"I70","v":1},{"$f":"J70","v":"10L1-SO-HDD"},{"$f":"K70","v":"S10L1-T630-S-HDD"},"[733-10059]",{"$f":"M70","v":150}]
[]
["Protezione dei dati Selezionata"]
[{"$f":"'Server10 Lotto1 T630'!B150","v":"None"}]
[]
["Servizio Specialistico di System and Network Management per sistema opertivo Windows, erogato on site.",1,"10L1-SO-WIN","S10L1-T630-S-WIN",null,193]
["Servizio Specialistico di System and Network Management per sistema opertivo Linux, erogato on site.",1,"10L1-SO-LINUX","S10L1-T630-S-LINUX",null,193]
[]
["None",{"$f":"\"\"","v":""},{"$f":"\"\"","v":""},{"$f":"\"\"","v":""},{"$f":"\"\"","v":""},{"$f":"\"\"","v":""}]
[{"$f":"IF('Server10 Lotto1 T630'!$C$12>=5,H81,\"None\")","v":"None"},{"$f":"IF('Server10 Lotto1 T630'!$C$12>=5,I81,\"\")","v":""},{"$f":"IF('Server10 Lotto1 T630'!$C$12>=5,J81,\"\")","v":""},{"$f":"IF('Server10 Lotto1 T630'!$C$12>=5,K81,\"\")","v":""},{"$f":"IF('Server10 Lotto1 T630'!$C$12>=5,L81,\"\")","v":""},{"$f":"IF('Server10 Lotto1 T630'!$C$12>=5,M81,\"\")","v":""},null,"Servizi di manutenzione preventiva",1,"10L1-SO-PREV","S10L1-T630-S-PREV",null,193]