{"text_format":"1","workbook":"xlsx","n_sheets":15,"sheets":["Server10 Lotto2 DL560","Server10 Lotto2 DL580","RACK, Accessori e Servizi","Riepilogo","Server10 Lotto2 DL560 2","Server10 Lotto2 DL560 3","Server10 Lotto2 DL580 2","Server10 Lotto2 DL580 3","Codici","Processor","Memory","Operating System","HDD","PCI","Servizi Opzionali"],"not_rendered":{"charts":0,"images":9,"macros":1,"external_links":1,"defined_names":120,"comments":0,"pivot_tables":0},"unopened":[],"bounds":{"document_bytes":16777216,"sheet_cells":100000,"rows_first":2000,"rows_last":500,"rows_between":2000,"halvings":0,"cell_chars":16384,"cell_head_chars":4096},"cells_cut":0,"cells_raw":0,"read":"whole","date_system":"1900"}

{"sheet":"Server10 Lotto2 DL560","index":0,"n_rows":118,"n_cols":8,"rows_kept":118,"cut":false,"hidden":false,"merged":[[63,8,66,10],[67,8,70,10],[104,2,104,4],[106,1,106,4],[107,2,107,4],[82,1,82,4],[83,2,83,4],[85,1,85,4],[86,2,86,4],[100,1,100,4],[88,1,88,4],[91,1,91,4],[97,1,97,4],[89,2,89,4],[92,2,92,4],[95,2,95,4],[109,1,109,4],[101,2,101,4],[103,1,103,4],[116,2,116,4],[118,1,118,4],[113,2,113,4],[112,1,112,4],[110,2,110,4],[115,1,115,4],[98,2,98,4],[94,1,94,4],[80,2,80,4],[70,1,70,4],[71,2,71,4],[73,1,73,4],[74,2,74,4],[76,1,76,4],[77,2,77,4],[79,1,79,4],[67,2,67,4],[48,2,48,4],[52,1,52,4],[53,2,53,4],[55,1,55,4],[56,2,56,4],[62,1,62,4],[63,2,63,4],[66,1,66,4],[47,1,47,4],[30,1,30,4],[31,2,31,4],[33,1,33,4],[36,1,36,4],[37,2,37,4],[43,1,43,4],[44,2,44,4],[28,2,28,4],[0,0,3,5],[4,0,4,4],[5,0,5,4],[10,0,11,5],[12,0,12,5],[18,2,18,4],[20,1,20,4],[24,2,24,4],[27,1,27,4]]}
[]
[]
[]
[]
["Server10 Lotto2 DL560",null,null,null,null,null,null,"List Price *"]
[null,null,null,null,null,null,null,{"$f":"F17*C16","v":0}]
[]
[]
[]
[]
["Components: \nServer HP Proliant DL560 Gen9 (2CPU Intel® Xeon® E5-4620 v4, 64GB , 2xHDD 300GB 15K RPM SAS 12Gbps 2.5in)"]
[]
[]
[]
["Proliant DL560 Gen9","Category: Server",null,null,null,{"$f":"5272.5","v":5272.5}]
[null,"Quantity: ",null,null,null,{"$f":"SUM(F20:F119)","v":0}]
[null,null,null,null,null,{"$f":"SUM(F15:F16)","v":5272.5}]
[]
[null,"Base"]
[null,"HPE DL560 Gen9 CTO Server",1,null,"742657-B21"]
[]
[null,"Configurazione dello chassis"]
[null,"HP DL560 Gen9 2SFF Media Bay Kit",1,null,"795090-B21"]
[]
[null,"Processore"]
[null,"HPE DL560 Gen9 E5-4620v4 FIO Kit",1,null,"830267-L21"]
[null,"HPE DL560 Gen9 E5-4620v4 Kit",1,null,"830267-B21"]
[]
[null,"Processore aggiuntivo"]
[null,"No Additional Processor",{"$f":"VLOOKUP($B$30, CPU_A, 2, FALSE)","v":0},{"$f":"VLOOKUP($B$30, CPU_A, 3, FALSE)","v":""},{"$f":"VLOOKUP($B$30, CPU_A, 5, FALSE)","v":""},{"$f":"VLOOKUP(B30, CPU_A, 12, FALSE)","v":0}]
[]
[null,"Mezz Board Option"]
[null,{"$f":"VLOOKUP($B$30, CPU_A, 6, FALSE)","v":""},{"$f":"VLOOKUP($B$30, CPU_A, 7, FALSE)","v":""},null,{"$f":"VLOOKUP($B$30, CPU_A, 8, FALSE)","v":""}]
[]
[null,"Memoria Totale in GB",null,{"$f":"IF(('Server10 Lotto2 DL560'!$D$12=0),\"\",'Server10 Lotto2 DL560'!#REF!)","v":""}]
[null,64]
[]
[null,"Capacità di memoria"]
[null,"HPE 32GB 2Rx4 PC4-2400T-R Kit",{"$f":"IF($B$30=\"No Additional Processor\",VLOOKUP($B$36, MEM_A1, 9, FALSE),VLOOKUP($B$36, MEM_A2, 9, FALSE))","v":"2"},null,"805351-B21"]
[]
[null,{"$f":"IF($B$30=\"No Additional Processor\",VLOOKUP($B$36, MEM_A1, 2, FALSE),VLOOKUP($B$36, MEM_A2, 2, FALSE))","v":""},{"$f":"IF($B$30=\"No Additional Processor\",VLOOKUP($B$36, MEM_A1, 3, FALSE),VLOOKUP($B$36, MEM_A2, 3, FALSE))","v":""},{"$f":"IF($B$30=\"No Additional Processor\",VLOOKUP($B$36, MEM_A1, 4, FALSE),VLOOKUP($B$36, MEM_A2, 4, FALSE))","v":""},{"$f":"IF($B$30=\"No Additional Processor\",VLOOKUP($B$36, MEM_A1, 6, FALSE),VLOOKUP($B$36, MEM_A2, 6, FALSE))","v":""},{"$f":"IF($B$30=\"No Additional Processor\",VLOOKUP($B$36, MEM_A1, 7, FALSE),VLOOKUP($B$36, MEM_A2, 7, FALSE))","v":""}]
[]
[null,{"$f":"IF($B$30=\"No Additional Processor\",VLOOKUP($B$36, MEM_A1, 11, FALSE),VLOOKUP($B$36, MEM_A2, 11, FALSE))","v":""},{"$f":"IF($B$30=\"No Additional Processor\",VLOOKUP($B$36, MEM_A1, 12, FALSE),VLOOKUP($B$36, MEM_A2, 12, FALSE))","v":""},{"$f":"IF($B$30=\"No Additional Processor\",VLOOKUP($B$36, MEM_A1, 13, FALSE),VLOOKUP($B$36, MEM_A2, 13, FALSE))","v":""},{"$f":"IF($B$30=\"No Additional Processor\",VLOOKUP($B$36, MEM_A1, 15, FALSE),VLOOKUP($B$36, MEM_A2, 15, FALSE))","v":""},{"$f":"IF($B$30=\"No Additional Processor\",VLOOKUP($B$36, MEM_A1, 16, FALSE),VLOOKUP($B$36, MEM_A2, 16, FALSE))","v":""}]
[]
[null,"Sistema operativo preinstallato"]
[null,"No Operating System",{"$f":"VLOOKUP($B$46, OS_A, 2, FALSE)","v":""},{"$f":"VLOOKUP($B$46, OS_A, 3, FALSE)","v":""},{"$f":"VLOOKUP($B$46, OS_A, 5, FALSE)","v":""},{"$f":"VLOOKUP($B$46, OS_A, 6, FALSE)","v":""}]
[null,null,{"$f":"IF($D$47=\"\",\"\",C46)","v":""},{"$f":"IF(H47+C30=3,\"10L2-WIN2\",IF(H47+C30=4,\"10L2-WINDC2\",\"\"))","v":""},{"$f":"IF($D$47=\"\",\"\",E46)","v":""},{"$f":"IF($D$47=\"\",\"\",F46)","v":""},null,{"$f":"IF(D46=\"10L2-WIN1\",1,IF(D46=\"10L2-WINDC1\",2,0))","v":0}]
[]
[null,"Client Access Licenses"]
[null,{"$f":"VLOOKUP($B$46, OS_A, 7, FALSE)","v":"None"},null,{"$f":"VLOOKUP($B$46, OS_A, 9, FALSE)","v":""},{"$f":"VLOOKUP($B$46, OS_A, 11, FALSE)","v":""},{"$f":"VLOOKUP($B$46, OS_A, 12, FALSE)*C50","v":0}]
[]
[null,{"$f":"VLOOKUP($B$46, OS_A, 13, FALSE)","v":"None"},null,{"$f":"VLOOKUP($B$46, OS_A, 15, FALSE)","v":""},{"$f":"VLOOKUP($B$46, OS_A, 17, FALSE)","v":""},{"$f":"VLOOKUP($B$46, OS_A, 18, FALSE)*C52","v":0}]
[]
[null,"Controller RAID"]
[null,"HP Smart Array P440ar/2G FIO Controller",1,null,"749974-B21"]
[]
[null,"Dischi rigidi"]
[null,"HP 300GB 12G SAS 15K 2.5in SC ENT HDD",2,null,"759208-B21"]
[]
[null,"HP 300GB 12G SAS 15K 2.5in SC ENT HDD",null,{"$f":"VLOOKUP($B$60, HDD_A,3, FALSE)","v":"10L2-HDD300GB"},{"$f":"VLOOKUP($B$60, HDD_A,5, FALSE)","v":"759208-B21"},{"$f":"VLOOKUP($B$60, HDD_A,6, FALSE)*C60","v":0}]
[]
[null,"HP 1TB 6G SAS 7.2K 2.5in SC MDL HDD",null,{"$f":"VLOOKUP($B$62, HDD_A,3, FALSE)","v":"10L2-HDD1TB"},{"$f":"VLOOKUP($B$62, HDD_A,5, FALSE)","v":"652749-B21"},{"$f":"VLOOKUP($B$62, HDD_A,6, FALSE)*C62","v":0}]
[]
[null,"Configurazione RAID con HDD 300GB"]
[null,"RAID 1  (2 HDDs)",1,null,{"$f":"VLOOKUP($B$65,  RAID_A1, 2, FALSE)","v":""}]
[null,"Hot Spare for 300GB HDD","No"]
[]
[null,"Configurazione RAID con HDD 1TB"]
[null,"",1,null,{"$f":"VLOOKUP($B$69,  RAID_A2, 2, FALSE)","v":""}]
[null,"Hot Spare for 1TB HDD","No"]
[]
[null,"Alimentatore"]
[null,"HP 1200W CS Plat PL HtPlg Pwr Supply Kit",2,null,"656364-B21"]
[]
[null,"PCIe Riser"]
[null,"HP DL560 Gen9 Secondary 3 Slot Riser Kit",1,null,"793474-B21"]
[]
[null,"Management Hardware"]
[null,"HP DL560 Gen9 Power Module w/ SID Kit",1,null,"795106-B21"]
[]
[null,"Scheda FlexibleLOM"]
[null,"HP Ethernet 1GbE 4P 331FLR FIO Adptr",1,null,"684208-B21"]
[]
[null,"Additional Card for PCIe Slot 1"]
[null,"None",{"$f":"VLOOKUP(B85,  PCI_A1, 2, FALSE)","v":""},{"$f":"VLOOKUP(B85,  PCI_A1, 3, FALSE)","v":""},{"$f":"VLOOKUP(B85,  PCI_A1, 5, FALSE)","v":""},{"$f":"VLOOKUP(B85,  PCI_A1, 6, FALSE)","v":""}]
[]
[null,"Additional Card for PCIe Slot 2"]
[null,"None",{"$f":"VLOOKUP(B88,  PCI_A1, 2, FALSE)","v":""},{"$f":"VLOOKUP(B88,  PCI_A1, 3, FALSE)","v":""},{"$f":"VLOOKUP(B88,  PCI_A1, 5, FALSE)","v":""},{"$f":"VLOOKUP(B88,  PCI_A1, 6, FALSE)","v":""}]
[]
[null,"Additional Card for PCIe Slot 3"]
[null,"None",{"$f":"VLOOKUP(B91,  PCI_A1, 2, FALSE)","v":""},{"$f":"VLOOKUP(B91,  PCI_A1, 3, FALSE)","v":""},{"$f":"VLOOKUP(B91,  PCI_A1, 5, FALSE)","v":""},{"$f":"VLOOKUP(B91,  PCI_A1, 6, FALSE)","v":""}]
[]
[null,"Additional Card for PCIe Slot 4"]
[null,"None",{"$f":"VLOOKUP(B94,  PCI_A1, 2, FALSE)","v":""},{"$f":"VLOOKUP(B94,  PCI_A1, 3, FALSE)","v":""},{"$f":"VLOOKUP(B94,  PCI_A1, 5, FALSE)","v":""},{"$f":"VLOOKUP(B94,  PCI_A1, 6, FALSE)","v":""}]
[]
[null,"Additional Card for PCIe Slot 5"]
[null,"None",{"$f":"VLOOKUP(B97,  PCI_A1, 2, FALSE)","v":""},{"$f":"VLOOKUP(B97,  PCI_A1, 3, FALSE)","v":""},{"$f":"VLOOKUP(B97,  PCI_A1, 5, FALSE)","v":""},{"$f":"VLOOKUP(B97,  PCI_A1, 6, FALSE)","v":""}]
[]
[null,"Additional Card for PCIe Slot 6"]
[null,"None",{"$f":"VLOOKUP(B100,  PCI_A1, 2, FALSE)","v":""},{"$f":"VLOOKUP(B100,  PCI_A1, 3, FALSE)","v":""},{"$f":"VLOOKUP(B100,  PCI_A1, 5, FALSE)","v":""},{"$f":"VLOOKUP(B100,  PCI_A1, 6, FALSE)","v":""}]
[]
[null,"Additional Card for PCIe Slot 7"]
[null,"None",{"$f":"VLOOKUP(B103,  PCI_A1, 2, FALSE)","v":""},{"$f":"VLOOKUP(B103,  PCI_A1, 3, FALSE)","v":""},{"$f":"VLOOKUP(B103,  PCI_A1, 5, FALSE)","v":""},{"$f":"VLOOKUP(B103,  PCI_A1, 6, FALSE)","v":""}]
[]
[null,"Bezel"]
[null,"HP 2U Security Bezel Kit",1,null,"666988-B21"]
[]
[null,"Unità ottica interna"]
[null,"HP 9.5mm SATA DVD-ROM Jb Gen9 Kit",1,null,"726536-B21"]
[]
[null,"Accessori per Server"]
[null,"HP BLc 10G SFP+ SR Transceiver",{"$f":"(VLOOKUP(B85,PCI_A1,8,FALSE))+((VLOOKUP(B88,PCI_A1,8,FALSE)))+((VLOOKUP(B91,PCI_A1,8,FALSE)))+((VLOOKUP(B94,PCI_A1,8,FALSE)))+((VLOOKUP(B97,PCI_A1,8,FALSE)))+((VLOOKUP(B100,PCI_A1,8,FALSE)))+((VLOOKUP(B103,PCI_A1,8,FALSE)))","v":0},null,"455883-B21"]
[]
[null,"Estenzione di Garanzia"]
[null,"None",{"$f":"VLOOKUP($B$115,  SO_A1, 2, FALSE)","v":""},{"$f":"VLOOKUP($B$115,  SO_A1, 3, FALSE)","v":""},{"$f":"VLOOKUP($B$115,  SO_A1, 5, FALSE)","v":""},{"$f":"VLOOKUP($B$115,  SO_A1, 6, FALSE)","v":""}]
[]
[null,"Protezione dei dati - Keep Your Hard Drive "]
[null,"None",{"$f":"VLOOKUP($B$118,  SO_A2, 2, FALSE)","v":""},{"$f":"VLOOKUP($B$118,  SO_A2, 3, FALSE)","v":""},{"$f":"VLOOKUP($B$118,  SO_A2,5, FALSE)","v":""},{"$f":"VLOOKUP($B$118,  SO_A2, 6, FALSE)","v":""}]

{"sheet":"Server10 Lotto2 DL580","index":1,"n_rows":118,"n_cols":8,"rows_kept":118,"cut":false,"hidden":false,"merged":[[63,8,66,10],[67,8,70,10],[104,2,104,4],[94,1,94,4],[95,2,95,4],[80,2,80,4],[82,1,82,4],[83,2,83,4],[85,1,85,4],[86,2,86,4],[97,1,97,4],[98,2,98,4],[100,1,100,4],[101,2,101,4],[103,1,103,4],[74,2,74,4],[118,1,118,4],[113,2,113,4],[106,1,106,4],[107,2,107,4],[109,1,109,4],[110,2,110,4],[112,1,112,4],[115,1,115,4],[116,2,116,4],[76,1,76,4],[77,2,77,4],[79,1,79,4],[92,2,92,4],[88,1,88,4],[89,2,89,4],[91,1,91,4],[48,2,48,4],[67,2,67,4],[70,1,70,4],[71,2,71,4],[73,1,73,4],[53,2,53,4],[55,1,55,4],[56,2,56,4],[62,1,62,4],[63,2,63,4],[66,1,66,4],[50,1,50,4],[52,1,52,4],[37,2,37,4],[43,1,43,4],[44,2,44,4],[47,1,47,4],[18,2,18,4],[36,1,36,4],[20,1,20,4],[21,2,21,4],[23,1,23,4],[24,2,24,4],[27,1,27,4],[28,2,28,4],[30,1,30,4],[31,2,31,4],[33,1,33,4],[0,0,3,5],[4,0,4,4],[5,0,5,4],[10,0,11,5],[12,0,12,5]]}
[]
[]
[]
[]
["Server10 Lotto2 DL580",null,null,null,null,null,null,"List Price *"]
[null,null,null,null,null,null,null,{"$f":"F17*C16","v":0}]
[]
[]
[]
[]
["Components: \nServer HP Proliant DL580 Gen9 (2CPU Intel® Xeon® E7-4830 v4, 64GB , 2xHDD 300GB 15K RPM SAS 12Gbps 2.5in)"]
[]
[]
[]
["Proliant DL580 Gen9","Category: Server",null,null,null,{"$f":"7444.5","v":7444.5}]
[null,"Quantity: ",null,null,null,{"$f":"SUM(F20:F119)","v":0}]
[null,null,null,null,null,{"$f":"SUM(F15:F16)","v":7444.5}]
[]
[null,"Base"]
[null,"HP DL580 Gen9 CTO Svr",1,null,"793161-B21"]
[]
[null,"Configurazione dello chassis"]
[null,"HP DL580 5 SFF Drive Backplane Kit",1,null,"739405-B21"]
[]
[null,"Processore"]
[null,"HPE DL580 Gen9 E7-4830v4 FIO 1P Kit",1,null,"816653-L21"]
[null,"HPE DL580 Gen9 E7-4830v4 1P Kit",1,null,"816653-B21"]
[]
[null,"Processore aggiuntivo"]
[null,"No Additional Processor",{"$f":"VLOOKUP($B$30, CPU_B, 2, FALSE)","v":0},{"$f":"VLOOKUP($B$30, CPU_B, 3, FALSE)","v":""},{"$f":"VLOOKUP($B$30, CPU_B, 5, FALSE)","v":""},{"$f":"VLOOKUP(B30, CPU_B, 12, FALSE)","v":""}]
[]
[null,"Memory Cartridge"]
[null,{"$f":"IF($B$30=\"No Additional Processor\",VLOOKUP($B$36, MEM_B1, 17, FALSE),VLOOKUP($B$36, MEM_B2, 17, FALSE))","v":"HP DL580 Gen9 12 DIMMs Memory Cartridge"},{"$f":"IF($B$30=\"No Additional Processor\",VLOOKUP($B$36, MEM_B1, 19, FALSE),VLOOKUP($B$36, MEM_B2, 19, FALSE))","v":2},null,{"$f":"IF($B$30=\"No Additional Processor\",VLOOKUP($B$36, MEM_B1, 18, FALSE),VLOOKUP($B$36, MEM_B2, 18, FALSE))","v":"788360-B21"}]
[]
[null,"Memoria Totale in GB",null,{"$f":"IF(('Server10 Lotto2 DL580'!$D$12=0),\"\",'Server10 Lotto2 DL580'!#REF!)","v":""}]
[null,64]
[]
[null,"Capacità di memoria"]
[null,{"$f":"IF($B$30=\"No Additional Processor\",VLOOKUP($B$36, MEM_B1, 8, FALSE),VLOOKUP($B$36, MEM_B2, 8, FALSE))","v":"HPE 16GB 2Rx4 PC4-2400T-R Kit"},{"$f":"IF($B$30=\"No Additional Processor\",VLOOKUP($B$36, MEM_B1, 9, FALSE),VLOOKUP($B$36, MEM_B2, 9, FALSE))","v":4},null,{"$f":"IF($B$30=\"No Additional Processor\",VLOOKUP($B$36, MEM_B1, 10, FALSE),VLOOKUP($B$36, MEM_B2, 10, FALSE))","v":"836220-B21"}]
[]
[null,{"$f":"IF($B$30=\"No Additional Processor\",VLOOKUP($B$36, MEM_B1, 2, FALSE),VLOOKUP($B$36, MEM_B2, 2, FALSE))","v":""},{"$f":"IF($B$30=\"No Additional Processor\",VLOOKUP($B$36, MEM_B1, 3, FALSE),VLOOKUP($B$36, MEM_B2, 3, FALSE))","v":""},{"$f":"IF($B$30=\"No Additional Processor\",VLOOKUP($B$36, MEM_B1, 4, FALSE),VLOOKUP($B$36, MEM_B2, 4, FALSE))","v":""},{"$f":"IF($B$30=\"No Additional Processor\",VLOOKUP($B$36, MEM_B1, 6, FALSE),VLOOKUP($B$36, MEM_B2, 6, FALSE))","v":""},{"$f":"IF($B$30=\"No Additional Processor\",VLOOKUP($B$36, MEM_B1, 7, FALSE),VLOOKUP($B$36, MEM_B2, 7, FALSE))","v":""}]
[]
[null,{"$f":"IF($B$30=\"No Additional Processor\",VLOOKUP($B$36, MEM_B1, 11, FALSE),VLOOKUP($B$36, MEM_B2, 11, FALSE))","v":""},{"$f":"IF($B$30=\"No Additional Processor\",VLOOKUP($B$36, MEM_B1, 12, FALSE),VLOOKUP($B$36, MEM_B2, 12, FALSE))","v":""},{"$f":"IF($B$30=\"No Additional Processor\",VLOOKUP($B$36, MEM_B1, 13, FALSE),VLOOKUP($B$36, MEM_B2, 13, FALSE))","v":""},{"$f":"IF($B$30=\"No Additional Processor\",VLOOKUP($B$36, MEM_B1, 15, FALSE),VLOOKUP($B$36, MEM_B2, 15, FALSE))","v":""},{"$f":"IF($B$30=\"No Additional Processor\",VLOOKUP($B$36, MEM_B1, 16, FALSE),VLOOKUP($B$36, MEM_B2, 16, FALSE))","v":""}]
[]
[null,"Sistema operativo preinstallato"]
[null,"No Operating System",{"$f":"VLOOKUP($B$46, OS_B, 2, FALSE)","v":""},{"$f":"VLOOKUP($B$46, OS_B, 3, FALSE)","v":""},{"$f":"VLOOKUP($B$46, OS_B, 5, FALSE)","v":""},{"$f":"VLOOKUP($B$46, OS_B, 6, FALSE)","v":""}]
[null,null,{"$f":"IF($D$47=\"\",\"\",C46)","v":""},{"$f":"IF(H47+C30=3,\"10L2-WIN2\",IF(H47+C30=4,\"10L2-WINDC2\",\"\"))","v":""},{"$f":"IF($D$47=\"\",\"\",E46)","v":""},{"$f":"IF($D$47=\"\",\"\",F46)","v":""},null,{"$f":"IF(D46=\"10L2-WIN1\",1,IF(D46=\"10L2-WINDC1\",2,0))","v":0}]
[]
[null,"Client Access Licenses"]
[null,{"$f":"VLOOKUP($B$46, OS_B, 7, FALSE)","v":"None"},null,{"$f":"VLOOKUP($B$46, OS_B, 9, FALSE)","v":""},{"$f":"VLOOKUP($B$46, OS_B, 11, FALSE)","v":""},{"$f":"VLOOKUP($B$46, OS_B, 12, FALSE)*C50","v":0}]
[]
[null,{"$f":"VLOOKUP($B$46, OS_B, 13, FALSE)","v":"None"},null,{"$f":"VLOOKUP($B$46, OS_B, 15, FALSE)","v":""},{"$f":"VLOOKUP($B$46, OS_B, 17, FALSE)","v":""},{"$f":"VLOOKUP($B$46, OS_B, 18, FALSE)*C52","v":0}]
[]
[null,"Controller RAID"]
[null,"HP Smart Array 2GB 24in FIO Flashback Write Cache",1,null,"758836-B21"]
[]
[null,"Dischi rigidi"]
[null,"HP 300GB 12G SAS 15K 2.5in SC ENT HDD",2,null,"759208-B21"]
[]
[null,"HP 300GB 12G SAS 15K 2.5in SC ENT HDD",0,{"$f":"VLOOKUP($B$60, HDD_A,3, FALSE)","v":"10L2-HDD300GB"},{"$f":"VLOOKUP($B$60, HDD_A,5, FALSE)","v":"759208-B21"},{"$f":"VLOOKUP($B$60, HDD_A,6, FALSE)*C60","v":0}]
[]
[null,"HP 1TB 6G SAS 7.2K 2.5in SC MDL HDD",null,{"$f":"VLOOKUP($B$62, HDD_A,3, FALSE)","v":"10L2-HDD1TB"},{"$f":"VLOOKUP($B$62, HDD_A,5, FALSE)","v":"652749-B21"},{"$f":"VLOOKUP($B$62, HDD_A,6, FALSE)*C62","v":0}]
[]
[null,"Configurazione RAID con HDD 300GB"]
[null,"RAID 1  (2 HDDs)",1,null,{"$f":"VLOOKUP($B$65,  RAID_B1, 2, FALSE)","v":"[780-BBJK]"}]
[null,"Hot Spare for 300GB HDD","No"]
[]
[null,"Configurazione RAID con HDD 1TB"]
[null,"",1,null,{"$f":"VLOOKUP($B$69,  RAID_B2, 2, FALSE)","v":""}]
[null,"Hot Spare for 1TB HDD","No"]
[]
[null,"Alimentatore"]
[null,"HP 1200W CS Plat PL HtPlg Pwr Supply Kit",4,null,"656364-B21"]
[]
[null,"Scheda FlexibleLOM"]
[null,"HP Ethernet 1GbE 4P 331FLR FIO Adptr",1,null,"684208-B21"]
[]
[null,"Additional Card for PCIe Slot 9 (CPU1 / CPU2)"]
[null,"None",{"$f":"VLOOKUP($B$79,  PCI_B1, 2, FALSE)","v":""},{"$f":"VLOOKUP($B$79,  PCI_B1, 3, FALSE)","v":""},{"$f":"VLOOKUP($B$79,  PCI_B1, 5, FALSE)","v":""},{"$f":"VLOOKUP($B$79,  PCI_B1, 6, FALSE)","v":""}]
[]
[null,"Additional Card for PCIe Slot 8 (CPU1 / CPU2)"]
[null,"None",{"$f":"VLOOKUP($B$82,  PCI_B2, 2, FALSE)","v":""},{"$f":"VLOOKUP($B$82,  PCI_B2, 3, FALSE)","v":""},{"$f":"VLOOKUP($B$82,  PCI_B2, 5, FALSE)","v":""},{"$f":"VLOOKUP($B$82,  PCI_B2, 6, FALSE)","v":""}]
[]
[null,"Additional Card for PCIe Slot 7 (CPU1 / CPU2)"]
[null,"None",{"$f":"VLOOKUP($B$85,  PCI_B3, 2, FALSE)","v":""},{"$f":"VLOOKUP($B$85,  PCI_B3, 3, FALSE)","v":""},{"$f":"VLOOKUP($B$85,  PCI_B3, 5, FALSE)","v":""},{"$f":"VLOOKUP($B$85,  PCI_B3, 6, FALSE)","v":""}]
[]
[null,"Additional Card for PCIe Slot 6 (CPU1 / CPU2)"]
[null,"None",{"$f":"VLOOKUP($B$88,  PCI_B4, 2, FALSE)","v":""},{"$f":"VLOOKUP($B$88,  PCI_B4, 3, FALSE)","v":""},{"$f":"VLOOKUP($B$88,  PCI_B4, 5, FALSE)","v":""},{"$f":"VLOOKUP($B$88,  PCI_B4, 6, FALSE)","v":""}]
[]
[null,"Additional Card for PCIe Slot 5 (CPU3 / CPU4)"]
[null,"None",{"$f":"IF(B91=\"Aggiungere Coppia di Processori\",\"\",(VLOOKUP(B91,PCI_B5, 2, FALSE)))","v":""},{"$f":"IF(B91=\"Aggiungere Coppia di Processori\",\"\",(VLOOKUP(B91,PCI_B5, 3, FALSE)))","v":""},{"$f":"IF(B91=\"Aggiungere Coppia di Processori\",\"\",(VLOOKUP(B91,PCI_B5, 5, FALSE)))","v":""},{"$f":"IF(B91=\"Aggiungere Coppia di Processori\",\"\",(VLOOKUP(B91,PCI_B5, 2, FALSE)))","v":""}]
[]
[null,"Additional Card for PCIe Slot 4 (CPU3 / CPU4)"]
[null,"None",{"$f":"IF(B94=\"Aggiungere Coppia di Processori\",\"\",(VLOOKUP(B94,PCI_B6, 2, FALSE)))","v":""},{"$f":"IF(B94=\"Aggiungere Coppia di Processori\",\"\",(VLOOKUP(B94,PCI_B6, 3, FALSE)))","v":""},{"$f":"IF(B94=\"Aggiungere Coppia di Processori\",\"\",(VLOOKUP(B94,PCI_B6, 5, FALSE)))","v":""},{"$f":"IF(B94=\"Aggiungere Coppia di Processori\",\"\",(VLOOKUP(B94,PCI_B6, 2, FALSE)))","v":""}]
[]
[null,"Additional Card for PCIe Slot 3 (CPU3 / CPU4)"]
[null,"None",{"$f":"IF(B97=\"Aggiungere Coppia di Processori\",\"\",(VLOOKUP(B97,PCI_B7, 2, FALSE)))","v":""},{"$f":"IF(B97=\"Aggiungere Coppia di Processori\",\"\",(VLOOKUP(B97,PCI_B7, 3, FALSE)))","v":""},{"$f":"IF(B97=\"Aggiungere Coppia di Processori\",\"\",(VLOOKUP(B97,PCI_B7, 5, FALSE)))","v":""},{"$f":"IF(B97=\"Aggiungere Coppia di Processori\",\"\",(VLOOKUP(B97,PCI_B7, 2, FALSE)))","v":""}]
[]
[null,"Additional Card for PCIe Slot 2 (CPU3 / CPU4)"]
[null,"None",{"$f":"IF(B100=\"Aggiungere Coppia di Processori\",\"\",(VLOOKUP(B100,PCI_B8, 2, FALSE)))","v":""},{"$f":"IF(B100=\"Aggiungere Coppia di Processori\",\"\",(VLOOKUP(B100,PCI_B8, 3, FALSE)))","v":""},{"$f":"IF(B100=\"Aggiungere Coppia di Processori\",\"\",(VLOOKUP(B100,PCI_B8, 5, FALSE)))","v":""},{"$f":"IF(B100=\"Aggiungere Coppia di Processori\",\"\",(VLOOKUP(B100,PCI_B8, 2, FALSE)))","v":""}]
[]
[null,"Additional Card for PCIe Slot 1 (CPU3 / CPU4)"]
[null,"None",{"$f":"IF(B103=\"Aggiungere Coppia di Processori\",\"\",(VLOOKUP(B103,PCI_B9, 2, FALSE)))","v":""},{"$f":"IF(B103=\"Aggiungere Coppia di Processori\",\"\",(VLOOKUP(B103,PCI_B9, 3, FALSE)))","v":""},{"$f":"IF(B103=\"Aggiungere Coppia di Processori\",\"\",(VLOOKUP(B103,PCI_B9, 5, FALSE)))","v":""},{"$f":"IF(B103=\"Aggiungere Coppia di Processori\",\"\",(VLOOKUP(B103,PCI_B9, 2, FALSE)))","v":""}]
[]
[null,"Bezel"]
[null,"HP 4U Security Bezel Kit",1,null,"741213-B21"]
[]
[null,"Accessori per Server"]
[null,"HP BLc 10G SFP+ SR Transceiver",{"$f":"(VLOOKUP(B79,PCI_A1,8,FALSE))+((VLOOKUP(B82,PCI_A1,8,FALSE)))+((VLOOKUP(B85,PCI_A1,8,FALSE)))+((VLOOKUP(B88,PCI_A1,8,FALSE)))+((VLOOKUP(B91,PCI_A1,8,FALSE)))+((VLOOKUP(B94,PCI_A1,8,FALSE)))+((VLOOKUP(B97,PCI_A1,8,FALSE)))+((VLOOKUP(B100,PCI_A1,8,FALSE)))+((VLOOKUP(B103,PCI_A1,8,FALSE)))","v":0},null,"455883-B21"]
[]
[null,"Unità ottica"]
[null,"HP Mobile USB DVDRW Drive",1,null,"701498-B21"]
[]
[null,"Estenzione di Garanzia"]
[null,"None",{"$f":"VLOOKUP($B$115,  SO_B1,2, FALSE)","v":""},{"$f":"VLOOKUP($B$115,  SO_B1, 3, FALSE)","v":""},{"$f":"VLOOKUP($B$115,  SO_B1, 5, FALSE)","v":""},{"$f":"VLOOKUP($B$115,  SO_B1, 6, FALSE)","v":""}]
[]
[null,"Protezione dei dati - Keep Your Hard Drive "]
[null,"None",{"$f":"VLOOKUP($B$118,  SO_B2, 2, FALSE)","v":""},{"$f":"VLOOKUP($B$118,  SO_B2, 3, FALSE)","v":""},{"$f":"VLOOKUP($B$118,  SO_B2,5, FALSE)","v":""},{"$f":"VLOOKUP($B$118,  SO_B2, 6, FALSE)","v":""}]

{"sheet":"RACK, Accessori e Servizi","index":2,"n_rows":63,"n_cols":17,"rows_kept":63,"cut":false,"hidden":false,"merged":[[11,13,23,17],[13,2,13,7],[16,2,16,7],[19,2,19,7],[22,2,22,7],[0,3,0,8],[2,12,9,12],[11,12,23,12],[23,4,23,7],[47,2,47,6],[4,2,4,7],[6,2,6,7],[8,2,8,7]]}
[null,null,null,"Indicare il numero delle Opzioni"]
[]
[null,null,null,null,null,null,null,null,null,null,null,null,"SERVIZI"]
[null,null,{"$f":"IF(SRV_A+SRV_B>=1,\"Servizi Specialistici\",\"\")","v":""}]
[null,null,{"$f":"IF(SRV_A+SRV_B>=1,\"Servizio Specialistico di System and Network Management per sistema opertivo Windows, erogato on site. (GG/Uomo)\",\"\")","v":""},null,null,null,null,null,null,null,{"$f":"IF(J5>=1,\"10L2-SO-WIN\",\"\")","v":""}]
[]
[null,null,{"$f":"IF(SRV_A+SRV_B>=1,\"Servizio Specialistico di System and Network Management per sistema opertivo Linux, erogato on site. (GG/Uomo)\",\"\")","v":""},null,null,null,null,null,null,null,{"$f":"IF(J7>=1,\"10L2-SO-LINUX\",\"\")","v":""}]
[]
[null,null,{"$f":"IF((SRV_A+SRV_AA+SRV_AAA+SRV_B+SRV_BB+SRV_BBB)>=5,\"Servizi specialistici sistemistici per aggiornare e prevenire malfunzionamenti. \n(Minimo 5 Server)\",\"\")","v":""},null,null,null,null,null,null,null,{"$f":"IF(J9>=1,\"10L2-SO-PREV\",\"\")","v":""}]
[]
[]
[null,null,null,null,null,null,null,null,null,null,null,null,"SERVER RACK","In questo foglio deve essere indicata la quantità delle opzioni Hardware  e dei Servizi da acquistare.\n\nDi seguito è possibile configurare fino a 10 tipologie di armadio Rack a seconda della tipologia e del numero di Server inseriti al suo interno."]
[null,null,"Rack (OpzRack)"]
[null,null,{"$f":"IF((SRV_A+SRV_AA+SRV_AAA+SRV_B+SRV_BB+SRV_BBB)>=1,\"Tecnosteel: armadio Rack 19'' 42U ''Tecno SuperServer''\",\"\")","v":""},null,null,null,null,null,null,null,{"$f":"IF(J14>=1,\"10L2-RACK\",\"\")","v":""}]
[]
[null,null,"KVM (OpzGUIRack)"]
[null,null,{"$f":"IF((SRV_A+SRV_AA+SRV_AAA+SRV_B+SRV_BB+SRV_BBB)>=1,\"Tecnosteel: OneView 1U Rackmount Console 17'' with Italian Keyboard\",\"\")","v":""},null,null,null,null,null,null,null,{"$f":"IF(J17>=1,\"10L2-GUI\",\"\")","v":""}]
[]
[null,null,"KVM Option (OpzSWGUIRack)"]
[null,null,{"$f":"IF((SRV_A+SRV_AA+SRV_AAA+SRV_B+SRV_BB+SRV_BBB)>=1,\"Tecnosteel: 8-port remote KVM switch with one remote user\",\"\")","v":""},null,null,null,null,null,null,null,{"$f":"IF(J20>=1,\"10L2-KVMIP\",\"\")","v":""}]
[]
[null,null,"Uninterrupted Power Supply (OpzUPS 3000VA)"]
[null,null,{"$f":"IF((SRV_A+SRV_AA+SRV_AAA+SRV_B+SRV_BB+SRV_BBB)>=1,\"Riello - UPS MSR3000EVO 3000VA 2U Rackmount (SNMP+USB+RS232)\",\"\")","v":""},null,null,null,null,null,null,null,{"$f":"IF(J23>=1,\"10L2-UPS\",\"\")","v":""}]
[]
[]
[null,null,null,"Totale-"]
[null,null,null,"RACK A","RACK B","RACK C","RACK D","RACK E","RACK F","RACK G","RACK H","RACK I","RACK J"]
[null,null,{"$f":"J14","v":0},{"$f":"IF(H48>0,IF(C28-H48=0,0,C28-H48),0)","v":0},{"$f":"IF(I48>0,IF(D28-I48=0,0,D28-I48),0)","v":0},0,0,0,0,0,0,0,0]
[]
[]
[null,null,null,"Server Modello 1",null,null,{"$f":"SRV_A","v":0}]
[null,null,null,"Server Modello 2",null,null,{"$f":"SRV_AA","v":0}]
[null,null,null,"Server Modello 3",null,null,{"$f":"SRV_AAA","v":0}]
[null,null,null,"Server Modello 4",null,null,{"$f":"SRV_B","v":0}]
[null,null,null,"Server Modello 5",null,null,{"$f":"SRV_BB","v":0}]
[null,null,null,"Server Modello 6",null,null,{"$f":"SRV_BBB","v":0}]
[]
[null,null,null,null,null,null,null,{"$f":"SUM(H4:H9)+H11+H80*2+H82*2","v":0},0,0,0,0,0,0,0,0,0]
[]
[]
[]
[]
[]
[]
[]
[null,null,"Rack ancora da configurare",null,null,{"$f":"J14-H48-I48-J48-K48-L48-M48-N48-O48-P48-Q48","v":0}]
[]
[null,null,"Indicare il numero di rack per questa configurazione"]
[]
[null,null,null,null,"Totali","da inserire",null,{"$f":"IF(C28>0,\"RACK A\",\"\")","v":""},{"$f":"IF(D28>0,\"RACK B\",\"\")","v":""},{"$f":"IF(E28>0,\"RACK C\",\"\")","v":""},{"$f":"IF(F28>0,\"RACK D\",\"\")","v":""},{"$f":"IF(G28>0,\"RACK E\",\"\")","v":""},{"$f":"IF(H28>0,\"RACK F\",\"\")","v":""},{"$f":"IF(I28>0,\"RACK G\",\"\")","v":""},{"$f":"IF(J28>0,\"RACK H\",\"\")","v":""},{"$f":"IF(K28>0,\"RACK I\",\"\")","v":""},{"$f":"IF(L28>0,\"RACK J\",\"\")","v":""}]
[]
[null,null,{"$f":"IF(G31*$J$14>0,\"Server Lotto2 DL560 Conf.1\",\"\")","v":""},null,{"$f":"G31","v":0},{"$f":"(E52-(H52*$H$48)-(I52*$I$48)-(J52*$J$48)-(K52*$K$48)-(L52*$L$48)-(M52*$M$48)-(N52*$N$48)-(O52*$O$48)-(P52*$P$48)-(Q52*$Q$48))","v":0}]
[null,null,{"$f":"IF(G32*$J$14>0,\"Server Lotto2 DL560 Conf.2\",\"\")","v":""},null,{"$f":"G32","v":0},{"$f":"(E53-(H53*$H$48)-(I53*$I$48)-(J53*$J$48)-(K53*$K$48)-(L53*$L$48)-(M53*$M$48)-(N53*$N$48)-(O53*$O$48)-(P53*$P$48)-(Q53*$Q$48))","v":0}]
[null,null,{"$f":"IF(G33*$J$14>0,\"Server Lotto2 DL560 Conf.3\",\"\")","v":""},null,0,0]
[null,null,{"$f":"IF(G34*$J$14>0,\"Server Lotto2 DL580 Conf.1\",\"\")","v":""},null,0,0]
[null,null,{"$f":"IF(G35*$J$14>0,\"Server Lotto2 DL580 Conf.2\",\"\")","v":""},null,0,0]
[null,null,{"$f":"IF(G36*$J$14>0,\"Server Lotto2 DL580 Conf.3\",\"\")","v":""},null,0,0]
[]
[null,null,{"$f":"IF(J17>0,\"OpzGUIRack Disponibili\",\" \")","v":" "},null,{"$f":"J17","v":0},{"$f":"J17-H59*H48-I59*I48-J59*J48-K59*K48-L59*L48-M59*M48-N59*N48-O59*O48-P59*P48-Q59*Q48","v":0}]
[]
[null,null,{"$f":"IF(J20>0,\"OpzSWGUIRack Disponibili\",\" \")","v":" "},null,{"$f":"J20","v":0},{"$f":"J20-H61*H48-I61*I48-J61*J48-K61*K48-L61*L48-M61*M48-N61*N48-O61*O48-P61*P48-Q61*Q48","v":0}]
[]
[null,null,{"$f":"IF(J23>0,\"OpzUPS 3000VA Disponibili\",\" \")","v":" "},null,{"$f":"J23","v":0},{"$f":"J23-H63*H48-I63*I48-J63*J48-K63*K48-L63*L48-M63*M48-N63*N48-O63*O48-P63*P48-Q63*Q48","v":0}]

{"sheet":"Riepilogo","index":3,"n_rows":198,"n_cols":42,"rows_kept":198,"cut":false,"hidden":false,"merged":[[113,1,115,5],[116,1,118,5],[113,8,115,12],[116,8,118,12],[113,15,115,19],[116,15,118,19],[161,1,163,5],[164,1,166,5],[161,8,163,12],[164,8,166,12],[161,15,163,19],[164,15,166,19],[137,16,137,19],[137,2,137,5],[137,9,137,12],[143,2,143,5],[144,2,144,5],[145,2,145,5],[146,2,146,5],[143,9,143,12],[144,9,144,12],[145,9,145,12],[146,9,146,12],[138,2,138,5],[185,6,185,7],[185,13,185,14],[179,1,179,2],[182,1,182,2],[182,6,182,7],[182,13,182,14],[183,1,183,2],[183,6,183,7],[183,13,183,14],[184,1,184,2],[184,6,184,7],[184,13,184,14],[178,1,178,2],[178,6,178,7],[178,13,178,14],[179,6,179,7],[179,13,179,14],[180,1,180,2],[180,6,180,7],[180,13,180,14],[181,1,181,2],[181,6,181,7],[181,13,181,14],[175,1,175,2],[175,6,175,7],[175,13,175,14],[176,1,176,2],[176,6,176,7],[176,13,176,14],[177,1,177,2],[177,6,177,7],[177,13,177,14],[169,3,170,18],[172,6,172,7],[172,13,172,14],[173,1,173,2],[173,6,173,7],[173,13,173,14],[174,1,174,2],[174,6,174,7],[174,13,174,14],[12,1,12,20],[13,2,13,5],[13,6,13,8],[13,9,13,16],[94,2,94,5],[95,2,95,5],[93,9,93,12],[94,9,94,12],[95,9,95,12],[93,16,93,19],[94,16,94,19],[95,16,95,19],[62,6,62,8],[62,9,62,16],[63,1,63,16],[63,17,63,20],[64,1,64,16],[64,17,64,20],[13,17,13,18],[35,19,35,20],[35,6,35,8],[34,19,34,20],[34,2,34,5],[34,6,34,8],[139,2,139,5],[138,9,138,12],[139,9,139,12],[143,16,143,19],[144,16,144,19],[145,16,145,19],[146,16,146,19],[138,16,138,19],[139,16,139,19],[141,2,141,5],[0,17,1,20],[0,1,0,5],[0,6,0,14],[1,1,1,5],[1,6,1,7],[1,8,5,16],[2,1,2,5],[2,6,2,7],[3,1,3,5],[3,6,3,7],[4,1,4,7],[5,1,5,5],[5,6,5,7],[7,1,7,3],[7,4,7,8],[7,9,7,10],[7,11,7,14],[7,15,7,16],[7,17,7,20],[11,2,11,5],[11,6,11,8],[11,9,11,16],[11,17,11,18],[11,19,11,20],[14,19,14,20],[15,17,15,18],[15,19,15,20],[79,2,79,5],[62,17,62,18],[62,19,62,20],[41,2,41,5],[41,6,41,8],[41,9,41,16],[41,17,41,18],[41,19,41,20],[42,2,42,5],[42,6,42,8],[42,9,42,16],[42,17,42,18],[42,19,42,20],[46,17,46,18],[46,19,46,20],[62,2,62,5],[31,19,31,20],[32,2,32,5],[32,6,32,8],[32,9,32,16],[32,17,32,18],[32,19,32,20],[13,19,13,20],[30,1,30,20],[34,17,34,18],[34,9,34,16],[14,2,14,5],[14,6,14,8],[14,9,14,16],[14,17,14,18],[16,19,16,20],[19,19,19,20],[20,6,20,8],[20,9,20,16],[20,17,20,18],[20,19,20,20],[21,2,21,5],[21,6,21,8],[21,9,21,16],[21,17,21,18],[23,2,23,5],[23,6,23,8],[23,9,23,16],[23,17,23,18],[23,19,23,20],[36,2,36,5],[36,6,36,8],[36,9,36,16],[36,17,36,18],[39,17,39,18],[16,17,16,18],[19,2,19,5],[19,6,19,8],[19,9,19,16],[19,17,19,18],[20,2,20,5],[16,2,16,5],[16,6,16,8],[31,2,31,5],[31,6,31,8],[31,9,31,16],[31,17,31,18],[16,9,16,16],[35,2,35,5],[35,9,35,16],[35,17,35,18],[22,2,22,5],[22,6,22,8],[29,9,29,16],[61,2,61,5],[61,6,61,8],[61,9,61,16],[61,17,61,18],[61,19,61,20],[49,19,49,20],[54,2,54,5],[54,6,54,8],[54,9,54,16],[54,17,54,18],[54,19,54,20],[55,17,55,18],[49,2,49,5],[49,6,49,8],[49,9,49,16],[49,17,49,18],[55,2,55,5],[55,6,55,8],[55,9,55,16],[60,2,60,5],[60,6,60,8],[60,9,60,16],[60,17,60,18],[60,19,60,20],[65,1,65,16],[65,17,65,20],[88,9,88,12],[89,9,89,12],[69,3,70,18],[73,1,73,3],[73,8,73,10],[73,15,73,17],[75,2,75,5],[75,9,75,12],[75,16,75,19],[76,2,76,5],[76,9,76,12],[76,16,76,19],[77,2,77,5],[77,9,77,12],[77,16,77,19],[80,2,80,5],[79,9,79,12],[79,16,79,19],[84,2,84,5],[85,2,85,5],[86,2,86,5],[87,2,87,5],[125,9,125,12],[125,16,125,19],[80,9,80,12],[80,16,80,19],[81,2,81,5],[81,9,81,12],[81,16,81,19],[88,2,88,5],[89,2,89,5],[96,2,96,5],[88,16,88,19],[89,16,89,19],[92,16,92,19],[96,16,96,19],[92,9,92,12],[96,9,96,12],[97,9,97,12],[98,9,98,12],[98,16,98,19],[97,2,97,5],[98,2,98,5],[97,16,97,19],[87,9,87,12],[93,2,93,5],[187,2,187,3],[187,4,187,5],[187,6,187,7],[187,8,187,9],[187,10,187,11],[187,12,187,13],[102,15,102,16],[102,17,102,19],[107,15,107,16],[107,17,107,19],[109,1,109,3],[121,1,121,3],[121,8,121,10],[121,15,121,17],[123,2,123,5],[123,9,123,12],[123,16,123,19],[124,2,124,5],[124,9,124,12],[124,16,124,19],[126,2,126,5],[126,9,126,12],[126,16,126,19],[125,2,125,5],[193,2,193,7],[193,14,193,19],[100,8,100,10],[100,1,100,3],[100,15,100,17],[102,3,102,5],[107,3,107,5],[102,1,102,2],[107,1,107,2],[109,8,109,10],[104,15,104,17],[102,8,102,9],[102,10,102,12],[107,8,107,9],[107,10,107,12],[104,1,104,3],[104,8,104,10],[187,14,187,15],[109,15,109,17],[187,16,187,17],[187,18,187,19],[127,2,127,5],[127,9,127,12],[127,16,127,19],[194,2,197,7],[194,14,197,19],[15,2,15,5],[15,6,15,8],[15,9,15,16],[50,2,50,5],[50,6,50,8],[50,9,50,16],[17,2,17,5],[17,6,17,8],[17,9,17,16],[17,17,17,18],[17,19,17,20],[18,2,18,5],[26,2,26,5],[26,6,26,8],[26,9,26,16],[26,17,26,18],[26,19,26,20],[18,6,18,8],[18,9,18,16],[18,17,18,18],[18,19,18,20],[190,3,191,18],[36,19,36,20],[37,2,37,5],[37,6,37,8],[37,9,37,16],[37,17,37,18],[37,19,37,20],[43,2,43,5],[43,6,43,8],[43,9,43,16],[43,17,43,18],[43,19,43,20],[40,2,40,5],[40,6,40,8],[40,9,40,16],[40,17,40,18],[40,19,40,20],[38,2,38,5],[38,6,38,8],[38,9,38,16],[38,17,38,18],[38,19,38,20],[39,2,39,5],[39,6,39,8],[39,9,39,16],[44,19,44,20],[45,6,45,8],[45,9,45,16],[45,17,45,18],[45,19,45,20],[47,2,47,5],[47,6,47,8],[47,9,47,16],[47,17,47,18],[47,19,47,20],[46,2,46,5],[46,6,46,8],[46,9,46,16],[44,2,44,5],[45,2,45,5],[44,6,44,8],[44,9,44,16],[44,17,44,18],[57,6,57,8],[57,9,57,16],[57,17,57,18],[57,19,57,20],[59,19,59,20],[53,2,53,5],[53,6,53,8],[53,9,53,16],[58,2,58,5],[58,6,58,8],[58,9,58,16],[58,17,58,18],[53,17,53,18],[53,19,53,20],[58,19,58,20],[55,19,55,20],[56,2,56,5],[56,6,56,8],[56,9,56,16],[56,17,56,18],[56,19,56,20],[27,2,27,5],[27,6,27,8],[27,9,27,16],[27,17,27,18],[27,19,27,20],[25,6,25,8],[25,9,25,16],[25,17,25,18],[25,19,25,20],[25,2,25,5],[128,2,128,5],[128,9,128,12],[128,16,128,19],[129,2,129,5],[129,9,129,12],[129,16,129,19],[130,2,130,5],[130,9,130,12],[130,16,130,19],[131,2,131,5],[131,9,131,12],[131,16,131,19],[132,2,132,5],[132,9,132,12],[132,16,132,19],[133,2,133,5],[133,9,133,12],[133,16,133,19],[134,2,134,5],[134,9,134,12],[134,16,134,19],[92,2,92,5],[150,1,150,2],[150,3,150,5],[150,8,150,9],[150,10,150,12],[150,15,150,16],[150,17,150,19],[135,9,135,12],[135,16,135,19],[136,9,136,12],[136,16,136,19],[140,9,140,12],[140,16,140,19],[141,9,141,12],[141,16,141,19],[142,2,142,5],[142,9,142,12],[142,16,142,19],[135,2,135,5],[136,2,136,5],[140,2,140,5],[28,2,28,5],[28,6,28,8],[28,9,28,16],[29,2,29,5],[29,6,29,8],[33,2,33,5],[59,2,59,5],[59,6,59,8],[59,9,59,16],[48,1,48,20],[51,17,51,18],[51,19,51,20],[50,17,50,18],[50,19,50,20],[51,2,51,5],[51,6,51,8],[51,9,51,16],[39,19,39,20],[52,2,52,5],[52,6,52,8],[52,9,52,16],[52,17,52,18],[59,17,59,18],[57,2,57,5],[78,16,78,19],[82,16,82,19],[83,16,83,19],[84,16,84,19],[85,16,85,19],[86,16,86,19],[87,16,87,19],[90,16,90,19],[91,16,91,19],[78,9,78,12],[82,9,82,12],[83,9,83,12],[84,9,84,12],[85,9,85,12],[86,9,86,12],[90,9,90,12],[91,9,91,12],[78,2,78,5],[82,2,82,5],[83,2,83,5],[90,2,90,5],[91,2,91,5],[155,17,155,19],[148,1,148,3],[148,8,148,10],[148,15,148,17],[157,1,157,3],[157,8,157,10],[157,15,157,17],[152,1,152,3],[152,8,152,10],[152,15,152,17],[155,1,155,2],[155,3,155,5],[155,8,155,9],[155,10,155,12],[155,15,155,16],[52,19,52,20],[9,1,9,3],[9,4,9,8],[9,9,9,10],[9,11,9,14],[9,15,9,16],[9,17,9,20],[33,6,33,8],[33,9,33,16],[33,17,33,18],[33,19,33,20],[24,2,24,5],[24,6,24,8],[24,9,24,16],[24,17,24,18],[24,19,24,20],[28,17,28,18],[28,19,28,20],[29,19,29,20],[21,19,21,20],[29,17,29,18],[22,9,22,16],[22,17,22,18],[22,19,22,20]]}
[null,"Amministrazione ",null,null,null,null,null,null,null,null,null,null,null,null,null,null,null,"CONFIGURATORE ELETTRONICO CONVENZIONE CONSIP \nSERVER 10 LOTTO 2",null,null,null,1]
[null,"N° Identificativo Ordine ",null,null,null,null,null,null,{"$f":"IF(G4=R66,\"Configurazione OK\",U4)","v":"Nel \"Tot Ordine Portale CONSIP\" deve essere inserito l'importo totale risultante dall'ordinativo del portale CONSIP.\nQualora l'importo inserito corrisponde al valore ricalcolato dal configuratore viene attivato il pulsante \"Salva in formato PDF\" che permette di generare il file pdf da allegare all'ordinativo."},null,null,null,null,null,null,null,null,null,null,null,null,1]
[null,"Data Ordine",null,null,null,null,null,null,null,null,null,null,null,null,null,null,null,null,null,null,null,1]
[null,"Tot Ordine Portale CONSIP IVA incl.",null,null,null,null,"x",null,null,null,null,null,null,null,null,null,null,null,null,null,"Nel \"Tot Ordine Portale CONSIP\" deve essere inserito l'importo totale risultante dall'ordinativo del portale CONSIP.\nQualora l'importo inserito corrisponde al valore ricalcolato dal configuratore viene attivato il pulsante \"Salva in formato PDF\" che permette di generare il file pdf da allegare all'ordinativo.",1]
[null,"LE CELLE IN GIALLO DEVO ESSERE COMPILATE OBBLIGATORIAMENTE",null,null,null,null,null,null,null,null,null,null,null,null,null,null,null,null,null,null,null,1]
[null,"Quantità Server Ordinati",null,null,null,null,{"$f":"IF(B32=\"\",0,B32)+IF(B14=\"\",0,B14)","v":0},null,null,null,null,null,null,null,null,null,null,null,null,"ver. 4.0",null,1]
[null,null,null,null,null,null,null,null,null,null,null,null,null,null,null,null,null,null,null,null,null,1]
[null,"Referente per la Consegna",null,null,null,null,null,null,null,"Telefono",null,null,null,null,null,"email",null,null,null,null,null,1]
[null,null,null,null,null,null,null,null,null,null,null,null,null,null,null,null,null,null,null,null,null,1]
[null,"Referente per l'installazione",null,null,null,null,null,null,null,"Telefono",null,null,null,null,null,"email",null,null,null,null,null,1]
[null,null,null,null,null,null,null,null,null,null,null,null,null,null,null,null,null,null,null,null,null,1]
[null,"Qtà Totale Ordinata","Oggetto di fornitura",null,null,null,"Codice Prodotto",null,null,"Descrizione Sintetica (si faccia riferimento alla guida alla convenzione per la descrizione estesa e per le regole di acquisto delle opzioni)",null,null,null,null,null,null,null,"Costo Unitario",null,"Costo Complessivo",null,1]
[null,"SERVER PRESTAZIONALE (HP PROLIANT DL560 Gen9)",null,null,null,null,null,null,null,null,null,null,null,null,null,null,null,null,null,null,null,{"$f":"IF(B14>=\"\",0,1)","v":0},null,"Server1","Server2","Server3"]
[null,{"$f":"IF(AE14>=1,AE14,\"\")","v":""},{"$f":"IF(AE14>0,(VLOOKUP(G14,COD_A,2,FALSE)),\"\")","v":""},null,null,null,{"$f":"IF(AE14>=1,W14,\"\")","v":""},null,null,{"$f":"IF(AE14>0,(VLOOKUP(G14,COD_A,5,FALSE)),\"\")","v":""},null,null,null,null,null,null,null,{"$f":"IF(AE14>0,(VLOOKUP(G14,COD_A,3,FALSE)),\"\")","v":""},null,{"$f":"IF(B14=\"\",\"\",R14*B14)","v":""},null,{"$f":"IF(B14>=\"\",0,1)","v":0},"10L2-DL560G9-U",{"$f":"SRV_A","v":0},{"$f":"SRV_AA","v":0},{"$f":"SRV_AAA","v":0},null,null,null,null,{"$f":"SUM(X14:AD14)","v":0}]
[null,{"$f":"IF(AE15>=1,AE15,\"\")","v":""},"",null,null,null,{"$f":"IF(AE15>=1,W15,\"\")","v":""},null,null,"",null,null,null,null,null,null,null,"",null,{"$f":"IF(B15=\"\",\"\",R15*B15)","v":""},null,{"$f":"IF(B15>=\"\",0,1)","v":0},"10L2-CPU-P-U",{"$f":"'Server10 Lotto2 DL560'!$C$30/2","v":0},{"$f":"'Server10 Lotto2 DL560 2'!$C$30/2","v":0},{"$f":"'Server10 Lotto2 DL560 3'!$C$30/2","v":0},null,{"$f":"X15*$X$14","v":0},{"$f":"Y15*$Y$14","v":0},{"$f":"Z15*$Z$14","v":0},{"$f":"SUM(AB15:AD15)","v":0}]
[null,{"$f":"IF(AE16>=1,AE16,\"\")","v":""},"",null,null,null,{"$f":"IF(AE16>=1,W16,\"\")","v":""},null,null,"",null,null,null,null,null,null,null,"",null,{"$f":"IF(B16=\"\",\"\",R16*B16)","v":""},null,0,"10L2-16GB-U",{"$f":"IF(MEM_A=\"\",0,MEM_A)","v":0},{"$f":"IF(MEM_AA=\"\",0,MEM_AA)","v":0},{"$f":"IF(MEM_AAA=\"\",0,MEM_AAA)","v":0},null,{"$f":"X16*$X$14","v":0},{"$f":"Y16*$Y$14","v":0},{"$f":"Z16*$Z$14","v":0},{"$f":"SUM(AB16:AD16)","v":0}]
[null,"","",null,null,null,"",null,null,"",null,null,null,null,null,null,null,"",null,"",null,0,"10L2-32GB-U",{"$f":"IF(MEM_A32=\"\",0,MEM_A32)","v":0},{"$f":"IF(MEM_AA32=\"\",0,MEM_AA32)","v":0},{"$f":"IF(MEM_AAA32=\"\",0,MEM_AAA32)","v":0},null,{"$f":"X17*$X$14","v":0},{"$f":"Y17*$Y$14","v":0},{"$f":"Z17*$Z$14","v":0},{"$f":"SUM(AB17:AD17)","v":0}]
[null,"","",null,null,null,"",null,null,"",null,null,null,null,null,null,null,"",null,"",null,0,null,null,null,null,null,null,null,null,null,null,null,"slot1",{"$f":"'Server10 Lotto2 DL560'!$D$85","v":""},{"$f":"'Server10 Lotto2 DL560 2'!$D$85","v":""},{"$f":"'Server10 Lotto2 DL560 3'!$D$85","v":""}]
[null,"","",null,null,null,"",null,null,"",null,null,null,null,null,null,null,"",null,"",null,0,"10L2-LAN1GB",{"$f":"COUNTIF($AI$18:$AI$24,W19)","v":0},{"$f":"COUNTIF($AJ$18:$AJ$24,W19)","v":0},{"$f":"COUNTIF($AK$18:$AK$24,W19)","v":0},null,{"$f":"X19*$X$14","v":0},{"$f":"Y19*$Y$14","v":0},{"$f":"Z19*$Z$14","v":0},{"$f":"SUM(AB19:AD19)","v":0},null,null,"slot2",{"$f":"'Server10 Lotto2 DL560'!$D$88","v":""},{"$f":"'Server10 Lotto2 DL560 2'!$D$88","v":""},{"$f":"'Server10 Lotto2 DL560 3'!$D$88","v":""}]
[null,"","",null,null,null,"",null,null,"",null,null,null,null,null,null,null,"",null,"",null,0,null,null,null,null,null,null,null,null,null,null,null,"slot3",{"$f":"'Server10 Lotto2 DL560'!$D$91","v":""},{"$f":"'Server10 Lotto2 DL560 2'!$D$91","v":""},{"$f":"'Server10 Lotto2 DL560 3'!$D$91","v":""}]
[null,"","",null,null,null,"",null,null,"",null,null,null,null,null,null,null,"",null,"",null,0,"10L2-LAN10GB",{"$f":"COUNTIF($AI$18:$AI$24,W21)","v":0},{"$f":"COUNTIF($AJ$18:$AJ$24,W21)","v":0},{"$f":"COUNTIF($AK$18:$AK$24,W21)","v":0},null,{"$f":"X21*$X$14","v":0},{"$f":"Y21*$Y$14","v":0},{"$f":"Z21*$Z$14","v":0},{"$f":"SUM(AB21:AD21)","v":0},null,null,"slot4",{"$f":"'Server10 Lotto2 DL560'!$D$94","v":""},{"$f":"'Server10 Lotto2 DL560 2'!$D$94","v":""},{"$f":"'Server10 Lotto2 DL560 3'!$D$94","v":""}]
[null,"","",null,null,null,"",null,null,"",null,null,null,null,null,null,null,"",null,"",null,0,null,null,null,null,null,null,null,null,null,null,null,"slot5",{"$f":"'Server10 Lotto2 DL560'!$D$97","v":""},{"$f":"'Server10 Lotto2 DL560 2'!$D$97","v":""},{"$f":"'Server10 Lotto2 DL560 3'!$D$97","v":""}]
[null,"","",null,null,null,"",null,null,"",null,null,null,null,null,null,null,"",null,"",null,0,"10L2-CNA10",{"$f":"COUNTIF($AI$18:$AI$24,W23)","v":0},{"$f":"COUNTIF($AJ$18:$AJ$24,W23)","v":0},{"$f":"COUNTIF($AK$18:$AK$24,W23)","v":0},null,{"$f":"X23*$X$14","v":0},0,0,0,null,null,"slot6",{"$f":"'Server10 Lotto2 DL560'!$D$100","v":""},{"$f":"'Server10 Lotto2 DL560 2'!$D$100","v":""},{"$f":"'Server10 Lotto2 DL560 3'!$D$100","v":""}]
[null,"","",null,null,null,"",null,null,"",null,null,null,null,null,null,null,"",null,"",null,0,null,null,null,null,null,null,null,null,null,null,null,"slot7",{"$f":"'Server10 Lotto2 DL560'!$D$103","v":""},{"$f":"'Server10 Lotto2 DL560 2'!$D$103","v":""},{"$f":"'Server10 Lotto2 DL560 3'!$D$103","v":""}]
[null,{"$f":"IF(AE25>=1,AE25,\"\")","v":""},"",null,null,null,{"$f":"IF(AE25>=1,W25,\"\")","v":""},null,null,"",null,null,null,null,null,null,null,"",null,"",null,0,"10L2-FC",{"$f":"COUNTIF($AI$18:$AI$24,W25)","v":0},{"$f":"COUNTIF($AJ$18:$AJ$24,W25)","v":0},{"$f":"COUNTIF($AK$18:$AK$24,W25)","v":0},null,0,0,0,0]
[null,"","",null,null,null,"",null,null,"",null,null,null,null,null,null,null,"",null,"",null,0,"10L2-HDD300GB",{"$f":"HD300_A","v":0},{"$f":"HD300_AA","v":0},{"$f":"HD300_AAA","v":0},null,{"$f":"X26*$X$14","v":0},{"$f":"Y26*$Y$14","v":0},{"$f":"Z26*$Z$14","v":0},{"$f":"SUM(AB26:AD26)","v":0}]
[null,"","",null,null,null,"",null,null,"",null,null,null,null,null,null,null,"",null,"",null,0,"10L2-HDD1TB",{"$f":"HD1000_A","v":0},{"$f":"HD1000_AA","v":0},{"$f":"HD1000_AAA","v":0},null,{"$f":"X27*$X$14","v":0},{"$f":"Y27*$Y$14","v":0},{"$f":"Z27*$Z$14","v":0},{"$f":"SUM(AB27:AD27)","v":0}]
[null,"","",null,null,null,"",null,null,"",null,null,null,null,null,null,null,"",null,"",null,0,"10L2-SO-12M",{"$f":"IF('Server10 Lotto2 DL560'!$D$115=W28,'Server10 Lotto2 DL560'!$C$115,0)","v":0},{"$f":"IF('Server10 Lotto2 DL560 2'!$D$115=W28,'Server10 Lotto2 DL560 2'!$C$115,0)","v":0},{"$f":"IF('Server10 Lotto2 DL560 3'!$D$115=W28,'Server10 Lotto2 DL560 3'!$C$115,0)","v":0},null,{"$f":"X28*$X$14","v":0},{"$f":"Y28*$Y$14","v":0},{"$f":"Z28*$Z$14","v":0},{"$f":"SUM(AB28:AD28)","v":0}]
[null,"","",null,null,null,"",null,null,"",null,null,null,null,null,null,null,"",null,"",null,0,"10L2-SO-24M",{"$f":"IF('Server10 Lotto2 DL560'!$D$115=W29,'Server10 Lotto2 DL560'!$C$115,0)","v":0},{"$f":"IF('Server10 Lotto2 DL560 2'!$D$115=W29,'Server10 Lotto2 DL560 2'!$C$115,0)","v":0},{"$f":"IF('Server10 Lotto2 DL560 3'!$D$115=W29,'Server10 Lotto2 DL560 3'!$C$115,0)","v":0},null,{"$f":"X29*$X$14","v":0},{"$f":"Y29*$Y$14","v":0},{"$f":"Z29*$Z$14","v":0},{"$f":"SUM(AB29:AD29)","v":0}]
[null,"","",null,null,null,"",null,null,"",null,null,null,null,null,null,null,"",null,"",null,0,"10L2-SO-HDD",{"$f":"IF('Server10 Lotto2 DL560'!$D$118=W30,'Server10 Lotto2 DL560'!$C$118,0)","v":0},{"$f":"IF('Server10 Lotto2 DL560 2'!$D$118=W30,'Server10 Lotto2 DL560 2'!$C$118,0)","v":0},{"$f":"IF('Server10 Lotto2 DL560 3'!$D$118=W30,'Server10 Lotto2 DL560 3'!$C$118,0)","v":0},null,{"$f":"X30*$X$14","v":0},{"$f":"Y30*$Y$14","v":0},{"$f":"Z30*$Z$14","v":0},{"$f":"SUM(AB30:AD30)","v":0}]
[null,"SERVER ENTERPRISE (HP PROLIANT DL580 Gen9)",null,null,null,null,null,null,null,null,null,null,null,null,null,null,null,null,null,null,null,{"$f":"IF(B32>=\"\",0,1)","v":0},"DL580","Server1","Server2","Server3"]
[null,{"$f":"IF(AE32>=1,AE32,\"\")","v":""},{"$f":"IF(AE32>0,(VLOOKUP(G32,COD_B,2,FALSE)),\"\")","v":""},null,null,null,{"$f":"IF(AE32>=1,W32,\"\")","v":""},null,null,{"$f":"IF(AE32>0,(VLOOKUP(G32,COD_B,5,FALSE)),\"\")","v":""},null,null,null,null,null,null,null,{"$f":"IF(AE32>0,(VLOOKUP(G32,COD_B,3,FALSE)),\"\")","v":""},null,{"$f":"IF(B32=\"\",\"\",R32*B32)","v":""},null,0,"10L2-DL580G9-U",{"$f":"SRV_B","v":0},{"$f":"SRV_BB","v":0},{"$f":"SRV_BBB","v":0},null,null,null,null,{"$f":"SUM(X32:AD32)","v":0}]
[null,{"$f":"IF(AE33>=1,AE33,\"\")","v":""},{"$f":"IF(AE33>0,(VLOOKUP(G33,COD_B,2,FALSE)),\"\")","v":""},null,null,null,{"$f":"IF(AE33>=1,W33,\"\")","v":""},null,null,{"$f":"IF(AE33>0,(VLOOKUP(G33,COD_B,5,FALSE)),\"\")","v":""},null,null,null,null,null,null,null,{"$f":"IF(AE33>0,(VLOOKUP(G33,COD_B,3,FALSE)),\"\")","v":""},null,{"$f":"IF(B33=\"\",\"\",R33*B33)","v":""},null,{"$f":"IF(B33>=\"\",0,1)","v":0},"10L2-CPU-E-U",{"$f":"'Server10 Lotto2 DL580'!$C$30/2","v":0},{"$f":"'Server10 Lotto2 DL580 2'!$C$30/2","v":0},{"$f":"'Server10 Lotto2 DL580 3'!$C$30/2","v":0},null,{"$f":"X33*$X$32","v":0},{"$f":"Y33*$Y$32","v":0},{"$f":"Z33*$Z$32","v":0},{"$f":"SUM(AB33:AD33)","v":0}]
[null,"","",null,null,null,"",null,null,"",null,null,null,null,null,null,null,"",null,"",null,0,"10L2-16GB-U",{"$f":"IF(MEM_B=\"\",0,MEM_B)","v":0},{"$f":"IF(MEM_BB=\"\",0,MEM_BB)","v":0},{"$f":"IF(MEM_BBB=\"\",0,MEM_BBB)","v":0},null,{"$f":"X34*$X$32","v":0},{"$f":"Y34*$Y$32","v":0},{"$f":"Z34*$Z$32","v":0},{"$f":"SUM(AB34:AD34)","v":0}]
[null,"","",null,null,null,"",null,null,"",null,null,null,null,null,null,null,"",null,"",null,0,"10L2-32GB-U",{"$f":"IF(MEM_B32=\"\",0,MEM_B32)","v":0},{"$f":"IF(MEM_BB32=\"\",0,MEM_BB32)","v":0},{"$f":"IF(MEM_BBB32=\"\",0,MEM_BBB32)","v":0},null,0,0,0,{"$f":"SUM(AB35:AD35)","v":0}]
[null,"","",null,null,null,"",null,null,"",null,null,null,null,null,null,null,"",null,"",null,0,null,{"$f":"COUNTIF($AI$36:$AI$44,W36)","v":0},{"$f":"COUNTIF($AJ$36:$AJ$44,W36)","v":0},{"$f":"COUNTIF($AK$36:$AK$44,W36)","v":0},null,{"$f":"X36*$X$32","v":0},{"$f":"Y36*$Y$32","v":0},{"$f":"Z36*$Z$32","v":0},{"$f":"SUM(AB36:AD36)","v":0},null,null,"slot1",{"$f":"'Server10 Lotto2 DL580'!$D$79","v":""},{"$f":"'Server10 Lotto2 DL580 2'!$D$79","v":""},{"$f":"'Server10 Lotto2 DL580 3'!$D$79","v":""}]
[null,"","",null,null,null,"",null,null,"",null,null,null,null,null,null,null,"",null,"",null,0,"10L2-LAN1GB",{"$f":"COUNTIF($AI$36:$AI$44,W37)","v":0},{"$f":"COUNTIF($AJ$36:$AJ$44,W37)","v":0},{"$f":"COUNTIF($AK$36:$AK$44,W37)","v":0},null,{"$f":"X37*$X$32","v":0},{"$f":"Y37*$Y$32","v":0},{"$f":"Z37*$Z$32","v":0},{"$f":"SUM(AB37:AD37)","v":0},null,null,"slot2",{"$f":"'Server10 Lotto2 DL580'!$D$82","v":""},{"$f":"'Server10 Lotto2 DL580 2'!$D$82","v":""},{"$f":"'Server10 Lotto2 DL580 3'!$D$82","v":""}]
[null,"","",null,null,null,"",null,null,"",null,null,null,null,null,null,null,"",null,"",null,0,null,0,0,0,null,0,0,0,0,null,null,"slot3",{"$f":"'Server10 Lotto2 DL580'!D85","v":""},{"$f":"'Server10 Lotto2 DL580 2'!D85","v":""},{"$f":"'Server10 Lotto2 DL580 3'!D85","v":""}]
[null,"","",null,null,null,"",null,null,"",null,null,null,null,null,null,null,"",null,"",null,0,"10L2-LAN10GB",0,0,0,null,0,0,0,0,null,null,"slot4",{"$f":"'Server10 Lotto2 DL580'!D88","v":""},{"$f":"'Server10 Lotto2 DL580 2'!D88","v":""},{"$f":"'Server10 Lotto2 DL580 3'!D88","v":""}]
[null,"","",null,null,null,"",null,null,"",null,null,null,null,null,null,null,"",null,"",null,0,null,0,0,0,null,0,0,0,0,null,null,"slot5",{"$f":"'Server10 Lotto2 DL580'!D91","v":""},{"$f":"'Server10 Lotto2 DL580 2'!D91","v":""},{"$f":"'Server10 Lotto2 DL580 3'!D91","v":""}]
[null,"","",null,null,null,"",null,null,"",null,null,null,null,null,null,null,"",null,"",null,0,"10L2-CNA10",0,0,0,null,0,0,0,0,null,null,"slot6",{"$f":"'Server10 Lotto2 DL580'!D94","v":""},{"$f":"'Server10 Lotto2 DL580 2'!D94","v":""},{"$f":"'Server10 Lotto2 DL580 3'!D94","v":""}]
[null,"","",null,null,null,"",null,null,"",null,null,null,null,null,null,null,"",null,"",null,0,null,0,0,0,null,0,0,0,0,null,null,"slot7",{"$f":"'Server10 Lotto2 DL580'!D97","v":""}]
[null,"","",null,null,null,"",null,null,"",null,null,null,null,null,null,null,"",null,"",null,0,"10L2-FC",0,0,{"$f":"COUNTIF($AK$36:$AK$41,W43)","v":0},null,0,0,0,0,null,null,"slot8",{"$f":"'Server10 Lotto2 DL580'!D100","v":""}]
[null,"","",null,null,null,"",null,null,"",null,null,null,null,null,null,null,"",null,"",null,0,"10L2-HDD300GB",{"$f":"HD300_B","v":0},{"$f":"HD300_BB","v":0},{"$f":"HD300_BBB","v":0},null,{"$f":"X44*$X$32","v":0},{"$f":"Y44*$Y$32","v":0},{"$f":"Z44*$Z$32","v":0},{"$f":"SUM(AB44:AD44)","v":0},null,null,"slot9",{"$f":"'Server10 Lotto2 DL580'!D103","v":""}]
[null,"","",null,null,null,"",null,null,"",null,null,null,null,null,null,null,"",null,"",null,0,"10L2-HDD1TB",{"$f":"HD1000_B","v":0},{"$f":"HD1000_BB","v":0},{"$f":"HD1000_BBB","v":0},null,{"$f":"X45*$X$32","v":0},{"$f":"Y45*$Y$32","v":0},{"$f":"Z45*$Z$32","v":0},{"$f":"SUM(AB45:AD45)","v":0}]
[null,"","",null,null,null,"",null,null,"",null,null,null,null,null,null,null,"",null,"",null,0,"10L2-SO-12M",{"$f":"IF('Server10 Lotto2 DL580'!$D$115=W46,'Server10 Lotto2 DL580'!$C$115,0)","v":0},{"$f":"IF('Server10 Lotto2 DL580 2'!$D$115=W46,'Server10 Lotto2 DL580 2'!$C$115,0)","v":0},{"$f":"IF('Server10 Lotto2 DL580 3'!$D$115=W46,'Server10 Lotto2 DL580 3'!$C$115,0)","v":0},null,{"$f":"X46*$X$32","v":0},{"$f":"Y46*$Y$32","v":0},{"$f":"Z46*$Z$32","v":0},{"$f":"SUM(AB46:AD46)","v":0}]
[null,"","",null,null,null,"",null,null,"",null,null,null,null,null,null,null,"",null,"",null,0,"10L2-SO-24M",{"$f":"IF('Server10 Lotto2 DL580'!$D$115=W47,'Server10 Lotto2 DL580'!$C$115,0)","v":0},{"$f":"IF('Server10 Lotto2 DL580 2'!$D$115=W47,'Server10 Lotto2 DL580 2'!$C$115,0)","v":0},{"$f":"IF('Server10 Lotto2 DL580 3'!$D$115=W47,'Server10 Lotto2 DL580 3'!$C$115,0)","v":0},null,0,0,0,0]
[null,"","",null,null,null,"",null,null,"",null,null,null,null,null,null,null,"",null,"",null,0,"10L2-SO-HDD",{"$f":"IF('Server10 Lotto2 DL580'!$D$118=W48,'Server10 Lotto2 DL580'!$C$118,0)","v":0},{"$f":"IF('Server10 Lotto2 DL580 2'!$D$118=W48,'Server10 Lotto2 DL580 2'!$C$118,0)","v":0},{"$f":"IF('Server10 Lotto2 DL580 3'!$D$118=W48,'Server10 Lotto2 DL580 3'!$C$118,0)","v":0},null,0,0,0,0]
[null,"OPZIONI COMUNI",null,null,null,null,null,null,null,null,null,null,null,null,null,null,null,null,null,null,null,{"$f":"IF(B49>=0,1,0)","v":1},null,"DL560","DL560 2","DL560 3","DL580","DL580 2","DL580 3","tot DL560","tot DL580"]
[null,{"$f":"IF(AP50=0,\"\",AP50)","v":""},{"$f":"IF(AP50=\"\",\"\",(VLOOKUP(G50,COD_A,2,FALSE)))","v":""},null,null,null,{"$f":"IF(AP50>0,W50,\"\")","v":""},null,null,{"$f":"IF(AP50>0,(VLOOKUP(G50,COD_A,5,FALSE)),\"\")","v":""},null,null,null,null,null,null,null,{"$f":"IF(AP50>0,(VLOOKUP(G50,COD_A,3,FALSE)),\"\")","v":""},null,{"$f":"IF(B50=\"\",\"\",R50*B50)","v":""},null,0,"10L2-WIN1",{"$f":"IF('Server10 Lotto2 DL560'!$D$46=W50,1,0)","v":0},{"$f":"IF('Server10 Lotto2 DL560 2'!$D$46=W50,1,0)","v":0},{"$f":"IF('Server10 Lotto2 DL560 3'!$D$46=W50,1,0)","v":0},{"$f":"IF('Server10 Lotto2 DL580'!$D$46=W50,1,0)","v":0},{"$f":"IF('Server10 Lotto2 DL580 2'!$D$46=W50,1,0)","v":0},{"$f":"IF('Server10 Lotto2 DL580 3'!$D$46=W50,1,0)","v":0},{"$f":"SUM(X50:Z50)","v":0},{"$f":"SUM(AA50:AC50)","v":0},{"$f":"X50*$X$14","v":0},{"$f":"Y50*$Y$14","v":0},{"$f":"Z50*$Z$14","v":0},{"$f":"AA50*$X$32","v":0},{"$f":"AB50*$Y$32","v":0},{"$f":"AC50*$Z$32","v":0},null,null,null,null,{"$f":"SUM(AF50:AL50)","v":0}]
[null,{"$f":"IF(AP51=0,\"\",AP51)","v":""},"",null,null,null,{"$f":"IF(AP51>0,W51,\"\")","v":""},null,null,"",null,null,null,null,null,null,null,"",null,{"$f":"IF(B51=\"\",\"\",R51*B51)","v":""},null,0,"10L2-WIN2",{"$f":"IF('Server10 Lotto2 DL560'!$D$47=W51,1,0)","v":0},{"$f":"IF('Server10 Lotto2 DL560 2'!$D$47=W51,1,0)","v":0},{"$f":"IF('Server10 Lotto2 DL560 3'!$D$47=W51,1,0)","v":0},{"$f":"IF('Server10 Lotto2 DL580'!$D$47=W51,1,0)","v":0},{"$f":"IF('Server10 Lotto2 DL580 2'!$D$48=W51,1,0)","v":0},{"$f":"IF('Server10 Lotto2 DL580 3'!$D$48=W51,1,0)","v":0},{"$f":"SUM(X51:Z51)","v":0},{"$f":"SUM(AA51:AC51)","v":0},{"$f":"X51*$X$14","v":0},{"$f":"Y51*$Y$14","v":0},{"$f":"Z51*$Z$14","v":0},{"$f":"AA51*$X$32","v":0},{"$f":"AB51*$Y$32","v":0},{"$f":"AC51*$Z$32","v":0},null,null,null,null,{"$f":"SUM(AF51:AL51)","v":0}]
[null,"","",null,null,null,"",null,null,"",null,null,null,null,null,null,null,"",null,"",null,0,"10L2-WINDC1",{"$f":"IF('Server10 Lotto2 DL560'!$D$46=W52,1,0)","v":0},{"$f":"IF('Server10 Lotto2 DL560 2'!$D$46=W52,1,0)","v":0},{"$f":"IF('Server10 Lotto2 DL560 3'!$D$46=W52,1,0)","v":0},{"$f":"IF('Server10 Lotto2 DL580'!$D$46=W52,1,0)","v":0},{"$f":"IF('Server10 Lotto2 DL580 2'!$D$46=W52,1,0)","v":0},{"$f":"IF('Server10 Lotto2 DL580 3'!$D$46=W52,1,0)","v":0},0,0,{"$f":"X52*$X$14","v":0},{"$f":"Y52*$Y$14","v":0},{"$f":"Z52*$Z$14","v":0},{"$f":"AA52*$X$32","v":0},{"$f":"AB52*$Y$32","v":0},{"$f":"AC52*$Z$32","v":0},null,null,null,null,{"$f":"SUM(AF52:AL52)","v":0}]
[null,"","",null,null,null,{"$f":"IF(AP53>0,W53,\"\")","v":""},null,null,"",null,null,null,null,null,null,null,"",null,"",null,0,"10L2-WINDC2",{"$f":"IF('Server10 Lotto2 DL560'!$D$47=W53,1,0)","v":0},{"$f":"IF('Server10 Lotto2 DL560 2'!$D$47=W53,1,0)","v":0},{"$f":"IF('Server10 Lotto2 DL560 3'!$D$47=W53,1,0)","v":0},{"$f":"IF('Server10 Lotto2 DL580'!$D$47=W53,1,0)","v":0},{"$f":"IF('Server10 Lotto2 DL580 2'!$D$48=W53,1,0)","v":0},{"$f":"IF('Server10 Lotto2 DL580 3'!$D$48=W53,1,0)","v":0},0,0,0,0,0,0,0,0,null,null,null,null,0]
[null,{"$f":"IF(AP54=0,\"\",AP54)","v":""},"",null,null,null,"",null,null,"",null,null,null,null,null,null,null,"",null,{"$f":"IF(B54=\"\",\"\",R54*B54)","v":""},null,0,"10L2-LINUX",{"$f":"IF('Server10 Lotto2 DL560'!$D$46=W54,1,0)","v":0},{"$f":"IF('Server10 Lotto2 DL560 2'!$D$46=W54,1,0)","v":0},{"$f":"IF('Server10 Lotto2 DL560 3'!$D$46=\"10L1-LINUX\",1,0)","v":0},{"$f":"IF('Server10 Lotto2 DL580'!$D$46=W54,1,0)","v":0},{"$f":"IF('Server10 Lotto2 DL580 2'!$D$46=W54,1,0)","v":0},{"$f":"IF('Server10 Lotto2 DL580 3'!$D$46=W54,1,0)","v":0},0,0,{"$f":"X54*$X$14","v":0},{"$f":"Y54*$Y$14","v":0},{"$f":"Z54*$Z$14","v":0},{"$f":"AA54*$X$32","v":0},{"$f":"AB54*$Y$32","v":0},{"$f":"AC54*$Z$32","v":0},null,null,null,null,{"$f":"SUM(AF54:AL54)","v":0}]
[null,{"$f":"IF(AP55=0,\"\",AP55)","v":""},"",null,null,null,{"$f":"IF(AP55>0,W55,\"\")","v":""},null,null,"",null,null,null,null,null,null,null,"",null,"",null,0,"10L2-CALUSER",{"$f":"'Server10 Lotto2 DL560'!$C$50","v":0},{"$f":"'Server10 Lotto2 DL560 2'!$C$50","v":0},{"$f":"'Server10 Lotto2 DL560 3'!$C$50","v":0},{"$f":"'Server10 Lotto2 DL580'!$C$50","v":0},{"$f":"'Server10 Lotto2 DL580 2'!$C$50","v":0},{"$f":"'Server10 Lotto2 DL580 3'!$C$50","v":0},0,0,{"$f":"X55*$X$14","v":0},{"$f":"Y55*$Y$14","v":0},{"$f":"Z55*$Z$14","v":0},0,0,0,null,null,null,null,0]
[null,{"$f":"IF(AP56=0,\"\",AP56)","v":""},"",null,null,null,"",null,null,"",null,null,null,null,null,null,null,"",null,"",null,0,"10L2-CALDEV",{"$f":"'Server10 Lotto2 DL560'!$C$52","v":0},{"$f":"'Server10 Lotto2 DL560 2'!$C$52","v":0},{"$f":"'Server10 Lotto2 DL560 3'!$C$52","v":0},{"$f":"'Server10 Lotto2 DL580'!$C$52","v":0},{"$f":"'Server10 Lotto2 DL580 2'!$C$52","v":0},{"$f":"'Server10 Lotto2 DL580 3'!$C$52","v":0},0,0,{"$f":"X56*$X$14","v":0},{"$f":"Y56*$Y$14","v":0},{"$f":"Z56*$Z$14","v":0},0,0,0,null,null,null,null,0]
[null,{"$f":"IF('RACK, Accessori e Servizi'!J14=0,\"\",'RACK, Accessori e Servizi'!J14)","v":""},{"$f":"IF(B57>0,(VLOOKUP(G57,COD_A,2,FALSE)),\"\")","v":""},null,null,null,{"$f":"IF('RACK, Accessori e Servizi'!J14>0,'RACK, Accessori e Servizi'!K14,\"\")","v":""},null,null,{"$f":"IF(B57>0,(VLOOKUP(G57,COD_A,5,FALSE)),\"\")","v":""},null,null,null,null,null,null,null,{"$f":"IF(B57>0,(VLOOKUP(G57,COD_A,3,FALSE)),\"\")","v":""},null,{"$f":"IF(B57=\"\",\"\",R57*B57)","v":""},null,0]
[null,{"$f":"IF('RACK, Accessori e Servizi'!J23=0,\"\",'RACK, Accessori e Servizi'!J23)","v":""},"",null,null,null,{"$f":"IF('RACK, Accessori e Servizi'!J23>0,'RACK, Accessori e Servizi'!K23,\"\")","v":""},null,null,"",null,null,null,null,null,null,null,"",null,{"$f":"IF(B58=\"\",\"\",R58*B58)","v":""},null,0]
[null,{"$f":"IF('RACK, Accessori e Servizi'!J17=0,\"\",'RACK, Accessori e Servizi'!J17)","v":""},"",null,null,null,{"$f":"IF('RACK, Accessori e Servizi'!J17>0,'RACK, Accessori e Servizi'!K17,\"\")","v":""},null,null,"",null,null,null,null,null,null,null,"",null,"",null,0]
[null,{"$f":"IF('RACK, Accessori e Servizi'!J20=0,\"\",'RACK, Accessori e Servizi'!J20)","v":""},"",null,null,null,{"$f":"IF('RACK, Accessori e Servizi'!J20>0,'RACK, Accessori e Servizi'!K20,\"\")","v":""},null,null,"",null,null,null,null,null,null,null,"",null,"",null,0]
[null,{"$f":"IF('RACK, Accessori e Servizi'!J5=0,\"\",'RACK, Accessori e Servizi'!J5)","v":""},{"$f":"IF(B61>0,(VLOOKUP(G61,COD_B,2,FALSE)),\"\")","v":""},null,null,null,{"$f":"IF('RACK, Accessori e Servizi'!J5>0,'RACK, Accessori e Servizi'!K5,\"\")","v":""},null,null,{"$f":"IF(B61>0,(VLOOKUP(G61,COD_B,5,FALSE)),\"\")","v":""},null,null,null,null,null,null,null,{"$f":"IF(B61>0,(VLOOKUP(G61,COD_B,3,FALSE)),\"\")","v":""},null,"",null,0]
[null,{"$f":"IF('RACK, Accessori e Servizi'!J7=0,\"\",'RACK, Accessori e Servizi'!J7)","v":""},{"$f":"IF(B62>0,(VLOOKUP(G62,COD_B,2,FALSE)),\"\")","v":""},null,null,null,{"$f":"IF('RACK, Accessori e Servizi'!J7>0,'RACK, Accessori e Servizi'!K7,\"\")","v":""},null,null,{"$f":"IF(B62>0,(VLOOKUP(G62,COD_B,5,FALSE)),\"\")","v":""},null,null,null,null,null,null,null,{"$f":"IF(B62>0,(VLOOKUP(G62,COD_B,3,FALSE)),\"\")","v":""},null,"",null,0]
[null,{"$f":"IF('RACK, Accessori e Servizi'!J9=0,\"\",'RACK, Accessori e Servizi'!J9)","v":""},{"$f":"IF(B63>0,(VLOOKUP(G63,COD_B,2,FALSE)),\"\")","v":""},null,null,null,{"$f":"IF('RACK, Accessori e Servizi'!J9>0,'RACK, Accessori e Servizi'!K9,\"\")","v":""},null,null,{"$f":"IF(B63>0,(VLOOKUP(G63,COD_B,5,FALSE)),\"\")","v":""},null,null,null,null,null,null,null,{"$f":"IF(B63>0,(VLOOKUP(G63,COD_B,3,FALSE)),\"\")","v":""},null,"",null,0]
[null,"I.V.A.",null,null,null,null,null,null,null,null,null,null,null,null,null,null,null,{"$f":"R65*22%","v":0},null,null,null,1]
[null,"TOTALE COSTO (I.V.A. Esclusa)",null,null,null,null,null,null,null,null,null,null,null,null,null,null,null,{"$f":"SUM(T14:U63)","v":0},null,null,null,1]
[null,"TOTALE ORDINE",null,null,null,null,null,null,null,null,null,null,null,null,null,null,null,{"$f":"SUM(R64:U65)","v":0},null,null,null,1]
[null,null,null,null,null,null,null,null,null,null,null,null,null,null,null,null,null,null,null,null,null,1]
[null,null,null,null,null,null,null,null,null,null,null,null,null,null,null,null,null,null,null,null,null,1]
[null,null,null,null,null,null,null,null,null,null,null,null,null,null,null,null,null,null,null,null,null,1]
[null,null,null,{"$f":"IF(G6>0,\"DETTAGLIO CONFIGURAZIONI SERVER LOTTO 2 \",\"\")","v":""},null,null,null,null,null,null,null,null,null,null,null,null,null,null,null,null,null,1]
[null,null,null,null,null,null,null,null,null,null,null,null,null,null,null,null,null,null,null,null,null,1]
[null,null,null,null,null,null,null,null,null,null,null,null,null,null,null,null,null,null,null,null,null,1]
[null,null,null,null,null,null,null,null,null,null,null,null,null,null,null,null,null,null,null,null,null,{"$f":"IF($B$14>=\"\",0,1)","v":0}]
[null,"Proliant DL560 Gen9 Conf.1",null,null,{"$f":"SRV_A","v":0},"Server",null,null,"Proliant DL560 Gen9 Conf.2",null,null,{"$f":"SRV_AA","v":0},"Server",null,null,"Proliant DL560 Gen9  Conf.3",null,null,{"$f":"SRV_AAA","v":0},"Server",null,{"$f":"IF($B$14>=\"\",0,1)","v":0}]
[null,null,null,null,null,null,null,null,null,null,null,null,null,null,null,null,null,null,null,null,null,0]
[null,{"$f":"IF(SRV_A>0,\"1\",\"-\")","v":"-"},{"$f":"IF(B76=\"-\",\"-\",CONCATENATE(MID($C$14,1,21),\" - \",$G$14))","v":"-"},null,null,null,null,null,{"$f":"IF(SRV_AA>0,\"1\",\"-\")","v":"-"},{"$f":"IF(I76=\"-\",\"-\",CONCATENATE(MID($C$14,1,21),\" - \",$G$14))","v":"-"},null,null,null,null,null,{"$f":"IF(SRV_AAA>0,\"1\",\"-\")","v":"-"},{"$f":"IF(P76=\"-\",\"-\",CONCATENATE(MID($C$14,1,21),\" - \",$G$14))","v":"-"},null,null,null,null,0]
[null,{"$f":"IF(X15=0,\"-\",X15)","v":"-"},{"$f":"IF(B77=\"-\",\"-\",CONCATENATE(MID($C$15,1,21),\" - \",$G$15))","v":"-"},null,null,null,null,null,{"$f":"IF(Y15=0,\"-\",Y15)","v":"-"},{"$f":"IF(I77=\"-\",\"-\",CONCATENATE(MID(C15,1,21),\" - \",G15))","v":"-"},null,null,null,null,null,{"$f":"IF(Z15=0,\"-\",Z15)","v":"-"},{"$f":"IF(P77=\"-\",\"-\",CONCATENATE(MID(C15,1,21),\" - \",G15))","v":"-"},null,null,null,null,{"$f":"IF(V15=0,0,1)","v":0}]
[null,"-",{"$f":"IF(B78=\"-\",\"-\",CONCATENATE(MID($C$16,1,21),\" - \",$G$16))","v":"-"},null,null,null,null,null,"-","-",null,null,null,null,null,"-","-",null,null,null,null,{"$f":"IF(V16=0,0,1)","v":0}]
[null,"-",{"$f":"IF(B79=\"-\",\"-\",CONCATENATE(MID($C$17,1,21),\" - \",$G$17))","v":"-"},null,null,null,null,null,"-","-",null,null,null,null,null,"-","-",null,null,null,null,0]
[null,"-",{"$f":"IF(B80=\"-\",\"-\",CONCATENATE(MID(C18,1,21),\" - \",G18))","v":"-"},null,null,null,null,null,"-","-",null,null,null,null,null,"-","-",null,null,null,null,0]
[null,"-","-",null,null,null,null,null,"-","-",null,null,null,null,null,"-","-",null,null,null,null,0]
[null,"-","-",null,null,null,null,null,"-","-",null,null,null,null,null,"-","-",null,null,null,null,0]
[null,"-","-",null,null,null,null,null,"-","-",null,null,null,null,null,"-","-",null,null,null,null,0]
[null,"-","-",null,null,null,null,null,"-","-",null,null,null,null,null,"-","-",null,null,null,null,0]
[null,"-","-",null,null,null,null,null,"-","-",null,null,null,null,null,"-","-",null,null,null,null,0]
[null,"-","-",null,null,null,null,null,"-","-",null,null,null,null,null,"-","-",null,null,null,null,0]
[null,"-","-",null,null,null,null,null,"-","-",null,null,null,null,null,"-","-",null,null,null,null,0]
[null,"-","-",null,null,null,null,null,"-","-",null,null,null,null,null,"-","-",null,null,null,null,0]
[null,"-","-",null,null,null,null,null,"-","-",null,null,null,null,null,"-","-",null,null,null,null,0]
[null,"-","-",null,null,null,null,null,"-","-",null,null,null,null,null,"-","-",null,null,null,null,0]
[null,"-","-",null,null,null,null,null,"-","-",null,null,null,null,null,"-","-",null,null,null,null,0]
[null,"-","-",null,null,null,null,null,"-","-",null,null,null,null,null,"-","-",null,null,null,null,0]
[null,{"$f":"IF(X50=0,\"-\",X50)","v":"-"},{"$f":"IF(B93=\"-\",\"-\",CONCATENATE(MID(C50,1,21),\" - \",G50))","v":"-"},null,null,null,null,null,{"$f":"IF(Y50=0,\"-\",Y50)","v":"-"},{"$f":"IF(I93=\"-\",\"-\",CONCATENATE(MID(C50,1,21),\" - \",G50))","v":"-"},null,null,null,null,null,{"$f":"IF(Z50=0,\"-\",Z50)","v":"-"},{"$f":"IF(P93=\"-\",\"-\",CONCATENATE(MID(C50,1,21),\" - \",G50))","v":"-"},null,null,null,null,{"$f":"IF(AD50=0,0,1)","v":0}]
[null,{"$f":"IF(X51=0,\"-\",X51)","v":"-"},{"$f":"IF(B94=\"-\",\"-\",CONCATENATE(MID(C51,1,21),\" - \",G51))","v":"-"},null,null,null,null,null,{"$f":"IF(Y51=0,\"-\",Y51)","v":"-"},{"$f":"IF(I94=\"-\",\"-\",CONCATENATE(MID(C51,1,21),\" - \",G51))","v":"-"},null,null,null,null,null,{"$f":"IF(Z51=0,\"-\",Z51)","v":"-"},{"$f":"IF(P94=\"-\",\"-\",CONCATENATE(MID(C51,1,21),\" - \",G51))","v":"-"},null,null,null,null,{"$f":"IF(AD51=0,0,1)","v":0}]
[null,"-","-",null,null,null,null,null,"-","-",null,null,null,null,null,"-","-",null,null,null,null,0]
[null,"-","-",null,null,null,null,null,"-","-",null,null,null,null,null,"-","-",null,null,null,null,0]
[null,{"$f":"IF(X54=0,\"-\",X54)","v":"-"},{"$f":"IF(B97=\"-\",\"-\",CONCATENATE(MID(C54,1,21),\" - \",G54))","v":"-"},null,null,null,null,null,{"$f":"IF(Y54=0,\"-\",Y54)","v":"-"},{"$f":"IF(I97=\"-\",\"-\",CONCATENATE(MID(C54,1,21),\" - \",G54))","v":"-"},null,null,null,null,null,{"$f":"IF(Z54=0,\"-\",Z54)","v":"-"},{"$f":"IF(P97=\"-\",\"-\",CONCATENATE(MID(C54,1,21),\" - \",G54))","v":"-"},null,null,null,null,0]
[null,{"$f":"IF(X55=0,\"-\",X55)","v":"-"},{"$f":"IF(B98=\"-\",\"-\",CONCATENATE(MID(C55,1,21),\" - \",G55))","v":"-"},null,null,null,null,null,{"$f":"IF(Y55=0,\"-\",Y55)","v":"-"},{"$f":"IF(I98=\"-\",\"-\",CONCATENATE(MID(C55,1,21),\" - \",G55))","v":"-"},null,null,null,null,null,{"$f":"IF(Z55=0,\"-\",Z55)","v":"-"},{"$f":"IF(P98=\"-\",\"-\",CONCATENATE(MID(C55,1,21),\" - \",G55))","v":"-"},null,null,null,null,0]
[null,{"$f":"IF(X56=0,\"-\",X56)","v":"-"},{"$f":"IF(B99=\"-\",\"-\",CONCATENATE(MID(C56,1,21),\" - \",G56))","v":"-"},null,null,null,null,null,{"$f":"IF(Y56=0,\"-\",Y56)","v":"-"},{"$f":"IF(I99=\"-\",\"-\",CONCATENATE(MID(C56,1,21),\" - \",G56))","v":"-"},null,null,null,null,null,{"$f":"IF(Z56=0,\"-\",Z56)","v":"-"},{"$f":"IF(P99=\"-\",\"-\",CONCATENATE(MID(C56,1,21),\" - \",G56))","v":"-"},null,null,null,null,0]
[null,null,null,null,null,null,null,null,null,null,null,null,null,null,null,null,null,null,null,null,null,{"$f":"IF($B$14>=\"\",0,1)","v":0}]
[null,"Configurazione RAID",null,null,null,null,null,null,"Configurazione RAID",null,null,null,null,null,null,"Configurazione RAID",null,null,null,null,null,0]
[null,null,null,null,null,null,null,null,null,null,null,null,null,null,null,null,null,null,null,null,null,0]
[null,{"$f":"IF(X14=0,\"\",\"HDD 300 GB\")","v":""},null,{"$f":"IF(X14=0,\"\",'Server10 Lotto2 DL560'!$B$65)","v":""},null,null,null,null,{"$f":"IF(Y14=0,\"\",\"HDD 300 GB\")","v":""},null,{"$f":"IF(Y14=0,\"\",'Server10 Lotto2 DL560 2'!$B$65)","v":""},null,null,null,null,{"$f":"IF(Z14=0,\"\",\"HDD 300 GB\")","v":""},null,{"$f":"IF(Z14=0,\"\",'Server10 Lotto2 DL560 3'!$B$65)","v":""},null,null,null,0]
[null,null,null,null,null,null,null,null,null,null,null,null,null,null,null,null,null,null,null,null,null,0]
[null,{"$f":"IF(X14=0,\"\",\"Hot spare HDD 300 GB\")","v":""},null,null,null,{"$f":"IF(X14=0,\"\",'Server10 Lotto2 DL560'!$C$66)","v":""},null,null,{"$f":"IF(Y14=0,\"\",\"Hot spare HDD 300 GB\")","v":""},null,null,null,{"$f":"IF(Y14=0,\"\",'Server10 Lotto2 DL560 2'!$C$66)","v":""},null,null,{"$f":"IF(Z14=0,\"\",\"Hot spare HDD 300 GB\")","v":""},null,null,null,{"$f":"IF(Z14=0,\"\",'Server10 Lotto2 DL560 3'!$C$66)","v":""},null,0]
[null,null,null,null,null,null,null,null,null,null,null,null,null,null,null,null,null,null,null,null,null,0]
[null,null,null,null,null,null,null,null,null,null,null,null,null,null,null,null,null,null,null,null,null,0]
[null,{"$f":"IF(X27=0,\"\",\"HDD 1000 GB\")","v":""},null,{"$f":"IF(X27=0,\"\",'Server10 Lotto2 DL560'!$B$69)","v":""},null,null,null,null,{"$f":"IF(Y27=0,\"\",\"HDD 1000 GB\")","v":""},null,{"$f":"IF(Y27=0,\"\",'Server10 Lotto2 DL560 2'!$B$69)","v":""},null,null,null,null,{"$f":"IF(Z27=0,\"\",\"HDD 1000 GB\")","v":""},null,{"$f":"IF(Z27=0,\"\",'Server10 Lotto2 DL560 2'!$B$69)","v":""},null,null,null,0]
[null,null,null,null,null,null,null,null,null,null,null,null,null,null,null,null,null,null,null,null,null,0]
[null,{"$f":"IF(X27=0,\"\",\"Hot spare HDD 1000 GB\")","v":""},null,null,null,{"$f":"IF(X27=0,\"\",'Server10 Lotto2 DL560'!$C$70)","v":""},null,null,{"$f":"IF(Y27=0,\"\",\"Hot spare HDD 1000 GB\")","v":""},null,null,null,{"$f":"IF(Y27=0,\"\",'Server10 Lotto2 DL560 2'!$C$70)","v":""},null,null,{"$f":"IF(Z27=0,\"\",\"Hot spare HDD 1000 GB\")","v":""},null,null,null,{"$f":"IF(Z27=0,\"\",'Server10 Lotto2 DL560 2'!$C$70)","v":""},null,0]
[null,null,null,null,null,null,null,null,null,null,null,null,null,null,null,null,null,null,null,null,null,0]
[null,null,null,null,null,null,null,null,null,null,null,null,null,null,null,null,null,null,null,null,null,0]
[null,"Note RAID",null,null,null,null,null,null,"Note RAID",null,null,null,null,null,null,"Note RAID",null,null,null,null,null,0]
[null,{"$f":"IF('Server10 Lotto2 DL560'!$I$64=0,\"\",'Server10 Lotto2 DL560'!$I$64)","v":""},null,null,null,null,null,null,{"$f":"IF('Server10 Lotto2 DL560 2'!$I$64=0,\"\",'Server10 Lotto2 DL560 2'!$I$64)","v":""},null,null,null,null,null,null,{"$f":"IF('Server10 Lotto2 DL560 3'!$I$64=0,\"\",'Server10 Lotto2 DL560 3'!$I$64)","v":""},null,null,null,null,null,0]
[null,null,null,null,null,null,null,null,null,null,null,null,null,null,null,null,null,null,null,null,null,0]
[null,null,null,null,null,null,null,null,null,null,null,null,null,null,null,null,null,null,null,null,null,0]
[null,{"$f":"IF('Server10 Lotto2 DL560'!$I$68=0,\"\",'Server10 Lotto2 DL560'!$I$68)","v":""},null,null,null,null,null,null,{"$f":"IF('Server10 Lotto2 DL560 2'!$I$68=0,\"\",'Server10 Lotto2 DL560 2'!$I$68)","v":""},null,null,null,null,null,null,{"$f":"IF('Server10 Lotto2 DL560 3'!$I$68=0,\"\",'Server10 Lotto2 DL560 3'!$I$68)","v":""},null,null,null,null,null,0]
[null,null,null,null,null,null,null,null,null,null,null,null,null,null,null,null,null,null,null,null,null,0]
[null,null,null,null,null,null,null,null,null,null,null,null,null,null,null,null,null,null,null,null,null,0]
[null,null,null,null,null,null,null,null,null,null,null,null,null,null,null,null,null,null,null,null,null,0]
[null,null,null,null,null,null,null,null,null,null,null,null,null,null,null,null,null,null,null,null,null,{"$f":"IF($B$32>=\"\",0,1)","v":0}]
[null,"Proliant DL580 Gen9 Conf.1",null,null,{"$f":"SRV_B","v":0},"Server",null,null,"Proliant DL580 Gen9 Conf.2",null,null,{"$f":"SRV_BB","v":0},"Server",null,null,"Proliant DL580 Gen9 Conf.3",null,null,{"$f":"SRV_BBB","v":0},"Server",null,{"$f":"IF($B$32>=\"\",0,1)","v":0},"DL580 1","DL580 2","DL580 3"]
[null,null,null,null,null,null,null,null,null,null,null,null,null,null,null,null,null,null,null,null,null,0,"CPU BASE","CPU BASE","CPU BASE"]
[null,{"$f":"IF(SRV_B>0,\"1\",\"-\")","v":"-"},{"$f":"IF(B124=\"-\",\"-\",CONCATENATE(MID(C32,1,24),\" - \",W132))","v":"-"},null,null,null,null,null,{"$f":"IF(SRV_BB>0,\"1\",\"-\")","v":"-"},{"$f":"IF(I124=\"-\",\"-\",CONCATENATE(MID(C32,1,24),\" - \",X132))","v":"-"},null,null,null,null,null,{"$f":"IF(SRV_BBB>0,\"1\",\"-\")","v":"-"},{"$f":"IF(P124=\"-\",\"-\",CONCATENATE(MID(C32,1,24),\" - \",Y132))","v":"-"},null,null,null,null,{"$f":"IF($B$32>=\"\",0,1)","v":0},{"$f":"IF(B124=\"-\",0,2)","v":0},{"$f":"IF(I124=\"-\",0,2)","v":0},{"$f":"IF(P124=\"-\",0,2)","v":0}]
[null,{"$f":"IF(X33=0,\"-\",X33)","v":"-"},{"$f":"IF(B125=\"-\",\"-\",CONCATENATE(MID(C33,1,24),\" - \",W133))","v":"-"},null,null,null,null,null,{"$f":"IF(Y33=0,\"-\",Y33)","v":"-"},{"$f":"IF(I125=\"-\",\"-\",CONCATENATE(MID(C33,1,24),\" - \",X133))","v":"-"},null,null,null,null,null,{"$f":"IF(Z33=0,\"-\",Z33)","v":"-"},{"$f":"IF(P125=\"-\",\"-\",CONCATENATE(MID(C33,1,24),\" - \",Y133))","v":"-"},null,null,null,null,{"$f":"IF(V33=0,0,1)","v":0},"CPU AGGIUNTIVE"]
[null,"-",{"$f":"IF(B126=\"-\",\"-\",CONCATENATE(MID(C34,1,24),\" - \",G34))","v":"-"},null,null,null,null,null,"-",{"$f":"IF(I126=\"-\",\"-\",CONCATENATE(MID(C34,1,24),\" - \",G34))","v":"-"},null,null,null,null,null,{"$f":"IF(Z34=0,\"-\",Z34)","v":"-"},{"$f":"IF(P126=\"-\",\"-\",CONCATENATE(MID(C34,1,24),\" - \",G34))","v":"-"},null,null,null,null,{"$f":"IF(V34=0,0,1)","v":0},{"$f":"'Server10 Lotto2 DL580'!$C$30","v":0},{"$f":"'Server10 Lotto2 DL580 2'!$C$30","v":0},{"$f":"'Server10 Lotto2 DL580 3'!$C$30","v":0}]
[null,"-","-",null,null,null,null,null,"-","-",null,null,null,null,null,"-",{"$f":"IF(P127=\"-\",\"-\",CONCATENATE(MID(C35,1,24),\" - \",G35))","v":"-"},null,null,null,null,0]
[null,"-","-",null,null,null,null,null,"-","-",null,null,null,null,null,"-","-",null,null,null,null,0,"Memory Slot"]
[null,"-","-",null,null,null,null,null,"-","-",null,null,null,null,null,"-","-",null,null,null,null,0,{"$f":"'Server10 Lotto2 DL580'!$C$33","v":2},{"$f":"'Server10 Lotto2 DL580 2'!$C$33","v":2},{"$f":"'Server10 Lotto2 DL580 3'!$C$33","v":2}]
[null,"-","-",null,null,null,null,null,"-","-",null,null,null,null,null,"-","-",null,null,null,null,0]
[null,"-","-",null,null,null,null,null,"-","-",null,null,null,null,null,"-","-",null,null,null,null,0,{"$f":"SUM(W124:W129)","v":2},{"$f":"SUM(X124:X129)","v":2},2]
[null,"-","-",null,null,null,null,null,"-","-",null,null,null,null,null,"-","-",null,null,null,null,0,{"$f":"IF(W131=$W$141,$X$141,IF(W131=$W$140,$X$140,IF(W131=$W$139,$X$139,IF(W131=$W$138,$X$138,\"-\"))))","v":"-"},{"$f":"IF(X131=$W$141,$X$141,IF(X131=$W$140,$X$140,IF(X131=$W$139,$X$139,IF(X131=$W$138,$X$138,\"-\"))))","v":"-"},"-"]
[null,"-","-",null,null,null,null,null,"-","-",null,null,null,null,null,"-","-",null,null,null,null,0,{"$f":"IF(W131=$W$141,$Y$141,IF(W131=$W$140,$Y$140,IF(W131=$W$139,$Y$139,IF(W131=$W$138,$Y$138,\"-\"))))","v":"-"},{"$f":"IF(X131=$W$141,$Y$141,IF(X131=$W$140,$Y$140,IF(X131=$W$139,$Y$139,IF(X131=$W$138,$Y$138,\"-\"))))","v":"-"},"-"]
[null,"-","-",null,null,null,null,null,"-","-",null,null,null,null,null,"-","-",null,null,null,null,0]
[null,"-","-",null,null,null,null,null,"-","-",null,null,null,null,null,"-","-",null,null,null,null,0]
[null,"-","-",null,null,null,null,null,"-","-",null,null,null,null,null,"-","-",null,null,null,null,0]
[null,"-","-",null,null,null,null,null,"-","-",null,null,null,null,null,"-","-",null,null,null,null,0]
[null,{"$f":"IF(X46=0,\"-\",X46)","v":"-"},{"$f":"IF(B138=\"-\",\"-\",CONCATENATE(MID(C46,1,24),\" - \",G46))","v":"-"},null,null,null,null,null,"-",{"$f":"IF(I138=\"-\",\"-\",CONCATENATE(MID(C46,1,24),\" - \",G46))","v":"-"},null,null,null,null,null,"-",{"$f":"IF(P138=\"-\",\"-\",CONCATENATE(MID(C46,1,24),\" - \",G46))","v":"-"},null,null,null,null,0,12,"10L2-DL580G94-U","10L2-CPU-E4-U"]
[null,"-","-",null,null,null,null,null,{"$f":"IF(Y47=0,\"-\",Y47)","v":"-"},"-",null,null,null,null,null,"-","-",null,null,null,null,0,8,"10L2-DL580G92-U","10L2-CPU-E2-U"]
[null,"-","-",null,null,null,null,null,"-","-",null,null,null,null,null,"-","-",null,null,null,null,0,6,"10L2-DL580G94-U"]
[null,{"$f":"IF(AA50=0,\"-\",AA50)","v":"-"},{"$f":"IF(B141=\"-\",\"-\",CONCATENATE(MID(C50,1,24),\" - \",G50))","v":"-"},null,null,null,null,null,{"$f":"IF(AB50=0,\"-\",AB50)","v":"-"},{"$f":"IF(I141=\"-\",\"-\",CONCATENATE(MID(C50,1,24),\" - \",G50))","v":"-"},null,null,null,null,null,{"$f":"IF(AC50=0,\"-\",AC50)","v":"-"},{"$f":"IF(P141=\"-\",\"-\",CONCATENATE(MID(C50,1,24),\" - \",G50))","v":"-"},null,null,null,null,{"$f":"IF(AE50=0,0,1)","v":0},4,"10L2-DL580G92-U"]
[null,{"$f":"IF(AA51=0,\"-\",AA51)","v":"-"},{"$f":"IF(B142=\"-\",\"-\",CONCATENATE(MID(C51,1,24),\" - \",G51))","v":"-"},null,null,null,null,null,{"$f":"IF(AB51=0,\"-\",AB51)","v":"-"},{"$f":"IF(I142=\"-\",\"-\",CONCATENATE(MID(C51,1,24),\" - \",G51))","v":"-"},null,null,null,null,null,{"$f":"IF(AC51=0,\"-\",AC51)","v":"-"},{"$f":"IF(P142=\"-\",\"-\",CONCATENATE(MID(C51,1,24),\" - \",G51))","v":"-"},null,null,null,null,{"$f":"IF(AE51=0,0,1)","v":0}]
[null,"-","-",null,null,null,null,null,"-","-",null,null,null,null,null,"-","-",null,null,null,null,0]
[null,"-","-",null,null,null,null,null,"-","-",null,null,null,null,null,"-","-",null,null,null,null,0]
[null,"-","-",null,null,null,null,null,"-","-",null,null,null,null,null,"-","-",null,null,null,null,0]
[null,"-","-",null,null,null,null,null,"-","-",null,null,null,null,null,"-","-",null,null,null,null,0]
[null,"-","-",null,null,null,null,null,"-","-",null,null,null,null,null,"-","-",null,null,null,null,0]
[null,null,null,null,null,null,null,null,null,null,null,null,null,null,null,null,null,null,null,null,null,{"$f":"IF($B$32>=\"\",0,1)","v":0}]
[null,"Configurazione RAID",null,null,null,null,null,null,"Configurazione RAID",null,null,null,null,null,null,"Configurazione RAID",null,null,null,null,null,0]
[null,null,null,null,null,null,null,null,null,null,null,null,null,null,null,null,null,null,null,null,null,0]
[null,{"$f":"IF(X32=0,\"\",\"HDD 300 GB\")","v":""},null,{"$f":"IF(X32=0,\"\",'Server10 Lotto2 DL580'!$B$65)","v":""},null,null,null,null,{"$f":"IF(Y32=0,\"\",\"HDD 300 GB\")","v":""},null,{"$f":"IF(Y32=0,\"\",'Server10 Lotto2 DL580 2'!$B$65)","v":""},null,null,null,null,{"$f":"IF(Z32=0,\"\",\"HDD 300 GB\")","v":""},null,{"$f":"IF(Z32=0,\"\",'Server10 Lotto2 DL580 3'!$B$65)","v":""},null,null,null,0]
[null,null,null,null,null,null,null,null,null,null,null,null,null,null,null,null,null,null,null,null,null,0]
[null,{"$f":"IF(X32=0,\"\",\"Hot spare HDD 300 GB\")","v":""},null,null,null,{"$f":"IF(X32=0,\"\",'Server10 Lotto2 DL580'!$C$66)","v":""},null,null,{"$f":"IF(Y32=0,\"\",\"Hot spare HDD 300 GB\")","v":""},null,null,null,{"$f":"IF(Y32=0,\"\",'Server10 Lotto2 DL580 2'!$C$66)","v":""},null,null,{"$f":"IF(Z32=0,\"\",\"Hot spare HDD 300 GB\")","v":""},null,null,null,{"$f":"IF(Z32=0,\"\",'Server10 Lotto2 DL580 3'!$C$66)","v":""},null,0]
[null,null,null,null,null,null,null,null,null,null,null,null,null,null,null,null,null,null,null,null,null,0]
[null,null,null,null,null,null,null,null,null,null,null,null,null,null,null,null,null,null,null,null,null,0]
[null,{"$f":"IF(X45=0,\"\",\"HDD 1000 GB\")","v":""},null,{"$f":"IF(X45=0,\"\",'Server10 Lotto2 DL580'!$B$69)","v":""},null,null,null,null,{"$f":"IF(Y44=0,\"\",\"HDD 1000 GB\")","v":""},null,{"$f":"IF(Y44=0,\"\",'Server10 Lotto2 DL580 2'!$B$69)","v":""},null,null,null,null,{"$f":"IF(Z44=0,\"\",\"HDD 1000 GB\")","v":""},null,{"$f":"IF(Z44=0,\"\",'Server10 Lotto2 DL580 3'!$B$69)","v":""},null,null,null,0]
[null,null,null,null,null,null,null,null,null,null,null,null,null,null,null,null,null,null,null,null,null,0]
[null,{"$f":"IF(X45=0,\"\",\"Hot spare HDD 1000 GB\")","v":""},null,null,null,{"$f":"IF(X45=0,\"\",'Server10 Lotto2 DL580'!$C$70)","v":""},null,null,{"$f":"IF(Y44=0,\"\",\"Hot spare HDD 1000 GB\")","v":""},null,null,null,{"$f":"IF(Y44=0,\"\",'Server10 Lotto2 DL580 2'!$C$70)","v":""},null,null,{"$f":"IF(Z44=0,\"\",\"Hot spare HDD 1000 GB\")","v":""},null,null,null,{"$f":"IF(Z44=0,\"\",'Server10 Lotto2 DL580 3'!$C$70)","v":""},null,0]
[null,null,null,null,null,null,null,null,null,null,null,null,null,null,null,null,null,null,null,null,null,0]
[null,null,null,null,null,null,null,null,null,null,null,null,null,null,null,null,null,null,null,null,null,0]
[null,"Note RAID",null,null,null,null,null,null,"Note RAID",null,null,null,null,null,null,"Note RAID",null,null,null,null,null,0]
[null,{"$f":"IF('Server10 Lotto2 DL580'!$I$64=0,\"\",'Server10 Lotto2 DL580'!$I$64)","v":""},null,null,null,null,null,null,{"$f":"IF('Server10 Lotto2 DL580 2'!$I$64=0,\"\",'Server10 Lotto2 DL580 2'!$I$64)","v":""},null,null,null,null,null,null,{"$f":"IF('Server10 Lotto2 DL580 3'!$I$64=0,\"\",'Server10 Lotto2 DL580 3'!$I$64)","v":""},null,null,null,null,null,0]
[null,null,null,null,null,null,null,null,null,null,null,null,null,null,null,null,null,null,null,null,null,0]
[null,null,null,null,null,null,null,null,null,null,null,null,null,null,null,null,null,null,null,null,null,0]
[null,{"$f":"IF('Server10 Lotto2 DL580'!$I$68=0,\"\",'Server10 Lotto2 DL580'!$I$68)","v":""},null,null,null,null,null,null,{"$f":"IF('Server10 Lotto2 DL580 2'!$I$68=0,\"\",'Server10 Lotto2 DL580 2'!$I$68)","v":""},null,null,null,null,null,null,{"$f":"IF('Server10 Lotto2 DL580 3'!$I$68=0,\"\",'Server10 Lotto2 DL580 3'!$I$68)","v":""},null,null,null,null,null,0]
[null,null,null,null,null,null,null,null,null,null,null,null,null,null,null,null,null,null,null,null,null,0]
[null,null,null,null,null,null,null,null,null,null,null,null,null,null,null,null,null,null,null,null,null,0]
[null,null,null,null,null,null,null,null,null,null,null,null,null,null,null,null,null,null,null,null,null,0]
[null,null,null,null,null,null,null,null,null,null,null,null,null,null,null,null,null,null,null,null,null,{"$f":"IF($D$170=\"\",0,1)","v":0}]
[null,null,null,{"$f":"IF('RACK, Accessori e Servizi'!H48>=1,\"DETTAGLIO CONFIGURAZIONE ARMADI RACK\",\"\")","v":""},null,null,null,null,null,null,null,null,null,null,null,null,null,null,null,null,null,{"$f":"IF($D$170=\"\",0,1)","v":0}]
[null,null,null,null,null,null,null,null,null,null,null,null,null,null,null,null,null,null,null,null,null,0]
[null,null,null,null,null,null,null,null,null,null,null,null,null,null,null,null,null,null,null,null,null,0]
[null,null,null,{"$f":"CONCATENATE('RACK, Accessori e Servizi'!H50,\"\nQty: \",'RACK, Accessori e Servizi'!H48)","v":"\nQty: "},{"$f":"CONCATENATE('RACK, Accessori e Servizi'!I50,\"\nQty: \",'RACK, Accessori e Servizi'!I48)","v":"\nQty: "},{"$f":"CONCATENATE('RACK, Accessori e Servizi'!J50,\"\nQty: \",'RACK, Accessori e Servizi'!J48)","v":"\nQty: "},{"$f":"CONCATENATE('RACK, Accessori e Servizi'!K50,\"\nQty: \",'RACK, Accessori e Servizi'!K48)","v":"\nQty: "},null,{"$f":"CONCATENATE('RACK, Accessori e Servizi'!L50,\"\nQty: \",'RACK, Accessori e Servizi'!L48)","v":"\nQty: "},{"$f":"CONCATENATE('RACK, Accessori e Servizi'!M50,\"\nQty: \",'RACK, Accessori e Servizi'!M48)","v":"\nQty: "},{"$f":"CONCATENATE('RACK, Accessori e Servizi'!N50,\"\nQty: \",'RACK, Accessori e Servizi'!N48)","v":"\nQty: "},{"$f":"CONCATENATE('RACK, Accessori e Servizi'!O50,\"\nQty: \",'RACK, Accessori e Servizi'!O48)","v":"\nQty: "},{"$f":"CONCATENATE('RACK, Accessori e Servizi'!P50,\"\nQty: \",'RACK, Accessori e Servizi'!P48)","v":"\nQty: "},{"$f":"CONCATENATE('RACK, Accessori e Servizi'!Q50,\"\nQty: \",'RACK, Accessori e Servizi'!Q48)","v":"\nQty: "},null,null,null,null,null,null,null,0]
[null,"DL560 Conf.1",null,{"$f":"'RACK, Accessori e Servizi'!H52","v":0},{"$f":"'RACK, Accessori e Servizi'!I52","v":0},{"$f":"'RACK, Accessori e Servizi'!J52","v":0},{"$f":"'RACK, Accessori e Servizi'!K52","v":0},null,{"$f":"'RACK, Accessori e Servizi'!L52","v":0},{"$f":"'RACK, Accessori e Servizi'!M52","v":0},{"$f":"'RACK, Accessori e Servizi'!N52","v":0},{"$f":"'RACK, Accessori e Servizi'!O52","v":0},{"$f":"'RACK, Accessori e Servizi'!P52","v":0},{"$f":"'RACK, Accessori e Servizi'!Q52","v":0},null,null,null,null,null,null,null,0]
[null,"DL560 Conf.2",null,{"$f":"'RACK, Accessori e Servizi'!H53","v":0},{"$f":"'RACK, Accessori e Servizi'!I53","v":0},{"$f":"'RACK, Accessori e Servizi'!J53","v":0},{"$f":"'RACK, Accessori e Servizi'!K53","v":0},null,{"$f":"'RACK, Accessori e Servizi'!L53","v":0},{"$f":"'RACK, Accessori e Servizi'!M53","v":0},{"$f":"'RACK, Accessori e Servizi'!N53","v":0},{"$f":"'RACK, Accessori e Servizi'!O53","v":0},{"$f":"'RACK, Accessori e Servizi'!P53","v":0},{"$f":"'RACK, Accessori e Servizi'!Q53","v":0},null,null,null,null,null,null,null,0]
[null,"DL560 Conf.3",null,{"$f":"'RACK, Accessori e Servizi'!H54","v":0},{"$f":"'RACK, Accessori e Servizi'!I54","v":0},{"$f":"'RACK, Accessori e Servizi'!J54","v":0},{"$f":"'RACK, Accessori e Servizi'!K54","v":0},null,{"$f":"'RACK, Accessori e Servizi'!L54","v":0},{"$f":"'RACK, Accessori e Servizi'!M54","v":0},{"$f":"'RACK, Accessori e Servizi'!N54","v":0},{"$f":"'RACK, Accessori e Servizi'!O54","v":0},{"$f":"'RACK, Accessori e Servizi'!P54","v":0},{"$f":"'RACK, Accessori e Servizi'!Q54","v":0},null,null,null,null,null,null,null,0]
[null,"DL580 Conf.1",null,{"$f":"'RACK, Accessori e Servizi'!H55","v":0},{"$f":"'RACK, Accessori e Servizi'!I55","v":0},{"$f":"'RACK, Accessori e Servizi'!J55","v":0},{"$f":"'RACK, Accessori e Servizi'!K55","v":0},null,{"$f":"'RACK, Accessori e Servizi'!L55","v":0},{"$f":"'RACK, Accessori e Servizi'!M55","v":0},{"$f":"'RACK, Accessori e Servizi'!N55","v":0},{"$f":"'RACK, Accessori e Servizi'!O55","v":0},{"$f":"'RACK, Accessori e Servizi'!P55","v":0},{"$f":"'RACK, Accessori e Servizi'!Q55","v":0},null,null,null,null,null,null,null,0]
[null,"DL580 Conf.2",null,{"$f":"'RACK, Accessori e Servizi'!H56","v":0},{"$f":"'RACK, Accessori e Servizi'!I56","v":0},{"$f":"'RACK, Accessori e Servizi'!J56","v":0},{"$f":"'RACK, Accessori e Servizi'!K56","v":0},null,{"$f":"'RACK, Accessori e Servizi'!L56","v":0},{"$f":"'RACK, Accessori e Servizi'!M56","v":0},{"$f":"'RACK, Accessori e Servizi'!N56","v":0},{"$f":"'RACK, Accessori e Servizi'!O56","v":0},{"$f":"'RACK, Accessori e Servizi'!P56","v":0},{"$f":"'RACK, Accessori e Servizi'!Q56","v":0},null,null,null,null,null,null,null,0]
[null,"DL580 Conf.3",null,{"$f":"'RACK, Accessori e Servizi'!H57","v":0},{"$f":"'RACK, Accessori e Servizi'!I57","v":0},{"$f":"'RACK, Accessori e Servizi'!J57","v":0},{"$f":"'RACK, Accessori e Servizi'!K57","v":0},null,{"$f":"'RACK, Accessori e Servizi'!L57","v":0},{"$f":"'RACK, Accessori e Servizi'!M57","v":0},{"$f":"'RACK, Accessori e Servizi'!N57","v":0},{"$f":"'RACK, Accessori e Servizi'!O57","v":0},{"$f":"'RACK, Accessori e Servizi'!P57","v":0},{"$f":"'RACK, Accessori e Servizi'!Q57","v":0},null,null,null,null,null,null,null,0]
[null,null,null,{"$f":"'RACK, Accessori e Servizi'!H58","v":0},{"$f":"'RACK, Accessori e Servizi'!I58","v":0},{"$f":"'RACK, Accessori e Servizi'!J58","v":0},{"$f":"'RACK, Accessori e Servizi'!K58","v":0},null,{"$f":"'RACK, Accessori e Servizi'!L58","v":0},{"$f":"'RACK, Accessori e Servizi'!M58","v":0},{"$f":"'RACK, Accessori e Servizi'!N58","v":0},{"$f":"'RACK, Accessori e Servizi'!O58","v":0},{"$f":"'RACK, Accessori e Servizi'!P58","v":0},{"$f":"'RACK, Accessori e Servizi'!Q58","v":0},null,null,null,null,null,null,null,0]
[null,"OpzGUIRack",null,{"$f":"'RACK, Accessori e Servizi'!H59","v":0},{"$f":"'RACK, Accessori e Servizi'!I59","v":0},{"$f":"'RACK, Accessori e Servizi'!J59","v":0},{"$f":"'RACK, Accessori e Servizi'!K59","v":0},null,{"$f":"'RACK, Accessori e Servizi'!L59","v":0},{"$f":"'RACK, Accessori e Servizi'!M59","v":0},{"$f":"'RACK, Accessori e Servizi'!N59","v":0},{"$f":"'RACK, Accessori e Servizi'!O59","v":0},{"$f":"'RACK, Accessori e Servizi'!P59","v":0},{"$f":"'RACK, Accessori e Servizi'!Q59","v":0},null,null,null,null,null,null,null,0]
[null,null,null,{"$f":"'RACK, Accessori e Servizi'!H60","v":0},{"$f":"'RACK, Accessori e Servizi'!I60","v":0},{"$f":"'RACK, Accessori e Servizi'!J60","v":0},{"$f":"'RACK, Accessori e Servizi'!K60","v":0},null,{"$f":"'RACK, Accessori e Servizi'!L60","v":0},{"$f":"'RACK, Accessori e Servizi'!M60","v":0},{"$f":"'RACK, Accessori e Servizi'!N60","v":0},{"$f":"'RACK, Accessori e Servizi'!O60","v":0},{"$f":"'RACK, Accessori e Servizi'!P60","v":0},{"$f":"'RACK, Accessori e Servizi'!Q60","v":0},null,null,null,null,null,null,null,0]
[null,"OpzSWGUIRack",0,{"$f":"'RACK, Accessori e Servizi'!H61","v":0},{"$f":"'RACK, Accessori e Servizi'!I61","v":0},{"$f":"'RACK, Accessori e Servizi'!J61","v":0},{"$f":"'RACK, Accessori e Servizi'!K61","v":0},null,{"$f":"'RACK, Accessori e Servizi'!L61","v":0},{"$f":"'RACK, Accessori e Servizi'!M61","v":0},{"$f":"'RACK, Accessori e Servizi'!N61","v":0},{"$f":"'RACK, Accessori e Servizi'!O61","v":0},{"$f":"'RACK, Accessori e Servizi'!P61","v":0},{"$f":"'RACK, Accessori e Servizi'!Q61","v":0},null,null,null,null,null,null,null,0]
[null,null,null,{"$f":"'RACK, Accessori e Servizi'!H62","v":0},{"$f":"'RACK, Accessori e Servizi'!I62","v":0},{"$f":"'RACK, Accessori e Servizi'!J62","v":0},{"$f":"'RACK, Accessori e Servizi'!K62","v":0},null,{"$f":"'RACK, Accessori e Servizi'!L62","v":0},{"$f":"'RACK, Accessori e Servizi'!M62","v":0},{"$f":"'RACK, Accessori e Servizi'!N62","v":0},{"$f":"'RACK, Accessori e Servizi'!O62","v":0},{"$f":"'RACK, Accessori e Servizi'!P62","v":0},{"$f":"'RACK, Accessori e Servizi'!Q62","v":0},null,null,null,null,null,null,null,0]
[null,"OpzUPS 3000VA",0,{"$f":"'RACK, Accessori e Servizi'!H63","v":0},{"$f":"'RACK, Accessori e Servizi'!I63","v":0},{"$f":"'RACK, Accessori e Servizi'!J63","v":0},{"$f":"'RACK, Accessori e Servizi'!K63","v":0},null,{"$f":"'RACK, Accessori e Servizi'!L63","v":0},{"$f":"'RACK, Accessori e Servizi'!M63","v":0},{"$f":"'RACK, Accessori e Servizi'!N63","v":0},{"$f":"'RACK, Accessori e Servizi'!O63","v":0},{"$f":"'RACK, Accessori e Servizi'!P63","v":0},{"$f":"'RACK, Accessori e Servizi'!Q63","v":0},null,null,null,null,null,null,null,0]
[null,null,null,null,null,null,null,null,null,null,null,null,null,null,null,null,null,null,null,null,null,0]
[null,null,null,null,null,null,null,null,null,null,null,null,null,null,null,null,null,null,null,null,null,0]
[null,null,null,null,null,null,null,null,null,null,null,null,null,null,null,null,null,null,null,null,null,1]
[null,null,null,null,null,null,null,null,null,null,null,null,null,null,null,null,null,null,null,null,null,1]
[null,null,null,{"$f":"MID(C188,13,5)","v":""},null,{"$f":"MID(E188,13,5)","v":""},null,"",null,"",null,"",null,"",null,"",null,"",null,"",null,1]
[null,null,null,"AREA RISERVATA AL FORNITORE",null,null,null,null,null,null,null,null,null,null,null,null,null,null,null,null,null,1]
[null,null,null,null,null,null,null,null,null,null,null,null,null,null,null,null,null,null,null,null,null,1]
[null,null,null,null,null,null,null,null,null,null,null,null,null,null,null,null,null,null,null,null,null,1]
[null,null,"VERIFICA STAGING",null,null,null,null,null,null,null,null,null,null,null,"VERIFICA INSTALLATORE",null,null,null,null,null,null,1]
[null,null,null,null,null,null,null,null,null,null,null,null,null,null,null,null,null,null,null,null,null,1]
[null,null,null,null,null,null,null,null,null,null,null,null,null,null,null,null,null,null,null,null,null,1]
[null,null,null,null,null,null,null,null,null,null,null,null,null,null,null,null,null,null,null,null,null,1]
[null,null,null,null,null,null,null,null,null,null,null,null,null,null,null,null,null,null,null,null,null,1]

{"sheet":"Server10 Lotto2 DL560 2","index":4,"n_rows":118,"n_cols":8,"rows_kept":118,"cut":false,"hidden":false,"merged":[[104,2,104,4],[63,8,66,10],[67,8,70,10],[95,2,95,4],[97,1,97,4],[98,2,98,4],[74,2,74,4],[76,1,76,4],[77,2,77,4],[79,1,79,4],[80,2,80,4],[82,1,82,4],[83,2,83,4],[85,1,85,4],[86,2,86,4],[88,1,88,4],[118,1,118,4],[106,1,106,4],[107,2,107,4],[109,1,109,4],[110,2,110,4],[112,1,112,4],[113,2,113,4],[115,1,115,4],[116,2,116,4],[91,1,91,4],[92,2,92,4],[94,1,94,4],[103,1,103,4],[67,2,67,4],[70,1,70,4],[71,2,71,4],[73,1,73,4],[100,1,100,4],[101,2,101,4],[89,2,89,4],[53,2,53,4],[55,1,55,4],[56,2,56,4],[62,1,62,4],[63,2,63,4],[66,1,66,4],[50,1,50,4],[52,1,52,4],[36,1,36,4],[20,1,20,4],[24,2,24,4],[27,1,27,4],[28,2,28,4],[30,1,30,4],[31,2,31,4],[33,1,33,4],[37,2,37,4],[43,1,43,4],[44,2,44,4],[47,1,47,4],[48,2,48,4],[18,2,18,4],[0,0,3,5],[4,0,4,4],[5,0,5,4],[10,0,11,5],[12,0,12,5]]}
[]
[]
[]
[]
["Server10 Lotto2 DL560",null,null,null,null,null,null,"List Price *"]
[null,null,null,null,null,null,null,{"$f":"F17*C16","v":0}]
[]
[]
[]
[]
["Components: \nServer HP Proliant DL560 Gen9 (2CPU Intel® Xeon® E5-4620 v4, 64GB , 2xHDD 300GB 15K RPM SAS 12Gbps 2.5in)"]
[]
[]
[]
["Proliant DL560 Gen9","Category: Server",null,null,null,{"$f":"5272.5","v":5272.5}]
[null,"Quantity: ",null,null,null,{"$f":"SUM(F20:F119)","v":0}]
[null,null,null,null,null,{"$f":"SUM(F15:F16)","v":5272.5}]
[]
[null,"Base"]
[null,"HP DL560 Gen9 CTO Mod-X",1,null,"742657-B21"]
[]
[null,"Configurazione dello chassis"]
[null,"HP DL560 Gen9 2SFF Media Bay Kit",1,null,"795090-B21"]
[]
[null,"Processore"]
[null,"HPE DL560 Gen9 E5-4620v4 FIO Kit",1,null,"830267-L21"]
[null,"HPE DL560 Gen9 E5-4620v4 Kit",1,null,"830267-B21"]
[]
[null,"Processore aggiuntivo"]
[null,"No Additional Processor",{"$f":"VLOOKUP($B$30, CPU_A, 2, FALSE)","v":0},{"$f":"VLOOKUP($B$30, CPU_A, 3, FALSE)","v":""},{"$f":"VLOOKUP($B$30, CPU_A, 5, FALSE)","v":""},{"$f":"VLOOKUP(B30, CPU_A, 12, FALSE)","v":0}]
[]
[null,"Mezz Board Option"]
[null,{"$f":"VLOOKUP($B$30, CPU_A, 6, FALSE)","v":""},{"$f":"VLOOKUP($B$30, CPU_A, 7, FALSE)","v":""},null,{"$f":"VLOOKUP($B$30, CPU_A, 8, FALSE)","v":""}]
[]
[null,"Memoria Totale in GB",null,{"$f":"IF(('Server10 Lotto2 DL560 2'!$D$12=0),\"\",'Server10 Lotto2 DL560 2'!#REF!)","v":""}]
[null,64]
[]
[null,"Capacità di memoria"]
[null,{"$f":"IF($B$30=\"No Additional Processor\",VLOOKUP($B$36, MEM_A1, 8, FALSE),VLOOKUP($B$36, MEM_A2, 8, FALSE))","v":"HPE 32GB 2Rx4 PC4-2400T-R Kit"},{"$f":"IF($B$30=\"No Additional Processor\",VLOOKUP($B$36, MEM_A1, 9, FALSE),VLOOKUP($B$36, MEM_A2, 9, FALSE))","v":"2"},null,{"$f":"IF($B$30=\"No Additional Processor\",VLOOKUP($B$36, MEM_A1, 10, FALSE),VLOOKUP($B$36, MEM_A2, 10, FALSE))","v":"805351-B21"}]
[]
[null,{"$f":"IF($B$30=\"No Additional Processor\",VLOOKUP($B$36, MEM_A1, 2, FALSE),VLOOKUP($B$36, MEM_A2, 2, FALSE))","v":""},{"$f":"IF($B$30=\"No Additional Processor\",VLOOKUP($B$36, MEM_A1, 3, FALSE),VLOOKUP($B$36, MEM_A2, 3, FALSE))","v":""},{"$f":"IF($B$30=\"No Additional Processor\",VLOOKUP($B$36, MEM_A1, 4, FALSE),VLOOKUP($B$36, MEM_A2, 4, FALSE))","v":""},{"$f":"IF($B$30=\"No Additional Processor\",VLOOKUP($B$36, MEM_A1, 6, FALSE),VLOOKUP($B$36, MEM_A2, 6, FALSE))","v":""},{"$f":"IF($B$30=\"No Additional Processor\",VLOOKUP($B$36, MEM_A1, 7, FALSE),VLOOKUP($B$36, MEM_A2, 7, FALSE))","v":""}]
[]
[null,{"$f":"IF($B$30=\"No Additional Processor\",VLOOKUP($B$36, MEM_A1, 11, FALSE),VLOOKUP($B$36, MEM_A2, 11, FALSE))","v":""},{"$f":"IF($B$30=\"No Additional Processor\",VLOOKUP($B$36, MEM_A1, 12, FALSE),VLOOKUP($B$36, MEM_A2, 12, FALSE))","v":""},{"$f":"IF($B$30=\"No Additional Processor\",VLOOKUP($B$36, MEM_A1, 13, FALSE),VLOOKUP($B$36, MEM_A2, 13, FALSE))","v":""},{"$f":"IF($B$30=\"No Additional Processor\",VLOOKUP($B$36, MEM_A1, 15, FALSE),VLOOKUP($B$36, MEM_A2, 15, FALSE))","v":""},{"$f":"IF($B$30=\"No Additional Processor\",VLOOKUP($B$36, MEM_A1, 16, FALSE),VLOOKUP($B$36, MEM_A2, 16, FALSE))","v":""}]
[]
[null,"Sistema operativo preinstallato"]
[null,"No Operating System",{"$f":"VLOOKUP($B$46, OS_A, 2, FALSE)","v":""},{"$f":"VLOOKUP($B$46, OS_A, 3, FALSE)","v":""},{"$f":"VLOOKUP($B$46, OS_A, 5, FALSE)","v":""},{"$f":"VLOOKUP($B$46, OS_A, 6, FALSE)","v":""}]
[null,null,{"$f":"IF($D$47=\"\",\"\",C46)","v":""},{"$f":"IF(H47+C30=3,\"10L1-WIN2\",IF(H47+C30=4,\"10L1-WINDC2\",\"\"))","v":""},{"$f":"IF($D$47=\"\",\"\",E46)","v":""},{"$f":"IF($D$47=\"\",\"\",F46)","v":""},null,{"$f":"IF(D46=\"10L2-WIN1\",1,IF(D46=\"10L2-WINDC1\",2,0))","v":0}]
[]
[null,"Client Access Licenses"]
[null,{"$f":"VLOOKUP($B$46, OS_A, 7, FALSE)","v":"None"},null,{"$f":"VLOOKUP($B$46, OS_A, 9, FALSE)","v":""},{"$f":"VLOOKUP($B$46, OS_A, 11, FALSE)","v":""},{"$f":"VLOOKUP($B$46, OS_A, 12, FALSE)*C50","v":0}]
[]
[null,{"$f":"VLOOKUP($B$46, OS_A, 13, FALSE)","v":"None"},null,{"$f":"VLOOKUP($B$46, OS_A, 15, FALSE)","v":""},{"$f":"VLOOKUP($B$46, OS_A, 17, FALSE)","v":""},{"$f":"VLOOKUP($B$46, OS_A, 18, FALSE)*C52","v":0}]
[]
[null,"Controller RAID"]
[null,"HP Smart Array P440ar/2G FIO Controller",1,null,"749974-B21"]
[]
[null,"Dischi rigidi"]
[null,"HP 300GB 12G SAS 15K 2.5in SC ENT HDD",2,null,"759208-B21"]
[]
[null,"HP 300GB 12G SAS 15K 2.5in SC ENT HDD",null,{"$f":"VLOOKUP($B$60, HDD_A,3, FALSE)","v":"10L2-HDD300GB"},{"$f":"VLOOKUP($B$60, HDD_A,5, FALSE)","v":"759208-B21"},{"$f":"VLOOKUP($B$60, HDD_A,6, FALSE)*C60","v":0}]
[]
[null,"HP 1TB 6G SAS 7.2K 2.5in SC MDL HDD",null,{"$f":"VLOOKUP($B$62, HDD_A,3, FALSE)","v":"10L2-HDD1TB"},{"$f":"VLOOKUP($B$62, HDD_A,5, FALSE)","v":"652749-B21"},{"$f":"VLOOKUP($B$62, HDD_A,6, FALSE)*C62","v":0}]
[]
[null,"Configurazione RAID con HDD 300GB"]
[null,"RAID 1  (2 HDDs)",1,null,{"$f":"VLOOKUP($B$65,  RAID_AA1, 2, FALSE)","v":""}]
[null,"Hot Spare for 300GB HDD","No"]
[]
[null,"Configurazione RAID con HDD 1TB"]
[null,"",1,null,{"$f":"VLOOKUP($B$69,  RAID_AA2, 2, FALSE)","v":""}]
[null,"Hot Spare for 1TB HDD","No"]
[]
[null,"Alimentatore"]
[null,"HP 1200W CS Plat PL HtPlg Pwr Supply Kit",2,null,"656364-B21"]
[]
[null,"PCIe Riser"]
[null,"HP DL560 Gen9 Secondary 3 Slot Riser Kit",1,null,"793474-B21"]
[]
[null,"Management Hardware"]
[null,"HP DL560 Gen9 Power Module w/ SID Kit",1,null,"795106-B21"]
[]
[null,"Scheda FlexibleLOM"]
[null,"HP Ethernet 1GbE 4P 331FLR FIO Adptr",1,null,"684208-B21"]
[]
[null,"Additional Card for PCIe Slot 1"]
[null,"None",{"$f":"VLOOKUP(B85,  PCI_A1, 2, FALSE)","v":""},{"$f":"VLOOKUP(B85,  PCI_A1, 3, FALSE)","v":""},{"$f":"VLOOKUP(B85,  PCI_A1, 5, FALSE)","v":""},{"$f":"VLOOKUP(B85,  PCI_A1, 6, FALSE)","v":""}]
[]
[null,"Additional Card for PCIe Slot 2"]
[null,"None",{"$f":"VLOOKUP(B88,  PCI_A1, 2, FALSE)","v":""},{"$f":"VLOOKUP(B88,  PCI_A1, 3, FALSE)","v":""},{"$f":"VLOOKUP(B88,  PCI_A1, 5, FALSE)","v":""},{"$f":"VLOOKUP(B88,  PCI_A1, 6, FALSE)","v":""}]
[]
[null,"Additional Card for PCIe Slot 3"]
[null,"None",{"$f":"VLOOKUP(B91,  PCI_A1, 2, FALSE)","v":""},{"$f":"VLOOKUP(B91,  PCI_A1, 3, FALSE)","v":""},{"$f":"VLOOKUP(B91,  PCI_A1, 5, FALSE)","v":""},{"$f":"VLOOKUP(B91,  PCI_A1, 6, FALSE)","v":""}]
[]
[null,"Additional Card for PCIe Slot 4"]
[null,"None",{"$f":"VLOOKUP(B94,  PCI_A1, 2, FALSE)","v":""},{"$f":"VLOOKUP(B94,  PCI_A1, 3, FALSE)","v":""},{"$f":"VLOOKUP(B94,  PCI_A1, 5, FALSE)","v":""},{"$f":"VLOOKUP(B94,  PCI_A1, 6, FALSE)","v":""}]
[]
[null,"Additional Card for PCIe Slot 5"]
[null,"None",{"$f":"VLOOKUP(B97,  PCI_A1, 2, FALSE)","v":""},{"$f":"VLOOKUP(B97,  PCI_A1, 3, FALSE)","v":""},{"$f":"VLOOKUP(B97,  PCI_A1, 5, FALSE)","v":""},{"$f":"VLOOKUP(B97,  PCI_A1, 6, FALSE)","v":""}]
[]
[null,"Additional Card for PCIe Slot 6"]
[null,"None",{"$f":"VLOOKUP(B100,  PCI_A1, 2, FALSE)","v":""},{"$f":"VLOOKUP(B100,  PCI_A1, 3, FALSE)","v":""},{"$f":"VLOOKUP(B100,  PCI_A1, 5, FALSE)","v":""},{"$f":"VLOOKUP(B100,  PCI_A1, 6, FALSE)","v":""}]
[]
[null,"Additional Card for PCIe Slot 7"]
[null,"None",{"$f":"VLOOKUP(B103,  PCI_A1, 2, FALSE)","v":""},{"$f":"VLOOKUP(B103,  PCI_A1, 3, FALSE)","v":""},{"$f":"VLOOKUP(B103,  PCI_A1, 5, FALSE)","v":""},{"$f":"VLOOKUP(B103,  PCI_A1, 6, FALSE)","v":""}]
[]
[null,"Bezel"]
[null,"HP 2U Security Bezel Kit",1,null,"666988-B21"]
[]
[null,"Unità ottica interna"]
[null,"HP 9.5mm SATA DVD-ROM Jb Gen9 Kit",1,null,"726536-B21"]
[]
[null,"Accessori per Server"]
[null,"HP BLc 10G SFP+ SR Transceiver",{"$f":"(VLOOKUP(B85,PCI_A1,8,FALSE))+((VLOOKUP(B88,PCI_A1,8,FALSE)))+((VLOOKUP(B91,PCI_A1,8,FALSE)))+((VLOOKUP(B94,PCI_A1,8,FALSE)))+((VLOOKUP(B97,PCI_A1,8,FALSE)))+((VLOOKUP(B100,PCI_A1,8,FALSE)))+((VLOOKUP(B103,PCI_A1,8,FALSE)))","v":0},null,"455883-B21"]
[]
[null,"Estenzione di Garanzia"]
[null,"None",{"$f":"VLOOKUP($B$115,  SO_A1, 2, FALSE)","v":""},{"$f":"VLOOKUP($B$115,  SO_A1, 3, FALSE)","v":""},{"$f":"VLOOKUP($B$115,  SO_A1, 5, FALSE)","v":""},{"$f":"VLOOKUP($B$115,  SO_A1, 6, FALSE)","v":""}]
[]
[null,"Protezione dei dati - Keep Your Hard Drive "]
[null,"None",{"$f":"VLOOKUP($B$118,  SO_AA2, 2, FALSE)","v":""},{"$f":"VLOOKUP($B$118,  SO_AA2, 3, FALSE)","v":""},{"$f":"VLOOKUP($B$118,  SO_AA2,5, FALSE)","v":""},{"$f":"VLOOKUP($B$118,  SO_AA2, 6, FALSE)","v":""}]

{"sheet":"Server10 Lotto2 DL560 3","index":5,"n_rows":118,"n_cols":8,"rows_kept":118,"cut":false,"hidden":false,"merged":[[104,2,104,4],[63,8,66,10],[67,8,70,10],[95,2,95,4],[97,1,97,4],[98,2,98,4],[74,2,74,4],[76,1,76,4],[77,2,77,4],[79,1,79,4],[80,2,80,4],[82,1,82,4],[83,2,83,4],[85,1,85,4],[86,2,86,4],[88,1,88,4],[118,1,118,4],[106,1,106,4],[107,2,107,4],[109,1,109,4],[110,2,110,4],[112,1,112,4],[113,2,113,4],[115,1,115,4],[116,2,116,4],[91,1,91,4],[92,2,92,4],[94,1,94,4],[103,1,103,4],[67,2,67,4],[70,1,70,4],[71,2,71,4],[73,1,73,4],[100,1,100,4],[101,2,101,4],[89,2,89,4],[53,2,53,4],[55,1,55,4],[56,2,56,4],[62,1,62,4],[63,2,63,4],[66,1,66,4],[50,1,50,4],[52,1,52,4],[36,1,36,4],[20,1,20,4],[24,2,24,4],[27,1,27,4],[28,2,28,4],[30,1,30,4],[31,2,31,4],[33,1,33,4],[37,2,37,4],[43,1,43,4],[44,2,44,4],[47,1,47,4],[48,2,48,4],[18,2,18,4],[0,0,3,5],[4,0,4,4],[5,0,5,4],[10,0,11,5],[12,0,12,5]]}
[]
[]
[]
[]
["Server10 Lotto2 DL560",null,null,null,null,null,null,"List Price *"]
[null,null,null,null,null,null,null,{"$f":"F17*C16","v":0}]
[]
[]
[]
[]
["Components: \nServer HP Proliant DL560 Gen9 (2CPU Intel® Xeon® E5-4620 v4, 64GB , 2xHDD 300GB 15K RPM SAS 12Gbps 2.5in)"]
[]
[]
[]
["Proliant DL560 Gen9","Category: Server",null,null,null,{"$f":"5272.5","v":5272.5}]
[null,"Quantity: ",null,null,null,{"$f":"SUM(F20:F119)","v":0}]
[null,null,null,null,null,{"$f":"SUM(F15:F16)","v":5272.5}]
[]
[null,"Base"]
[null,"HP DL560 Gen9 CTO Mod-X",1,null,"742657-B21"]
[]
[null,"Configurazione dello chassis"]
[null,"HP DL560 Gen9 2SFF Media Bay Kit",1,null,"795090-B21"]
[]
[null,"Processore"]
[null,"HPE DL560 Gen9 E5-4620v4 FIO Kit",1,null,"830267-L21"]
[null,"HPE DL560 Gen9 E5-4620v4 Kit",1,null,"830267-B21"]
[]
[null,"Processore aggiuntivo"]
[null,"No Additional Processor",{"$f":"VLOOKUP($B$30, CPU_A, 2, FALSE)","v":0},{"$f":"VLOOKUP($B$30, CPU_A, 3, FALSE)","v":""},{"$f":"VLOOKUP($B$30, CPU_A, 5, FALSE)","v":""},{"$f":"VLOOKUP(B30, CPU_A, 12, FALSE)","v":0}]
[]
[null,"Mezz Board Option"]
[null,{"$f":"VLOOKUP($B$30, CPU_A, 6, FALSE)","v":""},{"$f":"VLOOKUP($B$30, CPU_A, 7, FALSE)","v":""},null,{"$f":"VLOOKUP($B$30, CPU_A, 8, FALSE)","v":""}]
[]
[null,"Memoria Totale in GB",null,{"$f":"IF(('Server10 Lotto2 DL560 3'!$D$12=0),\"\",'Server10 Lotto2 DL560 3'!#REF!)","v":""}]
[null,64]
[]
[null,"Capacità di memoria"]
[null,{"$f":"IF($B$30=\"No Additional Processor\",VLOOKUP($B$36, MEM_A1, 8, FALSE),VLOOKUP($B$36, MEM_A2, 8, FALSE))","v":"HPE 32GB 2Rx4 PC4-2400T-R Kit"},{"$f":"IF($B$30=\"No Additional Processor\",VLOOKUP($B$36, MEM_A1, 9, FALSE),VLOOKUP($B$36, MEM_A2, 9, FALSE))","v":"2"},null,{"$f":"IF($B$30=\"No Additional Processor\",VLOOKUP($B$36, MEM_A1, 10, FALSE),VLOOKUP($B$36, MEM_A2, 10, FALSE))","v":"805351-B21"}]
[]
[null,{"$f":"IF($B$30=\"No Additional Processor\",VLOOKUP($B$36, MEM_A1, 2, FALSE),VLOOKUP($B$36, MEM_A2, 2, FALSE))","v":""},{"$f":"IF($B$30=\"No Additional Processor\",VLOOKUP($B$36, MEM_A1, 3, FALSE),VLOOKUP($B$36, MEM_A2, 3, FALSE))","v":""},{"$f":"IF($B$30=\"No Additional Processor\",VLOOKUP($B$36, MEM_A1, 4, FALSE),VLOOKUP($B$36, MEM_A2, 4, FALSE))","v":""},{"$f":"IF($B$30=\"No Additional Processor\",VLOOKUP($B$36, MEM_A1, 6, FALSE),VLOOKUP($B$36, MEM_A2, 6, FALSE))","v":""},{"$f":"IF($B$30=\"No Additional Processor\",VLOOKUP($B$36, MEM_A1, 7, FALSE),VLOOKUP($B$36, MEM_A2, 7, FALSE))","v":""}]
[]
[null,{"$f":"IF($B$30=\"No Additional Processor\",VLOOKUP($B$36, MEM_A1, 11, FALSE),VLOOKUP($B$36, MEM_A2, 11, FALSE))","v":""},{"$f":"IF($B$30=\"No Additional Processor\",VLOOKUP($B$36, MEM_A1, 12, FALSE),VLOOKUP($B$36, MEM_A2, 12, FALSE))","v":""},{"$f":"IF($B$30=\"No Additional Processor\",VLOOKUP($B$36, MEM_A1, 13, FALSE),VLOOKUP($B$36, MEM_A2, 13, FALSE))","v":""},{"$f":"IF($B$30=\"No Additional Processor\",VLOOKUP($B$36, MEM_A1, 15, FALSE),VLOOKUP($B$36, MEM_A2, 15, FALSE))","v":""},{"$f":"IF($B$30=\"No Additional Processor\",VLOOKUP($B$36, MEM_A1, 16, FALSE),VLOOKUP($B$36, MEM_A2, 16, FALSE))","v":""}]
[]
[null,"Sistema operativo preinstallato"]
[null,"No Operating System",{"$f":"VLOOKUP($B$46, OS_A, 2, FALSE)","v":""},{"$f":"VLOOKUP($B$46, OS_A, 3, FALSE)","v":""},{"$f":"VLOOKUP($B$46, OS_A, 5, FALSE)","v":""},{"$f":"VLOOKUP($B$46, OS_A, 6, FALSE)","v":""}]
[null,null,{"$f":"IF($D$47=\"\",\"\",C46)","v":""},{"$f":"IF(H47+C30=3,\"10L1-WIN2\",IF(H47+C30=4,\"10L1-WINDC2\",\"\"))","v":""},{"$f":"IF($D$47=\"\",\"\",E46)","v":""},{"$f":"IF($D$47=\"\",\"\",F46)","v":""},null,{"$f":"IF(D46=\"10L2-WIN1\",1,IF(D46=\"10L2-WINDC1\",2,0))","v":0}]
[]
[null,"Client Access Licenses"]
[null,{"$f":"VLOOKUP($B$46, OS_A, 7, FALSE)","v":"None"},null,{"$f":"VLOOKUP($B$46, OS_A, 9, FALSE)","v":""},{"$f":"VLOOKUP($B$46, OS_A, 11, FALSE)","v":""},{"$f":"VLOOKUP($B$46, OS_A, 12, FALSE)*C50","v":0}]
[]
[null,{"$f":"VLOOKUP($B$46, OS_A, 13, FALSE)","v":"None"},null,{"$f":"VLOOKUP($B$46, OS_A, 15, FALSE)","v":""},{"$f":"VLOOKUP($B$46, OS_A, 17, FALSE)","v":""},{"$f":"VLOOKUP($B$46, OS_A, 18, FALSE)*C52","v":0}]
[]
[null,"Controller RAID"]
[null,"HP Smart Array P440ar/2G FIO Controller",1,null,"749974-B21"]
[]
[null,"Dischi rigidi"]
[null,"HP 300GB 12G SAS 15K 2.5in SC ENT HDD",2,null,"759208-B21"]
[]
[null,"HP 300GB 12G SAS 15K 2.5in SC ENT HDD",null,{"$f":"VLOOKUP($B$60, HDD_A,3, FALSE)","v":"10L2-HDD300GB"},{"$f":"VLOOKUP($B$60, HDD_A,5, FALSE)","v":"759208-B21"},{"$f":"VLOOKUP($B$60, HDD_A,6, FALSE)*C60","v":0}]
[]
[null,"HP 1TB 6G SAS 7.2K 2.5in SC MDL HDD",null,{"$f":"VLOOKUP($B$62, HDD_A,3, FALSE)","v":"10L2-HDD1TB"},{"$f":"VLOOKUP($B$62, HDD_A,5, FALSE)","v":"652749-B21"},{"$f":"VLOOKUP($B$62, HDD_A,6, FALSE)*C62","v":0}]
[]
[null,"Configurazione RAID con HDD 300GB"]
[null,"RAID 1  (2 HDDs)",1,null,{"$f":"VLOOKUP($B$65,  RAID_AAA1, 2, FALSE)","v":""}]
[null,"Hot Spare for 300GB HDD","No"]
[]
[null,"Configurazione RAID con HDD 1TB"]
[null,"",1,null,{"$f":"VLOOKUP($B$69,  RAID_AAA2, 2, FALSE)","v":""}]
[null,"Hot Spare for 1TB HDD","No"]
[]
[null,"Alimentatore"]
[null,"HP 1200W CS Plat PL HtPlg Pwr Supply Kit",2,null,"656364-B21"]
[]
[null,"PCIe Riser"]
[null,"HP DL560 Gen9 Secondary 3 Slot Riser Kit",1,null,"793474-B21"]
[]
[null,"Management Hardware"]
[null,"HP DL560 Gen9 Power Module w/ SID Kit",1,null,"795106-B21"]
[]
[null,"Scheda FlexibleLOM"]
[null,"HP Ethernet 1GbE 4P 331FLR FIO Adptr",1,null,"684208-B21"]
[]
[null,"Additional Card for PCIe Slot 1"]
[null,"None",{"$f":"VLOOKUP(B85,  PCI_A1, 2, FALSE)","v":""},{"$f":"VLOOKUP(B85,  PCI_A1, 3, FALSE)","v":""},{"$f":"VLOOKUP(B85,  PCI_A1, 5, FALSE)","v":""},{"$f":"VLOOKUP(B85,  PCI_A1, 6, FALSE)","v":""}]
[]
[null,"Additional Card for PCIe Slot 2"]
[null,"None",{"$f":"VLOOKUP(B88,  PCI_A1, 2, FALSE)","v":""},{"$f":"VLOOKUP(B88,  PCI_A1, 3, FALSE)","v":""},{"$f":"VLOOKUP(B88,  PCI_A1, 5, FALSE)","v":""},{"$f":"VLOOKUP(B88,  PCI_A1, 6, FALSE)","v":""}]
[]
[null,"Additional Card for PCIe Slot 3"]
[null,"None",{"$f":"VLOOKUP(B91,  PCI_A1, 2, FALSE)","v":""},{"$f":"VLOOKUP(B91,  PCI_A1, 3, FALSE)","v":""},{"$f":"VLOOKUP(B91,  PCI_A1, 5, FALSE)","v":""},{"$f":"VLOOKUP(B91,  PCI_A1, 6, FALSE)","v":""}]
[]
[null,"Additional Card for PCIe Slot 4"]
[null,"None",{"$f":"VLOOKUP(B94,  PCI_A1, 2, FALSE)","v":""},{"$f":"VLOOKUP(B94,  PCI_A1, 3, FALSE)","v":""},{"$f":"VLOOKUP(B94,  PCI_A1, 5, FALSE)","v":""},{"$f":"VLOOKUP(B94,  PCI_A1, 6, FALSE)","v":""}]
[]
[null,"Additional Card for PCIe Slot 5"]
[null,"None",{"$f":"VLOOKUP(B97,  PCI_A1, 2, FALSE)","v":""},{"$f":"VLOOKUP(B97,  PCI_A1, 3, FALSE)","v":""},{"$f":"VLOOKUP(B97,  PCI_A1, 5, FALSE)","v":""},{"$f":"VLOOKUP(B97,  PCI_A1, 6, FALSE)","v":""}]
[]
[null,"Additional Card for PCIe Slot 6"]
[null,"None",{"$f":"VLOOKUP(B100,  PCI_A1, 2, FALSE)","v":""},{"$f":"VLOOKUP(B100,  PCI_A1, 3, FALSE)","v":""},{"$f":"VLOOKUP(B100,  PCI_A1, 5, FALSE)","v":""},{"$f":"VLOOKUP(B100,  PCI_A1, 6, FALSE)","v":""}]
[]
[null,"Additional Card for PCIe Slot 7"]
[null,"None",{"$f":"VLOOKUP(B103,  PCI_A1, 2, FALSE)","v":""},{"$f":"VLOOKUP(B103,  PCI_A1, 3, FALSE)","v":""},{"$f":"VLOOKUP(B103,  PCI_A1, 5, FALSE)","v":""},{"$f":"VLOOKUP(B103,  PCI_A1, 6, FALSE)","v":""}]
[]
[null,"Bezel"]
[null,"HP 2U Security Bezel Kit",1,null,"666988-B21"]
[]
[null,"Unità ottica interna"]
[null,"HP 9.5mm SATA DVD-ROM Jb Gen9 Kit",1,null,"726536-B21"]
[]
[null,"Accessori per Server"]
[null,"HP BLc 10G SFP+ SR Transceiver",{"$f":"(VLOOKUP(B85,PCI_A1,8,FALSE))+((VLOOKUP(B88,PCI_A1,8,FALSE)))+((VLOOKUP(B91,PCI_A1,8,FALSE)))+((VLOOKUP(B94,PCI_A1,8,FALSE)))+((VLOOKUP(B97,PCI_A1,8,FALSE)))+((VLOOKUP(B100,PCI_A1,8,FALSE)))+((VLOOKUP(B103,PCI_A1,8,FALSE)))","v":0},null,"455883-B21"]
[]
[null,"Estenzione di Garanzia"]
[null,"None",{"$f":"VLOOKUP($B$115,  SO_A1, 2, FALSE)","v":""},{"$f":"VLOOKUP($B$115,  SO_A1, 3, FALSE)","v":""},{"$f":"VLOOKUP($B$115,  SO_A1, 5, FALSE)","v":""},{"$f":"VLOOKUP($B$115,  SO_A1, 6, FALSE)","v":""}]
[]
[null,"Protezione dei dati - Keep Your Hard Drive "]
[null,"None",{"$f":"VLOOKUP($B$118,  SO_AAA2, 2, FALSE)","v":""},{"$f":"VLOOKUP($B$118,  SO_AAA2, 3, FALSE)","v":""},{"$f":"VLOOKUP($B$118,  SO_AAA2,5, FALSE)","v":""},{"$f":"VLOOKUP($B$118,  SO_AAA2, 6, FALSE)","v":""}]

{"sheet":"Server10 Lotto2 DL580 2","index":6,"n_rows":118,"n_cols":8,"rows_kept":118,"cut":false,"hidden":false,"merged":[[63,8,66,10],[67,8,70,10],[30,1,30,4],[28,2,28,4],[0,0,3,5],[4,0,4,4],[5,0,5,4],[10,0,11,5],[12,0,12,5],[18,2,18,4],[20,1,20,4],[21,2,21,4],[23,1,23,4],[24,2,24,4],[27,1,27,4],[31,2,31,4],[33,1,33,4],[36,1,36,4],[37,2,37,4],[43,1,43,4],[44,2,44,4],[67,2,67,4],[48,2,48,4],[50,1,50,4],[52,1,52,4],[53,2,53,4],[55,1,55,4],[56,2,56,4],[62,1,62,4],[63,2,63,4],[66,1,66,4],[47,1,47,4],[70,1,70,4],[71,2,71,4],[73,1,73,4],[92,2,92,4],[76,1,76,4],[77,2,77,4],[79,1,79,4],[80,2,80,4],[82,1,82,4],[83,2,83,4],[85,1,85,4],[86,2,86,4],[88,1,88,4],[89,2,89,4],[91,1,91,4],[104,2,104,4],[106,1,106,4],[107,2,107,4],[109,1,109,4],[74,2,74,4],[100,1,100,4],[101,2,101,4],[103,1,103,4],[95,2,95,4],[97,1,97,4],[98,2,98,4],[94,1,94,4],[113,2,113,4],[115,1,115,4],[116,2,116,4],[118,1,118,4],[110,2,110,4],[112,1,112,4]]}
[]
[]
[]
[]
["Server10 Lotto2 DL580",null,null,null,null,null,null,"List Price *"]
[null,null,null,null,null,null,null,{"$f":"F17*C16","v":0}]
[]
[]
[]
[]
["Components: \nServer HP Proliant DL580 Gen9 (2CPU Intel® Xeon® E7-4830 v4, 64GB , 2xHDD 300GB 15K RPM SAS 12Gbps 2.5in)"]
[]
[]
[]
["Proliant DL580 Gen9","Category: Server",null,null,null,{"$f":"7444.5","v":7444.5}]
[null,"Quantity: ",null,null,null,{"$f":"SUM(F20:F119)","v":0}]
[null,null,null,null,null,{"$f":"SUM(F15:F16)","v":7444.5}]
[]
[null,"Base"]
[null,"HP DL580 Gen9 CTO Svr",1,null,"793161-B21"]
[]
[null,"Configurazione dello chassis"]
[null,"HP DL580 5 SFF Drive Backplane Kit",1,null,"739405-B21"]
[]
[null,"Processore"]
[null,"HP DL580 Gen9 E7-4850 v3 FIO 1P Kit",1,null,"788325-L21"]
[null,"HP DL580 Gen9 E7-4850 v3 1P Kit",1,null,"788325-B21"]
[]
[null,"Processore aggiuntivo"]
[null,"No Additional Processor",{"$f":"VLOOKUP($B$30, CPU_B, 2, FALSE)","v":0},{"$f":"VLOOKUP($B$30, CPU_B, 3, FALSE)","v":""},{"$f":"VLOOKUP($B$30, CPU_B, 5, FALSE)","v":""},{"$f":"VLOOKUP(B30, CPU_B, 12, FALSE)","v":""}]
[]
[null,"Memory Cartridge"]
[null,{"$f":"IF($B$30=\"No Additional Processor\",VLOOKUP($B$36, MEM_B1, 17, FALSE),VLOOKUP($B$36, MEM_B2, 17, FALSE))","v":"HP DL580 Gen9 12 DIMMs Memory Cartridge"},{"$f":"IF($B$30=\"No Additional Processor\",VLOOKUP($B$36, MEM_B1, 19, FALSE),VLOOKUP($B$36, MEM_B2, 19, FALSE))","v":2},null,{"$f":"IF($B$30=\"No Additional Processor\",VLOOKUP($B$36, MEM_B1, 18, FALSE),VLOOKUP($B$36, MEM_B2, 18, FALSE))","v":"788360-B21"}]
[]
[null,"Memoria Totale in GB",null,{"$f":"IF(('Server10 Lotto2 DL580 2'!$D$12=0),\"\",'Server10 Lotto2 DL580 2'!#REF!)","v":""}]
[null,64]
[]
[null,"Capacità di memoria"]
[null,{"$f":"IF($B$30=\"No Additional Processor\",VLOOKUP($B$36, MEM_B1, 8, FALSE),VLOOKUP($B$36, MEM_B2, 8, FALSE))","v":"HPE 16GB 2Rx4 PC4-2400T-R Kit"},{"$f":"IF($B$30=\"No Additional Processor\",VLOOKUP($B$36, MEM_B1, 9, FALSE),VLOOKUP($B$36, MEM_B2, 9, FALSE))","v":4},null,{"$f":"IF($B$30=\"No Additional Processor\",VLOOKUP($B$36, MEM_B1, 10, FALSE),VLOOKUP($B$36, MEM_B2, 10, FALSE))","v":"836220-B21"}]
[]
[null,{"$f":"IF($B$30=\"No Additional Processor\",VLOOKUP($B$36, MEM_B1, 2, FALSE),VLOOKUP($B$36, MEM_B2, 2, FALSE))","v":""},{"$f":"IF($B$30=\"No Additional Processor\",VLOOKUP($B$36, MEM_B1, 3, FALSE),VLOOKUP($B$36, MEM_B2, 3, FALSE))","v":""},{"$f":"IF($B$30=\"No Additional Processor\",VLOOKUP($B$36, MEM_B1, 4, FALSE),VLOOKUP($B$36, MEM_B2, 4, FALSE))","v":""},{"$f":"IF($B$30=\"No Additional Processor\",VLOOKUP($B$36, MEM_B1, 6, FALSE),VLOOKUP($B$36, MEM_B2, 6, FALSE))","v":""},{"$f":"IF($B$30=\"No Additional Processor\",VLOOKUP($B$36, MEM_B1, 7, FALSE),VLOOKUP($B$36, MEM_B2, 7, FALSE))","v":""}]
[]
[null,{"$f":"IF($B$30=\"No Additional Processor\",VLOOKUP($B$36, MEM_B1, 11, FALSE),VLOOKUP($B$36, MEM_B2, 11, FALSE))","v":""},{"$f":"IF($B$30=\"No Additional Processor\",VLOOKUP($B$36, MEM_B1, 12, FALSE),VLOOKUP($B$36, MEM_B2, 12, FALSE))","v":""},{"$f":"IF($B$30=\"No Additional Processor\",VLOOKUP($B$36, MEM_B1, 13, FALSE),VLOOKUP($B$36, MEM_B2, 13, FALSE))","v":""},{"$f":"IF($B$30=\"No Additional Processor\",VLOOKUP($B$36, MEM_B1, 15, FALSE),VLOOKUP($B$36, MEM_B2, 15, FALSE))","v":""},{"$f":"IF($B$30=\"No Additional Processor\",VLOOKUP($B$36, MEM_B1, 16, FALSE),VLOOKUP($B$36, MEM_B2, 16, FALSE))","v":""}]
[]
[null,"Sistema operativo preinstallato"]
[null,"No Operating System",{"$f":"VLOOKUP($B$46, OS_B, 2, FALSE)","v":""},{"$f":"VLOOKUP($B$46, OS_B, 3, FALSE)","v":""},{"$f":"VLOOKUP($B$46, OS_B, 5, FALSE)","v":""},{"$f":"VLOOKUP($B$46, OS_B, 6, FALSE)","v":""}]
[null,null,{"$f":"IF($D$47=\"\",\"\",C46)","v":""},{"$f":"IF(H47+C30=3,\"10L2-WIN2\",IF(H47+C30=4,\"10L2-WINDC2\",\"\"))","v":""},{"$f":"IF($D$47=\"\",\"\",E46)","v":""},{"$f":"IF($D$47=\"\",\"\",F46)","v":""},null,{"$f":"IF(D46=\"10L2-WIN1\",1,IF(D46=\"10L2-WINDC1\",2,0))","v":0}]
[]
[null,"Client Access Licenses"]
[null,{"$f":"VLOOKUP($B$46, OS_B, 7, FALSE)","v":"None"},null,{"$f":"VLOOKUP($B$46, OS_B, 9, FALSE)","v":""},{"$f":"VLOOKUP($B$46, OS_B, 11, FALSE)","v":""},{"$f":"VLOOKUP($B$46, OS_B, 12, FALSE)*C50","v":0}]
[]
[null,{"$f":"VLOOKUP($B$46, OS_B, 13, FALSE)","v":"None"},null,{"$f":"VLOOKUP($B$46, OS_B, 15, FALSE)","v":""},{"$f":"VLOOKUP($B$46, OS_B, 17, FALSE)","v":""},{"$f":"VLOOKUP($B$46, OS_B, 18, FALSE)*C52","v":0}]
[]
[null,"Controller RAID"]
[null,"HP Smart Array 2GB 24in FIO Flashback Write Cache",1,null,"758836-B21"]
[]
[null,"Dischi rigidi"]
[null,"HP 300GB 12G SAS 15K 2.5in SC ENT HDD",2,null,"759208-B21"]
[]
[null,"HP 300GB 12G SAS 15K 2.5in SC ENT HDD",null,{"$f":"VLOOKUP($B$60, HDD_A,3, FALSE)","v":"10L2-HDD300GB"},{"$f":"VLOOKUP($B$60, HDD_A,5, FALSE)","v":"759208-B21"},{"$f":"VLOOKUP($B$60, HDD_A,6, FALSE)*C60","v":0}]
[]
[null,"HP 1TB 6G SAS 7.2K 2.5in SC MDL HDD",null,{"$f":"VLOOKUP($B$62, HDD_A,3, FALSE)","v":"10L2-HDD1TB"},{"$f":"VLOOKUP($B$62, HDD_A,5, FALSE)","v":"652749-B21"},{"$f":"VLOOKUP($B$62, HDD_A,6, FALSE)*C62","v":0}]
[]
[null,"Configurazione RAID con HDD 300GB"]
[null,"RAID 1  (2 HDDs)",1,null,{"$f":"VLOOKUP($B$65,  RAID_BB1, 2, FALSE)","v":"[780-BBJK]"}]
[null,"Hot Spare for 300GB HDD","No"]
[]
[null,"Configurazione RAID con HDD 1TB"]
[null,"",1,null,{"$f":"VLOOKUP($B$69,  RAID_BB2, 2, FALSE)","v":""}]
[null,"Hot Spare for 1TB HDD","No"]
[]
[null,"Alimentatore"]
[null,"HP 1200W CS Plat PL HtPlg Pwr Supply Kit",4,null,"656364-B21"]
[]
[null,"Scheda FlexibleLOM"]
[null,"HP Ethernet 1GbE 4P 331FLR FIO Adptr",1,null,"684208-B21"]
[]
[null,"Additional Card for PCIe Slot 9 (CPU1 / CPU2)"]
[null,"None",{"$f":"VLOOKUP($B$79,  PCI_B1, 2, FALSE)","v":""},{"$f":"VLOOKUP($B$79,  PCI_B1, 3, FALSE)","v":""},{"$f":"VLOOKUP($B$79,  PCI_B1, 5, FALSE)","v":""},{"$f":"VLOOKUP($B$79,  PCI_B1, 6, FALSE)","v":""}]
[]
[null,"Additional Card for PCIe Slot 8 (CPU1 / CPU2)"]
[null,"None",{"$f":"VLOOKUP($B$82,  PCI_B2, 2, FALSE)","v":""},{"$f":"VLOOKUP($B$82,  PCI_B2, 3, FALSE)","v":""},{"$f":"VLOOKUP($B$82,  PCI_B2, 5, FALSE)","v":""},{"$f":"VLOOKUP($B$82,  PCI_B2, 6, FALSE)","v":""}]
[]
[null,"Additional Card for PCIe Slot 7 (CPU1 / CPU2)"]
[null,"None",{"$f":"VLOOKUP($B$85,  PCI_B3, 2, FALSE)","v":""},{"$f":"VLOOKUP($B$85,  PCI_B3, 3, FALSE)","v":""},{"$f":"VLOOKUP($B$85,  PCI_B3, 5, FALSE)","v":""},{"$f":"VLOOKUP($B$85,  PCI_B3, 6, FALSE)","v":""}]
[]
[null,"Additional Card for PCIe Slot 6 (CPU1 / CPU2)"]
[null,"None",{"$f":"VLOOKUP($B$88,  PCI_B4, 2, FALSE)","v":""},{"$f":"VLOOKUP($B$88,  PCI_B4, 3, FALSE)","v":""},{"$f":"VLOOKUP($B$88,  PCI_B4, 5, FALSE)","v":""},{"$f":"VLOOKUP($B$88,  PCI_B4, 6, FALSE)","v":""}]
[]
[null,"Additional Card for PCIe Slot 5 (CPU3 / CPU4)"]
[null,"None",{"$f":"IF(B91=\"Aggiungere Coppia di Processori\",\"\",(VLOOKUP(B91,PCI_B5, 2, FALSE)))","v":""},{"$f":"IF(B91=\"Aggiungere Coppia di Processori\",\"\",(VLOOKUP(B91,PCI_B5, 3, FALSE)))","v":""},{"$f":"IF(B91=\"Aggiungere Coppia di Processori\",\"\",(VLOOKUP(B91,PCI_B5, 5, FALSE)))","v":""},{"$f":"IF(B91=\"Aggiungere Coppia di Processori\",\"\",(VLOOKUP(B91,PCI_B5, 2, FALSE)))","v":""}]
[]
[null,"Additional Card for PCIe Slot 4 (CPU3 / CPU4)"]
[null,"None",{"$f":"IF(B94=\"Aggiungere Coppia di Processori\",\"\",(VLOOKUP(B94,PCI_B6, 2, FALSE)))","v":""},{"$f":"IF(B94=\"Aggiungere Coppia di Processori\",\"\",(VLOOKUP(B94,PCI_B6, 3, FALSE)))","v":""},{"$f":"IF(B94=\"Aggiungere Coppia di Processori\",\"\",(VLOOKUP(B94,PCI_B6, 5, FALSE)))","v":""},{"$f":"IF(B94=\"Aggiungere Coppia di Processori\",\"\",(VLOOKUP(B94,PCI_B6, 2, FALSE)))","v":""}]
[]
[null,"Additional Card for PCIe Slot 3 (CPU3 / CPU4)"]
[null,"None",{"$f":"IF(B97=\"Aggiungere Coppia di Processori\",\"\",(VLOOKUP(B97,PCI_B7, 2, FALSE)))","v":""},{"$f":"IF(B97=\"Aggiungere Coppia di Processori\",\"\",(VLOOKUP(B97,PCI_B7, 3, FALSE)))","v":""},{"$f":"IF(B97=\"Aggiungere Coppia di Processori\",\"\",(VLOOKUP(B97,PCI_B7, 5, FALSE)))","v":""},{"$f":"IF(B97=\"Aggiungere Coppia di Processori\",\"\",(VLOOKUP(B97,PCI_B7, 2, FALSE)))","v":""}]
[]
[null,"Additional Card for PCIe Slot 2 (CPU3 / CPU4)"]
[null,"None",{"$f":"IF(B100=\"Aggiungere Coppia di Processori\",\"\",(VLOOKUP(B100,PCI_B8, 2, FALSE)))","v":""},{"$f":"IF(B100=\"Aggiungere Coppia di Processori\",\"\",(VLOOKUP(B100,PCI_B8, 3, FALSE)))","v":""},{"$f":"IF(B100=\"Aggiungere Coppia di Processori\",\"\",(VLOOKUP(B100,PCI_B8, 5, FALSE)))","v":""},{"$f":"IF(B100=\"Aggiungere Coppia di Processori\",\"\",(VLOOKUP(B100,PCI_B8, 2, FALSE)))","v":""}]
[]
[null,"Additional Card for PCIe Slot 1 (CPU3 / CPU4)"]
[null,"None",{"$f":"IF(B103=\"Aggiungere Coppia di Processori\",\"\",(VLOOKUP(B103,PCI_B9, 2, FALSE)))","v":""},{"$f":"IF(B103=\"Aggiungere Coppia di Processori\",\"\",(VLOOKUP(B103,PCI_B9, 3, FALSE)))","v":""},{"$f":"IF(B103=\"Aggiungere Coppia di Processori\",\"\",(VLOOKUP(B103,PCI_B9, 5, FALSE)))","v":""},{"$f":"IF(B103=\"Aggiungere Coppia di Processori\",\"\",(VLOOKUP(B103,PCI_B9, 2, FALSE)))","v":""}]
[]
[null,"Bezel"]
[null,"HP 4U Security Bezel Kit",1,null,"741213-B21"]
[]
[null,"Accessori per Server"]
[null,"HP BLc 10G SFP+ SR Transceiver",{"$f":"(VLOOKUP(B79,PCI_A1,8,FALSE))+((VLOOKUP(B82,PCI_A1,8,FALSE)))+((VLOOKUP(B85,PCI_A1,8,FALSE)))+((VLOOKUP(B88,PCI_A1,8,FALSE)))+((VLOOKUP(B91,PCI_A1,8,FALSE)))+((VLOOKUP(B94,PCI_A1,8,FALSE)))+((VLOOKUP(B97,PCI_A1,8,FALSE)))+((VLOOKUP(B100,PCI_A1,8,FALSE)))+((VLOOKUP(B103,PCI_A1,8,FALSE)))","v":0},null,"455883-B21"]
[]
[null,"Unità ottica"]
[null,"HP Mobile USB DVDRW Drive",1,null,"701498-B21"]
[]
[null,"Estenzione di Garanzia"]
[null,"None",{"$f":"VLOOKUP($B$115,  SO_B1,2, FALSE)","v":""},{"$f":"VLOOKUP($B$115,  SO_B1, 3, FALSE)","v":""},{"$f":"VLOOKUP($B$115,  SO_B1, 5, FALSE)","v":""},{"$f":"VLOOKUP($B$115,  SO_B1, 6, FALSE)","v":""}]
[]
[null,"Protezione dei dati - Keep Your Hard Drive "]
[null,"None",{"$f":"VLOOKUP($B$118,  SO_BB2, 2, FALSE)","v":""},{"$f":"VLOOKUP($B$118,  SO_BB2, 3, FALSE)","v":""},{"$f":"VLOOKUP($B$118,  SO_BB2,5, FALSE)","v":""},{"$f":"VLOOKUP($B$118,  SO_BB2, 6, FALSE)","v":""}]

{"sheet":"Server10 Lotto2 DL580 3","index":7,"n_rows":118,"n_cols":8,"rows_kept":118,"cut":false,"hidden":false,"merged":[[63,8,66,10],[67,8,70,10],[30,1,30,4],[28,2,28,4],[0,0,3,5],[4,0,4,4],[5,0,5,4],[10,0,11,5],[12,0,12,5],[18,2,18,4],[20,1,20,4],[21,2,21,4],[23,1,23,4],[24,2,24,4],[27,1,27,4],[31,2,31,4],[33,1,33,4],[36,1,36,4],[37,2,37,4],[43,1,43,4],[44,2,44,4],[67,2,67,4],[48,2,48,4],[50,1,50,4],[52,1,52,4],[53,2,53,4],[55,1,55,4],[56,2,56,4],[62,1,62,4],[63,2,63,4],[66,1,66,4],[47,1,47,4],[70,1,70,4],[71,2,71,4],[73,1,73,4],[92,2,92,4],[76,1,76,4],[77,2,77,4],[79,1,79,4],[80,2,80,4],[82,1,82,4],[83,2,83,4],[85,1,85,4],[86,2,86,4],[88,1,88,4],[89,2,89,4],[91,1,91,4],[104,2,104,4],[106,1,106,4],[107,2,107,4],[109,1,109,4],[74,2,74,4],[101,2,101,4],[103,1,103,4],[95,2,95,4],[97,1,97,4],[98,2,98,4],[100,1,100,4],[94,1,94,4],[113,2,113,4],[115,1,115,4],[116,2,116,4],[118,1,118,4],[110,2,110,4],[112,1,112,4]]}
[]
[]
[]
[]
["Server10 Lotto2 DL580",null,null,null,null,null,null,"List Price *"]
[null,null,null,null,null,null,null,{"$f":"F17*C16","v":0}]
[]
[]
[]
[]
["Components: \nServer HP Proliant DL580 Gen9 (2CPU Intel® Xeon® E7-4830 v4, 64GB , 2xHDD 300GB 15K RPM SAS 12Gbps 2.5in)"]
[]
[]
[]
["Proliant DL580 Gen9","Category: Server",null,null,null,{"$f":"7444.5","v":7444.5}]
[null,"Quantity: ",null,null,null,{"$f":"SUM(F20:F119)","v":0}]
[null,null,null,null,null,{"$f":"SUM(F15:F16)","v":7444.5}]
[]
[null,"Base"]
[null,"HP DL580 Gen9 CTO Svr",1,null,"793161-B21"]
[]
[null,"Configurazione dello chassis"]
[null,"HP DL580 5 SFF Drive Backplane Kit",1,null,"739405-B21"]
[]
[null,"Processore"]
[null,"HP DL580 Gen9 E7-4850 v3 FIO 1P Kit",1,null,"788325-L21"]
[null,"HP DL580 Gen9 E7-4850 v3 1P Kit",1,null,"788325-B21"]
[]
[null,"Processore aggiuntivo"]
[null,"No Additional Processor",{"$f":"VLOOKUP($B$30, CPU_B, 2, FALSE)","v":0},{"$f":"VLOOKUP($B$30, CPU_B, 3, FALSE)","v":""},{"$f":"VLOOKUP($B$30, CPU_B, 5, FALSE)","v":""},{"$f":"VLOOKUP(B30, CPU_B, 12, FALSE)","v":""}]
[]
[null,"Memory Cartridge"]
[null,{"$f":"IF($B$30=\"No Additional Processor\",VLOOKUP($B$36, MEM_B1, 17, FALSE),VLOOKUP($B$36, MEM_B2, 17, FALSE))","v":"HP DL580 Gen9 12 DIMMs Memory Cartridge"},{"$f":"IF($B$30=\"No Additional Processor\",VLOOKUP($B$36, MEM_B1, 19, FALSE),VLOOKUP($B$36, MEM_B2, 19, FALSE))","v":2},null,{"$f":"IF($B$30=\"No Additional Processor\",VLOOKUP($B$36, MEM_B1, 18, FALSE),VLOOKUP($B$36, MEM_B2, 18, FALSE))","v":"788360-B21"}]
[]
[null,"Memoria Totale in GB",null,{"$f":"IF(('Server10 Lotto2 DL580 3'!$D$12=0),\"\",'Server10 Lotto2 DL580 3'!#REF!)","v":""}]
[null,64]
[]
[null,"Capacità di memoria"]
[null,{"$f":"IF($B$30=\"No Additional Processor\",VLOOKUP($B$36, MEM_B1, 8, FALSE),VLOOKUP($B$36, MEM_B2, 8, FALSE))","v":"HPE 16GB 2Rx4 PC4-2400T-R Kit"},{"$f":"IF($B$30=\"No Additional Processor\",VLOOKUP($B$36, MEM_B1, 9, FALSE),VLOOKUP($B$36, MEM_B2, 9, FALSE))","v":4},null,{"$f":"IF($B$30=\"No Additional Processor\",VLOOKUP($B$36, MEM_B1, 10, FALSE),VLOOKUP($B$36, MEM_B2, 10, FALSE))","v":"836220-B21"}]
[]
[null,{"$f":"IF($B$30=\"No Additional Processor\",VLOOKUP($B$36, MEM_B1, 2, FALSE),VLOOKUP($B$36, MEM_B2, 2, FALSE))","v":""},{"$f":"IF($B$30=\"No Additional Processor\",VLOOKUP($B$36, MEM_B1, 3, FALSE),VLOOKUP($B$36, MEM_B2, 3, FALSE))","v":""},{"$f":"IF($B$30=\"No Additional Processor\",VLOOKUP($B$36, MEM_B1, 4, FALSE),VLOOKUP($B$36, MEM_B2, 4, FALSE))","v":""},{"$f":"IF($B$30=\"No Additional Processor\",VLOOKUP($B$36, MEM_B1, 6, FALSE),VLOOKUP($B$36, MEM_B2, 6, FALSE))","v":""},{"$f":"IF($B$30=\"No Additional Processor\",VLOOKUP($B$36, MEM_B1, 7, FALSE),VLOOKUP($B$36, MEM_B2, 7, FALSE))","v":""}]
[]
[null,{"$f":"IF($B$30=\"No Additional Processor\",VLOOKUP($B$36, MEM_B1, 11, FALSE),VLOOKUP($B$36, MEM_B2, 11, FALSE))","v":""},{"$f":"IF($B$30=\"No Additional Processor\",VLOOKUP($B$36, MEM_B1, 12, FALSE),VLOOKUP($B$36, MEM_B2, 12, FALSE))","v":""},{"$f":"IF($B$30=\"No Additional Processor\",VLOOKUP($B$36, MEM_B1, 13, FALSE),VLOOKUP($B$36, MEM_B2, 13, FALSE))","v":""},{"$f":"IF($B$30=\"No Additional Processor\",VLOOKUP($B$36, MEM_B1, 15, FALSE),VLOOKUP($B$36, MEM_B2, 15, FALSE))","v":""},{"$f":"IF($B$30=\"No Additional Processor\",VLOOKUP($B$36, MEM_B1, 16, FALSE),VLOOKUP($B$36, MEM_B2, 16, FALSE))","v":""}]
[]
[null,"Sistema operativo preinstallato"]
[null,"No Operating System",{"$f":"VLOOKUP($B$46, OS_B, 2, FALSE)","v":""},{"$f":"VLOOKUP($B$46, OS_B, 3, FALSE)","v":""},{"$f":"VLOOKUP($B$46, OS_B, 5, FALSE)","v":""},{"$f":"VLOOKUP($B$46, OS_B, 6, FALSE)","v":""}]
[null,null,{"$f":"IF($D$41=\"\",\"\",C46)","v":""},{"$f":"IF(H47+C30=3,\"10L2-WIN2\",IF(H47+C30=4,\"10L2-WINDC2\",\"\"))","v":""},{"$f":"IF($D$41=\"\",\"\",E46)","v":""},{"$f":"IF($D$41=\"\",\"\",F46)","v":""},null,{"$f":"IF(D46=\"10L2-WIN1\",1,IF(D46=\"10L2-WINDC1\",2,0))","v":0}]
[]
[null,"Client Access Licenses"]
[null,{"$f":"VLOOKUP($B$46, OS_B, 7, FALSE)","v":"None"},null,{"$f":"VLOOKUP($B$46, OS_B, 9, FALSE)","v":""},{"$f":"VLOOKUP($B$46, OS_B, 11, FALSE)","v":""},{"$f":"VLOOKUP($B$46, OS_B, 12, FALSE)*C50","v":0}]
[]
[null,{"$f":"VLOOKUP($B$46, OS_B, 13, FALSE)","v":"None"},null,{"$f":"VLOOKUP($B$46, OS_B, 15, FALSE)","v":""},{"$f":"VLOOKUP($B$46, OS_B, 17, FALSE)","v":""},{"$f":"VLOOKUP($B$46, OS_B, 18, FALSE)*C52","v":0}]
[]
[null,"Controller RAID"]
[null,"HP Smart Array 2GB 24in FIO Flashback Write Cache",1,null,"758836-B21"]
[]
[null,"Dischi rigidi"]
[null,"HP 300GB 12G SAS 15K 2.5in SC ENT HDD",2,null,"759208-B21"]
[]
[null,"HP 300GB 12G SAS 15K 2.5in SC ENT HDD",0,{"$f":"VLOOKUP($B$60, HDD_A,3, FALSE)","v":"10L2-HDD300GB"},{"$f":"VLOOKUP($B$60, HDD_A,5, FALSE)","v":"759208-B21"},{"$f":"VLOOKUP($B$60, HDD_A,6, FALSE)*C60","v":0}]
[]
[null,"HP 1TB 6G SAS 7.2K 2.5in SC MDL HDD",0,{"$f":"VLOOKUP($B$62, HDD_A,3, FALSE)","v":"10L2-HDD1TB"},{"$f":"VLOOKUP($B$62, HDD_A,5, FALSE)","v":"652749-B21"},{"$f":"VLOOKUP($B$62, HDD_A,6, FALSE)*C62","v":0}]
[]
[null,"Configurazione RAID con HDD 300GB"]
[null,"RAID 1  (2 HDDs)",1,null,{"$f":"VLOOKUP($B$65,  RAID_BBB1, 2, FALSE)","v":"[780-BBJK]"}]
[null,"Hot Spare for 300GB HDD","No"]
[]
[null,"Configurazione RAID con HDD 1TB"]
[null,"",1,null,{"$f":"VLOOKUP($B$69,  RAID_BBB2, 2, FALSE)","v":""}]
[null,"Hot Spare for 1TB HDD","No"]
[]
[null,"Alimentatore"]
[null,"HP 1200W CS Plat PL HtPlg Pwr Supply Kit",4,null,"656364-B21"]
[]
[null,"Scheda FlexibleLOM"]
[null,"HP Ethernet 1GbE 4P 331FLR FIO Adptr",1,null,"684208-B21"]
[]
[null,"Additional Card for PCIe Slot 9 (CPU1 / CPU2)"]
[null,"None",{"$f":"VLOOKUP($B$79,  PCI_B1, 2, FALSE)","v":""},{"$f":"VLOOKUP($B$79,  PCI_B1, 3, FALSE)","v":""},{"$f":"VLOOKUP($B$79,  PCI_B1, 5, FALSE)","v":""},{"$f":"VLOOKUP($B$79,  PCI_B1, 6, FALSE)","v":""}]
[]
[null,"Additional Card for PCIe Slot 8 (CPU1 / CPU2)"]
[null,"None",{"$f":"VLOOKUP($B$82,  PCI_B2, 2, FALSE)","v":""},{"$f":"VLOOKUP($B$82,  PCI_B2, 3, FALSE)","v":""},{"$f":"VLOOKUP($B$82,  PCI_B2, 5, FALSE)","v":""},{"$f":"VLOOKUP($B$82,  PCI_B2, 6, FALSE)","v":""}]
[]
[null,"Additional Card for PCIe Slot 7 (CPU1 / CPU2)"]
[null,"None",{"$f":"VLOOKUP($B$85,  PCI_B3, 2, FALSE)","v":""},{"$f":"VLOOKUP($B$85,  PCI_B3, 3, FALSE)","v":""},{"$f":"VLOOKUP($B$85,  PCI_B3, 5, FALSE)","v":""},{"$f":"VLOOKUP($B$85,  PCI_B3, 6, FALSE)","v":""}]
[]
[null,"Additional Card for PCIe Slot 6 (CPU1 / CPU2)"]
[null,"None",{"$f":"VLOOKUP($B$88,  PCI_B4, 2, FALSE)","v":""},{"$f":"VLOOKUP($B$88,  PCI_B4, 3, FALSE)","v":""},{"$f":"VLOOKUP($B$88,  PCI_B4, 5, FALSE)","v":""},{"$f":"VLOOKUP($B$88,  PCI_B4, 6, FALSE)","v":""}]
[]
[null,"Additional Card for PCIe Slot 5 (CPU3 / CPU4)"]
[null,"None",{"$f":"IF(B91=\"Aggiungere Coppia di Processori\",\"\",(VLOOKUP(B91,PCI_B5, 2, FALSE)))","v":""},{"$f":"IF(B91=\"Aggiungere Coppia di Processori\",\"\",(VLOOKUP(B91,PCI_B5, 3, FALSE)))","v":""},{"$f":"IF(B91=\"Aggiungere Coppia di Processori\",\"\",(VLOOKUP(B91,PCI_B5, 5, FALSE)))","v":""},{"$f":"IF(B91=\"Aggiungere Coppia di Processori\",\"\",(VLOOKUP(B91,PCI_B5, 2, FALSE)))","v":""}]
[]
[null,"Additional Card for PCIe Slot 4 (CPU3 / CPU4)"]
[null,"None",{"$f":"IF(B94=\"Aggiungere Coppia di Processori\",\"\",(VLOOKUP(B94,PCI_B6, 2, FALSE)))","v":""},{"$f":"IF(B94=\"Aggiungere Coppia di Processori\",\"\",(VLOOKUP(B94,PCI_B6, 3, FALSE)))","v":""},{"$f":"IF(B94=\"Aggiungere Coppia di Processori\",\"\",(VLOOKUP(B94,PCI_B6, 5, FALSE)))","v":""},{"$f":"IF(B94=\"Aggiungere Coppia di Processori\",\"\",(VLOOKUP(B94,PCI_B6, 2, FALSE)))","v":""}]
[]
[null,"Additional Card for PCIe Slot 3 (CPU3 / CPU4)"]
[null,"None",{"$f":"IF(B97=\"Aggiungere Coppia di Processori\",\"\",(VLOOKUP(B97,PCI_B7, 2, FALSE)))","v":""},{"$f":"IF(B97=\"Aggiungere Coppia di Processori\",\"\",(VLOOKUP(B97,PCI_B7, 3, FALSE)))","v":""},{"$f":"IF(B97=\"Aggiungere Coppia di Processori\",\"\",(VLOOKUP(B97,PCI_B7, 5, FALSE)))","v":""},{"$f":"IF(B97=\"Aggiungere Coppia di Processori\",\"\",(VLOOKUP(B97,PCI_B7, 2, FALSE)))","v":""}]
[]
[null,"Additional Card for PCIe Slot 2 (CPU3 / CPU4)"]
[null,"None",{"$f":"IF(B100=\"Aggiungere Coppia di Processori\",\"\",(VLOOKUP(B100,PCI_B8, 2, FALSE)))","v":""},{"$f":"IF(B100=\"Aggiungere Coppia di Processori\",\"\",(VLOOKUP(B100,PCI_B8, 3, FALSE)))","v":""},{"$f":"IF(B100=\"Aggiungere Coppia di Processori\",\"\",(VLOOKUP(B100,PCI_B8, 5, FALSE)))","v":""},{"$f":"IF(B100=\"Aggiungere Coppia di Processori\",\"\",(VLOOKUP(B100,PCI_B8, 2, FALSE)))","v":""}]
[]
[null,"Additional Card for PCIe Slot 1 (CPU3 / CPU4)"]
[null,"None",{"$f":"IF(B103=\"Aggiungere Coppia di Processori\",\"\",(VLOOKUP(B103,PCI_B9, 2, FALSE)))","v":""},{"$f":"IF(B103=\"Aggiungere Coppia di Processori\",\"\",(VLOOKUP(B103,PCI_B9, 3, FALSE)))","v":""},{"$f":"IF(B103=\"Aggiungere Coppia di Processori\",\"\",(VLOOKUP(B103,PCI_B9, 5, FALSE)))","v":""},{"$f":"IF(B103=\"Aggiungere Coppia di Processori\",\"\",(VLOOKUP(B103,PCI_B9, 2, FALSE)))","v":""}]
[]
[null,"Bezel"]
[null,"HP 4U Security Bezel Kit",1,null,"741213-B21"]
[]
[null,"Accessori per Server"]
[null,"HP BLc 10G SFP+ SR Transceiver",{"$f":"(VLOOKUP(B79,PCI_A1,8,FALSE))+((VLOOKUP(B82,PCI_A1,8,FALSE)))+((VLOOKUP(B85,PCI_A1,8,FALSE)))+((VLOOKUP(B88,PCI_A1,8,FALSE)))+((VLOOKUP(B91,PCI_A1,8,FALSE)))+((VLOOKUP(B94,PCI_A1,8,FALSE)))+((VLOOKUP(B97,PCI_A1,8,FALSE)))+((VLOOKUP(B100,PCI_A1,8,FALSE)))+((VLOOKUP(B103,PCI_A1,8,FALSE)))","v":0},null,"455883-B21"]
[]
[null,"Unità ottica"]
[null,"HP Mobile USB DVDRW Drive",1,null,"701498-B21"]
[]
[null,"Estenzione di Garanzia"]
[null,"None",{"$f":"VLOOKUP($B$115,  SO_B1,2, FALSE)","v":""},{"$f":"VLOOKUP($B$115,  SO_B1, 3, FALSE)","v":""},{"$f":"VLOOKUP($B$115,  SO_B1, 5, FALSE)","v":""},{"$f":"VLOOKUP($B$115,  SO_B1, 6, FALSE)","v":""}]
[]
[null,"Protezione dei dati - Keep Your Hard Drive "]
[null,"None",{"$f":"VLOOKUP($B$118,  SO_BBB2, 2, FALSE)","v":""},{"$f":"VLOOKUP($B$118,  SO_BBB2, 3, FALSE)","v":""},{"$f":"VLOOKUP($B$118,  SO_BBB2,5, FALSE)","v":""},{"$f":"VLOOKUP($B$118,  SO_BBB2, 6, FALSE)","v":""}]

{"sheet":"Codici","index":8,"n_rows":133,"n_cols":5,"rows_kept":133,"cut":false,"hidden":true,"merged":[[127,1,130,1],[127,2,130,2],[92,0,94,0],[92,1,94,1],[119,0,121,0],[119,1,121,1],[119,2,121,2],[103,1,104,1],[32,2,35,2],[17,0,18,0],[17,1,18,1],[89,0,90,0],[89,1,90,1],[50,0,51,0],[50,1,51,1],[77,1,80,1],[63,1,64,1],[87,0,88,0],[87,1,88,1],[65,1,66,1],[63,0,64,0],[77,2,80,2],[65,0,66,0],[52,0,53,0],[10,0,12,0],[10,1,12,1],[19,0,20,0],[19,1,20,1],[32,1,35,1],[52,1,53,1],[54,0,55,0],[54,1,55,1],[56,0,57,0],[56,1,57,1]]}
["Codici"]
["10L2-DL560G9-U","Server prestazionale",5272.5,1,"HPE ProLiant DL560 Gen9 Server prestazionale V4\n(2CPU Intel® Xeon® E5-4620 v4, 64GB RDIMM, 2xHDD 300GB 15k RPM SAS 12Gbps 2.5in)"]
[{"$f":"\"\"","v":""},{"$f":"\"\"","v":""},{"$f":"\"\"","v":""},{"$f":"\"\"","v":""},{"$f":"\"\"","v":""}]
["10L2-WIN1","OpzWinServ1",540,1,"Microsoft® Windows Server 2012 R2, Standard Edition, 2 Socket, 2Vm, ROK, COA + Media"]
["10L2-WIN2","OpzWinServ2",540,1,"Microsoft® Windows Server 2012 R2, Standard Edition, 2 Socket, 2Vm, Additional License"]
["10L2-WINDC1","OpzWinServ DC1",2440,1,"Microsoft® Windows Server 2012 R2, Datacenter Edition, 2 Socket, unlimited virtualization rights, ROK, COA + Media"]
["10L2-WINDC2","OpzWinServ DC2",2440,1,"Microsoft® Windows Server 2012 R2, Datacenter Edition, 2 Socket, unlimited virtualization rights, Additional License"]
["10L2-CALDEV","OpzDeviceCal",22,1,"MS Windows Server 2012 R2, CAL 1 DEV (1-pack fo Windows Server 2012 R2 Device CALs (Standard or Datacenter))"]
["10L2-CALUSER","OpzUserCal",24,1,"MS Windows Server 2012 R2, CAL 1 USR (1-pack fo Windows Server 2012 R2 User CALs (Standard or Datacenter))"]
["10L2-LINUX","OpzOpenSource",45,null,"DVD Linux Centos 7.x"]
["10L2-CPU-P-U","Opz2P",2749,2,"Kit 2 CPU Intel® Xeon® E5-4620 v4\n(Intel Xeon E5-4620 v4 2.1GHz, 25M Cache, 8 GT/s QPI, Turbo, HT, 10 core, 20 thread)"]
[null,null,null,1,"HPE DL560 Gen9 CPU Mezz Board w/ Mech Kit"]
[]
["10L2-16GB-U","OpzRam16",141,1,"Kit Upgrade Ram 16GB V4\n(16GB RDIMM, 2400MT/s, Dual Rank x4) "]
["10L2-32GB-U","OpzRam32",320,1,"Kit Upgrade Ram 32GB V4\n(32GB RDIMM, 2400MT/s, Dual Rank x4)"]
["10L2-64GB-U","OpzRam64",652,1,"Kit Upgrade Ram 64GB V4\n(64GB RDIMM, 2400MT/s, Dual Rank x4)"]
["10L2-LAN1GB","OpzGigabit",35,1,"Scheda LAN Gigabit\n(HPE Ethernet 1Gb 2P 332T Adptr)"]
["10L2-LAN10GB","OpzGigabit 10GB",716,1,"Scheda LAN 10 Gigabit\n(HPE Ethernet 10Gb 2P 530SFP)"]
[null,null,null,2,"HP BLc 10G SFP+ SR Transceiver"]
["10L2-CNA10","OpzGigabit 10GB CNA",778,1,"Scheda CNA\n(HPE StoreFabric CN1200E 10Gb CNA)"]
[null,null,null,2,"HPE BLc 10G SFP+ SR Transceiver"]
["10L2-HDD300GB","OpzStorage300",140,1,"HDD 300Gb SAS\n(HPE HDD 300GB 12G SAS 15K 2.5\"  )"]
["10L2-HDD1TB","OpzStorage1Tb",278,1,"HDD 1TB NLSAS\n(HPE HDD 1TB 6G SAS 7.2K 2.5\")"]
["10L2-FC","OpzFibreChannel",889,1,"Scheda FC\n(HPE 82Q 8Gb Dual Port PCI-e FC HBA)"]
["10L2-UPS","OpzUPS 3000VA",428,1,"UPS MSR 3000 VA"]
["10L2-GUI","OpzGUIRack",466,1,"Console KVM GUI per rack"]
["10L2-KVMIP","OpzSWGUIRack",550,1,"KVM Switch IP per GUI con cavi"]
["10L2-RACK","OpzRack",503,null,"Armadio Rack 42U"]
[]
["10L2-SO-WIN","ServOpzSysManWindows",200,1,"System-Network Mng. svc Windows"]
["10L2-SO-LINUX","ServOpzSysManOS",200,1,"System-Network Mng. svc Linux"]
["10L2-SO-PREV","Manutenzione Preventiva",200,1,"Servizi di manutenzione Preventiva"]
["10L2-SO-HDD","Hard-Disk retention",300,1,"Servizio HDD Retention"]
[null,null,null,1,"3Yr Data Protection - Keep Your Hard Drive"]
[null,null,null,1,"4Yr Data Protection - Keep Your Hard Drive"]
[null,null,null,1,"5Yr Data Protection - Keep Your Hard Drive"]
["10L2-SO-12M","OpzEstensione12",350,1,"Estensione garanzia 12 mesi Agg."]
["10L2-SO-24M","OpzEstensione24",700,1,"Estensione garanzia 24 mesi Agg."]
[]
["10L2-DL580G9-U","Server enterprise",7444.5,1,"HPE ProLiant DL580 Gen9 Server enterprise V4\n(2CPU Intel® Xeon® E7-4830 v4, 64GB RDIMM, 2xHDD 300GB 15k RPM SAS 12Gbps 2.5in)"]
[{"$f":"\"\"","v":""},{"$f":"\"\"","v":""},{"$f":"\"\"","v":""},{"$f":"\"\"","v":""},{"$f":"\"\"","v":""}]
["10L2-DL580G92","Server enterprise",7444.5,1,"HPE ProLiant DL580 Gen9 Server enterprise V4\n(2CPU Intel® Xeon® E7-4830 v4, 64GB RDIMM, 2xHDD 300GB 15k RPM SAS 12Gbps 2.5in)"]
["10L2-DL580G94","Server enterprise",7444.5,1,"HPE ProLiant DL580 Gen9 Server enterprise V4\n(2CPU Intel® Xeon® E7-4830 v4, 64GB RDIMM, 2xHDD 300GB 15k RPM SAS 12Gbps 2.5in)"]
["10L2-WIN1","OpzWinServ1",540,1,"Microsoft® Windows Server 2012 R2, Standard Edition, 2 Socket, 2Vm, ROK, COA + Media"]
["10L2-WIN2","OpzWinServ2",540,1,"Microsoft® Windows Server 2012 R2, Standard Edition, 2 Socket, 2Vm, Additional License"]
["10L2-WINDC1","OpzWinServ DC1",2440,1,"Microsoft® Windows Server 2012 R2, Datacenter Edition, 2 Socket, unlimited virtualization rights, ROK, COA + Media"]
["10L2-WINDC2","OpzWinServ DC2",2440,1,"Microsoft® Windows Server 2012 R2, Datacenter Edition, 2 Socket, unlimited virtualization rights, Additional License"]
["10L2-CALDEV","OpzDeviceCal",22,1,"MS Windows Server 2012 R2, CAL 1 DEV (1-pack fo Windows Server 2012 R2 Device CALs (Standard or Datacenter))"]
["10L2-CALUSER","OpzUserCal",24,1,"MS Windows Server 2012 R2, CAL 1 USR (1-pack fo Windows Server 2012 R2 User CALs (Standard or Datacenter))"]
["10L2-LINUX","OpzOpenSource",45,null,"DVD Linux Centos 7.x"]
["10L2-CPU-E-U","Opz2P",3601,2,"Kit 2 CPU Intel® Xeon® E7-4830 v4\n(Intel Xeon E7-4830 v4 2.0GHz,35M Cache,8.00GT/s QPI,Turbo,HT,14 core, 28 thread)"]
[null,null,null,2,"HP DL580 Gen9 12 DIMMs Memory Cartridge"]
["10L2-CPU-E4-U","Opz2P",3601,2,"Kit 2 CPU Intel® Xeon® E7-4830 v4 - 4MC\n(Intel Xeon E7-4830 v4 2.0GHz,35M Cache,8.00GT/s QPI,Turbo,HT,14 core, 28 thread)"]
[null,null,null,4,"HP DL580 Gen9 12 DIMMs Memory Cartridge"]
["10L2-CPU-E2-U","Opz2P",3601,2,"Kit 2 CPU Intel® Xeon® E7-4830 v4 - 2MC\n(Intel Xeon E7-4830 v4 2.0GHz,35M Cache,8.00GT/s QPI,Turbo,HT,14 core, 28 thread)"]
[null,null,null,2,"HP DL580 Gen9 12 DIMMs Memory Cartridge"]
["10L2-CPU-E0-U","Opz2P",3601,2,"Kit 2 CPU Intel® Xeon® E7-4830 v4\n(Intel Xeon E7-4830 v4 2.0GHz,35M Cache,8.00GT/s QPI,Turbo,HT,14 core, 28 thread)"]
[null,null,null,0,"HP DL580 Gen9 12 DIMMs Memory Cartridge"]
["10L2-16GB-U","OpzRam16",141,1,"Kit Upgrade Ram 16GB V4\n(16GB RDIMM, 2400MT/s, Dual Rank x4) "]
["10L2-32GB-U","OpzRam32",320,1,"Kit Upgrade Ram 32GB V4\n(32GB RDIMM, 2400MT/s, Dual Rank x4)"]
["10L2B-32GB-L","OpzRam32",320,1,"Upgrade KIT RAM 32GB-L"]
["10L2-64GB-U","OpzRam64",652,1,"Kit Upgrade Ram 64GB V4\n(64GB RDIMM, 2400MT/s, Dual Rank x4)"]
["10L2-LAN1GB","OpzGigabit",35,1,"Scheda LAN Gigabit\n(HPE Ethernet 1Gb 2P 332T Adptr)"]
["10L2-LAN10GB","OpzGigabit 10GB",716,1,"Scheda LAN 10 Gigabit\n(HPE Ethernet 10Gb 2P 530SFP)"]
[null,null,null,2,"HP BLc 10G SFP+ SR Transceiver"]
["10L2-CNA10","OpzGigabit 10GB CNA",778,1,"Scheda CNA\n(HPE StoreFabric CN1200E 10Gb CNA)"]
[null,null,null,2,"HPE BLc 10G SFP+ SR Transceiver"]
["10L2-HDD300GB","OpzStorage300",140,1,"HDD 300Gb SAS\n(HPE HDD 300GB 12G SAS 15K 2.5\"  )"]
["10L2-HDD1TB","OpzStorage1Tb",278,1,"HDD 1TB NLSAS\n(HPE HDD 1TB 6G SAS 7.2K 2.5\")"]
["10L2-FC","OpzFibreChannel",889,1,"Scheda FC\n(HPE 82Q 8Gb Dual Port PCI-e FC HBA)"]
["10L2-UPS","OpzUPS 3000VA",428,1,"UPS MSR 3000 VA"]
["10L2-GUI","OpzGUIRack",466,1,"Console KVM GUI per rack"]
["10L2-KVMIP","OpzSWGUIRack",550,1,"KVM Switch IP per GUI con cavi"]
["10L2-RACK","OpzRack",503,null,"Armadio Rack 42U"]
["10L2-SO-WIN","ServOpzSysManWindows",200,1,"System-Network Mng. svc Windows"]
["10L2-SO-LINUX","ServOpzSysManOS",200,1,"System-Network Mng. svc Linux"]
["10L2-SO-PREV","Manutenzione Preventiva",200,1,"Servizi di manutenzione Preventiva"]
["10L2-SO-HDD","Hard-Disk retention",300,1,"Servizio HDD Retention"]
[null,null,null,1,"3Yr Data Protection - Keep Your Hard Drive"]
[null,null,null,1,"4Yr Data Protection - Keep Your Hard Drive"]
[null,null,null,1,"5Yr Data Protection - Keep Your Hard Drive"]
["10L2-SO-12M","OpzEstensione12",350,1,"Estensione garanzia 12 mesi Agg."]
["10L2-SO-24M","OpzEstensione24",700,1,"Estensione garanzia 24 mesi Agg."]
[]
["10L1-T630","Server Tower",2340,1,"Server DELL PowerEdge T630 (1CPU Intel® Xeon® E5-2650 v3, 32GB RDIMM, 2xHDD 300GB 10K RPM SAS 12Gbps 2.5in)"]
[{"$f":"\"\"","v":""},{"$f":"\"\"","v":""},{"$f":"\"\"","v":""},{"$f":"\"\"","v":""},{"$f":"\"\"","v":""}]
["10L1-WIN","OpzWinServ1",505,1,"Kit Windows Server 2012, Standard Edition, 2 Socket, 2VM, ROK, COA + Media"]
["10L1-CALUSER","OpzUserCal",25,1,"1-pack of Windows Server 2012 User CALs (Standard or Datacenter)"]
[null,null,null,1,"CS_Consip9_Windows Server CAL 2012 Italian 1pk DSP OEI 1 Clt User CAL"]
["10L1-CALDEV","OpzDeviceCal",25,1,"1-pack of Windows Server 2012 Device CALs (Standard or Datacenter)"]
[null,null,null,1,"CS_Consip9_Windows Server CAL 2012 Italian 1pk DSP OEI 1 Clt Device CAL"]
["10L1-LINUX","OpzOpenSource",45]
["10L1-CPU-T","Opz1P",800,1,"Intel Xeon E5-2650 v3 2.3GHz,25M Cache,9.60GT/s QPI,Turbo,HT,10C/20T (105W) Max Mem 2133MHz,Customer Kit"]
[null,null,null,1,"Kit - 105W Heatsink for T630"]
[]
["10L1-16GB","OpzRam16",160,1,"16GB RDIMM, 2133 MT/s, Dual Rank, x4 Data Width,CusKit"]
["10L1-32GB","OpzRam32",320,1,"32GB RDIMM, 2133 MT/s, Low Volt, Dual Rank, x4 Data Width"]
["10L1-32GB-L","OpzRam32",320,1,"32GB LRDIMM, 2133 MT/s, Quad Rank, x4 Data Width,CusKit"]
["10L1-64GB","OpzRam64",644,1,"Modulo di memoria sostitutivo certificato Dell 64 GB per alcuni sistemi Dell - LRDIMM 4Rx4 a 2.133 MHz"]
[]
["10L1-LAN1GB","OpzGigabit",35,1,"Broadcom 5720 DP 1Gb Network Interface Card,Full Height,CusKit"]
[]
[]
["10L1-LAN10GB","OpzGigabit 10GB",417,1,"QLogic 57810 Dual Port 10Gb Direct Attach/SFP+ Network Adapter,Full Height,CusKit"]
[null,null,null,2,"PowerEdge SFP+, 10GbE SR/SX, Optical Tranceiver, LC Connector, for Intel and Broadcom,CusKit"]
[]
[]
[]
[]
["10L1-HDD300GB-T","OpzStorage300",91,1,"300GB 10K RPM SAS 12Gbps 2.5in Hot-plug Hard Drive,CusKit"]
["10L1-HDD1TB","OpzStorage1Tb",296,1,"1TB 7.2K RPM NLSAS 6Gbps 2.5in Hot-plug Hard Drive,13G,CusKit"]
[]
["10L1-FC","OpzFibreChannel",940,1,"Emulex LPE 12002, Dual Port 8Gb Fibre Channel HBA,Full Height,CusKit"]
["10L1-RDX","OpzRDX",365,1,"Unità di backup RDX (esterno) + 3 cartucce da 500GB"]
[]
["10L1-UPS-T","OpzUPS 3000VA",407,1,"Riello - UPS MSR3000EVO 3000VA Tower (SNMP+USB+RS232)"]
[]
[]
[]
["10L1-GUI-T","OpzGUIDesk",96,1,"Dell: Kit Monitor 19\" + Mouse + Keyboard"]
[null,null,null,1,"Mice : Dell USB Dual Tone Mouse - Grey - 2 button & Scrollwheel - kit"]
[null,null,null,1,"Dell 19 Monitor | E1916H - 47cm(18.5\") Black ITL"]
[]
[]
["10L1-SO-WIN","ServOpzSysManWindows",193,1,"Servizio Specialistico di System and Network Management per sistema opertivo Windows, erogato on site."]
["10L1-SO-LINUX","ServOpzSysManOS",193,1,"Servizio Specialistico di System and Network Management per sistema opertivo Linux, erogato on site."]
["10L1-SO-PREV","Manutenzione Preventiva",193,1,"Servizi specialistici sistemistici per aggiornare e prevenire malfunzionamenti"]
["10L1-SO-HDD","Hard-Disk retention",150,1,"Data Protection - Keep Your Hard Drive"]
[null,null,null,1,"3Yr Data Protection - Keep Your Hard Drive"]
[null,null,null,1,"4Yr Data Protection - Keep Your Hard Drive"]
[null,null,null,1,"5Yr Data Protection - Keep Your Hard Drive"]
["10L1-SO-12M-T","OpzEstensione12",175,1,"Estensione della manutenzione in garanzia per ulteriori 12 mesi"]
["10L1-SO-24M-T","OpzEstensione24",350,1,"Estensione della manutenzione in garanzia per ulteriori 24 mesi"]

{"sheet":"Processor","index":9,"n_rows":12,"n_cols":12,"rows_kept":12,"cut":false,"hidden":true,"merged":[]}
["Additional Processor"]
["Server DL560",null,"CPU-A"]
["No Additional Processor",0,{"$f":"\"\"","v":""},null,{"$f":"\"\"","v":""},{"$f":"\"\"","v":""},{"$f":"\"\"","v":""},{"$f":"\"\"","v":""}]
["HPE DL560 Gen9 E5-4620v4 Kit",2,"10L2-CPU-P-U","S10L2-DL560-CPU-U","830267-B21","HPE DL560 Gen9 CPU Mezz Board w/ Mech Kit",1,"795107-B21",null,null,null,2749]
[]
["Server DL580",null,"CPU-B"]
["No Additional Processor",0,{"$f":"\"\"","v":""},null,{"$f":"\"\"","v":""},{"$f":"\"\"","v":""},{"$f":"\"\"","v":""},{"$f":"\"\"","v":""},null,null,null,{"$f":"\"\"","v":""}]
["HPE DL580 Gen9 E7-4830v4 1P Kit",2,"10L2-CPU-E-U","S10L2-DL580-CPU-U","816653-B21","HPE DL580 Gen9 12 DIMMs Memory Cartridge",2,"788360-B21",null,null,null,3601]
[]
["Server T630",null,"CPU-C"]
["No Additional Processor",0,{"$f":"\"\"","v":""},null,"[374-BBBX]",{"$f":"\"\"","v":""},{"$f":"\"\"","v":""},{"$f":"\"\"","v":""},null,null,null,{"$f":"\"\"","v":""}]
["Intel Xeon E5-2650 v3 2.3GHz,25M Cache,9.60GT/s QPI,Turbo,HT,10C/20T (105W) Max Mem 2133MHz,Customer Kit",1,"10L1-CPU-T","S10L1-T630-CPU","[338-BFCF]","Kit - 105W Heatsink for T630",1,"[412-AADU]",null,null,null,800]

{"sheet":"Memory","index":10,"n_rows":113,"n_cols":27,"rows_kept":113,"cut":false,"hidden":true,"merged":[[48,7,48,9],[48,1,48,6],[48,10,48,15]]}
[null,"Total Memory"]
[]
[null,"HPE 16GB 2Rx4 PC4-2400T-R Kit",1,"10L2-16GB-U","S10L2-DL560-16GB-U","836220-B21",141]
[null,"HPE 32GB 2Rx4 PC4-2400T-R Kit",1,"10L2-32GB-U","S10L2-DL560-32GB-U","805351-B21",320]
[null,"HP 64GB 4Rx4 PC4-2133P-L Kit",1,"10L2A-64GB","S10L2-DL560-64GB-U","726724-B21",652]
[null,"HPE 16GB 2Rx4 PC4-2400T-R Kit",1,"10L2-16GB-U","S10L2-DL580-16GB-U","836220-B21",141]
[null,"HPE 32GB 2Rx4 PC4-2400T-R Kit",1,"10L2-32GB-U","S10L2-DL580-32GB-U","805351-B21",320]
[null,"HP 32GB 4Rx4 PC4-2133P-L Kit",1,"10L2B-32GB-L","S10L2-DL580-32GB-L","726722-B21",320]
[null,"HP 64GB 4Rx4 PC4-2133P-L Kit",1,"10L2B-64GB-L","S10L2-DL580-64GB-L","726724-B21",652]
[]
[]
["2CPU","MEMORY A"]
[64,{"$f":"\"\"","v":""},{"$f":"\"\"","v":""},{"$f":"\"\"","v":""},{"$f":"\"\"","v":""},{"$f":"\"\"","v":""},{"$f":"\"\"","v":""},"HPE 32GB 2Rx4 PC4-2400T-R Kit","2","805351-B21",{"$f":"\"\"","v":""},{"$f":"\"\"","v":""},{"$f":"\"\"","v":""},{"$f":"\"\"","v":""},{"$f":"\"\"","v":""},{"$f":"\"\"","v":""}]
["96 (16GB)","HPE 16GB 2Rx4 PC4-2400T-R Kit",2,"10L2-16GB-U","S10L2-DL560-16GB","836220-B21",{"$f":"$G$3*C14","v":282},"HPE 32GB 2Rx4 PC4-2400T-R Kit","2","805351-B21",{"$f":"\"\"","v":""},{"$f":"\"\"","v":""},{"$f":"\"\"","v":""},{"$f":"\"\"","v":""},{"$f":"\"\"","v":""},{"$f":"\"\"","v":""}]
[128,{"$f":"\"\"","v":""},{"$f":"\"\"","v":""},{"$f":"\"\"","v":""},{"$f":"\"\"","v":""},{"$f":"\"\"","v":""},{"$f":"\"\"","v":""},"HPE 32GB 2Rx4 PC4-2400T-R Kit","2","805351-B21","HPE 32GB 2Rx4 PC4-2400T-R Kit",2,"10L2-32GB-U","S10L2-DL560-32GB","805351-B21",{"$f":"$G$4*L15","v":640}]
["128 (16GB)","HPE 16GB 2Rx4 PC4-2400T-R Kit",4,"10L2-16GB-U","S10L2-DL560-16GB","836220-B21",{"$f":"$G$3*C16","v":564},"HPE 32GB 2Rx4 PC4-2400T-R Kit","2","805351-B21",{"$f":"\"\"","v":""},{"$f":"\"\"","v":""},{"$f":"\"\"","v":""},{"$f":"\"\"","v":""},{"$f":"\"\"","v":""},{"$f":"\"\"","v":""}]
["160 (16GB)","HPE 16GB 2Rx4 PC4-2400T-R Kit",6,"10L2-16GB-U","S10L2-DL560-16GB","836220-B21",{"$f":"$G$3*C17","v":846},"HPE 32GB 2Rx4 PC4-2400T-R Kit","2","805351-B21",{"$f":"\"\"","v":""},{"$f":"\"\"","v":""},{"$f":"\"\"","v":""},{"$f":"\"\"","v":""},{"$f":"\"\"","v":""},{"$f":"\"\"","v":""}]
[192,{"$f":"\"\"","v":""},{"$f":"\"\"","v":""},{"$f":"\"\"","v":""},{"$f":"\"\"","v":""},{"$f":"\"\"","v":""},{"$f":"\"\"","v":""},"HPE 32GB 2Rx4 PC4-2400T-R Kit","2","805351-B21","HPE 32GB 2Rx4 PC4-2400T-R Kit",4,"10L2-32GB-U","S10L2-DL560-32GB","805351-B21",{"$f":"$G$4*L18","v":1280}]
["192 (16GB)","HPE 16GB 2Rx4 PC4-2400T-R Kit",8,"10L2-16GB-U","S10L2-DL560-16GB","836220-B21",{"$f":"$G$3*C19","v":1128},"HPE 32GB 2Rx4 PC4-2400T-R Kit","2","805351-B21",{"$f":"\"\"","v":""},{"$f":"\"\"","v":""},{"$f":"\"\"","v":""},{"$f":"\"\"","v":""},{"$f":"\"\"","v":""},{"$f":"\"\"","v":""}]
[256,{"$f":"\"\"","v":""},{"$f":"\"\"","v":""},{"$f":"\"\"","v":""},{"$f":"\"\"","v":""},{"$f":"\"\"","v":""},{"$f":"\"\"","v":""},"HPE 32GB 2Rx4 PC4-2400T-R Kit","2","805351-B21","HPE 32GB 2Rx4 PC4-2400T-R Kit",6,"10L2-32GB-U","S10L2-DL560-32GB","805351-B21",{"$f":"$G$4*L20","v":1920}]
["256 (16GB)","HPE 16GB 2Rx4 PC4-2400T-R Kit",12,"10L2-16GB-U","S10L2-DL560-16GB","836220-B21",{"$f":"$G$3*C21","v":1692},"HPE 32GB 2Rx4 PC4-2400T-R Kit","2","805351-B21",{"$f":"\"\"","v":""},{"$f":"\"\"","v":""},{"$f":"\"\"","v":""},{"$f":"\"\"","v":""},{"$f":"\"\"","v":""},{"$f":"\"\"","v":""}]
[320,{"$f":"\"\"","v":""},{"$f":"\"\"","v":""},{"$f":"\"\"","v":""},{"$f":"\"\"","v":""},{"$f":"\"\"","v":""},{"$f":"\"\"","v":""},"HPE 32GB 2Rx4 PC4-2400T-R Kit","2","805351-B21","HPE 32GB 2Rx4 PC4-2400T-R Kit",8,"10L2-32GB-U","S10L2-DL560-32GB","805351-B21",{"$f":"$G$4*L22","v":2560}]
["320 (16GB)","HPE 16GB 2Rx4 PC4-2400T-R Kit",16,"10L2-16GB-U","S10L2-DL560-16GB","836220-B21",{"$f":"$G$3*C23","v":2256},"HPE 32GB 2Rx4 PC4-2400T-R Kit","2","805351-B21",{"$f":"\"\"","v":""},{"$f":"\"\"","v":""},{"$f":"\"\"","v":""},{"$f":"\"\"","v":""},{"$f":"\"\"","v":""},{"$f":"\"\"","v":""}]
[384,{"$f":"\"\"","v":""},{"$f":"\"\"","v":""},{"$f":"\"\"","v":""},{"$f":"\"\"","v":""},{"$f":"\"\"","v":""},{"$f":"\"\"","v":""},"HPE 32GB 2Rx4 PC4-2400T-R Kit","2","805351-B21","HPE 32GB 2Rx4 PC4-2400T-R Kit",10,"10L2-32GB-U","S10L2-DL560-32GB","805351-B21",{"$f":"$G$4*L24","v":3200}]
["384 (16GB)","HPE 16GB 2Rx4 PC4-2400T-R Kit",20,"10L2-16GB-U","S10L2-DL560-16GB","836220-B21",{"$f":"$G$3*C25","v":2820},"HPE 32GB 2Rx4 PC4-2400T-R Kit","2","805351-B21",{"$f":"\"\"","v":""},{"$f":"\"\"","v":""},{"$f":"\"\"","v":""},{"$f":"\"\"","v":""},{"$f":"\"\"","v":""},{"$f":"\"\"","v":""}]
[512,{"$f":"\"\"","v":""},{"$f":"\"\"","v":""},{"$f":"\"\"","v":""},{"$f":"\"\"","v":""},{"$f":"\"\"","v":""},{"$f":"\"\"","v":""},"HPE 32GB 2Rx4 PC4-2400T-R Kit","2","805351-B21","HPE 32GB 2Rx4 PC4-2400T-R Kit",14,"10L2-32GB-U","S10L2-DL560-32GB","805351-B21",{"$f":"$G$4*L26","v":4480}]
[640,{"$f":"\"\"","v":""},{"$f":"\"\"","v":""},{"$f":"\"\"","v":""},{"$f":"\"\"","v":""},{"$f":"\"\"","v":""},{"$f":"\"\"","v":""},"HPE 32GB 2Rx4 PC4-2400T-R Kit","2","805351-B21","HPE 32GB 2Rx4 PC4-2400T-R Kit",18,"10L2-32GB-U","S10L2-DL560-32GB","805351-B21",{"$f":"$G$4*L27","v":5760}]
[768,{"$f":"\"\"","v":""},{"$f":"\"\"","v":""},{"$f":"\"\"","v":""},{"$f":"\"\"","v":""},{"$f":"\"\"","v":""},{"$f":"\"\"","v":""},"HPE 32GB 2Rx4 PC4-2400T-R Kit","2","805351-B21","HPE 32GB 2Rx4 PC4-2400T-R Kit",22,"10L2-32GB-U","S10L2-DL560-32GB","805351-B21",{"$f":"$G$4*L28","v":7040}]
["4CPU"]
[64,{"$f":"\"\"","v":""},{"$f":"\"\"","v":""},{"$f":"\"\"","v":""},{"$f":"\"\"","v":""},{"$f":"\"\"","v":""},{"$f":"\"\"","v":""},"HPE 32GB 2Rx4 PC4-2400T-R Kit","2","805351-B21",{"$f":"\"\"","v":""},{"$f":"\"\"","v":""},{"$f":"\"\"","v":""},{"$f":"\"\"","v":""},{"$f":"\"\"","v":""},{"$f":"\"\"","v":""}]
[128,{"$f":"\"\"","v":""},{"$f":"\"\"","v":""},{"$f":"\"\"","v":""},{"$f":"\"\"","v":""},{"$f":"\"\"","v":""},{"$f":"\"\"","v":""},"HPE 32GB 2Rx4 PC4-2400T-R Kit","2","805351-B21","HPE 32GB 2Rx4 PC4-2400T-R Kit",2,"10L2-32GB-U","S10L2-DL560-32GB","805351-B21",{"$f":"$G$4*L31","v":640}]
["192 (16GB)","HPE 16GB 2Rx4 PC4-2400T-R Kit",4,"10L2-16GB-U","S10L2-DL560-16GB","836220-B21",{"$f":"$G$3*C32","v":564},"HPE 32GB 2Rx4 PC4-2400T-R Kit","2","805351-B21","HPE 32GB 2Rx4 PC4-2400T-R Kit",2,"10L2-32GB-U","S10L2-DL560-32GB","805351-B21",640]
[256,{"$f":"\"\"","v":""},{"$f":"\"\"","v":""},{"$f":"\"\"","v":""},{"$f":"\"\"","v":""},{"$f":"\"\"","v":""},{"$f":"\"\"","v":""},"HPE 32GB 2Rx4 PC4-2400T-R Kit","2","805351-B21","HPE 32GB 2Rx4 PC4-2400T-R Kit",6,"10L2-32GB-U","S10L2-DL560-32GB","805351-B21",1920]
["256 (16GB)","HPE 16GB 2Rx4 PC4-2400T-R Kit",8,"10L2-16GB-U","S10L2-DL560-16GB","836220-B21",{"$f":"$G$3*C34","v":1128},"HPE 32GB 2Rx4 PC4-2400T-R Kit","2","805351-B21","HPE 32GB 2Rx4 PC4-2400T-R Kit",2,"10L2-32GB-U","S10L2-DL560-32GB","805351-B21",640]
[320,{"$f":"\"\"","v":""},{"$f":"\"\"","v":""},{"$f":"\"\"","v":""},{"$f":"\"\"","v":""},{"$f":"\"\"","v":""},{"$f":"\"\"","v":""},"HPE 32GB 2Rx4 PC4-2400T-R Kit","2","805351-B21","HPE 32GB 2Rx4 PC4-2400T-R Kit",8,"10L2-32GB-U","S10L2-DL560-32GB","805351-B21",2560]
["320 (16GB)","HPE 16GB 2Rx4 PC4-2400T-R Kit",12,"10L2-16GB-U","S10L2-DL560-16GB","836220-B21",{"$f":"$G$3*C36","v":1692},"HPE 32GB 2Rx4 PC4-2400T-R Kit","2","805351-B21","HPE 32GB 2Rx4 PC4-2400T-R Kit",2,"10L2-32GB-U","S10L2-DL560-32GB","805351-B21",640]
[384,{"$f":"\"\"","v":""},{"$f":"\"\"","v":""},{"$f":"\"\"","v":""},{"$f":"\"\"","v":""},{"$f":"\"\"","v":""},{"$f":"\"\"","v":""},"HPE 32GB 2Rx4 PC4-2400T-R Kit","2","805351-B21","HPE 32GB 2Rx4 PC4-2400T-R Kit",10,"10L2-32GB-U","S10L2-DL560-32GB","805351-B21",3200]
["384 (16GB)","HPE 16GB 2Rx4 PC4-2400T-R Kit",16,"10L2-16GB-U","S10L2-DL560-16GB","836220-B21",{"$f":"$G$3*C38","v":2256},"HPE 32GB 2Rx4 PC4-2400T-R Kit","2","805351-B21","HPE 32GB 2Rx4 PC4-2400T-R Kit",2,"10L2-32GB-U","S10L2-DL560-32GB","805351-B21",640]
[512,{"$f":"\"\"","v":""},{"$f":"\"\"","v":""},{"$f":"\"\"","v":""},{"$f":"\"\"","v":""},{"$f":"\"\"","v":""},{"$f":"\"\"","v":""},"HPE 32GB 2Rx4 PC4-2400T-R Kit","2","805351-B21","HPE 32GB 2Rx4 PC4-2400T-R Kit",14,"10L2-32GB-U","S10L2-DL560-32GB","805351-B21",4480]
["512 (16GB)","HPE 16GB 2Rx4 PC4-2400T-R Kit",24,"10L2-16GB-U","S10L2-DL560-16GB","836220-B21",{"$f":"$G$3*C40","v":3384},"HPE 32GB 2Rx4 PC4-2400T-R Kit","2","805351-B21","HPE 32GB 2Rx4 PC4-2400T-R Kit",2,"10L2-32GB-U","S10L2-DL560-32GB","805351-B21",640]
[640,{"$f":"\"\"","v":""},{"$f":"\"\"","v":""},{"$f":"\"\"","v":""},{"$f":"\"\"","v":""},{"$f":"\"\"","v":""},{"$f":"\"\"","v":""},"HPE 32GB 2Rx4 PC4-2400T-R Kit","2","805351-B21","HPE 32GB 2Rx4 PC4-2400T-R Kit",18,"10L2-32GB-U","S10L2-DL560-32GB","805351-B21",5760]
["640 (16GB)","HPE 16GB 2Rx4 PC4-2400T-R Kit",32,"10L2-16GB-U","S10L2-DL560-16GB","836220-B21",{"$f":"$G$3*C42","v":4512},"HPE 32GB 2Rx4 PC4-2400T-R Kit","2","805351-B21","HPE 32GB 2Rx4 PC4-2400T-R Kit",2,"10L2-32GB-U","S10L2-DL560-32GB","805351-B21",640]
[768,{"$f":"\"\"","v":""},{"$f":"\"\"","v":""},{"$f":"\"\"","v":""},{"$f":"\"\"","v":""},{"$f":"\"\"","v":""},{"$f":"\"\"","v":""},"HPE 32GB 2Rx4 PC4-2400T-R Kit","2","805351-B21","HPE 32GB 2Rx4 PC4-2400T-R Kit",22,"10L2-32GB-U","S10L2-DL560-32GB","805351-B21",7040]
["768 (16GB)","HPE 16GB 2Rx4 PC4-2400T-R Kit",40,"10L2-16GB-U","S10L2-DL560-16GB","836220-B21",{"$f":"$G$3*C44","v":5640},"HPE 32GB 2Rx4 PC4-2400T-R Kit","2","805351-B21","HPE 32GB 2Rx4 PC4-2400T-R Kit",2,"10L2-32GB-U","S10L2-DL560-32GB","805351-B21",640]
[1280,{"$f":"\"\"","v":""},{"$f":"\"\"","v":""},{"$f":"\"\"","v":""},{"$f":"\"\"","v":""},{"$f":"\"\"","v":""},{"$f":"\"\"","v":""},"HPE 32GB 2Rx4 PC4-2400T-R Kit","2","805351-B21","HPE 32GB 2Rx4 PC4-2400T-R Kit",38,"10L2-32GB-U","S10L2-DL560-32GB","805351-B21",12160]
[1536,{"$f":"\"\"","v":""},{"$f":"\"\"","v":""},{"$f":"\"\"","v":""},{"$f":"\"\"","v":""},{"$f":"\"\"","v":""},{"$f":"\"\"","v":""},"HPE 32GB 2Rx4 PC4-2400T-R Kit","2","805351-B21","HPE 32GB 2Rx4 PC4-2400T-R Kit",46,"10L2-32GB-U","S10L2-DL560-32GB","805351-B21",14720]
[]
[null,"MEMORY B"]
["2CPU","UPGRADE 16GB",null,null,null,null,null,"MEMORIA BASE",null,null,"UPGRADE 32GB",null,null,null,null,null,null,null,null,"Memoria Totale","Prezzo Totale Memorie","Memory Cartridge Totali","DIMM Slot",32,16,16]
[64,{"$f":"\"\"","v":""},{"$f":"\"\"","v":""},{"$f":"\"\"","v":""},{"$f":"\"\"","v":""},{"$f":"\"\"","v":""},{"$f":"\"\"","v":""},"HPE 16GB 2Rx4 PC4-2400T-R Kit",4,"836220-B21",{"$f":"\"\"","v":""},{"$f":"\"\"","v":""},{"$f":"\"\"","v":""},{"$f":"\"\"","v":""},{"$f":"\"\"","v":""},{"$f":"\"\"","v":""},"HP DL580 Gen9 12 DIMMs Memory Cartridge","788360-B21",2,{"$f":"A50","v":64},null,{"$f":"S50","v":2},{"$f":"AA50","v":4},{"$f":"IF(L50=\"\",0,L50)","v":0},{"$f":"IF(I50=\"\",0,I50)","v":4},{"$f":"IF(C50=\"\",0,C50)","v":0},{"$f":"SUM(X50:Z50)","v":4}]
[128,"HPE 16GB 2Rx4 PC4-2400T-R Kit",4,"10L2-16GB-U","S10L2-DL560-16GB-U","836220-B21",{"$f":"$G$3*C51","v":564},"HPE 16GB 2Rx4 PC4-2400T-R Kit",4,"836220-B21",{"$f":"\"\"","v":""},{"$f":"\"\"","v":""},{"$f":"\"\"","v":""},{"$f":"\"\"","v":""},{"$f":"\"\"","v":""},{"$f":"\"\"","v":""},"HP DL580 Gen9 12 DIMMs Memory Cartridge","788360-B21",2,128,null,{"$f":"S51","v":2},8,0,4,4,8]
[192,{"$f":"\"\"","v":""},{"$f":"\"\"","v":""},{"$f":"\"\"","v":""},{"$f":"\"\"","v":""},{"$f":"\"\"","v":""},{"$f":"\"\"","v":""},"HPE 16GB 2Rx4 PC4-2400T-R Kit",4,"836220-B21","HPE 32GB 2Rx4 PC4-2400T-R Kit",4,"10L2-32GB-U","S10L2-DL560-32GB-U","805351-B21",{"$f":"$G$4*L52","v":1280},"HP DL580 Gen9 12 DIMMs Memory Cartridge","788360-B21",2,192,null,2,8,4,4,0,8]
[256,"HPE 16GB 2Rx4 PC4-2400T-R Kit",4,"10L2-16GB-U","S10L2-DL560-16GB-U","836220-B21",{"$f":"$G$3*C53","v":564},"HPE 16GB 2Rx4 PC4-2400T-R Kit",4,"836220-B21","HPE 32GB 2Rx4 PC4-2400T-R Kit",4,"10L2-32GB-U","S10L2-DL560-32GB-U","805351-B21",1280,"HP DL580 Gen9 12 DIMMs Memory Cartridge","788360-B21",2,256,null,2,12,4,4,4,12]
[320,{"$f":"\"\"","v":""},{"$f":"\"\"","v":""},{"$f":"\"\"","v":""},{"$f":"\"\"","v":""},{"$f":"\"\"","v":""},{"$f":"\"\"","v":""},"HPE 16GB 2Rx4 PC4-2400T-R Kit",4,"836220-B21","HPE 32GB 2Rx4 PC4-2400T-R Kit",8,"10L2-32GB-U","S10L2-DL560-32GB-U","805351-B21",2560,"HP DL580 Gen9 12 DIMMs Memory Cartridge","788360-B21",2,320,null,2,12,8,4,0,12]
[384,"HPE 16GB 2Rx4 PC4-2400T-R Kit",4,"10L2-16GB-U","S10L2-DL560-16GB-U","836220-B21",{"$f":"$G$3*C55","v":564},"HPE 16GB 2Rx4 PC4-2400T-R Kit",4,"836220-B21","HPE 32GB 2Rx4 PC4-2400T-R Kit",8,"10L2-32GB-U","S10L2-DL560-32GB-U","805351-B21",2560,"HP DL580 Gen9 12 DIMMs Memory Cartridge","788360-B21",2,384,null,2,16,8,4,4,16]
[448,{"$f":"\"\"","v":""},{"$f":"\"\"","v":""},{"$f":"\"\"","v":""},{"$f":"\"\"","v":""},{"$f":"\"\"","v":""},{"$f":"\"\"","v":""},"HPE 16GB 2Rx4 PC4-2400T-R Kit",4,"836220-B21","HPE 32GB 2Rx4 PC4-2400T-R Kit",12,"10L2-32GB-U","S10L2-DL560-32GB-U","805351-B21",3840,"HP DL580 Gen9 12 DIMMs Memory Cartridge","788360-B21",2,448,null,2,16,12,4,0,16]
[512,"HPE 16GB 2Rx4 PC4-2400T-R Kit",4,"10L2-16GB-U","S10L2-DL560-16GB-U","836220-B21",{"$f":"$G$3*C57","v":564},"HPE 16GB 2Rx4 PC4-2400T-R Kit",4,"836220-B21","HPE 32GB 2Rx4 PC4-2400T-R Kit",12,"10L2-32GB-U","S10L2-DL560-32GB-U","805351-B21",3840,"HP DL580 Gen9 12 DIMMs Memory Cartridge","788360-B21",2,512,null,2,20,12,4,4,20]
[576,{"$f":"\"\"","v":""},{"$f":"\"\"","v":""},{"$f":"\"\"","v":""},{"$f":"\"\"","v":""},{"$f":"\"\"","v":""},{"$f":"\"\"","v":""},"HPE 16GB 2Rx4 PC4-2400T-R Kit",4,"836220-B21","HPE 32GB 2Rx4 PC4-2400T-R Kit",16,"10L2-32GB-U","S10L2-DL560-32GB-U","805351-B21",{"$f":"$G$4*L58","v":5120},"HP DL580 Gen9 12 DIMMs Memory Cartridge","788360-B21",2,576,null,2,20,16,4,0,20]
[640,"HPE 16GB 2Rx4 PC4-2400T-R Kit",4,"10L2-16GB-U","S10L2-DL560-16GB-U","836220-B21",{"$f":"$G$3*C59","v":564},"HPE 16GB 2Rx4 PC4-2400T-R Kit",4,"836220-B21","HPE 32GB 2Rx4 PC4-2400T-R Kit",16,"10L2-32GB-U","S10L2-DL560-32GB-U","805351-B21",5120,"HP DL580 Gen9 12 DIMMs Memory Cartridge","788360-B21",2,640,null,2,24,16,4,4,24]
[704,{"$f":"\"\"","v":""},{"$f":"\"\"","v":""},{"$f":"\"\"","v":""},{"$f":"\"\"","v":""},{"$f":"\"\"","v":""},{"$f":"\"\"","v":""},"HPE 16GB 2Rx4 PC4-2400T-R Kit",4,"836220-B21","HPE 32GB 2Rx4 PC4-2400T-R Kit",20,"10L2-32GB-U","S10L2-DL560-32GB-U","805351-B21",6400,"HP DL580 Gen9 12 DIMMs Memory Cartridge","788360-B21",2,704,null,2,24,20,4,0,24]
[768,{"$f":"\"\"","v":""},{"$f":"\"\"","v":""},{"$f":"\"\"","v":""},{"$f":"\"\"","v":""},{"$f":"\"\"","v":""},{"$f":"\"\"","v":""},{"$f":"\"\"","v":""},{"$f":"\"\"","v":""},{"$f":"\"\"","v":""},"HPE 32GB 2Rx4 PC4-2400T-R Kit",24,"10L2-32GB-U","S10L2-DL560-32GB-U","805351-B21",7680,"HP DL580 Gen9 12 DIMMs Memory Cartridge","788360-B21",2,768,null,2,24,24,0,0,24]
[896,"HPE 16GB 2Rx4 PC4-2400T-R Kit",4,"10L2-16GB-U","S10L2-DL560-16GB-U","836220-B21",{"$f":"$G$3*C62","v":564},"HPE 16GB 2Rx4 PC4-2400T-R Kit",4,"836220-B21","HPE 32GB 2Rx4 PC4-2400T-R Kit",24,"10L2-32GB-U","S10L2-DL560-32GB-U","805351-B21",7680,"HP DL580 Gen9 12 DIMMs Memory Cartridge","788360-B21",4,896,null,4,32,24,4,4,32]
[1024,"HPE 16GB 2Rx4 PC4-2400T-R Kit",12,"10L2-16GB-U","S10L2-DL560-16GB-U","836220-B21",1692,"HPE 16GB 2Rx4 PC4-2400T-R Kit",4,"836220-B21","HPE 32GB 2Rx4 PC4-2400T-R Kit",24,"10L2-32GB-U","S10L2-DL560-32GB-U","805351-B21",7680,"HP DL580 Gen9 12 DIMMs Memory Cartridge","788360-B21",4,1024,null,4,40,24,4,12,40]
[1152,"HPE 16GB 2Rx4 PC4-2400T-R Kit",4,"10L2-16GB-U","S10L2-DL560-16GB-U","836220-B21",{"$f":"$G$3*C64","v":564},"HPE 16GB 2Rx4 PC4-2400T-R Kit",4,"836220-B21","HPE 32GB 2Rx4 PC4-2400T-R Kit",32,"10L2-32GB-U","S10L2-DL560-32GB-U","805351-B21",{"$f":"$G$4*L64","v":10240},"HP DL580 Gen9 12 DIMMs Memory Cartridge","788360-B21",4,1152,null,4,40,32,4,4,40]
[1280,"HPE 16GB 2Rx4 PC4-2400T-R Kit",12,"10L2-16GB-U","S10L2-DL560-16GB-U","836220-B21",{"$f":"$G$3*C65","v":1692},"HPE 16GB 2Rx4 PC4-2400T-R Kit",4,"836220-B21","HPE 32GB 2Rx4 PC4-2400T-R Kit",32,"10L2-32GB-U","S10L2-DL560-32GB-U","805351-B21",10240,"HP DL580 Gen9 12 DIMMs Memory Cartridge","788360-B21",4,1280,null,4,48,32,4,12,48]
[1408,"HPE 16GB 2Rx4 PC4-2400T-R Kit",4,"10L2-16GB-U","S10L2-DL560-16GB-U","836220-B21",{"$f":"$G$3*C66","v":564},"HPE 16GB 2Rx4 PC4-2400T-R Kit",4,"836220-B21","HPE 32GB 2Rx4 PC4-2400T-R Kit",40,"10L2-32GB-U","S10L2-DL560-32GB-U","805351-B21",12800,"HP DL580 Gen9 12 DIMMs Memory Cartridge","788360-B21",4,1408,null,4,48,40,4,4,48]
[1536,{"$f":"\"\"","v":""},{"$f":"\"\"","v":""},{"$f":"\"\"","v":""},{"$f":"\"\"","v":""},{"$f":"\"\"","v":""},{"$f":"\"\"","v":""},{"$f":"\"\"","v":""},{"$f":"\"\"","v":""},{"$f":"\"\"","v":""},"HPE 32GB 2Rx4 PC4-2400T-R Kit",48,"10L2-32GB-U","S10L2-DL560-32GB-U","805351-B21",15360,"HP DL580 Gen9 12 DIMMs Memory Cartridge","788360-B21",4,1536,null,4,48,48,0,0,48]
["4CPU"]
[128,"HPE 16GB 2Rx4 PC4-2400T-R Kit",4,"10L2-16GB-U","S10L2-DL560-16GB-U","836220-B21",{"$f":"$G$3*C69","v":564},"HPE 16GB 2Rx4 PC4-2400T-R Kit",4,"836220-B21",{"$f":"\"\"","v":""},{"$f":"\"\"","v":""},{"$f":"\"\"","v":""},{"$f":"\"\"","v":""},{"$f":"\"\"","v":""},{"$f":"\"\"","v":""},"HP DL580 Gen9 12 DIMMs Memory Cartridge","788360-B21",4,{"$f":"A69","v":128},null,4,{"$f":"AA69","v":8},{"$f":"IF(L69=\"\",0,L69)","v":0},{"$f":"IF(I69=\"\",0,I69)","v":4},{"$f":"IF(C69=\"\",0,C69)","v":4},{"$f":"SUM(X69:Z69)","v":8}]
[256,"HPE 16GB 2Rx4 PC4-2400T-R Kit",12,"10L2-16GB-U","S10L2-DL560-16GB-U","836220-B21",1692,"HPE 16GB 2Rx4 PC4-2400T-R Kit",4,"836220-B21",{"$f":"\"\"","v":""},{"$f":"\"\"","v":""},{"$f":"\"\"","v":""},{"$f":"\"\"","v":""},{"$f":"\"\"","v":""},{"$f":"\"\"","v":""},"HP DL580 Gen9 12 DIMMs Memory Cartridge","788360-B21",4,256,null,4,16,0,4,12,16]
[384,"HPE 16GB 2Rx4 PC4-2400T-R Kit",4,"10L2-16GB-U","S10L2-DL560-16GB-U","836220-B21",564,"HPE 16GB 2Rx4 PC4-2400T-R Kit",4,"836220-B21","HPE 32GB 2Rx4 PC4-2400T-R Kit",8,"10L2-32GB-U","S10L2-DL560-32GB-U","805351-B21",{"$f":"$G$4*L71","v":2560},"HP DL580 Gen9 12 DIMMs Memory Cartridge","788360-B21",4,384,null,4,16,8,4,4,16]
[512,"HPE 16GB 2Rx4 PC4-2400T-R Kit",12,"10L2-16GB-U","S10L2-DL560-16GB-U","836220-B21",1692,"HPE 16GB 2Rx4 PC4-2400T-R Kit",4,"836220-B21","HPE 32GB 2Rx4 PC4-2400T-R Kit",8,"10L2-32GB-U","S10L2-DL560-32GB-U","805351-B21",{"$f":"$G$4*L72","v":2560},"HP DL580 Gen9 12 DIMMs Memory Cartridge","788360-B21",4,512,null,4,24,8,4,12,24]
[640,"HPE 16GB 2Rx4 PC4-2400T-R Kit",4,"10L2-16GB-U","S10L2-DL560-16GB-U","836220-B21",564,"HPE 16GB 2Rx4 PC4-2400T-R Kit",4,"836220-B21","HPE 32GB 2Rx4 PC4-2400T-R Kit",16,"10L2-32GB-U","S10L2-DL560-32GB-U","805351-B21",{"$f":"$G$4*L73","v":5120},"HP DL580 Gen9 12 DIMMs Memory Cartridge","788360-B21",4,640,null,4,24,16,4,4,24]
[768,"HPE 16GB 2Rx4 PC4-2400T-R Kit",12,"10L2-16GB-U","S10L2-DL560-16GB-U","836220-B21",1692,"HPE 16GB 2Rx4 PC4-2400T-R Kit",4,"836220-B21","HPE 32GB 2Rx4 PC4-2400T-R Kit",16,"10L2-32GB-U","S10L2-DL560-32GB-U","805351-B21",{"$f":"$G$4*L74","v":5120},"HP DL580 Gen9 12 DIMMs Memory Cartridge","788360-B21",4,768,null,4,32,16,4,12,32]
[896,"HPE 16GB 2Rx4 PC4-2400T-R Kit",4,"10L2-16GB-U","S10L2-DL560-16GB-U","836220-B21",564,"HPE 16GB 2Rx4 PC4-2400T-R Kit",4,"836220-B21","HPE 32GB 2Rx4 PC4-2400T-R Kit",24,"10L2-32GB-U","S10L2-DL560-32GB-U","805351-B21",{"$f":"$G$4*L75","v":7680},"HP DL580 Gen9 12 DIMMs Memory Cartridge","788360-B21",4,896,null,4,32,24,4,4,32]
[1024,"HPE 16GB 2Rx4 PC4-2400T-R Kit",12,"10L2-16GB-U","S10L2-DL560-16GB-U","836220-B21",{"$f":"$G$3*C76","v":1692},"HPE 16GB 2Rx4 PC4-2400T-R Kit",4,"836220-B21","HPE 32GB 2Rx4 PC4-2400T-R Kit",24,"10L2-32GB-U","S10L2-DL560-32GB-U","805351-B21",7680,"HP DL580 Gen9 12 DIMMs Memory Cartridge","788360-B21",4,1024,null,4,40,24,4,12,40]
[1152,"HPE 16GB 2Rx4 PC4-2400T-R Kit",4,"10L2-16GB-U","S10L2-DL560-16GB-U","836220-B21",{"$f":"$G$3*C77","v":564},"HPE 16GB 2Rx4 PC4-2400T-R Kit",4,"836220-B21","HPE 32GB 2Rx4 PC4-2400T-R Kit",32,"10L2-32GB-U","S10L2-DL560-32GB-U","805351-B21",{"$f":"$G$4*L77","v":10240},"HP DL580 Gen9 12 DIMMs Memory Cartridge","788360-B21",4,1152,null,4,40,32,4,4,40]
[1280,"HPE 16GB 2Rx4 PC4-2400T-R Kit",12,"10L2-16GB-U","S10L2-DL560-16GB-U","836220-B21",{"$f":"$G$3*C78","v":1692},"HPE 16GB 2Rx4 PC4-2400T-R Kit",4,"836220-B21","HPE 32GB 2Rx4 PC4-2400T-R Kit",32,"10L2-32GB-U","S10L2-DL560-32GB-U","805351-B21",10240,"HP DL580 Gen9 12 DIMMs Memory Cartridge","788360-B21",4,1280,null,4,48,32,4,12,48]
[1408,"HPE 16GB 2Rx4 PC4-2400T-R Kit",4,"10L2-16GB-U","S10L2-DL560-16GB-U","836220-B21",{"$f":"$G$3*C79","v":564},"HPE 16GB 2Rx4 PC4-2400T-R Kit",4,"836220-B21","HPE 32GB 2Rx4 PC4-2400T-R Kit",40,"10L2-32GB-U","S10L2-DL560-32GB-U","805351-B21",12800,"HP DL580 Gen9 12 DIMMs Memory Cartridge","788360-B21",4,1408,null,4,48,40,4,4,48]
[1536,{"$f":"\"\"","v":""},{"$f":"\"\"","v":""},{"$f":"\"\"","v":""},{"$f":"\"\"","v":""},{"$f":"\"\"","v":""},{"$f":"\"\"","v":""},{"$f":"\"\"","v":""},{"$f":"\"\"","v":""},{"$f":"\"\"","v":""},"HPE 32GB 2Rx4 PC4-2400T-R Kit",48,"10L2-32GB-U","S10L2-DL560-32GB-U","805351-B21",15360,"HP DL580 Gen9 12 DIMMs Memory Cartridge","788360-B21",4,1536,null,4,48,48,0,0,48]
[1792,"HPE 16GB 2Rx4 PC4-2400T-R Kit",12,"10L2B-16GB","S10L2-DL560-16GB-U","836220-B21",{"$f":"$G$3*C81","v":1692},"HPE 16GB 2Rx4 PC4-2400T-R Kit",4,"836220-B21","HPE 32GB 2Rx4 PC4-2400T-R Kit",48,"10L2-32GB-U","S10L2-DL560-32GB-U","805351-B21",{"$f":"$G$4*L81","v":15360},"HP DL580 Gen9 12 DIMMs Memory Cartridge","788360-B21",8,{"$f":"A81","v":1792},null,8,{"$f":"AA81","v":64},{"$f":"IF(L81=\"\",0,L81)","v":48},{"$f":"IF(I81=\"\",0,I81)","v":4},{"$f":"IF(C81=\"\",0,C81)","v":12},{"$f":"SUM(X81:Z81)","v":64}]
[2048,"HPE 16GB 2Rx4 PC4-2400T-R Kit",28,"10L2B-16GB","S10L2-DL560-16GB-U","836220-B21",{"$f":"$G$3*C82","v":3948},"HPE 16GB 2Rx4 PC4-2400T-R Kit",4,"836220-B21","HPE 32GB 2Rx4 PC4-2400T-R Kit",48,"10L2-32GB-U","S10L2-DL560-32GB-U","805351-B21",{"$f":"$G$4*L82","v":15360},"HP DL580 Gen9 12 DIMMs Memory Cartridge","788360-B21",8,{"$f":"A82","v":2048},null,8,80,48,4,28,80]
[2304,"HPE 16GB 2Rx4 PC4-2400T-R Kit",12,"10L2B-16GB","S10L2-DL560-16GB-U","836220-B21",{"$f":"$G$3*C83","v":1692},"HPE 16GB 2Rx4 PC4-2400T-R Kit",4,"836220-B21","HPE 32GB 2Rx4 PC4-2400T-R Kit",64,"10L2-32GB-U","S10L2-DL560-32GB-U","805351-B21",{"$f":"$G$4*L83","v":20480},"HP DL580 Gen9 12 DIMMs Memory Cartridge","788360-B21",8,2304,null,8,80,64,4,12,80]
[2560,"HPE 16GB 2Rx4 PC4-2400T-R Kit",28,"10L2B-16GB","S10L2-DL560-16GB-U","836220-B21",{"$f":"$G$3*C84","v":3948},"HPE 16GB 2Rx4 PC4-2400T-R Kit",4,"836220-B21","HPE 32GB 2Rx4 PC4-2400T-R Kit",64,"10L2-32GB-U","S10L2-DL560-32GB-U","805351-B21",{"$f":"$G$4*L84","v":20480},"HP DL580 Gen9 12 DIMMs Memory Cartridge","788360-B21",8,2560,null,8,96,64,4,28,96]
[2816,"HPE 16GB 2Rx4 PC4-2400T-R Kit",12,"10L2B-16GB","S10L2-DL560-16GB-U","836220-B21",{"$f":"$G$3*C85","v":1692},"HPE 16GB 2Rx4 PC4-2400T-R Kit",4,"836220-B21","HPE 32GB 2Rx4 PC4-2400T-R Kit",80,"10L2-32GB-U","S10L2-DL560-32GB-U","805351-B21",{"$f":"$G$4*L85","v":25600},"HP DL580 Gen9 12 DIMMs Memory Cartridge","788360-B21",8,2816,null,8,96,80,4,12,96]
[3072,null,null,null,null,null,null,null,null,null,"HPE 32GB 2Rx4 PC4-2400T-R Kit",96,"10L2-32GB-U","S10L2-DL560-32GB-U","805351-B21",{"$f":"$G$4*L86","v":30720},"HP DL580 Gen9 12 DIMMs Memory Cartridge","788360-B21",8,3072,null,8,96,96,0,0,96]
[]
[]
["1CPU","MEMORY C"]
[32]
[64]
[128]
[160]
[192]
[256]
["2CPU"]
[32]
[64]
[128]
[160]
[192]
[256]
[320]
[384]
[512]
[]
[]
[]
[]
[]
[]
[]
[null,null,null,null,null,null,null,null,null,null,null,null,"44GB8"]

{"sheet":"Operating System","index":11,"n_rows":19,"n_cols":18,"rows_kept":19,"cut":false,"hidden":true,"merged":[[0,1,0,2]]}
["Operating System"]
["DL560"]
["No Operating System",{"$f":"\"\"","v":""},{"$f":"\"\"","v":""},{"$f":"\"\"","v":""},{"$f":"\"\"","v":""},{"$f":"\"\"","v":""},"None",{"$f":"\"\"","v":""},{"$f":"\"\"","v":""},{"$f":"\"\"","v":""},{"$f":"\"\"","v":""},null,"None",{"$f":"\"\"","v":""},{"$f":"\"\"","v":""},{"$f":"\"\"","v":""},{"$f":"\"\"","v":""}]
["Kit Windows Server 2012 R2, Standard Edition, 2 Socket, 2VM, ROK",1,"10L2-WIN1","S10L2-DL560-WIN1","748921-B21",540,"1-pack of Windows Server 2012 User CALs (Standard or Datacenter)",1,"10L2-CALUSER","S10L2-DL560-USR","701608-A21",24,"1-pack of Windows Server 2012 Device CALs (Standard or Datacenter)",1,"10L2-CALDEV","S10L2-DL560-DEV","701609-A21",22]
["Kit Windows Server 2012 R2, Datacenter Edition, 2 Socket, ROK",1,"10L2-WINDC1","S10L2-DL560-WINDC1","748922-B21",2440,"1-pack of Windows Server 2012 User CALs (Standard or Datacenter)",1,"10L2-CALUSER","S10L2-DL560-USR","701608-A21",24,"1-pack of Windows Server 2012 Device CALs (Standard or Datacenter)",1,"10L2-CALDEV","S10L2-DL560-DEV","701609-A21",22]
["CentOS 7.0",1,"10L2-LINUX","S10L2-DL560-LINUX",{"$f":"\"\"","v":""},45,"None",{"$f":"\"\"","v":""},{"$f":"\"\"","v":""},{"$f":"\"\"","v":""},{"$f":"\"\"","v":""},null,"None",{"$f":"\"\"","v":""},{"$f":"\"\"","v":""},{"$f":"\"\"","v":""},{"$f":"\"\"","v":""}]
[]
[]
["R730xd"]
["No Operating System",{"$f":"\"\"","v":""},{"$f":"\"\"","v":""},{"$f":"\"\"","v":""},{"$f":"\"\"","v":""},{"$f":"\"\"","v":""},"None",{"$f":"\"\"","v":""},{"$f":"\"\"","v":""},{"$f":"\"\"","v":""},{"$f":"\"\"","v":""},null,"None",{"$f":"\"\"","v":""},{"$f":"\"\"","v":""},{"$f":"\"\"","v":""},{"$f":"\"\"","v":""}]
["Kit Windows Server 2012 R2, Standard Edition, 2 Socket, 2VM, ROK",1,"10L2-WIN1","S10L2-DL580-WIN1","748921-B21",540,"1-pack of Windows Server 2012 User CALs (Standard or Datacenter)",1,"10L2-CALUSER","S10L2-DL580-USR","701608-A21",24,"1-pack of Windows Server 2012 Device CALs (Standard or Datacenter)",1,"10L2-CALDEV","S10L2-DL580-DEV","701609-A21",22]
["Kit Windows Server 2012 R2, Datacenter Edition, 2 Socket, ROK",1,"10L2-WINDC1","S10L2-DL580-WINDC1","748922-B21",2440,"1-pack of Windows Server 2012 User CALs (Standard or Datacenter)",1,"10L2-CALUSER","S10L2-DL580-USR","701608-A21",24,"1-pack of Windows Server 2012 Device CALs (Standard or Datacenter)",1,"10L2-CALDEV","S10L2-DL580-DEV","701609-A21",22]
["CentOS 7.0",1,"10L2-LINUX","S10L2-DL580-LINUX",{"$f":"\"\"","v":""},45,"None",{"$f":"\"\"","v":""},{"$f":"\"\"","v":""},{"$f":"\"\"","v":""},{"$f":"\"\"","v":""},null,"None",{"$f":"\"\"","v":""},{"$f":"\"\"","v":""},{"$f":"\"\"","v":""},{"$f":"\"\"","v":""}]
[]
[]
["T630"]
["No Operating System",{"$f":"\"\"","v":""},{"$f":"\"\"","v":""},{"$f":"\"\"","v":""},"[611-BBBF]",{"$f":"\"\"","v":""},"None",{"$f":"\"\"","v":""},{"$f":"\"\"","v":""},{"$f":"\"\"","v":""},{"$f":"\"\"","v":""},null,"None",{"$f":"\"\"","v":""},{"$f":"\"\"","v":""},{"$f":"\"\"","v":""},{"$f":"\"\"","v":""}]
["Kit Windows Server 2012, Standard Edition, 2 Socket, 2VM, ROK, COA + Media",1,"10L1-WIN","S10L1-T630-WIN","[638-BBBD]",505,"1-pack of Windows Server 2012 User CALs (Standard or Datacenter)",1,"10L1-CALUSER","S10L1-T630-USR","[618-10778]",25,"1-pack of Windows Server 2012 Device CALs (Standard or Datacenter)",1,"10L1-CALDEV","S10L1-T630-DEV","[618-10777]",25]
["CentOS 7.0",1,"10L1-LINUX","S10L1-T630-LINUX",{"$f":"\"\"","v":""},45,"None",{"$f":"\"\"","v":""},{"$f":"\"\"","v":""},{"$f":"\"\"","v":""},{"$f":"\"\"","v":""},null,"None",{"$f":"\"\"","v":""},{"$f":"\"\"","v":""},{"$f":"\"\"","v":""},{"$f":"\"\"","v":""}]

{"sheet":"HDD","index":12,"n_rows":187,"n_cols":15,"rows_kept":187,"cut":false,"hidden":true,"merged":[]}
["Hard Drives"]
["DL560"]
["HP 300GB 12G SAS 15K 2.5in SC ENT HDD",null,"10L2-HDD300GB","S10L2-DL560-HDD300","759208-B21",140]
["HP 1TB 6G SAS 7.2K 2.5in SC MDL HDD",null,"10L2-HDD1TB","S10L2-DL560-HDD1000","652749-B21",278]
[null,"DL560","DL560 2","DL560 3"]
["HDD max",8,8,8]
["HDD 300GB Base",2,2,2,"Hot Spare for 300GB HDD",{"$f":"'Server10 Lotto2 DL560'!$C$66","v":"No"},{"$f":"IF(F7=\"Yes\",1,0)","v":0},{"$f":"'Server10 Lotto2 DL560 2'!$C$66","v":"No"},{"$f":"IF(H7=\"Yes\",1,0)","v":0},{"$f":"'Server10 Lotto2 DL560 3'!$C$66","v":"No"},{"$f":"IF(J7=\"Yes\",1,0)","v":0}]
["HDD 300GB Selected",{"$f":"'Server10 Lotto2 DL560'!$C$60","v":0},{"$f":"'Server10 Lotto2 DL560 2'!$C$60","v":0},{"$f":"'Server10 Lotto2 DL560 2'!$C$60","v":0}]
["HP 300GB 12G SAS 15K 2.5in SC ENT HDD",0,0,0]
[null,1,1,1]
[null,2,2,2]
[null,3,3,3]
[null,4,4,4]
[null,5,5,5]
[null,6,6,6]
["HDD max",8,8,8]
["HDD 300GB",{"$f":"B7+B8","v":2},{"$f":"C7+C8","v":2},2]
["HDD 1TB Selected",{"$f":"'Server10 Lotto2 DL560'!$C$62","v":0},{"$f":"'Server10 Lotto2 DL560 2'!$C$62","v":0},{"$f":"'Server10 Lotto2 DL560 3'!$C$62","v":0},"Hot Spare for 1TB HDD",{"$f":"'Server10 Lotto2 DL560'!$C$70","v":"No"},{"$f":"IF(F18=\"Yes\",1,0)","v":0},{"$f":"'Server10 Lotto2 DL560 2'!$C$70","v":"No"},{"$f":"IF(H18=\"Yes\",1,0)","v":0},{"$f":"'Server10 Lotto2 DL560 3'!$C$70","v":"No"},{"$f":"IF(J18=\"Yes\",1,0)","v":0}]
["HP 1TB 6G SAS 7.2K 2.5in SC MDL HDD",{"$f":"B$6-B$7-B$8","v":6},{"$f":"C$6-C$7-C$8","v":6},6]
[null,{"$f":"IF(B19-1<1,0,B19-1)","v":5},5,5]
[null,4,4,4]
[null,3,3,3]
[null,2,2,2]
[null,1,1,1]
[null,0,0,0]
[null,0]
[null,0]
[]
["Hot Spare","Yes"]
[null,"No"]
[]
["RAID Configuration",null,null,"HDD 300GB DL560",null,"HDD 1TB DL560",null,"HDD 300GB DL560 2",null,"HDD 1TB DL560 2",null,"HDD 300GB DL560 3",null,"HDD 1TB DL560 3"]
["RAID Personalizzato",{"$f":"IF($B$106<=8,0,\"\")","v":0},{"$f":"\"\"","v":""},{"$f":"IF($G$7=0,A33,\"\")","v":"RAID Personalizzato"},{"$f":"IF($G$7=0,C33,\"\")","v":""},{"$f":"IF($G$18=0,A33,\"\")","v":"RAID Personalizzato"},{"$f":"IF($G$18=0,C33,\"\")","v":""},{"$f":"IF(I7=0,$A$33,\"\")","v":"RAID Personalizzato"},{"$f":"IF(I7=0,$C$33,\"\")","v":""},{"$f":"IF(I18=0,$A$33,\"\")","v":"RAID Personalizzato"},{"$f":"IF(I18=0,$C$33,\"\")","v":""},{"$f":"IF(K7=0,$A$33,\"\")","v":"RAID Personalizzato"},{"$f":"IF(K7=0,$C$33,\"\")","v":""},{"$f":"IF(K18=0,$A$33,\"\")","v":"RAID Personalizzato"},{"$f":"IF(K18=0,$C$33,\"\")","v":""}]
["RAID non Configurato (1-8 HDDs)",1,{"$f":"\"\"","v":""},{"$f":"IF($G$7=0,A34,\"\")","v":"RAID non Configurato (1-8 HDDs)"},{"$f":"IF($G$7=0,C34,\"\")","v":""},{"$f":"IF($G$18=0,A34,\"\")","v":"RAID non Configurato (1-8 HDDs)"},{"$f":"IF($G$18=0,C34,\"\")","v":""},{"$f":"IF(I7=0,$A$34,\"\")","v":"RAID non Configurato (1-8 HDDs)"},{"$f":"IF(I7=0,$C$34,\"\")","v":""},{"$f":"IF(I18=0,$A$34,\"\")","v":"RAID non Configurato (1-8 HDDs)"},{"$f":"IF(I18=0,$C$34,\"\")","v":""},{"$f":"IF(K7=0,$A$34,\"\")","v":"RAID non Configurato (1-8 HDDs)"},{"$f":"IF(K7=0,$C$34,\"\")","v":""},{"$f":"IF(K18=0,$A$34,\"\")","v":"RAID non Configurato (1-8 HDDs)"},{"$f":"IF(K18=0,$C$34,\"\")","v":""}]
["RAID 0 (1-8 HDDs)",1,{"$f":"\"\"","v":""},{"$f":"IF($G$7=0,A35,\"\")","v":"RAID 0 (1-8 HDDs)"},{"$f":"IF($G$7=0,C35,\"\")","v":""},{"$f":"IF($G$18=0,A35,\"\")","v":"RAID 0 (1-8 HDDs)"},{"$f":"IF($G$18=0,C35,\"\")","v":""},{"$f":"IF(I7=0,$A$35,\"\")","v":"RAID 0 (1-8 HDDs)"},{"$f":"IF(I7=0,$C$35,\"\")","v":""},{"$f":"IF(I18=0,$A$35,\"\")","v":"RAID 0 (1-8 HDDs)"},{"$f":"IF(I18=0,$C$35,\"\")","v":""},{"$f":"IF(K7=0,$A$35,\"\")","v":"RAID 0 (1-8 HDDs)"},{"$f":"IF(K7=0,$C$35,\"\")","v":""},{"$f":"IF(K18=0,$A$35,\"\")","v":"RAID 0 (1-8 HDDs)"},{"$f":"IF(K18=0,$C$35,\"\")","v":""}]
["RAID 1  (2 HDDs)",1,{"$f":"\"\"","v":""},{"$f":"IF($B$7+$B$8-$G$7=2,A36,\"\")","v":"RAID 1  (2 HDDs)"},{"$f":"IF($B$7+$B$8-$G$7=2,C36,\"\")","v":""},{"$f":"IF($B$18-$G$18=2,A36,\"\")","v":""},{"$f":"IF($B$18-$G$18=2,C36,\"\")","v":""},{"$f":"IF($C$7+$C$8-I7=2,$A$36,\"\")","v":"RAID 1  (2 HDDs)"},{"$f":"IF($C$7+$C$8-I7=2,$C$36,\"\")","v":""},{"$f":"IF($C$18-I18=2,A36,\"\")","v":""},{"$f":"IF($C$18-I18=2,$C$36,\"\")","v":""},{"$f":"IF($C$7+$C$8-K7=2,$A$36,\"\")","v":"RAID 1  (2 HDDs)"},{"$f":"IF($C$7+$C$8-K7=2,$C$36,\"\")","v":""},{"$f":"IF($C$18-M18=2,E36,\"\")","v":""},{"$f":"IF($D$18-K18=2,$C$36,\"\")","v":""}]
["RAID 5 (da 3 a 10 HDDs)",1,{"$f":"\"\"","v":""},{"$f":"IF($B$7+$B$8-$G$7>=3,A37,\"\")","v":""},{"$f":"IF($B$7+$B$8-$G$7>=3,C37,\"\")","v":""},{"$f":"IF($B$18-$G$18>=3,A37,\"\")","v":""},{"$f":"IF($B$18-$G$18>=3,C37,\"\")","v":""},{"$f":"IF($C$7+$C$8-I7>=3,$A$37,\"\")","v":""},{"$f":"IF($C$7+$C$8-I7>=3,$C$37,\"\")","v":""},{"$f":"IF($C$18-I18>=3,$A$37,\"\")","v":""},{"$f":"IF($C$18-I18>=3,$C$37,\"\")","v":""},{"$f":"IF($D$7+$D$8-K7>=3,$A$37,\"\")","v":""},{"$f":"IF($D$7+$D$8-K7>=3,$C$37,\"\")","v":""},{"$f":"IF($D$18-K18>=3,$A$37,\"\")","v":""},{"$f":"IF($D$18-K18>=3,$C$37,\"\")","v":""}]
["RAID 10 (4-8 HDDs in pairs) ",1,{"$f":"\"\"","v":""},{"$f":"IF($B$7+$B$8-$G$7=4,A38,\"\")","v":""},{"$f":"IF($B$7+$B$8-$G$7=4,C38,\"\")","v":""},{"$f":"IF($B$18-$G$18=4,A38,\"\")","v":""},{"$f":"IF($B$18-$G$18=4,C38,\"\")","v":""},{"$f":"IF($C$7+$C$8-I7=4,$A$38,\"\")","v":""},{"$f":"IF($C$7+$C$8-I7=4,$C$38,\"\")","v":""},{"$f":"IF($C$18-I18=4,$A$38,\"\")","v":""},{"$f":"IF($C$18-I18=4,$C$38,\"\")","v":""},{"$f":"IF($D$7+$D$8-K7=4,$A$38,\"\")","v":""},{"$f":"IF($D$7+$D$8-K7=4,$C$38,\"\")","v":""},{"$f":"IF($D$18-K18=4,$A$38,\"\")","v":""},{"$f":"IF($D$18-K18=4,$C$38,\"\")","v":""}]
["RAID 1+RAID 1 (2 + 2 HDDs) ",1,{"$f":"\"\"","v":""},{"$f":"IF($B$7+$B$8-$G$7=4,A39,\"\")","v":""},{"$f":"IF($B$7+$B$8-$G$7=4,C39,\"\")","v":""},{"$f":"IF($B$18-$G$18=4,A39,\"\")","v":""},{"$f":"IF($B$18-$G$18=4,C39,\"\")","v":""},{"$f":"IF($C$7+$C$8-I7=4,$A$39,\"\")","v":""},{"$f":"IF($C$7+$C$8-I7=4,$C$39,\"\")","v":""},{"$f":"IF($C$18-I18=4,A39,\"\")","v":""},{"$f":"IF($C$18-I18=4,$C$39,\"\")","v":""},{"$f":"IF($D$7+$D$8-K7=4,$A$39,\"\")","v":""},{"$f":"IF($D$7+$D$8-K7=4,$C$39,\"\")","v":""},{"$f":"IF($D$18-K18=4,A39,\"\")","v":""},{"$f":"IF($D$18-K18=4,$C$39,\"\")","v":""}]
["RAID 1+RAID 5 (2 + 3-8 HDDs)",1,{"$f":"\"\"","v":""},{"$f":"IF($B$7+$B$8-$G$7>=5,A40,\"\")","v":""},{"$f":"IF($B$7+$B$8-$G$7>=5,C40,\"\")","v":""},{"$f":"IF($B$18-$G$18>=5,A40,\"\")","v":""},{"$f":"IF($B$18-$G$18>=5,C40,\"\")","v":""},{"$f":"IF($C$7+$C$8-I7>=5,$A$40,\"\")","v":""},{"$f":"IF($C$7+$C$8-I7>=5,$C$40,\"\")","v":""},{"$f":"IF($C$18-I18>=5,$A$40,\"\")","v":""},{"$f":"IF($C$18-I18>=5,$C$40,\"\")","v":""},{"$f":"IF($D$7+$D$8-K7>=5,$A$40,\"\")","v":""},{"$f":"IF($D$7+$D$8-K7>=5,$C$40,\"\")","v":""},{"$f":"IF($D$18-K18>=5,$A$40,\"\")","v":""},{"$f":"IF($D$18-K18>=5,$C$40,\"\")","v":""}]
["RAID 1 + RAID 10 (2 + 4 HDDs in pairs) ",1,{"$f":"\"\"","v":""},{"$f":"IF($B$7+$B$8-$G$7=6,A41,\"\")","v":""},{"$f":"IF($B$7+$B$8-$G$7=6,C41,\"\")","v":""},{"$f":"IF($B$18-$G$18=6,A41,\"\")","v":""},{"$f":"IF($B$18-$G$18=6,C41,\"\")","v":""},{"$f":"IF($C$7+$C$8-I7=6,$A$41,\"\")","v":""},{"$f":"IF($C$7+$C$8-I7=6,$C$41,\"\")","v":""},{"$f":"IF($C$18-I18=6,A41,\"\")","v":""},{"$f":"IF($C$18-I18=6,$C$41,\"\")","v":""},{"$f":"IF($D$7+$D$8-M7=6,$A$41,\"\")","v":""},{"$f":"IF($D$7+$D$8-M7=6,$C$41,\"\")","v":""},{"$f":"IF($D$18-K18=6,A41,\"\")","v":""},{"$f":"IF($D$18-K18=6,$C$41,\"\")","v":""}]
[]
["R730xd"]
["HP 300GB 12G SAS 15K 2.5in SC ENT HDD",null,"10L2-HDD300GB","S10L2-DL580-HDD300","759208-B21",140]
["HP 1TB 6G SAS 7.2K 2.5in SC MDL HDD",null,"10L2-HDD1TB","S10L2-DL580-HDD1000","652749-B21",278]
[null,{"$f":"'Server10 Lotto2 DL580'!$C$66","v":"No"},{"$f":"'Server10 Lotto2 DL580 2'!$C$66","v":"No"},{"$f":"'Server10 Lotto2 DL580 3'!$C$66","v":"No"}]
["HDD max",10,10,10]
["HDD 300GB Base",2,2,2]
["Hot Spare for 300GB HDD",{"$f":"IF(B46=\"Yes\",1,0)","v":0},{"$f":"IF(C46=\"Yes\",1,0)","v":0},{"$f":"IF(D46=\"Yes\",1,0)","v":0}]
["HDD 300GB Selected",{"$f":"'Server10 Lotto2 DL580'!$C$60","v":0},{"$f":"'Server10 Lotto2 DL580 2'!$C$60","v":0},{"$f":"'Server10 Lotto2 DL580 3'!$C$60","v":0}]
["HP 300GB 12G SAS 15K 2.5in SC ENT HDD",0,0,0]
[null,1,1,1]
[null,2,2,2]
[null,3,3,3]
[null,4,4,4]
[null,5,5,5]
[null,6,6,6]
[null,7,7,7]
[null,8,8,8]
[]
[]
[]
[]
[]
[]
[null,{"$f":"'Server10 Lotto2 DL580'!$C$70","v":"No"},{"$f":"'Server10 Lotto2 DL580 2'!$C$70","v":"No"},{"$f":"'Server10 Lotto2 DL580 3'!$C$70","v":"No"}]
["HDD max",10,10,10]
["HDD 300GB",{"$f":"B48+B50","v":2},{"$f":"C48+C50","v":2},{"$f":"D48+D50","v":2}]
["Hot Spare for 1TB HDD",{"$f":"IF(B66=\"Yes\",1,0)","v":0},{"$f":"IF(C66=\"Yes\",1,0)","v":0},{"$f":"IF(D66=\"Yes\",1,0)","v":0}]
["HDD 1TB Selected",{"$f":"'Server10 Lotto2 DL580'!$C$62","v":0},{"$f":"'Server10 Lotto2 DL580 2'!$C$62","v":0},{"$f":"'Server10 Lotto2 DL580 3'!$C$62","v":0}]
["HP 1TB 6G SAS 7.2K 2.5in SC MDL HDD",{"$f":"$B$67-$B$68-$B$70","v":8},{"$f":"$C$67-$C$68-$C$70","v":8},{"$f":"$D$67-$D$68-$D$70","v":8}]
[null,{"$f":"IF(B71-1<1,0,B71-1)","v":7},7,{"$f":"IF(D71-1<1,0,D71-1)","v":7}]
[null,6,6,{"$f":"IF(D72-1<1,0,D72-1)","v":6}]
[null,5,5,{"$f":"IF(D73-1<1,0,D73-1)","v":5}]
[null,4,4,{"$f":"IF(D74-1<1,0,D74-1)","v":4}]
[null,3,3,{"$f":"IF(D75-1<1,0,D75-1)","v":3}]
[null,2,2,{"$f":"IF(D76-1<1,0,D76-1)","v":2}]
[null,1,1,{"$f":"IF(D77-1<1,0,D77-1)","v":1}]
[null,0,0,{"$f":"IF(D78-1<1,0,D78-1)","v":0}]
[]
[]
[]
[]
[]
[]
[]
[]
[]
["RAID Configuration",null,null,"HDD 300GB R730xd",null,"HDD 1TB R730xd",null,"HDD 300GB R730xd 2",null,"HDD 1TB R730xd 2",null,"HDD 300GB R730xd 3",null,"HDD 1TB R730xd 3"]
["RAID Personalizzato",{"$f":"IF($B$106<=8,0,\"\")","v":0},"[780-BBJC]",{"$f":"IF($B$49=0,A90,\"\")","v":"RAID Personalizzato"},{"$f":"IF($B$49=0,C90,\"\")","v":"[780-BBJC]"},{"$f":"IF($B$69=0,A90,\"\")","v":"RAID Personalizzato"},{"$f":"IF($B$69=0,C90,\"\")","v":"[780-BBJC]"},{"$f":"IF($C$49=0,A90,\"\")","v":"RAID Personalizzato"},{"$f":"IF($C$49=0,C90,\"\")","v":"[780-BBJC]"},{"$f":"IF($C$69=0,A90,\"\")","v":"RAID Personalizzato"},{"$f":"IF($C$69=0,C90,\"\")","v":"[780-BBJC]"},{"$f":"IF($D$49=0,A90,\"\")","v":"RAID Personalizzato"},{"$f":"IF($D$49=0,C90,\"\")","v":"[780-BBJC]"},{"$f":"IF($D$69=0,A90,\"\")","v":"RAID Personalizzato"},{"$f":"IF($D$69=0,C90,\"\")","v":"[780-BBJC]"}]
["RAID non Configurato (1-8 HDDs)",1,"[780-BBJD] ",{"$f":"IF($B$49=0,A91,\"\")","v":"RAID non Configurato (1-8 HDDs)"},{"$f":"IF($B$49=0,C91,\"\")","v":"[780-BBJD] "},{"$f":"IF($B$69=0,A91,\"\")","v":"RAID non Configurato (1-8 HDDs)"},{"$f":"IF($B$69=0,C91,\"\")","v":"[780-BBJD] "},{"$f":"IF($C$49=0,A91,\"\")","v":"RAID non Configurato (1-8 HDDs)"},{"$f":"IF($C$49=0,C91,\"\")","v":"[780-BBJD] "},{"$f":"IF($C$69=0,A91,\"\")","v":"RAID non Configurato (1-8 HDDs)"},{"$f":"IF($C$69=0,C91,\"\")","v":"[780-BBJD] "},{"$f":"IF($D$49=0,A91,\"\")","v":"RAID non Configurato (1-8 HDDs)"},{"$f":"IF($D$49=0,C91,\"\")","v":"[780-BBJD] "},{"$f":"IF($D$69=0,A91,\"\")","v":"RAID non Configurato (1-8 HDDs)"},{"$f":"IF($D$69=0,C91,\"\")","v":"[780-BBJD] "}]
["RAID 0 (1-8 HDDs)",1,"[780-BBJF]",{"$f":"IF($B$49=0,A92,\"\")","v":"RAID 0 (1-8 HDDs)"},{"$f":"IF($B$49=0,C92,\"\")","v":"[780-BBJF]"},{"$f":"IF($B$69=0,A92,\"\")","v":"RAID 0 (1-8 HDDs)"},{"$f":"IF($B$69=0,C92,\"\")","v":"[780-BBJF]"},{"$f":"IF($C$49=0,A92,\"\")","v":"RAID 0 (1-8 HDDs)"},{"$f":"IF($C$49=0,C92,\"\")","v":"[780-BBJF]"},{"$f":"IF($C$69=0,A92,\"\")","v":"RAID 0 (1-8 HDDs)"},{"$f":"IF($C$69=0,C92,\"\")","v":"[780-BBJF]"},{"$f":"IF($D$49=0,A92,\"\")","v":"RAID 0 (1-8 HDDs)"},{"$f":"IF($D$49=0,C92,\"\")","v":"[780-BBJF]"},{"$f":"IF($D$69=0,A92,\"\")","v":"RAID 0 (1-8 HDDs)"},{"$f":"IF($D$69=0,C92,\"\")","v":"[780-BBJF]"}]
["RAID 1  (2 HDDs)",1,"[780-BBJK]",{"$f":"IF($B$48+$B$50-$B$49=2,A93,\"\")","v":"RAID 1  (2 HDDs)"},{"$f":"IF($B$48+$B$50-$B$49=2,C93,\"\")","v":"[780-BBJK]"},{"$f":"IF($B$70-$B$69=2,A93,\"\")","v":""},{"$f":"IF($B$70-$B$69=2,C93,\"\")","v":""},{"$f":"IF($C$48+$C$50-$C$49=2,A93,\"\")","v":"RAID 1  (2 HDDs)"},{"$f":"IF($C$48+$C$50-$C$49=2,C93,\"\")","v":"[780-BBJK]"},{"$f":"IF($C$70-$C$69=2,A93,\"\")","v":""},{"$f":"IF($C$70-$C$69=2,C93,\"\")","v":""},{"$f":"IF($D$48+$D$50-$D$49=2,A93,\"\")","v":"RAID 1  (2 HDDs)"},{"$f":"IF($D$48+$D$50-$D$49=2,C93,\"\")","v":"[780-BBJK]"},{"$f":"IF($D$70-$D$69=2,A93,\"\")","v":""},{"$f":"IF($D$70-$D$69=2,C93,\"\")","v":""}]
["RAID 5 (da 3 a 10 HDDs)",1,"[780-BBJL]",{"$f":"IF($B$48+$B$50-$B$49>=3,A94,\"\")","v":""},{"$f":"IF($B$48+$B$50-$B$49>=3,C94,\"\")","v":""},{"$f":"IF($B$70-$B$69>=3,A94,\"\")","v":""},{"$f":"IF($B$70-$B$69>=3,C94,\"\")","v":""},{"$f":"IF($C$48+$C$50-$C$49>=3,A94,\"\")","v":""},{"$f":"IF($C$48+$C$50-$C$49>=3,C94,\"\")","v":""},{"$f":"IF($C$70-$C$69>=3,A94,\"\")","v":""},{"$f":"IF($C$70-$C$69>=3,C94,\"\")","v":""},{"$f":"IF($D$48+$D$50-$D$49>=3,A94,\"\")","v":""},{"$f":"IF($D$48+$D$50-$D$49>=3,C94,\"\")","v":""},{"$f":"IF($D$70-$D$69>=3,A94,\"\")","v":""},{"$f":"IF($D$70-$D$69>=3,C94,\"\")","v":""}]
["RAID 10 (4-8 HDDs in pairs) ",1,"[780-BBJN]",{"$f":"IF($B$48+$B$50-$B$49=4,A95,\"\")","v":""},{"$f":"IF($B$48+$B$50-$B$49=4,C95,\"\")","v":""},{"$f":"IF($B$70-$B$69=4,A95,\"\")","v":""},{"$f":"IF($B$70-$B$69=4,C95,\"\")","v":""},{"$f":"IF($C$48+$C$50-$C$49=4,A95,\"\")","v":""},{"$f":"IF($C$48+$C$50-$C$49=4,C95,\"\")","v":""},{"$f":"IF($C$70-$C$69=4,A95,\"\")","v":""},{"$f":"IF($C$70-$C$69=4,C95,\"\")","v":""},{"$f":"IF($D$48+$D$50-$D$49=4,A95,\"\")","v":""},{"$f":"IF($D$48+$D$50-$D$49=4,C95,\"\")","v":""},{"$f":"IF($D$70-$D$69=4,A95,\"\")","v":""},{"$f":"IF($D$70-$D$69=4,C95,\"\")","v":""}]
["RAID 1+RAID 1 (2 + 2 HDDs) ",1,"[780-BBJO]",{"$f":"IF($B$48+$B$50-$B$49=4,A96,\"\")","v":""},{"$f":"IF($B$48+$B$50-$B$49=4,C96,\"\")","v":""},{"$f":"IF($B$70-$B$69=4,A96,\"\")","v":""},{"$f":"IF($B$70-$B$69=4,C96,\"\")","v":""},{"$f":"IF($C$48+$C$50-$C$49=4,A96,\"\")","v":""},{"$f":"IF($C$48+$C$50-$C$49=4,C96,\"\")","v":""},{"$f":"IF($C$70-$C$69=4,A96,\"\")","v":""},{"$f":"IF($C$70-$C$69=4,C96,\"\")","v":""},{"$f":"IF($D$48+$D$50-$D$49=4,A96,\"\")","v":""},{"$f":"IF($D$48+$D$50-$D$49=4,C96,\"\")","v":""},{"$f":"IF($D$70-$D$69=4,A96,\"\")","v":""},{"$f":"IF($D$70-$D$69=4,C96,\"\")","v":""}]
["RAID 1+RAID 5 (2 + 3-8 HDDs)",1,"[780-BBJP]",{"$f":"IF($B$48+$B$50-$B$49>=5,A97,\"\")","v":""},{"$f":"IF($B$48+$B$50-$B$49>=5,C97,\"\")","v":""},{"$f":"IF($B$70-$B$69>=5,A97,\"\")","v":""},{"$f":"IF($B$70-$B$69>=5,C97,\"\")","v":""},{"$f":"IF($C$48+$C$50-$C$49>=5,A97,\"\")","v":""},{"$f":"IF($C$48+$C$50-$C$49>=5,C97,\"\")","v":""},{"$f":"IF($C$70-$C$69>=5,A97,\"\")","v":""},{"$f":"IF($C$70-$C$69>=5,C97,\"\")","v":""},{"$f":"IF($D$48+$D$50-$D$49>=5,A97,\"\")","v":""},{"$f":"IF($D$48+$D$50-$D$49>=5,C97,\"\")","v":""},{"$f":"IF($D$70-$D$69>=5,A97,\"\")","v":""},{"$f":"IF($D$70-$D$69>=5,C97,\"\")","v":""}]
["RAID 1 + RAID 10 (2 + 4 HDDs in pairs) ",1,"[780-BBJQ] ",{"$f":"IF($B$48+$B$50-$B$49=6,A98,\"\")","v":""},{"$f":"IF($B$48+$B$50-$B$49=6,C98,\"\")","v":""},{"$f":"IF($B$70-$B$69=6,A98,\"\")","v":""},{"$f":"IF($B$70-$B$69=6,C98,\"\")","v":""},{"$f":"IF($C$48+$C$50-$C$49=6,A98,\"\")","v":""},{"$f":"IF($C$48+$C$50-$C$49=6,C98,\"\")","v":""},{"$f":"IF($C$70-$C$69=6,A98,\"\")","v":""},{"$f":"IF($C$70-$C$69=6,C98,\"\")","v":""},{"$f":"IF($D$48+$D$50-$D$49=6,A98,\"\")","v":""},{"$f":"IF($D$48+$D$50-$D$49=6,C98,\"\")","v":""},{"$f":"IF($D$70-$D$69=6,A98,\"\")","v":""},{"$f":"IF($D$70-$D$69=6,C98,\"\")","v":""}]
[]
[]
[]
[]
[]
[]
["T630"]
["300GB 10K RPM SAS 12Gbps 2.5in Hot-plug Hard Drive,CusKit",null,"10L1-HDD300GB-T","S10L1-T630-HDD300","[400-AJOQ]",91]
["1TB 7.2K RPM NLSAS 6Gbps 2.5in Hot-plug Hard Drive,13G,CusKit",null,"10L1-HDD1TB","S10L1-T630-HDD1000","[400-AEFF]",296]
[]
["HDD max",32]
["HDD 300GB Base",2]
["HDD 300GB Selected",{"$f":"#REF!","v":{"$error":"#REF!"}}]
["300GB 10K RPM SAS 12Gbps 2.5in Hot-plug Hard Drive,CusKit",0,null,"Hot Spare for 300GB HDD",{"$f":"#REF!","v":{"$error":"#REF!"}},{"$f":"IF(E112=\"Yes\",1,0)","v":{"$error":"#REF!"}}]
[null,1]
[null,2]
[null,3]
[null,4]
[null,5]
[null,6]
[null,7]
[null,8]
[null,9]
[null,10]
[null,11]
[null,12]
[null,13]
[null,14]
[null,15]
[null,16]
[null,17]
[null,18]
[null,19]
[null,20]
[null,21]
[null,22]
[null,23]
[null,24]
[null,25]
[null,26]
[null,27]
[null,28]
[null,29]
[null,30]
["HDD max",32]
["HDD 300GB",{"$f":"B110+B111","v":{"$error":"#REF!"}}]
["HDD 1TB Selected",{"$f":"#REF!","v":{"$error":"#REF!"}},null,"Hot Spare for 1TB HDD",{"$f":"#REF!","v":{"$error":"#REF!"}},{"$f":"IF(E145=\"Yes\",1,0)","v":{"$error":"#REF!"}}]
["1TB 7.2K RPM NLSAS 6Gbps 2.5in Hot-plug Hard Drive,13G,CusKit",{"$f":"$B$143-$B$144-$B$145","v":{"$error":"#REF!"}}]
[null,{"$f":"IF(B146-1<1,0,B146-1)","v":{"$error":"#REF!"}}]
[null,{"$error":"#REF!"}]
[null,{"$error":"#REF!"}]
[null,{"$error":"#REF!"}]
[null,{"$error":"#REF!"}]
[null,{"$error":"#REF!"}]
[null,{"$error":"#REF!"}]
[null,{"$error":"#REF!"}]
[null,{"$f":"IF(B154-1<1,0,B154-1)","v":{"$error":"#REF!"}}]
[null,{"$error":"#REF!"}]
[null,{"$error":"#REF!"}]
[null,{"$error":"#REF!"}]
[null,{"$error":"#REF!"}]
[null,{"$error":"#REF!"}]
[null,{"$error":"#REF!"}]
[null,{"$error":"#REF!"}]
[null,{"$error":"#REF!"}]
[null,{"$error":"#REF!"}]
[null,{"$error":"#REF!"}]
[null,{"$error":"#REF!"}]
[null,{"$error":"#REF!"}]
[null,{"$error":"#REF!"}]
[null,{"$error":"#REF!"}]
[null,{"$error":"#REF!"}]
[null,{"$error":"#REF!"}]
[null,{"$error":"#REF!"}]
[null,{"$error":"#REF!"}]
[null,{"$error":"#REF!"}]
[null,{"$error":"#REF!"}]
[null,{"$error":"#REF!"}]
[]
["RAID Configuration",null,null,"HDD 300GB",null,"HDD 1TB"]
["C1 - No RAID for H330 (1-8 HDDs)",{"$f":"IF($B$106<=8,0,\"\")","v":0},"[780-BBJC]",{"$f":"IF($F$112=0,A179,\"\")","v":{"$error":"#REF!"}},{"$f":"IF($F$112=0,C179,\"\")","v":{"$error":"#REF!"}},{"$f":"IF($F$145=0,A179,\"\")","v":{"$error":"#REF!"}},{"$f":"IF($F$145=0,C179,\"\")","v":{"$error":"#REF!"}}]
["C10 - Unconfigured RAID for H330 (1-8 HDDs)",1,"[780-BBJD] ",{"$f":"IF($F$112=0,A180,\"\")","v":{"$error":"#REF!"}},{"$f":"IF($F$112=0,C180,\"\")","v":{"$error":"#REF!"}},{"$f":"IF($F$145=0,A180,\"\")","v":{"$error":"#REF!"}},{"$f":"IF($F$145=0,C180,\"\")","v":{"$error":"#REF!"}}]
["C2 - RAID 0 for H330 (1-8 HDDs)",1,"[780-BBJF]",{"$f":"IF($F$112=0,A181,\"\")","v":{"$error":"#REF!"}},{"$f":"IF($F$112=0,C181,\"\")","v":{"$error":"#REF!"}},{"$f":"IF($F$145=0,A181,\"\")","v":{"$error":"#REF!"}},{"$f":"IF($F$145=0,C181,\"\")","v":{"$error":"#REF!"}}]
["C3 - RAID 1 for H330 (2 HDDs)",1,"[780-BBJK]",{"$f":"IF($B$110+$B$111-$F$112=2,A182,\"\")","v":{"$error":"#REF!"}},{"$f":"IF($B$110+$B$111-$F$112=2,C182,\"\")","v":{"$error":"#REF!"}},{"$f":"IF($B$145-$F$145=2,A182,\"\")","v":{"$error":"#REF!"}},{"$f":"IF($B$145-$F$145=2,C182,\"\")","v":{"$error":"#REF!"}}]
["C4 - RAID 5 for H330 (3-8 HDDs)",1,"[780-BBJL]",{"$f":"IF($B$110+$B$111-$F$112>=3,A183,\"\")","v":{"$error":"#REF!"}},{"$f":"IF($B$110+$B$111-$F$112>=3,C183,\"\")","v":{"$error":"#REF!"}},{"$f":"IF($B$145-$F$145>=3,A183,\"\")","v":{"$error":"#REF!"}},{"$f":"IF($B$145-$F$145>=3,C183,\"\")","v":{"$error":"#REF!"}}]
["C6 - RAID 10 forH330 (4-8 HDDs in pairs) ",1,"[780-BBJN]",{"$f":"IF($B$110+$B$111-$F$112=4,A184,\"\")","v":{"$error":"#REF!"}},{"$f":"IF($B$110+$B$111-$F$112=4,C184,\"\")","v":{"$error":"#REF!"}},{"$f":"IF($B$145-$F$145=4,A184,\"\")","v":{"$error":"#REF!"}},{"$f":"IF($B$145-$F$145=4,C184,\"\")","v":{"$error":"#REF!"}}]
["C7 - RAID 1+RAID 1 for H330 (2 + 2 HDDs) ",1,"[780-BBJO]",{"$f":"IF($B$110+$B$111-$F$112=4,A185,\"\")","v":{"$error":"#REF!"}},{"$f":"IF($B$110+$B$111-$F$112=4,C185,\"\")","v":{"$error":"#REF!"}},{"$f":"IF($B$145-$F$145=4,A185,\"\")","v":{"$error":"#REF!"}},{"$f":"IF($B$145-$F$145=4,C185,\"\")","v":{"$error":"#REF!"}}]
["C8 - RAID 1+RAID 5 for H330 (2 + 3-8 HDDs)",1,"[780-BBJP]",{"$f":"IF($B$110+$B$111-$F$112>=5,A186,\"\")","v":{"$error":"#REF!"}},{"$f":"IF($B$110+$B$111-$F$112>=5,C186,\"\")","v":{"$error":"#REF!"}},{"$f":"IF($B$145-$F$145>=5,A186,\"\")","v":{"$error":"#REF!"}},{"$f":"IF($B$145-$F$145>=5,C186,\"\")","v":{"$error":"#REF!"}}]
["C9 - RAID 1+RAID 10 for H330 (2 + 4 HDDs in pairs) ",1,"[780-BBJQ] ",{"$f":"IF($B$110+$B$111-$F$112=6,A187,\"\")","v":{"$error":"#REF!"}},{"$f":"IF($B$110+$B$111-$F$112=6,C187,\"\")","v":{"$error":"#REF!"}},{"$f":"IF($B$145-$F$145=6,A187,\"\")","v":{"$error":"#REF!"}},{"$f":"IF($B$145-$F$145=6,C187,\"\")","v":{"$error":"#REF!"}}]

{"sheet":"PCI","index":13,"n_rows":210,"n_cols":9,"rows_kept":210,"cut":false,"hidden":true,"merged":[]}
["Additional Card for PCIe Slot 1"]
["DL560"]
["None",{"$f":"\"\"","v":""},{"$f":"\"\"","v":""},{"$f":"\"\"","v":""},{"$f":"\"\"","v":""},{"$f":"\"\"","v":""},{"$f":"\"\"","v":""},0,{"$f":"\"\"","v":""}]
["HPE Ethernet 1Gb 2P 332T Adptr",1,"10L2-LAN1GB","S10L1-DL560-LAN1","615732-B21",35,"",0,""]
["HPE Ethernet 10Gb 2P 530SFP+ Adptr",1,"10L2-LAN10GB","S10L1-DL560-LAN10","652503-B21",716,"HPE BLc 10G SFP+ SR Transceiver",2,"455883-B21"]
["HPE StoreFabric CN1200E 10Gb CNA",1,"10L2-CNA10","S10L1-DL560-CNA10","E7Y06A",778,"HPE BLc 10G SFP+ SR Transceiver",2,"455883-B21"]
["HPE 82Q 8Gb Dual Port PCI-e FC HBA",1,"10L2-FC","S10L1-DL560-FC","AJ764A",889,null,0,""]
[]
["Additional Card for PCIe Slot 2"]
["DL560"]
["None","","","","","","",0,""]
["HPE Ethernet 1Gb 2P 332T Adptr",1,"10L2-LAN1GB","S10L1-DL560-LAN1","615732-B21",35,"",0,""]
["HPE Ethernet 10Gb 2P 530SFP+ Adptr",1,"10L2-LAN10GB","S10L1-DL560-LAN10","652503-B21",716,"HPE BLc 10G SFP+ SR Transceiver",2,"455883-B21"]
["HPE StoreFabric CN1200E 10Gb CNA",1,"10L2-CNA10","S10L1-DL560-CNA10","E7Y06A",778,"HPE BLc 10G SFP+ SR Transceiver",2,"455883-B21"]
["HPE 82Q 8Gb Dual Port PCI-e FC HBA",1,"10L2-FC","S10L1-DL560-FC","AJ764A",889,null,0,""]
[]
["Additional Card for PCIe Slot 3"]
["DL560"]
["None","","","","","","",0,""]
["HPE Ethernet 1Gb 2P 332T Adptr",1,"10L2-LAN1GB","S10L1-DL560-LAN1","615732-B21",35,"",0,""]
["HPE Ethernet 10Gb 2P 530SFP+ Adptr",1,"10L2-LAN10GB","S10L1-DL560-LAN10","652503-B21",716,"HPE BLc 10G SFP+ SR Transceiver",2,"455883-B21"]
["HPE StoreFabric CN1200E 10Gb CNA",1,"10L2-CNA10","S10L1-DL560-CNA10","E7Y06A",778,"HPE BLc 10G SFP+ SR Transceiver",2,"455883-B21"]
["HPE 82Q 8Gb Dual Port PCI-e FC HBA",1,"10L2-FC","S10L1-DL560-FC","AJ764A",889,null,0,""]
[]
["Additional Card for PCIe Slot 4"]
["DL560"]
["None","","","","","","",0,""]
["HPE Ethernet 1Gb 2P 332T Adptr",1,"10L2-LAN1GB","S10L1-DL560-LAN1","615732-B21",35,"",0,""]
["HPE Ethernet 10Gb 2P 530SFP+ Adptr",1,"10L2-LAN10GB","S10L1-DL560-LAN10","652503-B21",716,"HPE BLc 10G SFP+ SR Transceiver",2,"455883-B21"]
["HPE StoreFabric CN1200E 10Gb CNA",1,"10L2-CNA10","S10L1-DL560-CNA10","E7Y06A",778,"HPE BLc 10G SFP+ SR Transceiver",2,"455883-B21"]
["HPE 82Q 8Gb Dual Port PCI-e FC HBA",1,"10L2-FC","S10L1-DL560-FC","AJ764A",889,null,0,""]
[]
["Additional Card for PCIe Slot 5"]
["DL560"]
["None","","","","","","",0,""]
["HPE Ethernet 1Gb 2P 332T Adptr",1,"10L2-LAN1GB","S10L1-DL560-LAN1","615732-B21",35,"",0,""]
["HPE Ethernet 10Gb 2P 530SFP+ Adptr",1,"10L2-LAN10GB","S10L1-DL560-LAN10","652503-B21",716,"HPE BLc 10G SFP+ SR Transceiver",2,"455883-B21"]
["HPE StoreFabric CN1200E 10Gb CNA",1,"10L2-CNA10","S10L1-DL560-CNA10","E7Y06A",778,"HPE BLc 10G SFP+ SR Transceiver",2,"455883-B21"]
["HPE 82Q 8Gb Dual Port PCI-e FC HBA",1,"10L2-FC","S10L1-DL560-FC","AJ764A",889,null,0,""]
[]
["Additional Card for PCIe Slot 6"]
["DL560"]
["None","","","","","","",0,""]
["HPE Ethernet 1Gb 2P 332T Adptr",1,"10L2-LAN1GB","S10L1-DL560-LAN1","615732-B21",35,"",0,""]
["HPE Ethernet 10Gb 2P 530SFP+ Adptr",1,"10L2-LAN10GB","S10L1-DL560-LAN10","652503-B21",716,"HPE BLc 10G SFP+ SR Transceiver",2,"455883-B21"]
["HPE StoreFabric CN1200E 10Gb CNA",1,"10L2-CNA10","S10L1-DL560-CNA10","E7Y06A",778,"HPE BLc 10G SFP+ SR Transceiver",2,"455883-B21"]
["HPE 82Q 8Gb Dual Port PCI-e FC HBA",1,"10L2-FC","S10L1-DL560-FC","AJ764A",889,null,0,""]
[]
["Additional Card for PCIe Slot 7"]
["DL560"]
["None","","","","","","",0,""]
["HPE Ethernet 1Gb 2P 332T Adptr",1,"10L2-LAN1GB","S10L1-DL560-LAN1","615732-B21",35,"",0,""]
["HPE Ethernet 10Gb 2P 530SFP+ Adptr",1,"10L2-LAN10GB","S10L1-DL560-LAN10","652503-B21",716,"HPE BLc 10G SFP+ SR Transceiver",2,"455883-B21"]
["HPE StoreFabric CN1200E 10Gb CNA",1,"10L2-CNA10","S10L1-DL560-CNA10","E7Y06A",778,"HPE BLc 10G SFP+ SR Transceiver",2,"455883-B21"]
["HPE 82Q 8Gb Dual Port PCI-e FC HBA",1,"10L2-FC","S10L1-DL560-FC","AJ764A",889,null,0,""]
[]
[]
["Additional Card for PCIe Slot 1"]
["DL580"]
["None","","","","","","",0,""]
["HPE Ethernet 1Gb 2P 332T Adptr",1,"10L2-LAN1GB","S10L1-DL560-LAN1","615732-B21",35,"",0,""]
["HPE Ethernet 10Gb 2P 530SFP+ Adptr",1,"10L2-LAN10GB","S10L1-DL560-LAN10","652503-B21",716,"HPE BLc 10G SFP+ SR Transceiver",2,"455883-B21"]
["HPE StoreFabric CN1200E 10Gb CNA",1,"10L2-CNA10","S10L1-DL560-CNA10","E7Y06A",778,"HPE BLc 10G SFP+ SR Transceiver",2,"455883-B21"]
["HPE 82Q 8Gb Dual Port PCI-e FC HBA",1,"10L2-FC","S10L1-DL560-FC","AJ764A",889,null,0,""]
[]
["Additional Card for PCIe Slot 2"]
["DL580"]
["None","","","","","","",0,""]
["HPE Ethernet 1Gb 2P 332T Adptr",1,"10L2-LAN1GB","S10L1-DL560-LAN1","615732-B21",35,"",0,""]
["HPE Ethernet 10Gb 2P 530SFP+ Adptr",1,"10L2-LAN10GB","S10L1-DL560-LAN10","652503-B21",716,"HPE BLc 10G SFP+ SR Transceiver",2,"455883-B21"]
["HPE StoreFabric CN1200E 10Gb CNA",1,"10L2-CNA10","S10L1-DL560-CNA10","E7Y06A",778,"HPE BLc 10G SFP+ SR Transceiver",2,"455883-B21"]
["HPE 82Q 8Gb Dual Port PCI-e FC HBA",1,"10L2-FC","S10L1-DL560-FC","AJ764A",889,null,0,""]
[]
["Additional Card for PCIe Slot 3"]
["DL580"]
["None","","","","","","",0,""]
["HPE Ethernet 1Gb 2P 332T Adptr",1,"10L2-LAN1GB","S10L1-DL560-LAN1","615732-B21",35,"",0,""]
["HPE Ethernet 10Gb 2P 530SFP+ Adptr",1,"10L2-LAN10GB","S10L1-DL560-LAN10","652503-B21",716,"HPE BLc 10G SFP+ SR Transceiver",2,"455883-B21"]
["HPE StoreFabric CN1200E 10Gb CNA",1,"10L2-CNA10","S10L1-DL560-CNA10","E7Y06A",778,"HPE BLc 10G SFP+ SR Transceiver",2,"455883-B21"]
["HPE 82Q 8Gb Dual Port PCI-e FC HBA",1,"10L2-FC","S10L1-DL560-FC","AJ764A",889,null,0,""]
[]
["Additional Card for PCIe Slot 4"]
["DL580"]
["None","","","","","","",0,""]
["HPE Ethernet 1Gb 2P 332T Adptr",1,"10L2-LAN1GB","S10L1-DL560-LAN1","615732-B21",35,"",0,""]
["HPE Ethernet 10Gb 2P 530SFP+ Adptr",1,"10L2-LAN10GB","S10L1-DL560-LAN10","652503-B21",716,"HPE BLc 10G SFP+ SR Transceiver",2,"455883-B21"]
["HPE StoreFabric CN1200E 10Gb CNA",1,"10L2-CNA10","S10L1-DL560-CNA10","E7Y06A",778,"HPE BLc 10G SFP+ SR Transceiver",2,"455883-B21"]
["HPE 82Q 8Gb Dual Port PCI-e FC HBA",1,"10L2-FC","S10L1-DL560-FC","AJ764A",889,null,0,""]
[]
["Additional Card for PCIe Slot 5"]
["DL580"]
["None","","","","","","",0,""]
["HPE Ethernet 1Gb 2P 332T Adptr",1,"10L2-LAN1GB","S10L1-DL560-LAN1","615732-B21",35,"",0,""]
["HPE Ethernet 10Gb 2P 530SFP+ Adptr",1,"10L2-LAN10GB","S10L1-DL560-LAN10","652503-B21",716,"HP BLc 10G SFP+ SR Transceiver",2,"455883-B21"]
["HPE StoreFabric CN1200E 10Gb CNA",1,"10L2-CNA10","S10L1-DL560-CNA10","E7Y06A",778,"HP BLc 10G SFP+ SR Transceiver",2,"455883-B21"]
["HPE 82Q 8Gb Dual Port PCI-e FC HBA",1,"10L2-FC","S10L1-DL560-FC","AJ764A",889,null,0,""]
[]
["Additional Card for PCIe Slot 6"]
["DL580"]
["None","","","","","","",0,""]
["HPE Ethernet 1Gb 2P 332T Adptr",1,"10L2-LAN1GB","S10L1-DL560-LAN1","615732-B21",35,"",0,""]
["HPE Ethernet 10Gb 2P 530SFP+ Adptr",1,"10L2-LAN10GB","S10L1-DL560-LAN10","652503-B21",716,"HPE BLc 10G SFP+ SR Transceiver",2,"455883-B21"]
["HPE StoreFabric CN1200E 10Gb CNA",1,"10L2-CNA10","S10L1-DL560-CNA10","E7Y06A",778,"HPE BLc 10G SFP+ SR Transceiver",2,"455883-B21"]
["HPE 82Q 8Gb Dual Port PCI-e FC HBA",1,"10L2-FC","S10L1-DL560-FC","AJ764A",889,null,0,""]
[]
["Additional Card for PCIe Slot 7"]
["DL580"]
["None","","","","","","",0,""]
["HPE Ethernet 1Gb 2P 332T Adptr",1,"10L2-LAN1GB","S10L1-DL560-LAN1","615732-B21",35,"",0,""]
["HPE Ethernet 10Gb 2P 530SFP+ Adptr",1,"10L2-LAN10GB","S10L1-DL560-LAN10","652503-B21",716,"HPE BLc 10G SFP+ SR Transceiver",2,"455883-B21"]
["HPE StoreFabric CN1200E 10Gb CNA",1,"10L2-CNA10","S10L1-DL560-CNA10","E7Y06A",778,"HPE BLc 10G SFP+ SR Transceiver",2,"455883-B21"]
["HPE 82Q 8Gb Dual Port PCI-e FC HBA",1,"10L2-FC","S10L1-DL560-FC","AJ764A",889,null,0,""]
[]
["Additional Card for PCIe Slot 8"]
["DL580"]
["None","","","","","","",0,""]
["HPE Ethernet 1Gb 2P 332T Adptr",1,"10L2-LAN1GB","S10L1-DL560-LAN1","615732-B21",35,"",0,""]
["HPE Ethernet 10Gb 2P 530SFP+ Adptr",1,"10L2-LAN10GB","S10L1-DL560-LAN10","652503-B21",716,"HPE BLc 10G SFP+ SR Transceiver",2,"455883-B21"]
["HPE StoreFabric CN1200E 10Gb CNA",1,"10L2-CNA10","S10L1-DL560-CNA10","E7Y06A",778,"HPE BLc 10G SFP+ SR Transceiver",2,"455883-B21"]
["HPE 82Q 8Gb Dual Port PCI-e FC HBA",1,"10L2-FC","S10L1-DL560-FC","AJ764A",889,null,0,""]
[]
["Additional Card for PCIe Slot 9"]
["DL580"]
["None","","","","","","",0,""]
["HPE Ethernet 1Gb 2P 332T Adptr",1,"10L2-LAN1GB","S10L1-DL560-LAN1","615732-B21",35,"",0,""]
["HPE Ethernet 10Gb 2P 530SFP+ Adptr",1,"10L2-LAN10GB","S10L1-DL560-LAN10","652503-B21",716,"HPE BLc 10G SFP+ SR Transceiver",2,"455883-B21"]
["HPE StoreFabric CN1200E 10Gb CNA",1,"10L2-CNA10","S10L1-DL560-CNA10","E7Y06A",778,"HPE BLc 10G SFP+ SR Transceiver",2,"455883-B21"]
["HPE 82Q 8Gb Dual Port PCI-e FC HBA",1,"10L2-FC","S10L1-DL560-FC","AJ764A",889,null,0,""]
[]
["Aggiungere Coppia di Processori"]
[]
[]
[]
[]
[]
[]
[]
[]
[]
[]
[]
[]
[]
[]
[]
[]
[]
[]
[]
[]
[]
[]
[]
[]
[]
[]
[]
[]
[]
[]
[]
[]
[]
["Additional Card for PCIe Slot 1 (Full height) (CPU1)"]
["T630"]
["None",{"$f":"\"\"","v":""},{"$f":"\"\"","v":""},{"$f":"\"\"","v":""},{"$f":"\"\"","v":""},{"$f":"\"\"","v":""},{"$f":"\"\"","v":""},0,{"$f":"\"\"","v":""}]
["Broadcom 5720 DP 1Gb Network Interface Card,Full Height,CusKit",1,"10L1-LAN1GB","S10L1-T630-LAN1","[540-BBGY]",35,"",0,""]
["Emulex LPE 12002, Dual Port 8Gb Fibre Channel HBA,Full Height,CusKit",1,"10L1-FC","S10L1-T630-FC","[406-BBGR]",940,null,0,""]
["QLogic 57810 Dual Port 10Gb Direct Attach/SFP+ Network Adapter,Full Height,CusKit",1,"10L1-LAN10GB","S10L1-T630-LAN10","[540-BBGS]",417,"PowerEdge SFP+, 10GbE SR/SX, Optical Tranceiver, LC Connector, for Intel and Broadcom,CusKit",2,"[407-BBOK]"]
[]
[]
["Additional Card for PCIe Slot 2 (Full height) (CPU1)"]
["T630"]
["None",{"$f":"\"\"","v":""},{"$f":"\"\"","v":""},{"$f":"\"\"","v":""},{"$f":"\"\"","v":""},{"$f":"\"\"","v":""},{"$f":"\"\"","v":""},0,{"$f":"\"\"","v":""}]
["Broadcom 5720 DP 1Gb Network Interface Card,Full Height,CusKit",1,"10L1-LAN1GB","S10L1-T630-LAN1","[540-BBGY]",35,"",0,""]
["Emulex LPE 12002, Dual Port 8Gb Fibre Channel HBA,Full Height,CusKit",1,"10L1-FC","S10L1-T630-FC","[406-BBGR]",940,null,0,""]
["QLogic 57810 Dual Port 10Gb Direct Attach/SFP+ Network Adapter,Full Height,CusKit",1,"10L1-LAN10GB","S10L1-T630-LAN10","[540-BBGS]",417,"PowerEdge SFP+, 10GbE SR/SX, Optical Tranceiver, LC Connector, for Intel and Broadcom,CusKit",2,"[407-BBOK]"]
[]
[]
["Additional Card for PCIe Slot 3 (Full height) (CPU2)"]
["T630"]
["None",{"$f":"\"\"","v":""},{"$f":"\"\"","v":""},{"$f":"\"\"","v":""},{"$f":"\"\"","v":""},{"$f":"\"\"","v":""},{"$f":"\"\"","v":""},0,{"$f":"\"\"","v":""}]
["Broadcom 5720 DP 1Gb Network Interface Card,Full Height,CusKit",1,"10L1-LAN1GB","S10L1-T630-LAN1","[540-BBGY]",35,"",0,""]
["Emulex LPE 12002, Dual Port 8Gb Fibre Channel HBA,Full Height,CusKit",1,"10L1-FC","S10L1-T630-FC","[406-BBGR]",940,null,0,""]
["QLogic 57810 Dual Port 10Gb Direct Attach/SFP+ Network Adapter,Full Height,CusKit",1,"10L1-LAN10GB","S10L1-T630-LAN10","[540-BBGS]",417,"PowerEdge SFP+, 10GbE SR/SX, Optical Tranceiver, LC Connector, for Intel and Broadcom,CusKit",2,"[407-BBOK]"]
[]
[]
["Additional Card for PCIe Slot 4 (Full height) (CPU2)"]
["T630"]
["None",{"$f":"\"\"","v":""},{"$f":"\"\"","v":""},{"$f":"\"\"","v":""},{"$f":"\"\"","v":""},{"$f":"\"\"","v":""},{"$f":"\"\"","v":""},0,{"$f":"\"\"","v":""}]
["Broadcom 5720 DP 1Gb Network Interface Card,Full Height,CusKit",1,"10L1-LAN1GB","S10L1-T630-LAN1","[540-BBGY]",35,"",0,""]
["Emulex LPE 12002, Dual Port 8Gb Fibre Channel HBA,Full Height,CusKit",1,"10L1-FC","S10L1-T630-FC","[406-BBGR]",940,null,0,""]
["QLogic 57810 Dual Port 10Gb Direct Attach/SFP+ Network Adapter,Full Height,CusKit",1,"10L1-LAN10GB","S10L1-T630-LAN10","[540-BBGS]",417,"PowerEdge SFP+, 10GbE SR/SX, Optical Tranceiver, LC Connector, for Intel and Broadcom,CusKit",2,"[407-BBOK]"]
[]
[]
[]
["Additional Card for PCIe Slot 5 (Full height) (CPU2)"]
["T630"]
["None",{"$f":"\"\"","v":""},{"$f":"\"\"","v":""},{"$f":"\"\"","v":""},{"$f":"\"\"","v":""},{"$f":"\"\"","v":""},{"$f":"\"\"","v":""},0,{"$f":"\"\"","v":""}]
["Broadcom 5720 DP 1Gb Network Interface Card,Full Height,CusKit",1,"10L1-LAN1GB","S10L1-T630-LAN1","[540-BBGY]",35,"",0,""]
["Emulex LPE 12002, Dual Port 8Gb Fibre Channel HBA,Full Height,CusKit",1,"10L1-FC","S10L1-T630-FC","[406-BBGR]",940,null,0,""]
["QLogic 57810 Dual Port 10Gb Direct Attach/SFP+ Network Adapter,Full Height,CusKit",1,"10L1-LAN10GB","S10L1-T630-LAN10","[540-BBGS]",417,"PowerEdge SFP+, 10GbE SR/SX, Optical Tranceiver, LC Connector, for Intel and Broadcom,CusKit",2,"[407-BBOK]"]
[]
[]
["Additional Card for PCIe Slot 6 (Full height) (CPU2)"]
["T630"]
["None",{"$f":"\"\"","v":""},{"$f":"\"\"","v":""},{"$f":"\"\"","v":""},{"$f":"\"\"","v":""},{"$f":"\"\"","v":""},{"$f":"\"\"","v":""},0,{"$f":"\"\"","v":""}]
["Broadcom 5720 DP 1Gb Network Interface Card,Full Height,CusKit",1,"10L1-LAN1GB","S10L1-T630-LAN1","[540-BBGY]",35,"",0,""]
["Emulex LPE 12002, Dual Port 8Gb Fibre Channel HBA,Full Height,CusKit",1,"10L1-FC","S10L1-T630-FC","[406-BBGR]",940,null,0,""]
["QLogic 57810 Dual Port 10Gb Direct Attach/SFP+ Network Adapter,Full Height,CusKit",1,"10L1-LAN10GB","S10L1-T630-LAN10","[540-BBGS]",417,"PowerEdge SFP+, 10GbE SR/SX, Optical Tranceiver, LC Connector, for Intel and Broadcom,CusKit",2,"[407-BBOK]"]

{"sheet":"Servizi Opzionali","index":14,"n_rows":81,"n_cols":13,"rows_kept":81,"cut":false,"hidden":true,"merged":[]}
["Warranty Upgrades",null,null,null,null,null,"Protezione dei dati - Keep Your Hard Drive "]
["DL560"]
["None",{"$f":"\"\"","v":""},{"$f":"\"\"","v":""},{"$f":"\"\"","v":""},{"$f":"\"\"","v":""},{"$f":"\"\"","v":""},null,null,{"$f":"IF(($A$22=$A$12),\"\",IF($A$8=$A$3,I13,IF($A$8=$A$4,I14,IF($A$8=$A$5,I15))))","v":""},{"$f":"IF(($A$22=$A$12),\"\",IF($A$8=$A$3,J13,IF($A$8=$A$4,J14,IF($A$8=$A$5,J15))))","v":""},{"$f":"IF(($A$22=$A$12),\"\",IF($A$8=$A$3,K13,IF($A$8=$A$4,K14,IF($A$8=$A$5,K15))))","v":""},{"$f":"IF(($A$22=$A$12),\"\",IF($A$8=$A$3,L13,IF($A$8=$A$4,L14,IF($A$8=$A$5,L15))))","v":""},{"$f":"IF(($A$22=$A$12),\"\",IF($A$8=$A$3,M13,IF($A$8=$A$4,M14,IF($A$8=$A$5,M15))))","v":""}]
["4Yr Warranty upgrade ",1,"10L2-SO-12M","S10L2-DL560-S-12M",{"$f":"\"\"","v":""},350]
["5Yr Warranty upgrade ",1,"10L2-SO-24M","S10L2-DL560-S-24M",{"$f":"\"\"","v":""},700]
[]
["Estensione Garanzia Selezionata"]
[{"$f":"'Server10 Lotto2 DL560'!$B$115","v":"None"},null,"DL560"]
[{"$f":"'Server10 Lotto2 DL560 2'!$B$115","v":"None"},null,"DL560 2"]
[{"$f":"'Server10 Lotto2 DL560 3'!$B$115","v":"None"},null,"DL560 3"]
[]
["None",{"$f":"\"\"","v":""},{"$f":"\"\"","v":""},{"$f":"\"\"","v":""},{"$f":"\"\"","v":""},{"$f":"\"\"","v":""},null,"None"]
[{"$f":"IF($A$8=$A$3,H13,IF($A$8=$A$4,H14,IF($A$8=$A$5,H15)))","v":"3Yr Data Protection - Keep Your Hard Drive"},1,"10L2-SO-HDD","S10L2-DL560-S-HDD",{"$f":"IF($A$8=$A$3,L13,IF($A$8=$A$4,L14,IF($A$8=$A$5,L15)))","v":""},300,null,"3Yr Data Protection - Keep Your Hard Drive",1,"10L2-SO-HDD","S10L2-DL560-S-HDD",{"$f":"\"\"","v":""},300]
["None",{"$f":"\"\"","v":""},{"$f":"\"\"","v":""},{"$f":"\"\"","v":""},{"$f":"\"\"","v":""},{"$f":"\"\"","v":""},null,"4Yr Data Protection - Keep Your Hard Drive",{"$f":"I13","v":1},{"$f":"J13","v":"10L2-SO-HDD"},{"$f":"K13","v":"S10L2-DL560-S-HDD"},{"$f":"\"\"","v":""},{"$f":"M13","v":300}]
[{"$f":"IF(A9=A3,H13,IF(A9=A4,H14,IF(A9=A5,H15)))","v":"3Yr Data Protection - Keep Your Hard Drive"},1,"10L2-SO-HDD","S10L2-DL560-S-HDD",{"$f":"IF(A9=A3,L13,IF(A9=A4,L14,IF(A9=A5,L15)))","v":""},300,null,"5Yr Data Protection - Keep Your Hard Drive",{"$f":"I13","v":1},{"$f":"J13","v":"10L2-SO-HDD"},{"$f":"K13","v":"S10L2-DL560-S-HDD"},{"$f":"\"\"","v":""},{"$f":"M13","v":300}]
["None",{"$f":"\"\"","v":""},{"$f":"\"\"","v":""},{"$f":"\"\"","v":""},{"$f":"\"\"","v":""},{"$f":"\"\"","v":""}]
[{"$f":"IF(A10=A3,H13,IF(A10=A4,H14,IF(A10=A5,H15)))","v":"3Yr Data Protection - Keep Your Hard Drive"},1,"10L2-SO-HDD","S10L2-DL560-S-HDD",{"$f":"IF(A10=A3,L13,IF(A10=A4,L14,IF(A10=A5,L15)))","v":""},300]
[]
[]
[]
["Protezione dei dati Selezionata"]
[{"$f":"'Server10 Lotto2 DL560'!B118","v":"None"}]
[]
["Servizio Specialistico di System and Network Management per sistema opertivo Windows, erogato on site.",1,"10L2-SO-WIN","S10L1-R630-S-WIN",null,200]
["Servizio Specialistico di System and Network Management per sistema opertivo Linux, erogato on site.",1,"10L2-SO-LINUX","S10L1-R630-S-LINUX",null,200]
[]
["None",{"$f":"\"\"","v":""},{"$f":"\"\"","v":""},{"$f":"\"\"","v":""},{"$f":"\"\"","v":""},{"$f":"\"\"","v":""}]
[{"$f":"IF('Server10 Lotto2 DL560'!$C$16>=5,H28,\"None\")","v":"None"},{"$f":"IF('Server10 Lotto2 DL560'!$C$16>=5,I28,\"\")","v":""},{"$f":"IF('Server10 Lotto2 DL560'!$C$16>=5,J28,\"\")","v":""},{"$f":"IF('Server10 Lotto2 DL560'!$C$16>=5,K28,\"\")","v":""},{"$f":"IF('Server10 Lotto2 DL560'!$C$16>=5,L28,\"\")","v":""},{"$f":"IF('Server10 Lotto2 DL560'!$C$16>=5,M28,\"\")","v":""},null,"Servizi di manutenzione preventiva",1,"10L1-SO-PREV","S10L1-T630-S-PREV",null,200]
[]
["Warranty Upgrades",null,null,null,null,null,"Protezione dei dati - Keep Your Hard Drive "]
["DL580"]
["None",{"$f":"\"\"","v":""},{"$f":"\"\"","v":""},{"$f":"\"\"","v":""},{"$f":"\"\"","v":""},{"$f":"\"\"","v":""},null,null,{"$f":"IF(($A$22=$A$12),\"\",IF($A$8=$A$3,I42,IF($A$8=$A$4,I43,IF($A$8=$A$5,I44))))","v":""},{"$f":"IF(($A$22=$A$12),\"\",IF($A$8=$A$3,J42,IF($A$8=$A$4,J43,IF($A$8=$A$5,J44))))","v":""},{"$f":"IF(($A$22=$A$12),\"\",IF($A$8=$A$3,K42,IF($A$8=$A$4,K43,IF($A$8=$A$5,K44))))","v":""},{"$f":"IF(($A$22=$A$12),\"\",IF($A$8=$A$3,L42,IF($A$8=$A$4,L43,IF($A$8=$A$5,L44))))","v":""},{"$f":"IF(($A$22=$A$12),\"\",IF($A$8=$A$3,M42,IF($A$8=$A$4,M43,IF($A$8=$A$5,M44))))","v":""}]
["4Yr Warranty upgrade ",1,"10L2-SO-12M","S10L2-DL580-S-12M",{"$f":"\"\"","v":""},350]
["5Yr Warranty upgrade ",1,"10L2-SO-24M","S10L1-DL580-S-24M",{"$f":"\"\"","v":""},700]
[]
["Estensione Garanzia Selezionata"]
[{"$f":"'Server10 Lotto2 DL580'!$B$115","v":"None"},null,"DL580 "]
[{"$f":"'Server10 Lotto2 DL580 2'!$B$115","v":"None"},null,"DL580 2"]
[{"$f":"'Server10 Lotto2 DL580 3'!$B$115","v":"None"},null,"DL580 3"]
[]
["None",{"$f":"\"\"","v":""},{"$f":"\"\"","v":""},{"$f":"\"\"","v":""},{"$f":"\"\"","v":""},{"$f":"\"\"","v":""},null,"None"]
[{"$f":"IF($A$37=$A$32,H42,IF($A$37=$A$33,H43,IF($A$37=$A$34,H44)))","v":"3Yr Data Protection - Keep Your Hard Drive"},1,"10L2-SO-HDD","S10L2-DL580-S-HDD",{"$f":"IF($A$37=$A$32,L42,IF($A$37=$A$33,L43,IF($A$37=$A$34,L44)))","v":"[733-10057]"},300,null,"3Yr Data Protection - Keep Your Hard Drive",1,"10L2-SO-HDD","S10L2-DL580-S-HDD","[733-10057]",300]
["None",{"$f":"\"\"","v":""},{"$f":"\"\"","v":""},{"$f":"\"\"","v":""},{"$f":"\"\"","v":""},{"$f":"\"\"","v":""},null,"4Yr Data Protection - Keep Your Hard Drive",{"$f":"I42","v":1},{"$f":"J42","v":"10L2-SO-HDD"},{"$f":"K42","v":"S10L2-DL580-S-HDD"},"[733-10058]",{"$f":"M42","v":300}]
[{"$f":"IF(A38=A32,H42,IF(A38=A33,H43,IF(A38=A34,H44)))","v":"3Yr Data Protection - Keep Your Hard Drive"},1,"10L2-SO-HDD","S10L2-DL580-S-HDD",{"$f":"IF(A38=A32,L42,IF(A38=A33,L43,IF(A38=A34,L44)))","v":"[733-10057]"},300,null,"5Yr Data Protection - Keep Your Hard Drive",{"$f":"I42","v":1},{"$f":"J42","v":"10L2-SO-HDD"},{"$f":"K42","v":"S10L2-DL580-S-HDD"},"[733-10059]",{"$f":"M42","v":300}]
["None",{"$f":"\"\"","v":""},{"$f":"\"\"","v":""},{"$f":"\"\"","v":""},{"$f":"\"\"","v":""},{"$f":"\"\"","v":""}]
[{"$f":"IF(A39=A32,H42,IF(A39=A33,H43,IF(A39=A34,H44)))","v":"3Yr Data Protection - Keep Your Hard Drive"},1,"10L2-SO-HDD","S10L2-DL580-S-HDD",{"$f":"IF(A39=A32,L42,IF(A39=A33,L43,IF(A39=A34,L44)))","v":"[733-10057]"},300]
[]
[]
[]
["Protezione dei dati Selezionata"]
[{"$f":"'Server10 Lotto2 DL580'!B118","v":"None"}]
[]
["Servizio Specialistico di System and Network Management per sistema opertivo Windows, erogato on site.",1,"10L2-SO-WIN","S10L1-R730xd-S-WIN",null,200]
["Servizio Specialistico di System and Network Management per sistema opertivo Linux, erogato on site.",1,"10L2-SO-LINUX","S10L1-R730xd-S-LINUX",null,200]
[]
["None",{"$f":"\"\"","v":""},{"$f":"\"\"","v":""},{"$f":"\"\"","v":""},{"$f":"\"\"","v":""},{"$f":"\"\"","v":""}]
[{"$f":"IF('Server10 Lotto2 DL580'!$C$16>=5,H57,\"None\")","v":"None"},{"$f":"IF('Server10 Lotto2 DL580'!$C$16>=5,I57,\"\")","v":""},{"$f":"IF('Server10 Lotto2 DL580'!$C$16>=5,J57,\"\")","v":""},{"$f":"IF('Server10 Lotto2 DL580'!$C$16>=5,K57,\"\")","v":""},{"$f":"IF('Server10 Lotto2 DL580'!$C$16>=5,L57,\"\")","v":""},{"$f":"IF('Server10 Lotto2 DL580'!$C$16>=5,M57,\"\")","v":""},null,"Servizi di manutenzione preventiva",1,"10L2-SO-PREV","S10L2-DL580-S-PREV",null,200]
[]
[]
["Warranty Upgrades",null,null,null,null,null,"Protezione dei dati - Keep Your Hard Drive "]
["T630"]
["None",{"$f":"\"\"","v":""},{"$f":"\"\"","v":""},{"$f":"\"\"","v":""},{"$f":"\"\"","v":""},{"$f":"\"\"","v":""},null,null,{"$f":"IF(($A$22=$A$12),\"\",IF($A$8=$A$3,I70,IF($A$8=$A$4,I71,IF($A$8=$A$5,I72))))","v":""},{"$f":"IF(($A$22=$A$12),\"\",IF($A$8=$A$3,J70,IF($A$8=$A$4,J71,IF($A$8=$A$5,J72))))","v":""},{"$f":"IF(($A$22=$A$12),\"\",IF($A$8=$A$3,K70,IF($A$8=$A$4,K71,IF($A$8=$A$5,K72))))","v":""},{"$f":"IF(($A$22=$A$12),\"\",IF($A$8=$A$3,L70,IF($A$8=$A$4,L71,IF($A$8=$A$5,L72))))","v":""},{"$f":"IF(($A$22=$A$12),\"\",IF($A$8=$A$3,M70,IF($A$8=$A$4,M71,IF($A$8=$A$5,M72))))","v":""}]
["4Yr Warranty upgrade ",1,"10L1-SO-12M-T","S10L1-T630-S-12M",{"$f":"\"\"","v":""},175]
["5Yr Warranty upgrade ",1,"10L1-SO-24M-T","S10L1-T630-S-24M",{"$f":"\"\"","v":""},350]
[]
["Estensione Garanzia Selezionata"]
[{"$f":"#REF!","v":{"$error":"#REF!"}}]
[]
["None",{"$f":"\"\"","v":""},{"$f":"\"\"","v":""},{"$f":"\"\"","v":""},{"$f":"\"\"","v":""},{"$f":"\"\"","v":""},null,"None"]
[{"$f":"IF($A$67=$A$62,H70,IF($A$67=$A$63,H71,IF($A$67=$A$64,H72)))","v":{"$error":"#REF!"}},1,"10L1-SO-HDD","S10L1-T630-S-HDD",{"$f":"IF($A$67=$A$62,L70,IF($A$67=$A$63,L71,IF($A$67=$A$64,L72)))","v":{"$error":"#REF!"}},150,null,"3Yr Data Protection - Keep Your Hard Drive",1,"10L1-SO-HDD","S10L1-T630-S-HDD","[733-10057]",150]
[null,null,null,null,null,null,null,"4Yr Data Protection - Keep Your Hard Drive",{"$f":"I70","v":1},{"$f":"J70","v":"10L1-SO-HDD"},{"$f":"K70","v":"S10L1-T630-S-HDD"},"[733-10058]",{"$f":"M70","v":150}]
[null,null,null,null,null,null,null,"5Yr Data Protection - Keep Your Hard Drive",{"$f":"I70","v":1},{"$f":"J70","v":"10L1-SO-HDD"},{"$f":"K70","v":"S10L1-T630-S-HDD"},"[733-10059]",{"$f":"M70","v":150}]
[]
["Protezione dei dati Selezionata"]
[{"$f":"#REF!","v":{"$error":"#REF!"}}]
[]
["Servizio Specialistico di System and Network Management per sistema opertivo Windows, erogato on site.",1,"10L1-SO-WIN","S10L1-T630-S-WIN",null,193]
["Servizio Specialistico di System and Network Management per sistema opertivo Linux, erogato on site.",1,"10L1-SO-LINUX","S10L1-T630-S-LINUX",null,193]
[]
["None",{"$f":"\"\"","v":""},{"$f":"\"\"","v":""},{"$f":"\"\"","v":""},{"$f":"\"\"","v":""},{"$f":"\"\"","v":""}]
[{"$f":"IF(#REF!>=5,H81,\"None\")","v":{"$error":"#REF!"}},{"$f":"IF(#REF!>=5,I81,\"\")","v":{"$error":"#REF!"}},{"$f":"IF(#REF!>=5,J81,\"\")","v":{"$error":"#REF!"}},{"$f":"IF(#REF!>=5,K81,\"\")","v":{"$error":"#REF!"}},{"$f":"IF(#REF!>=5,L81,\"\")","v":{"$error":"#REF!"}},{"$f":"IF(#REF!>=5,M81,\"\")","v":{"$error":"#REF!"}},null,"Servizi di manutenzione preventiva",1,"10L1-SO-PREV","S10L1-T630-S-PREV",null,193]