{"text_format":"1","workbook":"xlsx","n_sheets":16,"sheets":["Server10 Lotto3 VRTX","Server10 Lotto1 R630","Server10 Lotto3 HP CS250","RACK, Accessori e Servizi","Riepilogo","Server10 Lotto1 R630 2","Server10 Lotto1 R630 3","Server10 Lotto1 R730xd 2","Server10 Lotto1 R730xd 3","Codici","Processor","Memory","Operating System","HDD","PCI","Servizi Opzionali"],"not_rendered":{"charts":0,"images":12,"macros":1,"external_links":1,"defined_names":112,"comments":0,"pivot_tables":0},"unopened":[],"bounds":{"document_bytes":16777216,"sheet_cells":100000,"rows_first":2000,"rows_last":500,"rows_between":2000,"halvings":0,"cell_chars":16384,"cell_head_chars":4096},"cells_cut":0,"cells_raw":0,"read":"whole","date_system":"1900"}

{"sheet":"Server10 Lotto3 VRTX","index":0,"n_rows":141,"n_cols":6,"rows_kept":141,"cut":false,"hidden":false,"merged":[[121,6,122,8],[123,6,123,8],[70,1,70,4],[71,2,71,4],[73,1,73,4],[85,1,85,4],[108,2,108,4],[107,1,107,4],[91,1,91,4],[105,2,105,3],[98,1,98,4],[101,1,101,4],[104,1,104,4],[141,1,141,4],[130,2,130,4],[132,1,132,4],[133,2,133,4],[135,1,135,4],[139,2,139,4],[62,2,62,4],[64,1,64,4],[65,2,65,4],[67,1,67,4],[95,1,95,4],[79,1,79,4],[80,2,80,4],[82,1,82,4],[83,2,83,4],[74,2,74,4],[76,1,76,4],[77,2,77,4],[68,2,68,4],[86,2,86,4],[88,1,88,4],[89,2,89,4],[129,1,129,4],[110,1,110,4],[127,2,127,4],[136,2,136,3],[138,1,138,4],[120,2,120,4],[126,1,126,4],[111,2,111,4],[113,1,113,4],[116,1,116,4],[117,2,117,4],[119,1,119,4],[25,2,25,4],[28,2,28,4],[24,1,24,4],[45,1,45,4],[48,1,48,4],[37,2,37,4],[39,1,39,4],[30,1,30,4],[31,2,31,4],[27,1,27,4],[33,1,33,4],[34,2,34,4],[36,1,36,4],[42,1,42,4],[51,1,51,4],[52,2,52,3],[54,1,54,4],[55,2,55,4],[61,1,61,4],[14,2,14,4],[18,1,18,4],[19,2,19,4],[21,1,21,4],[22,2,22,4],[0,0,3,5],[4,0,4,4],[5,0,5,4],[6,0,7,5],[8,0,8,5]]}
[]
[]
[]
[]
["Server10 Lotto3 VRTX",null,null,null,null,"List Price *"]
[null,null,null,null,null,{"$f":"F13*C12","v":0}]
["Components: "]
[]
[]
[]
["VRTX Chassis","Categoria: BladeServerEnclosure",null,null,null,{"$f":"10281","v":10281}]
[null,"Quantity: ",null,null,null,{"$f":"SUM(F16:F142)","v":9}]
[null,null,null,null,null,{"$f":"SUM(F11:F12)","v":10290}]
[]
[null,"Base"]
[null,"PowerEdge VRTX Tower Chassis",1,null,"[210-ABCU][800-BBFF]"]
[null,"Tower to Rack Conversion Kit for VRTX Chassis - Kit",1,null,"[350-BBDK]"]
[null,"Rack Rails, 3U for VRTX Rack Chassis - Kit",1,null,"[770-BBDS]"]
[]
[null,"Configurazione dello chassis"]
[null,"PowerEdge VRTX Tower Configuration for 2.5 inch Hard Drives (max 25)",1,null,"[321-BBDI]"]
[]
[null,"Configurazione RAID"]
[null,"Poweredge VRTX 2.5 HD HotPlug Backplane with Dual Controller in Redundant Mode",1,null,"[321-BBIQ][780-BBFQ]"]
[]
[null,"Spedizione"]
[null,"VRTX EMEA1 Ship Docs (English/French/German/Spanish/Russian/Hebrew)",1,null,"[338-BFFF]"]
[]
[null,"Packaging"]
[null,"Shipping Materials, VRTX Tower Chassis with up to Two Half-Height Server Nodes",1,null,"[340-AAWF]"]
[]
[null,"Sistema documentazione"]
[null,"No System Documentation, No OpenManage DVD Kit",1,null,"[631-AACK]"]
[]
[null,"Alimentatore"]
[null,"PowerEdge VRTX Redundant Power Supply, 4 x 1100W, (2+2)",1,null,"[450-AAYC]"]
[]
[null,"Cavi di alimentazione"]
[null,"Italian Spare Power Cord 220V",4,null,"[450-AAYN]"]
[]
[null,"Guide per rack"]
[null,"No Rails",1,null,"[770-BBCR]"]
[]
[null,"Unità ottica interna"]
[null,"No Internal Optical Drive",null,null,"[429-AAIQ][429-AAIS]"]
[]
[null,"Pannello frontale"]
[null,"PowerEdge VRTX Locking Security Bezel",1,null,"[350-BBCU]"]
[]
[null,"Chassis Management Controller"]
[null,"Chassis Management Controller Card for PowerEdge VRTX Chassis",1,null,"[403-BBCR][405-AABX]"]
[]
[null,"Scheda di rete secondaria per fabric A"]
[null,"PowerEdge VRTX 1Gb Switch Module, Internal 16 ports to External 8 ports",1,null,"[540-BBCP]"]
[]
[null,"Dischi rigidi (max 25)"]
[null,"300GB 10K RPM SAS 12Gbps 2.5in Hot-plug Hard Drive",2,null,"[400-AJQC]"]
[]
[null,"300GB 10K RPM SAS 12Gbps 2.5in Hot-plug Hard Drive - Kit",null,{"$f":"VLOOKUP($B$59, HDD_C,3, FALSE)","v":"10L3-HDD300GB-DELL"},{"$f":"VLOOKUP($B$59, HDD_C,5, FALSE)","v":"[400-AJQC]"},{"$f":"VLOOKUP($B$59, HDD_C,6, FALSE)*C59","v":0}]
[]
[null,"1.2TB 10K RPM SAS 12Gbps 2.5in Hot-plug Hard Drive - Kit",null,{"$f":"VLOOKUP($B$61, HDD_C,3, FALSE)","v":"10L3-HDD1TB-DELL"},{"$f":"VLOOKUP($B$61, HDD_C,5, FALSE)","v":"[400-AJPX]"},{"$f":"VLOOKUP($B$61, HDD_C,6, FALSE)*C61","v":0}]
[]
[null,"Alimentatore"]
[null,"PowerEdge VRTX Redundant Power Supply, 4 x 1600W, (2+2)",1,null,"[450-AEJX]"]
[]
[null,"Cavi di alimentazione"]
[null,"Italian Spare Power Cord 220V",4,null,"[450-AAYN]"]
[]
[null,"Additional Card for PCIe Slot 1 (Full height)"]
[null,"None",{"$f":"VLOOKUP($B$70,  PCI_C1, 2, FALSE)","v":""},{"$f":"VLOOKUP($B$70,  PCI_C1, 3, FALSE)","v":""},{"$f":"VLOOKUP($B$70,  PCI_C1, 5, FALSE)","v":""},{"$f":"VLOOKUP($B$70,  PCI_C1, 6, FALSE)","v":""}]
[]
[null,"Additional Card for PCIe Slot 2 (Full height)"]
[null,"None",{"$f":"VLOOKUP($B$73,  PCI_C2, 2, FALSE)","v":""},{"$f":"VLOOKUP($B$73,  PCI_C2, 3, FALSE)","v":""},{"$f":"VLOOKUP($B$73,  PCI_C2, 5, FALSE)","v":""},{"$f":"VLOOKUP($B$73,  PCI_C2, 6, FALSE)","v":""}]
[]
[null,"Additional Card for PCIe Slot 3 (Full height)"]
[null,"None",{"$f":"VLOOKUP($B$76,  PCI_C3, 2, FALSE)","v":""},{"$f":"VLOOKUP($B$76,  PCI_C3, 3, FALSE)","v":""},{"$f":"VLOOKUP($B$76,  PCI_C3, 5, FALSE)","v":""},{"$f":"VLOOKUP($B$76,  PCI_C3, 6, FALSE)","v":""}]
[]
[null,"Additional Card for PCIe Slot 4 (Low Profile)"]
[null,"None",{"$f":"VLOOKUP($B$79,  PCI_C4, 2, FALSE)","v":""},{"$f":"VLOOKUP($B$79,  PCI_C4, 3, FALSE)","v":""},{"$f":"VLOOKUP($B$79,  PCI_C4, 5, FALSE)","v":""},{"$f":"VLOOKUP($B$79,  PCI_C4, 6, FALSE)","v":""}]
[]
[null,"Additional Card for PCIe Slot 5 (Low Profile)"]
[null,"None",{"$f":"VLOOKUP($B$82,  PCI_C5, 2, FALSE)","v":""},{"$f":"VLOOKUP($B$82,  PCI_C5, 3, FALSE)","v":""},{"$f":"VLOOKUP($B$82,  PCI_C5, 5, FALSE)","v":""},{"$f":"VLOOKUP($B$82,  PCI_C5, 6, FALSE)","v":""}]
[]
[null,"Additional Card for PCIe Slot 6 (Low Profile)"]
[null,"None",{"$f":"VLOOKUP($B$85,  PCI_C6, 2, FALSE)","v":""},{"$f":"VLOOKUP($B$85,  PCI_C6, 3, FALSE)","v":""},{"$f":"VLOOKUP($B$85,  PCI_C6, 5, FALSE)","v":""},{"$f":"VLOOKUP($B$85,  PCI_C6, 6, FALSE)","v":""}]
[]
[null,"Additional Card for PCIe Slot 7 (Low Profile)"]
[null,"None",{"$f":"VLOOKUP($B$88,  PCI_C5, 2, FALSE)","v":""},{"$f":"VLOOKUP($B$88,  PCI_C5, 3, FALSE)","v":""},{"$f":"VLOOKUP($B$88,  PCI_C5, 5, FALSE)","v":""},{"$f":"VLOOKUP($B$88,  PCI_C5, 6, FALSE)","v":""}]
[]
[null,"Additional Card for PCIe Slot 8 (Low Profile)"]
[null,"None",{"$f":"VLOOKUP($B$91,  PCI_C6, 2, FALSE)","v":""},{"$f":"VLOOKUP($B$91,  PCI_C6, 3, FALSE)","v":""},{"$f":"VLOOKUP($B$91,  PCI_C6, 5, FALSE)","v":""},{"$f":"VLOOKUP($B$91,  PCI_C6, 6, FALSE)","v":""}]
[]
[]
["PowerEdge M630 per VRTX Chassies","Categoria: Blade ",null,null,null,2]
[null,"Quantity: ",2,null,null,3]
[null,null,null,null,null,4]
[null,"Base"]
[null,"PowerEdge M630 Motherboard MLK",1,null,"[210-ACZY][329-BCZJ][330-BBBG][340-AFBP][340-ANUJ][461-AACZ][634-BBLZ][750-AACQ][750-AACR][750-AACS][750-AACT][750-AACU]"]
[]
[null,"Configurazione dello chassis"]
[null,"2.5\" Backplane with up to 2 Hard Drives and PERC RAID Controller",1,null,"[406-BBEO]"]
[]
[null,"Raffreddamento"]
[null,"Standard Cooling",1,null,"[384-BBDP]"]
[]
[null,"Processore"]
[null,"Intel Xeon E5-2620 v4 2.1GHz,20M Cache,8.0GT/s QPI,Turbo,HT,8C/16T (85W) Max Mem 2133MHz",1,null,"[338-BJCZ]"]
[]
[null,"Processore aggiuntivo"]
[null,"No Additional Processor",{"$f":"VLOOKUP($B$110, CPU_C, 2, FALSE)","v":0},{"$f":"VLOOKUP($B$110, CPU_C, 3, FALSE)","v":""},{"$f":"VLOOKUP($B$110, CPU_C, 5, FALSE)","v":"[374-BBBX]"},{"$f":"VLOOKUP(B110, CPU_C, 12, FALSE)","v":""}]
[]
[null,"Tipo di configurazione memoria"]
[null,"Performance Optimized",1,null,"[370-AAIP]"]
[]
[null,"Memoria Totale in GB per singolo Blade",null,{"$f":"IF(('Server10 Lotto3 VRTX'!$D$8=0),\"\",'Server10 Lotto3 VRTX'!#REF!)","v":""}]
[null,32]
[]
[null,"Tipo e velocità della memoria DIMM"]
[null,"2400MT/s RDIMMs ",1,null,"[370-ACPH]"]
[]
[null,"Capacità di memoria"]
[null,{"$f":"IF($B$110=\"No Additional Processor\",VLOOKUP($B$116, MEM_C1, 8, FALSE),VLOOKUP($B$116, MEM_C2, 8, FALSE))","v":"16GB RDIMM, 2400MT/s, Dual Rank, x8 Data Width"},{"$f":"IF($B$110=\"No Additional Processor\",VLOOKUP($B$116, MEM_C1, 9, FALSE),VLOOKUP($B$116, MEM_C2, 9, FALSE))","v":"2"},null,{"$f":"IF($B$110=\"No Additional Processor\",VLOOKUP($B$116, MEM_C1, 10, FALSE),VLOOKUP($B$116, MEM_C2, 10, FALSE))","v":"[370-ACNX]"}]
[]
[null,{"$f":"IF($B$110=\"No Additional Processor\",VLOOKUP($B$116, MEM_C1, 2, FALSE),VLOOKUP($B$116, MEM_C2, 2, FALSE))","v":""},{"$f":"IF($B$110=\"No Additional Processor\",VLOOKUP($B$116, MEM_C1, 3, FALSE),VLOOKUP($B$116, MEM_C2, 3, FALSE))","v":""},{"$f":"IF($B$110=\"No Additional Processor\",VLOOKUP($B$116, MEM_C1, 4, FALSE),VLOOKUP($B$116, MEM_C2, 4, FALSE))","v":""},{"$f":"IF($B$110=\"No Additional Processor\",VLOOKUP($B$116, MEM_C1, 6, FALSE),VLOOKUP($B$116, MEM_C2, 6, FALSE))","v":""},{"$f":"IF($B$110=\"No Additional Processor\",VLOOKUP($B$116, MEM_C1, 7, FALSE),VLOOKUP($B$116, MEM_C2, 7, FALSE))","v":""}]
[]
[null,{"$f":"IF($B$110=\"No Additional Processor\",VLOOKUP($B$116, MEM_C1, 11, FALSE),VLOOKUP($B$116, MEM_C2, 11, FALSE))","v":""},{"$f":"IF($B$110=\"No Additional Processor\",VLOOKUP($B$116, MEM_C1, 12, FALSE),VLOOKUP($B$116, MEM_C2, 12, FALSE))","v":""},{"$f":"IF($B$110=\"No Additional Processor\",VLOOKUP($B$116, MEM_C1, 13, FALSE),VLOOKUP($B$116, MEM_C2, 13, FALSE))","v":""},{"$f":"IF($B$110=\"No Additional Processor\",VLOOKUP($B$116, MEM_C1, 15, FALSE),VLOOKUP($B$116, MEM_C2, 15, FALSE))","v":""},{"$f":"IF($B$110=\"No Additional Processor\",VLOOKUP($B$116, MEM_C1, 16, FALSE),VLOOKUP($B$116, MEM_C2, 16, FALSE))","v":""}]
[]
[null,"Sistema operativo preinstallato"]
[null,"Windows Server 2012 R2, Standard Edition, Factory Installed, No Media, 2 Socket, 2 VMs",1,null,"[618-BBDS]"]
[]
[null,"Kit supporti sistema operativo"]
[null,"Windows Server 2012 R2, Standard Edition, Media Kit",1,null,"[618-BBDF]"]
[]
[null,"Controller RAID"]
[null,"H330 Controller",1,null,"[405-AAED]"]
[]
[null,"Dischi rigidi"]
[null,"300GB 10K RPM SAS 12Gbps 2.5in Hot-plug Hard Drive",2,null,"[400-AJQC]"]
[]
[null,"RAID Configuration"]
[null,"C3 - RAID 1 for H330/H730/H730P (2 HDDs, SAS/SATA/SSD)",1,null,"[780-BBLW]"]

{"sheet":"Server10 Lotto1 R630","index":1,"n_rows":144,"n_cols":8,"rows_kept":144,"cut":false,"hidden":true,"merged":[[71,8,74,10],[75,8,78,10],[132,1,132,4],[133,2,133,4],[135,1,135,4],[130,2,130,4],[114,1,114,4],[115,2,115,4],[117,1,117,4],[118,2,118,4],[120,1,120,4],[121,2,121,4],[123,1,123,4],[124,2,124,4],[126,1,126,4],[127,2,127,4],[144,1,144,4],[136,2,136,4],[138,1,138,4],[139,2,139,4],[141,1,141,4],[142,2,142,4],[129,1,129,4],[112,2,112,4],[96,1,96,4],[97,2,97,4],[99,1,99,4],[100,2,100,4],[102,1,102,4],[103,2,103,4],[105,1,105,4],[106,2,106,4],[108,1,108,4],[109,2,109,4],[111,1,111,4],[94,2,94,4],[78,1,78,4],[79,2,79,4],[81,1,81,4],[82,2,82,4],[84,1,84,4],[85,2,85,4],[87,1,87,4],[88,2,88,4],[90,1,90,4],[91,2,91,4],[93,1,93,4],[75,2,75,4],[53,2,53,4],[55,1,55,4],[56,2,56,4],[58,1,58,4],[60,1,60,4],[61,2,61,4],[63,1,63,4],[64,2,64,4],[70,1,70,4],[71,2,71,4],[74,1,74,4],[52,1,52,4],[29,1,29,4],[30,2,30,4],[33,1,33,4],[34,2,34,4],[36,1,36,4],[39,1,39,4],[40,2,40,4],[42,1,42,4],[43,2,43,4],[49,1,49,4],[50,2,50,4],[27,2,27,4],[0,0,3,5],[4,0,4,4],[5,0,5,4],[10,0,11,5],[12,0,12,5],[18,2,18,4],[20,1,20,4],[21,2,21,4],[23,1,23,4],[24,2,24,4],[26,1,26,4]]}
[]
[]
[]
[]
["Server10 Lotto1 R630",null,null,null,null,null,null,"List Price *"]
[null,null,null,null,null,null,null,{"$f":"F17*C16","v":0}]
[]
[]
[]
[]
["Components: \nServer DELL PowerEdge R630 (1CPU Intel® Xeon® E5-2650 v3, 32GB RDIMM, 2xHDD 300GB 10K RPM SAS 12Gbps 2.5in)"]
[]
[]
[]
["PowerEdge R630","Category: Server",null,null,null,{"$f":"1806","v":1806}]
[null,"Quantity: ",null,null,null,{"$f":"SUM(F20:F145)","v":0}]
[null,null,null,null,null,{"$f":"SUM(F15:F16)","v":1806}]
[]
[null,"Base"]
[null,"PowerEdge R630 Server, 8HDD, TPM",1,null,"[210-ACXS][329-BCIY][461-AACZ]"]
[]
[null,"Chassis Configuration"]
[null,"Chassis with up to 8, 2.5\" Hard Drives, up to 2 PCIe Slots (With Optional Riser)",1,null,"[321-BBKJ]"]
[]
[null,"Processor"]
[null,"Intel® Xeon® E5-2650 v3 2.3GHz,25M Cache,9.60GT/s QPI,Turbo,HT,10C/20T (105W) Max Mem 2133MHz",1,null,"[338-BFFF]"]
[]
[null,"Additional Processor"]
[null,"No Additional Processor",{"$f":"VLOOKUP($B$29, CPU_A, 2, FALSE)","v":0},{"$f":"VLOOKUP($B$29, CPU_A, 3, FALSE)","v":""},{"$f":"VLOOKUP($B$29, CPU_A, 5, FALSE)","v":"[374-BBBX]"},{"$f":"VLOOKUP(B29, CPU_A, 12, FALSE)","v":""}]
[]
[null,"Processor Thermal Configuration"]
[null,"1 CPU up to 120W",1,null,"[370-ABWN][412-AAEE]"]
[null,{"$f":"VLOOKUP($B$29, CPU_A, 6, FALSE)","v":""},{"$f":"VLOOKUP($B$29, CPU_A, 7, FALSE)","v":""},null,{"$f":"VLOOKUP($B$29, CPU_A, 8, FALSE)","v":""}]
[]
[null,"Memory Configuration Type"]
[null,"Performance Optimized",1,null,"[370-AAIP]"]
[]
[null,"Total Memory in GB",null,{"$f":"IF(('Server10 Lotto1 R630'!$D$12=0),\"\",'Server10 Lotto1 R630'!#REF!)","v":""}]
[null,32]
[]
[null,"Memory DIMM Type and Speed"]
[null,"2133MT/s RDIMMs ",1,null,"[370-ABUF]"]
[]
[null,"Memory Capacity"]
[null,{"$f":"IF($B$29=\"No Additional Processor\",VLOOKUP($B$39, MEM_A1, 8, FALSE),VLOOKUP($B$39, MEM_A2, 8, FALSE))","v":"16GB RDIMM, 2133MT/s, Dual Rank, x4 Data Width"},{"$f":"IF($B$29=\"No Additional Processor\",VLOOKUP($B$39, MEM_A1, 9, FALSE),VLOOKUP($B$39, MEM_A2, 9, FALSE))","v":"2"},null,{"$f":"IF($B$29=\"No Additional Processor\",VLOOKUP($B$39, MEM_A1, 10, FALSE),VLOOKUP($B$39, MEM_A2, 10, FALSE))","v":"[370-ABUG]"}]
[]
[null,{"$f":"IF($B$29=\"No Additional Processor\",VLOOKUP($B$39, MEM_A1, 2, FALSE),VLOOKUP($B$39, MEM_A2, 2, FALSE))","v":""},{"$f":"IF($B$29=\"No Additional Processor\",VLOOKUP($B$39, MEM_A1, 3, FALSE),VLOOKUP($B$39, MEM_A2, 3, FALSE))","v":""},{"$f":"IF($B$29=\"No Additional Processor\",VLOOKUP($B$39, MEM_A1, 4, FALSE),VLOOKUP($B$39, MEM_A2, 4, FALSE))","v":""},{"$f":"IF($B$29=\"No Additional Processor\",VLOOKUP($B$39, MEM_A1, 6, FALSE),VLOOKUP($B$39, MEM_A2, 6, FALSE))","v":""},{"$f":"IF($B$29=\"No Additional Processor\",VLOOKUP($B$39, MEM_A1, 7, FALSE),VLOOKUP($B$39, MEM_A2, 7, FALSE))","v":""}]
[]
[null,{"$f":"IF($B$29=\"No Additional Processor\",VLOOKUP($B$39, MEM_A1, 11, FALSE),VLOOKUP($B$39, MEM_A2, 11, FALSE))","v":""},{"$f":"IF($B$29=\"No Additional Processor\",VLOOKUP($B$39, MEM_A1, 12, FALSE),VLOOKUP($B$39, MEM_A2, 12, FALSE))","v":""},{"$f":"IF($B$29=\"No Additional Processor\",VLOOKUP($B$39, MEM_A1, 13, FALSE),VLOOKUP($B$39, MEM_A2, 13, FALSE))","v":""},{"$f":"IF($B$29=\"No Additional Processor\",VLOOKUP($B$39, MEM_A1, 15, FALSE),VLOOKUP($B$39, MEM_A2, 15, FALSE))","v":""},{"$f":"IF($B$29=\"No Additional Processor\",VLOOKUP($B$39, MEM_A1, 16, FALSE),VLOOKUP($B$39, MEM_A2, 16, FALSE))","v":""}]
[]
[null,"Operating System"]
[null,"No Operating System",{"$f":"VLOOKUP($B$52, OS_A, 2, FALSE)","v":""},{"$f":"VLOOKUP($B$52, OS_A, 3, FALSE)","v":""},{"$f":"VLOOKUP($B$52, OS_A, 5, FALSE)","v":"[611-BBBF]"},{"$f":"VLOOKUP($B$52, OS_A, 6, FALSE)","v":""}]
[]
[null,"OS Media Kits"]
[null,"No Media Required",1,null,"[605-BBFN]"]
[]
[null,"Client Access Licenses"]
[null,{"$f":"VLOOKUP($B$52, OS_A, 7, FALSE)","v":"None"},null,{"$f":"VLOOKUP($B$52, OS_A, 9, FALSE)","v":""},{"$f":"VLOOKUP($B$52, OS_A, 11, FALSE)","v":""},{"$f":"VLOOKUP($B$52, OS_A, 12, FALSE)*C58","v":0}]
[]
[null,{"$f":"VLOOKUP($B$52, OS_A, 13, FALSE)","v":"None"},null,{"$f":"VLOOKUP($B$52, OS_A, 15, FALSE)","v":""},{"$f":"VLOOKUP($B$52, OS_A, 17, FALSE)","v":""},{"$f":"VLOOKUP($B$52, OS_A, 18, FALSE)*C60","v":0}]
[]
[null,"RAID Controller"]
[null,"PERC H330 RAID Controller",1,null,"[405-AAEF]"]
[]
[null,"Hard Drives"]
[null,"300GB 10K RPM SAS 12Gbps 2.5in Hot-plug Hard Drive",2,null,"[400-AJPK]"]
[]
[null,"300GB 10K RPM SAS 12Gbps 2.5in Hot-plug Hard Drive,CusKit",null,{"$f":"VLOOKUP($B$68, HDD_A,3, FALSE)","v":"10L1-HDD300GB"},{"$f":"VLOOKUP($B$68, HDD_A,5, FALSE)","v":"[400-AJOQ]"},{"$f":"VLOOKUP($B$68, HDD_A,6, FALSE)*C68","v":0}]
[]
[null,"1TB 7.2K RPM NLSAS 6Gbps 2.5in Hot-plug Hard Drive,13G,CusKit",null,{"$f":"VLOOKUP($B$70, HDD_A,3, FALSE)","v":"10L1-HDD1TB"},{"$f":"VLOOKUP($B$70, HDD_A,5, FALSE)","v":"[400-AEFF]"},{"$f":"VLOOKUP($B$70, HDD_A,6, FALSE)*C70","v":0}]
[]
[null,"RAID Configuration HDD 300GB"]
[null,"C3 - RAID 1 for H330 (2 HDDs)",1,null,{"$f":"VLOOKUP($B$73,  RAID_A1, 2, FALSE)","v":"[780-BBJK]"}]
[null,"Hot Spare for 300GB HDD","No"]
[]
[null,"RAID Configuration HDD 1TB"]
[null,"",1,null,{"$f":"VLOOKUP($B$77,  RAID_A2, 2, FALSE)","v":""}]
[null,"Hot Spare for 1TB HDD","No"]
[]
[null,"Power Management BIOS Settings"]
[null,"Performance BIOS Setting",1,null,"[384-BBBL]"]
[]
[null,"Power Supply"]
[null,"Dual, Hot-plug, Redundant Power Supply (1+1), 750W, Titanium, 200-240VAC",1,null,"[450-ADWT]"]
[]
[null,"Power Cords"]
[null,"Rack Power Cord 2M (C13/C14 12A)",2,null,"[450-AADY]"]
[]
[null,"PCIe Riser"]
[null,{"$f":"VLOOKUP(B29, CPU_A, 9, FALSE)","v":"Riser with up to 1, x8 PCIe Slots + 1, x16 PCIe Slots for x8, 2 PCIe Chassis with 1 Processor"},{"$f":"VLOOKUP($B$29, CPU_A, 10, FALSE)","v":1},null,{"$f":"VLOOKUP($B$29, CPU_A, 11, FALSE)","v":"[330-BBCS]"}]
[]
[null,"Embedded Systems Management"]
[null,"iDrac8, Enterprise",1,null,"[385-BBHO]"]
[]
[null,"Network Daughter Card"]
[null,"Broadcom 5720 QP 1Gb Network Daughter Card",1,null,"[540-BBBW]"]
[]
[null,"Additional Card for PCIe Slot 1 (Low Profile)"]
[null,"None",{"$f":"VLOOKUP($B$99,  PCI_A1, 2, FALSE)","v":""},{"$f":"VLOOKUP($B$99,  PCI_A1, 3, FALSE)","v":""},{"$f":"VLOOKUP($B$99,  PCI_A1, 5, FALSE)","v":""},{"$f":"VLOOKUP($B$99,  PCI_A1, 6, FALSE)","v":""}]
[]
[null,"Additional Card for PCIe Slot 2 (Full height)"]
[null,"None",{"$f":"VLOOKUP($B$102,  PCI_A2, 2, FALSE)","v":""},{"$f":"VLOOKUP($B$102,  PCI_A2, 3, FALSE)","v":""},{"$f":"VLOOKUP($B$102,  PCI_A2, 5, FALSE)","v":""},{"$f":"VLOOKUP($B$102,  PCI_A2, 6, FALSE)","v":""}]
[]
[null,"Bezel"]
[null,"Bezel 8 Drive Chassis",1,null,"[325-BBII]"]
[]
[null,"Rack Rails"]
[null,"ReadyRails™ Sliding Rails Without Cable Management Arm",1,null,"[770-BBBC]"]
[]
[null,"Internal Optical Drive"]
[null,"No Internal Optical Drive for 8 HDD Chassis",1,null,"[429-AAQN]"]
[]
[null,"Server Accessories"]
[null,"PowerEdge SFP+, 10GbE SR/SX, Optical Tranceiver, LC Connector, for Intel and Broadcom,CusKit",{"$f":"(VLOOKUP(B102,PCI_A2,8,FALSE))+((VLOOKUP(B99,PCI_A1,8,FALSE)))","v":0},null,"[407-BBQE]"]
[]
[null,"System Documentation"]
[null,"Electronic System Documentation and OpenManage DVD Kit",1,null,"[343-BBDK]"]
[]
[null,"SHIPPING"]
[null,"R630 Shipping - 8 Drive Chassis, EMEA1 (English/French/German/Spanish/Russian/Hebrew)",1,null,"[340-AMIN]"]
[]
[null,"Order Information"]
[null,"PowerEdge Order - EMEA",1,null,"[800-11671]"]
[]
[null,"Base warranty"]
[null,"3Yr Basic Warranty - Next Business Day - Minimum Warranty",1,null,"[709-12767][709-12768]"]
[]
[null,"Servizi di assitenza"]
[null,"Dell Channel Order - Service Info only",1,null,"[710-31085]"]
[]
[null,"Warranty Upgrades"]
[null,"None",{"$f":"VLOOKUP($B$132,  SO_A1, 2, FALSE)","v":""},{"$f":"VLOOKUP($B$132,  SO_A1, 3, FALSE)","v":""},{"$f":"VLOOKUP($B$132,  SO_A1, 5, FALSE)","v":""},{"$f":"VLOOKUP($B$132,  SO_A1, 6, FALSE)","v":""}]
[]
[null,"Protezione dei dati - Keep Your Hard Drive "]
[null,"None",{"$f":"VLOOKUP($B$135,  SO_A2, 2, FALSE)","v":""},{"$f":"VLOOKUP($B$135,  SO_A2, 3, FALSE)","v":""},{"$f":"VLOOKUP($B$135,  SO_A2,5, FALSE)","v":""},{"$f":"VLOOKUP($B$135,  SO_A2, 6, FALSE)","v":""}]
[]
[null,"Servizi di Installazione"]
[null,"No Installation Service Selected",1,null,"[683-11870]"]
[]
[null,"Channel only - Support Extension"]
[null,"Channel 39M Basic Warranty - Next Business Day",1,null,"[723-28776]"]
[]
[null,"Warranty Upgrades - Non-Std/Local POS"]
[null,"CSTM CONSIP - 39M Onsite Labor Support for CRU for Servers with Basic Warranty",1,null,"[681-24467]"]

{"sheet":"Server10 Lotto3 HP CS250","index":2,"n_rows":66,"n_cols":8,"rows_kept":66,"cut":false,"hidden":false,"merged":[[41,2,41,4],[45,1,45,4],[52,1,52,4],[46,2,46,4],[66,1,66,4],[61,1,61,4],[53,2,53,4],[55,1,55,4],[56,2,56,4],[58,1,58,4],[59,2,59,4],[40,1,40,4],[20,1,20,4],[21,2,21,4],[23,1,23,4],[24,2,24,4],[27,1,27,4],[28,2,28,4],[30,1,30,4],[31,2,31,4],[34,1,34,4],[35,2,35,4],[37,1,37,4],[18,2,18,4],[0,0,3,5],[4,0,4,4],[5,0,5,4],[10,0,11,5],[12,0,12,5]]}
[]
[]
[]
[]
["Server10 Lotto3 CS250-HC",null,null,null,null,null,null,"List Price *"]
[null,null,null,null,null,null,null,{"$f":"F17*C16","v":0}]
[]
[]
[]
[]
["Components: \nHP ConvergedSystem 250-HC StoreVirtual System"]
[]
[]
[]
[" ConvergedSystem 250-HC","Category: Server",null,null,null,{"$f":"75694","v":75694}]
[null,"Quantity: ",null,null,null,{"$f":"SUM(F20:F62)*4","v":0}]
[null,null,null,null,null,{"$f":"SUM(F15:F16)","v":75694}]
[]
[null,"Base"]
[null,"HPE HC 250 System for VMware vSphere Sys",1,null,"M0T03A"]
[]
[null,"Configurazione dello chassis"]
[null,"HPE Hyper Converged 250 Node",4,null,"M0T04A"]
[]
[null,"Processori per singolo Nodo"]
[null,"HPE XL1x0r Gen9 E5-2640v4 Kit",1,null,"793016-L21"]
[null,"HPE XL1x0r Gen9 E5-2640v4 FIO Kit",1,null,"793016-B21"]
[]
[null,"Additional Processor"]
[null,"No Additional Processor",{"$f":"VLOOKUP($B$30, CPU_B, 2, FALSE)","v":0},{"$f":"VLOOKUP($B$30, CPU_B, 3, FALSE)","v":""},null,{"$f":"VLOOKUP(B30, CPU_B, 12, FALSE)","v":""}]
[]
[null,"Processor Thermal Configuration"]
[null,"1 CPU Standard",1,null,"[370-ABWF][374-BBHM][750-AAEL]"]
[null,{"$f":"VLOOKUP($B$30, CPU_B, 6, FALSE)","v":""},{"$f":"VLOOKUP($B$30, CPU_B, 7, FALSE)","v":""},null,{"$f":"VLOOKUP($B$30, CPU_B, 8, FALSE)","v":""}]
[]
[null,"Memory Configuration Type"]
[null,"Performance Optimized",1,null,"[370-AAIP]"]
[]
[null,"Memoria Totale in GB per singolo Nodo",null,{"$f":"IF(('Server10 Lotto3 HP CS250'!$D$12=0),\"\",'Server10 Lotto3 HP CS250'!#REF!)","v":""}]
[null,192]
[]
[null,"Capacità di memoria"]
[null,{"$f":"IF($B$30=\"No Additional Processor\",VLOOKUP($B$40, MEM_B1, 8, FALSE),VLOOKUP($B$40, MEM_B2, 8, FALSE))","v":"HPE 32GB 2Rx4 PC4-2400T-R Kit"},6,null,{"$f":"IF($B$30=\"No Additional Processor\",VLOOKUP($B$40, MEM_B1, 10, FALSE),VLOOKUP($B$40, MEM_B2, 10, FALSE))","v":"728629-B21"}]
[]
[null,{"$f":"IF($B$30=\"No Additional Processor\",VLOOKUP($B$40, MEM_B1, 2, FALSE),VLOOKUP($B$40, MEM_B2, 2, FALSE))","v":""},{"$f":"IF($B$30=\"No Additional Processor\",VLOOKUP($B$40, MEM_B1, 3, FALSE),VLOOKUP($B$40, MEM_B2, 3, FALSE))","v":""},{"$f":"IF($B$30=\"No Additional Processor\",VLOOKUP($B$40, MEM_B1, 4, FALSE),VLOOKUP($B$40, MEM_B2, 4, FALSE))","v":""},{"$f":"IF($B$30=\"No Additional Processor\",VLOOKUP($B$40, MEM_B1, 6, FALSE),VLOOKUP($B$40, MEM_B2, 6, FALSE))","v":""},{"$f":"IF($B$30=\"No Additional Processor\",VLOOKUP($B$40, MEM_B1, 7, FALSE),VLOOKUP($B$40, MEM_B2, 7, FALSE))","v":""}]
[]
[null,"Dischi rigidi per singolo Nodo"]
[null,"HP 480GB 6G SATA MU-3 SFF SC SSD",2,null,"717971-B21"]
[]
[null,"HP 1.2TB 12G SAS 10K 2.5in SC ENT HDD",3,null,"781518-B21"]
[]
[null,"None",{"$f":"VLOOKUP($B$52, HDD_B,4, FALSE)","v":0},{"$f":"VLOOKUP($B$52, HDD_B,3, FALSE)","v":""},{"$f":"VLOOKUP($B$52, HDD_B,5, FALSE)","v":""},{"$f":"VLOOKUP($B$52, HDD_B,6, FALSE)*C52","v":0}]
[]
[null,"Servizi di Installazione"]
[null,"No Installation Service Selected",1,null,"[683-11870]"]
[]
[null,"Channel only - Support Extension"]
[null,"Channel 39M Basic Warranty - Next Business Day",1,null,"[723-28780]"]
[]
[null,"Warranty Upgrades - Non-Std/Local POS"]
[null,"CSTM CONSIP - 39M Onsite Labor Support for CRU for Servers with Basic Warranty",1,null,"[681-24467]"]
[]
[null,"Sistema operativo preinstallato"]
[null,"HPE HC 250 SW LTU for VMware vSphere 6.0",4,null,"M0T20A"]
[null,"VMw vSphere EntPlus 1P 3yr SW",8,null,"BD715A"]
[null,"VMw vCenter Server Std for vSph 3yr SW",1,null,"BD725A"]

{"sheet":"RACK, Accessori e Servizi","index":3,"n_rows":62,"n_cols":17,"rows_kept":62,"cut":false,"hidden":false,"merged":[[0,3,0,8],[16,4,16,7],[19,4,19,7],[22,4,22,7],[49,2,49,6],[15,2,15,7],[24,2,24,7],[18,2,18,7],[21,2,21,7],[25,4,25,7],[13,13,25,17],[4,2,4,7],[6,2,6,7],[10,2,10,7],[13,12,25,12],[11,4,11,7],[2,12,7,12],[9,12,11,12]]}
[null,null,null,"Indicare il numero delle Opzioni"]
[]
[null,null,null,null,null,null,null,null,null,null,null,null,"SERVIZI"]
[null,null,{"$f":"IF(SRV_A+SRV_B+SRV_C>=1,\"Servizi Specialistici\",\"\")","v":""}]
[null,null,{"$f":"IF(SRV_A+SRV_B+SRV_C>=1,\"Servizio Specialistico di creazione, configurazione e installazione fino a 5 VM\",\"\")","v":""},null,null,null,null,null,null,null,{"$f":"IF(J5>=1,\"10L3-SO-AVV\",\"\")","v":""}]
[]
[null,null,{"$f":"IF(SRV_A+SRV_B+SRV_C>=1,\"Servizio Specialistico di migrazione da server fisico a virtuale fino a 5 VM\",\"\")","v":""},null,null,null,null,null,null,null,{"$f":"IF(J7>=1,\"10L3-SO-MIG\",\"\")","v":""}]
[]
[]
[null,null,null,null,null,null,null,null,null,null,null,null,"Solo per CS250-HC"]
[null,null,{"$f":"IF(SRV_B>=1,\"HP 5130-24G-4SFP+ EI Switch\ninclude: 4 x HP X240 10G SFP+ SFP+ 3m DAC Cable\",\"\")","v":""},null,null,null,null,null,null,null,{"$f":"IF(J11>=1,\"10L3-SWITCH\",\"\")","v":""}]
[]
[]
[null,null,null,null,null,null,null,null,null,null,null,null,null,"In questo foglio deve essere indicata la quantità delle opzioni Hardware  e dei Servizi da acquistare.\n\nDi seguito è possibile configurare fino a 10 tipologie di armadio Rack a seconda della tipologia e del numero di Server inseriti al suo interno."]
[null,null,{"$f":"IF(SRV_C+SRV_B>=1,\"Rack (OpzRack)\",\"\")","v":""}]
[null,null,{"$f":"IF(SRV_C+SRV_B>=1,\"Tecnosteel: armadio Rack 19'' 42U ''Tecno SuperServer''\",\"\")","v":""},null,null,null,null,null,null,null,{"$f":"IF(J16>=1,\"10L3-RACK\",\"\")","v":""}]
[]
[null,null,{"$f":"IF(SRV_C+SRV_B>=1,\"KVM (OpzGUIRack)\",\"\")","v":""}]
[null,null,{"$f":"IF(SRV_C+SRV_B>=1,\"Tecnosteel: OneView 1U Rackmount Console 17'' with Italian Keyboard\",\"\")","v":""},null,null,null,null,null,null,null,{"$f":"IF(J19>=1,\"10L3-GUI\",\"\")","v":""}]
[]
[null,null,{"$f":"IF(SRV_C+SRV_B>=1,\"KVM Option (OpzSWGUIRack)\",\"\")","v":""}]
[null,null,{"$f":"IF(SRV_C+SRV_B>=1,\"Tecnosteel: 8-port remote KVM switch with one remote user\",\"\")","v":""},null,null,null,null,null,null,null,{"$f":"IF(J22>=1,\"10L3-KVMIP\",\"\")","v":""}]
[]
[null,null,{"$f":"IF(SRV_C+SRV_B>=1,\"Uninterrupted Power Supply (OpzUPS 3000VA)\",\"\")","v":""}]
[null,null,{"$f":"IF(SRV_C+SRV_B>=1,\"Riello - UPS MSR3000EVO 3000VA 2U Rackmount (SNMP+USB+RS232)\",\"\")","v":""},null,null,null,null,null,null,null,{"$f":"IF(J25>=1,\"10L3-UPS\",\"\")","v":""}]
[]
[]
[null,null,null,"Totale-"]
[null,null,null,"RACK A","RACK B","RACK C","RACK D","RACK E","RACK F","RACK G","RACK H","RACK I","RACK J"]
[null,null,{"$f":"J16","v":0},{"$f":"IF(H50>0,IF(C30-H50=0,0,C30-H50),0)","v":0},{"$f":"IF(I50>0,IF(D30-I50=0,0,D30-I50),0)","v":0},0,0,0,0,0,0,0,0]
[]
[]
[null,null,null,"Server Modello 1",null,null,{"$f":"SRV_C","v":0}]
[null,null,null,"Server Modello 2",null,null,{"$f":"SRV_AA","v":0}]
[null,null,null,"Server Modello 3",null,null,{"$f":"SRV_AAA","v":0}]
[null,null,null,"Server Modello 4",null,null,{"$f":"SRV_B","v":0}]
[null,null,null,"Server Modello 5",null,null,{"$f":"SRV_BB","v":0}]
[null,null,null,"Server Modello 6",null,null,{"$f":"J11","v":0}]
[]
[null,null,null,null,null,null,null,{"$f":"SUM(H4:H11)+H13+H64*2+H66*2","v":0},0,0,0,0,0,0,0,0,0]
[]
[]
[]
[]
[]
[]
[]
[null,null,"Rack ancora da configurare",null,null,{"$f":"J16-H50-I50-J50-K50-L50-M50-N50-O50-P50-Q50","v":0}]
[]
[null,null,"Indicare il numero di rack per questa configurazione"]
[]
[null,null,null,null,"Totali","da inserire",null,{"$f":"IF(C30>0,D29,\"\")","v":""},{"$f":"IF(D30>0,E29,\"\")","v":""},"","","","","","","",""]
[]
[null,null,"DELL PowerEdge VRTX",null,{"$f":"G33","v":0},{"$f":"(E54-(H54*$H$50)-(I54*$I$50)-(J54*$J$50)-(K54*$K$50)-(L54*$L$50)-(M54*$M$50)-(N54*$N$50)-(O54*$O$50)-(P54*$P$50)-(Q54*$Q$50))","v":0}]
[null,null,{"$f":"IF(G36>0,\"HP CS250-HC\",\"\")","v":""},null,{"$f":"G36","v":0},{"$f":"(E55-(H55*$H$50)-(I55*$I$50)-(J55*$J$50)-(K55*$K$50)-(L55*$L$50)-(M55*$M$50)-(N55*$N$50)-(O55*$O$50)-(P55*$P$50)-(Q55*$Q$50))","v":0}]
[null,null,{"$f":"IF(G38>0,\"Switch di rete\",\"\")","v":""},null,{"$f":"J11","v":0},0]
[]
[null,null,{"$f":"IF(J19>0,\"OpzGUIRack Disponibili\",\" \")","v":" "},null,{"$f":"J19","v":0},{"$f":"J19-H58*H50-I58*I50-J58*J50-K58*K50-L58*L50-M58*M50-N58*N50-O58*O50-P58*P50-Q58*Q50","v":0}]
[]
[null,null,{"$f":"IF(J22>0,\"OpzSWGUIRack Disponibili\",\" \")","v":" "},null,{"$f":"J22","v":0},{"$f":"J22-H60*H50-I60*I50-J60*J50-K60*K50-L60*L50-M60*M50-N60*N50-O60*O50-P60*P50-Q60*Q50","v":0}]
[]
[null,null,{"$f":"IF(J25>0,\"OpzUPS 3000VA Disponibili\",\" \")","v":" "},null,{"$f":"J25","v":0},{"$f":"J25-H62*H50-I62*I50-J62*J50-K62*K50-L62*L50-M62*M50-N62*N50-O62*O50-P62*P50-Q62*Q50","v":0}]

{"sheet":"Riepilogo","index":4,"n_rows":83,"n_cols":41,"rows_kept":83,"cut":false,"hidden":false,"merged":[[43,1,43,16],[43,17,43,20],[44,1,44,16],[44,17,44,20],[11,1,11,20],[7,1,7,3],[7,4,7,8],[7,9,7,10],[7,11,7,14],[7,15,7,16],[7,17,7,20],[9,1,9,3],[9,4,9,8],[9,9,9,10],[9,11,9,14],[9,15,9,16],[9,17,9,20],[12,2,12,5],[12,6,12,8],[12,9,12,16],[12,17,12,18],[12,19,12,20],[13,1,13,20],[14,2,14,5],[14,6,14,8],[14,9,14,16],[14,17,14,18],[0,17,1,20],[0,1,0,5],[0,6,0,14],[1,1,1,5],[1,6,1,7],[1,8,5,16],[2,1,2,5],[2,6,2,7],[3,1,3,5],[3,6,3,7],[4,1,4,7],[5,1,5,5],[5,6,5,7],[30,19,30,20],[14,19,14,20],[29,1,29,20],[32,17,32,18],[32,2,32,5],[32,19,32,20],[32,6,32,8],[15,19,15,20],[16,17,16,18],[16,19,16,20],[32,9,32,16],[15,2,15,5],[15,6,15,8],[15,9,15,16],[15,17,15,18],[17,2,17,5],[17,6,17,8],[30,2,30,5],[30,6,30,8],[30,9,30,16],[30,17,30,18],[17,9,17,16],[23,2,23,5],[23,6,23,8],[71,2,71,3],[71,4,71,5],[71,6,71,7],[71,8,71,9],[71,10,71,11],[71,12,71,13],[45,1,45,16],[45,17,45,20],[49,3,50,18],[53,1,53,3],[53,15,53,17],[55,2,55,5],[55,16,55,19],[56,2,56,5],[56,16,56,19],[57,2,57,5],[57,16,57,19],[60,2,60,5],[60,16,60,19],[61,2,61,5],[61,16,61,19],[68,2,68,5],[59,2,59,5],[52,7,70,13],[78,2,81,7],[78,14,81,19],[16,2,16,5],[16,6,16,8],[16,9,16,16],[18,2,18,5],[18,6,18,8],[18,9,18,16],[18,17,18,18],[18,19,18,20],[19,2,19,5],[19,6,19,8],[19,9,19,16],[19,17,19,18],[19,19,19,20],[74,3,75,18],[77,2,77,7],[77,14,77,19],[71,14,71,15],[71,16,71,17],[69,2,69,5],[68,16,68,19],[69,16,69,19],[71,18,71,19],[33,17,33,18],[33,19,33,20],[34,2,34,5],[34,6,34,8],[34,9,34,16],[34,17,34,18],[34,19,34,20],[42,9,42,16],[42,17,42,18],[42,6,42,8],[42,19,42,20],[41,2,41,5],[41,6,41,8],[41,9,41,16],[41,17,41,18],[41,19,41,20],[35,2,35,5],[28,17,28,18],[23,9,23,16],[38,17,38,18],[38,19,38,20],[40,19,40,20],[39,2,39,5],[39,6,39,8],[39,9,39,16],[39,17,39,18],[36,1,36,20],[39,19,39,20],[37,2,37,5],[37,6,37,8],[37,9,37,16],[37,17,37,18],[35,6,35,8],[35,9,35,16],[35,17,35,18],[35,19,35,20],[26,6,26,8],[26,9,26,16],[23,17,23,18],[23,19,23,20],[33,9,33,16],[24,2,24,5],[24,6,24,8],[24,9,24,16],[24,17,24,18],[24,19,24,20],[17,17,17,18],[17,19,17,20],[20,2,20,5],[20,6,20,8],[20,9,20,16],[20,17,20,18],[20,19,20,20],[21,2,21,5],[21,6,21,8],[21,9,21,16],[21,17,21,18],[21,19,21,20],[22,2,22,5],[22,6,22,8],[22,9,22,16],[22,17,22,18],[22,19,22,20],[25,2,25,5],[25,6,25,8],[25,9,25,16],[25,17,25,18],[25,19,25,20],[62,2,62,5],[63,2,63,5],[64,2,64,5],[27,19,27,20],[28,19,28,20],[31,19,31,20],[37,19,37,20],[40,2,40,5],[40,6,40,8],[40,9,40,16],[40,17,40,18],[38,2,38,5],[38,6,38,8],[38,9,38,16],[59,16,59,19],[42,2,42,5],[26,17,26,18],[26,19,26,20],[26,2,26,5],[65,2,65,5],[66,2,66,5],[67,2,67,5],[27,2,27,5],[27,6,27,8],[27,9,27,16],[27,17,27,18],[28,2,28,5],[28,6,28,8],[31,2,31,5],[31,6,31,8],[31,9,31,16],[31,17,31,18],[58,16,58,19],[62,16,62,19],[63,16,63,19],[64,16,64,19],[65,16,65,19],[66,16,66,19],[67,16,67,19],[58,2,58,5],[33,2,33,5],[33,6,33,8],[28,9,28,16]]}
[null,"Amministrazione ",null,null,null,null,null,null,null,null,null,null,null,null,null,null,null,"CONFIGURATORE ELETTRONICO CONVENZIONE CONSIP \nSERVER 10 LOTTO 3",null,null,null,1]
[null,"N° Identificativo Ordine ",null,null,null,null,null,null,{"$f":"IF(G4=R46,\"Configurazione OK\",U4)","v":"Nel \"Tot Ordine Portale CONSIP\" deve essere inserito l'importo totale risultante dall'ordinativo del portale CONSIP.\nQualora l'importo inserito corrisponde al valore ricalcolato dal configuratore viene attivato il pulsante \"Salva in formato PDF\" che permette di generare il file pdf da allegare all'ordinativo."},null,null,null,null,null,null,null,null,null,null,null,null,1]
[null,"Data Ordine",null,null,null,null,null,null,null,null,null,null,null,null,null,null,null,null,null,null,null,1]
[null,"Tot Ordine Portale CONSIP IVA incl.",null,null,null,null,"x",null,null,null,null,null,null,null,null,null,null,null,null,null,"Nel \"Tot Ordine Portale CONSIP\" deve essere inserito l'importo totale risultante dall'ordinativo del portale CONSIP.\nQualora l'importo inserito corrisponde al valore ricalcolato dal configuratore viene attivato il pulsante \"Salva in formato PDF\" che permette di generare il file pdf da allegare all'ordinativo.",1]
[null,"LE CELLE IN GIALLO DEVO ESSERE COMPILATE OBBLIGATORIAMENTE",null,null,null,null,null,null,null,null,null,null,null,null,null,null,null,null,null,null,null,1]
[null,"Quantità Server Ordinati",null,null,null,null,{"$f":"IF(B31=\"\",0,B31)+IF(B15=\"\",0,B15)","v":0},null,null,null,null,null,null,null,null,null,null,null,null,"ver. 4.1",null,1]
[null,null,null,null,null,null,null,null,null,null,null,null,null,null,null,null,null,null,null,null,null,1]
[null,"Referente per la Consegna",null,null,null,null,null,null,null,"Telefono",null,null,null,null,null,"email",null,null,null,null,null,1]
[null,null,null,null,null,null,null,null,null,null,null,null,null,null,null,null,null,null,null,null,null,1]
[null,"Referente per l'installazione",null,null,null,null,null,null,null,"Telefono",null,null,null,null,null,"email",null,null,null,null,null,1]
[null,null,null,null,null,null,null,null,null,null,null,null,null,null,null,null,null,null,null,null,null,1]
[null,"ATTENZIONE: I CODICI PRODOTTO DELL'ORDINE CONSIP DEVONO ESSERE SPECULARI A QUELLI GENERATI DAL CONFIGURATORE.",null,null,null,null,null,null,null,null,null,null,null,null,null,null,null,null,null,null,null,1]
[null,"Qtà Totale Ordinata","Oggetto di fornitura",null,null,null,"Codice Prodotto",null,null,"Descrizione Sintetica (si faccia riferimento alla guida alla convenzione per la descrizione estesa e per le regole di acquisto delle opzioni)",null,null,null,null,null,null,null,"Costo Unitario",null,"Costo Complessivo",null,1]
[null,"Server DC-Box General Purpose (DELL PowerEdge VRTX)",null,null,null,null,null,null,null,null,null,null,null,null,null,null,null,null,null,null,null,{"$f":"IF(B15>=\"\",0,1)","v":0},null,"Server1","Server2","Server3"]
[null,{"$f":"IF(AE15>=1,AE15,\"\")","v":""},{"$f":"IF(AE15>0,(VLOOKUP(G15,COD_C,2,FALSE)),\"\")","v":""},null,null,null,{"$f":"IF(AE15>=1,W15,\"\")","v":""},null,null,{"$f":"IF(AE15>0,(VLOOKUP(G15,COD_C,5,FALSE)),\"\")","v":""},null,null,null,null,null,null,null,{"$f":"IF(AE15>0,(VLOOKUP(G15,COD_C,3,FALSE)),\"\")","v":""},null,{"$f":"IF(B15=\"\",\"\",R15*B15)","v":""},null,{"$f":"IF(B15>=\"\",0,1)","v":0},"10L3-VRTX-U",{"$f":"SRV_C","v":0},{"$f":"SRV_AA","v":0},{"$f":"SRV_AAA","v":0},null,null,null,null,{"$f":"SUM(X15:AD15)","v":0}]
[null,{"$f":"IF(AE16>=1,AE16,\"\")","v":""},"",null,null,null,{"$f":"IF(AE16>=1,W16,\"\")","v":""},null,null,"",null,null,null,null,null,null,null,"",null,{"$f":"IF(B16=\"\",\"\",R16*B16)","v":""},null,{"$f":"IF(B16>=\"\",0,1)","v":0},"10L3-BLADE-U",{"$f":"'Server10 Lotto3 VRTX'!C95-2","v":0},{"$f":"'Server10 Lotto1 R630 2'!$C$29","v":0},{"$f":"'Server10 Lotto1 R630 3'!$C$29","v":0},null,{"$f":"X16*$X$15","v":0},{"$f":"Y16*$Y$15","v":0},{"$f":"Z16*$Z$15","v":0},{"$f":"SUM(AB16:AD16)","v":0}]
[null,{"$f":"IF(AE17>=1,AE17,\"\")","v":""},"",null,null,null,{"$f":"IF(AE17>=1,W17,\"\")","v":""},null,null,"",null,null,null,null,null,null,null,"",null,{"$f":"IF(B17=\"\",\"\",R17*B17)","v":""},null,0,"10L3-CPU-U",{"$f":"'Server10 Lotto3 VRTX'!C110*'Server10 Lotto3 VRTX'!C95","v":0},{"$f":"IF(MEM_AA=\"\",0,MEM_AA)","v":0},{"$f":"IF(MEM_AAA=\"\",0,MEM_AAA)","v":0},null,{"$f":"X17*$X$15","v":0},{"$f":"Y17*$Y$15","v":0},{"$f":"Z17*$Z$15","v":0},{"$f":"SUM(AB17:AD17)","v":0}]
[null,"","",null,null,null,"",null,null,"",null,null,null,null,null,null,null,"",null,"",null,0,"10L3-16GB-VRTX",{"$f":"IF(MEM_C=\"\",0,MEM_C)*'Server10 Lotto3 VRTX'!C95","v":0},{"$f":"IF(MEM_AA32=\"\",0,MEM_AA32)","v":0},{"$f":"IF(MEM_AAA32=\"\",0,MEM_AAA32)","v":0},null,{"$f":"X18*$X$15","v":0},{"$f":"Y18*$Y$15","v":0},{"$f":"Z18*$Z$15","v":0},{"$f":"SUM(AB18:AD18)","v":0}]
[null,"","",null,null,null,"",null,null,"",null,null,null,null,null,null,null,"",null,"",null,0,"10L3-32GB-VRTX",{"$f":"IF(MEM_C32=\"\",0,MEM_C32)*'Server10 Lotto3 VRTX'!C95","v":0},{"$f":"COUNTIF($AJ$19:$AJ$20,W19)","v":0},{"$f":"COUNTIF($AK$19:$AK$20,W19)","v":0},null,{"$f":"X19*$X$15","v":0},{"$f":"Y19*$Y$15","v":0},{"$f":"Z19*$Z$15","v":0},{"$f":"SUM(AB19:AD19)","v":0},null,null,"slot1",{"$f":"'Server10 Lotto3 VRTX'!$D$70","v":""},{"$f":"'Server10 Lotto1 R630 2'!$D$99","v":""},{"$f":"'Server10 Lotto1 R630 3'!$D$99","v":""}]
[null,"","",null,null,null,"",null,null,"",null,null,null,null,null,null,null,"",null,"",null,0,"10L3-LAN1GB",{"$f":"COUNTIF($AI$19:$AI$26,W20)","v":0},{"$f":"COUNTIF($AJ$19:$AJ$20,W20)","v":0},{"$f":"COUNTIF($AK$19:$AK$20,W20)","v":0},null,{"$f":"X20*$X$15","v":0},{"$f":"Y20*$Y$15","v":0},{"$f":"Z20*$Z$15","v":0},{"$f":"SUM(AB20:AD20)","v":0},null,null,"slot2",{"$f":"'Server10 Lotto3 VRTX'!$D$73","v":""},{"$f":"'Server10 Lotto1 R630 2'!$D$102","v":""},{"$f":"'Server10 Lotto1 R630 3'!$D$102","v":""}]
[null,"","",null,null,null,"",null,null,"",null,null,null,null,null,null,null,"",null,"",null,0,"10L3-LAN1GB-LP",{"$f":"COUNTIF($AI$19:$AI$26,W21)","v":0},0,0,null,{"$f":"X21*$X$15","v":0},{"$f":"Y21*$Y$15","v":0},{"$f":"Z21*$Z$15","v":0},{"$f":"SUM(AB21:AD21)","v":0},null,null,"slot3",{"$f":"'Server10 Lotto3 VRTX'!$D$76","v":""}]
[null,"","",null,null,null,"",null,null,"",null,null,null,null,null,null,null,"",null,"",null,0,"10L3-LAN10GB",{"$f":"COUNTIF($AI$19:$AI$26,W22)","v":0},0,0,null,0,0,0,0,null,null,"slot4",{"$f":"'Server10 Lotto3 VRTX'!$D$79","v":""}]
[null,"","",null,null,null,"",null,null,"",null,null,null,null,null,null,null,"",null,"",null,0,"10L3-LAN10GB-LP",{"$f":"COUNTIF($AI$19:$AI$26,W23)","v":0},0,0,null,0,0,0,0,null,null,"slot5",{"$f":"'Server10 Lotto3 VRTX'!$D$82","v":""}]
[null,"","",null,null,null,{"$f":"IF(AE24>=1,W24,\"\")","v":""},null,null,"",null,null,null,null,null,null,null,"",null,"",null,0,"10L3-CNA10",{"$f":"COUNTIF($AI$19:$AI$26,W24)","v":0},0,0,null,{"$f":"X24*$X$15","v":0},0,0,0,null,null,"slot6",{"$f":"'Server10 Lotto3 VRTX'!$D$85","v":""}]
[null,"","",null,null,null,"",null,null,"",null,null,null,null,null,null,null,"",null,"",null,0,"10L3-CNA10-LP",{"$f":"COUNTIF($AI$19:$AI$26,W25)","v":0},{"$f":"COUNTIF($AJ$19:$AJ$20,#REF!)","v":0},{"$f":"COUNTIF($AK$19:$AK$20,#REF!)","v":0},null,0,0,0,0,null,null,"slot7",{"$f":"'Server10 Lotto3 VRTX'!$D$88","v":""}]
[null,{"$f":"IF(AE26>=1,AE26,\"\")","v":""},"",null,null,null,"",null,null,"",null,null,null,null,null,null,null,"",null,"",null,0,"10L3-FC-U",0,{"$f":"COUNTIF($AJ$19:$AJ$20,W25)","v":0},{"$f":"COUNTIF($AK$19:$AK$20,W25)","v":0},null,0,0,0,0,null,null,"slot8",{"$f":"'Server10 Lotto3 VRTX'!$D$91","v":""}]
[null,"","",null,null,null,"",null,null,"",null,null,null,null,null,null,null,"",null,"",null,0,"10L3-FC-LP-U",0,{"$f":"HD300_AA","v":0},{"$f":"HD300_AAA","v":0},null,{"$f":"X27*$X$15","v":0},{"$f":"Y27*$Y$15","v":0},{"$f":"Z27*$Z$15","v":0},{"$f":"SUM(AB27:AD27)","v":0}]
[null,"","",null,null,null,{"$f":"IF(AE28>=1,W28,\"\")","v":""},null,null,"",null,null,null,null,null,null,null,"",null,"",null,0,"10L3-HDD300GB-DELL",{"$f":"HD300_C","v":0},{"$f":"IF('Server10 Lotto1 R630 2'!$D$132=W26,'Server10 Lotto1 R630 2'!$C$132,0)","v":0},{"$f":"IF('Server10 Lotto1 R630 3'!$D$132=W26,'Server10 Lotto1 R630 3'!$C$132,0)","v":0},null,{"$f":"X28*$X$15","v":0},{"$f":"Y28*$Y$15","v":0},{"$f":"Z28*$Z$15","v":0},{"$f":"SUM(AB28:AD28)","v":0}]
[null,"","",null,null,null,"",null,null,"",null,null,null,null,null,null,null,"",null,"",null,0,"10L3-HDD1TB-DELL",{"$f":"HD1000_c","v":0},{"$f":"IF('Server10 Lotto1 R630 2'!$D$135=W27,'Server10 Lotto1 R630 2'!$C$135,0)","v":0},{"$f":"IF('Server10 Lotto1 R630 3'!$D$135=W27,'Server10 Lotto1 R630 3'!$C$135,0)","v":0},null,{"$f":"X29*$X$15","v":0},{"$f":"Y29*$Y$15","v":0},{"$f":"Z29*$Z$15","v":0},{"$f":"SUM(AB29:AD29)","v":0},null,{"$f":"IF(X29=0,0,IF(X29+X28=2,5,IF(X29+#REF!=2,4,3)))","v":0},{"$f":"IF(Y29=0,0,IF(Y29+Y28=2,5,IF(Y29+#REF!=2,4,3)))","v":0},{"$f":"IF(Z29=0,0,IF(Z29+Z28=2,5,IF(Z29+#REF!=2,4,3)))","v":0},{"$f":"IF(AG29=5,#REF!,IF(AG29=4,#REF!,IF(AG29=3,#REF!,\"\")))","v":""},{"$f":"IF(AH29=5,#REF!,IF(AH29=4,#REF!,IF(AH29=3,#REF!,\"\")))","v":""},{"$f":"IF(AI29=5,#REF!,IF(AI29=4,#REF!,IF(AI29=3,#REF!,\"\")))","v":""}]
[null,"Server DC-Box Sddc (HP ConvergedSystem 250-HC StoreVirtual System)",null,null,null,null,null,null,null,null,null,null,null,null,null,null,null,null,null,null,null,{"$f":"IF(B31>=\"\",0,1)","v":0},"CS250-HC-U","Server1","Server2","Server3"]
[null,{"$f":"IF(AE31>=1,AE31,\"\")","v":""},{"$f":"IF(AE31>0,(VLOOKUP(G31,COD_A,2,FALSE)),\"\")","v":""},null,null,null,{"$f":"IF(AE31>=1,W31,\"\")","v":""},null,null,{"$f":"IF(AE31>0,(VLOOKUP(G31,COD_A,5,FALSE)),\"\")","v":""},null,null,null,null,null,null,null,{"$f":"IF(AE31>0,(VLOOKUP(G31,COD_A,3,FALSE)),\"\")","v":""},null,{"$f":"IF(B31=\"\",\"\",R31*B31)","v":""},null,0,"10L3-250HC-U",{"$f":"SRV_B","v":0},{"$f":"SRV_BB","v":0},{"$f":"SRV_BBB","v":0},null,null,null,null,{"$f":"SUM(X31:AD31)","v":0}]
[null,{"$f":"IF(AE32>=1,AE32,\"\")","v":""},"",null,null,null,{"$f":"IF(AE32>=1,W32,\"\")","v":""},null,null,"",null,null,null,null,null,null,null,"",null,{"$f":"IF(B32=\"\",\"\",R32*B32)","v":""},null,0,"10L3-32GB-HP-U",{"$f":"IF(MEM_B=\"\",0,MEM_B)*4","v":0},null,null,null,{"$f":"X32*$X$31","v":0},{"$f":"Y32*$Y$31","v":0},{"$f":"Z32*$Z$31","v":0},{"$f":"SUM(AB32:AD32)","v":0}]
[null,"","",null,null,null,{"$f":"IF(AE33>=1,W33,\"\")","v":""},null,null,"",null,null,null,null,null,null,null,"",null,"",null,0,"10L3-HD1TB-HP-U",{"$f":"HD300_B*4","v":0},{"$f":"COUNTIF($AJ$33:$AJ$35,W33)","v":0},{"$f":"COUNTIF($AK$33:$AK$35,W33)","v":0},null,{"$f":"X33*$X$31","v":0},{"$f":"Y33*$Y$31","v":0},{"$f":"Z33*$Z$31","v":0},{"$f":"SUM(AB33:AD33)","v":0},null,null,"slot1",{"$f":"'Server10 Lotto3 HP CS250'!#REF!","v":{"$error":"#REF!"}},{"$f":"'Server10 Lotto1 R730xd 2'!$D$99","v":""},{"$f":"'Server10 Lotto1 R730xd 3'!$D$99","v":""}]
[null,"","",null,null,null,"",null,null,"",null,null,null,null,null,null,null,"",null,"",null,0,"10L3-HD300-HP-U",{"$f":"COUNTIF($AI$33:$AI$35,W34)","v":0},{"$f":"COUNTIF($AJ$33:$AJ$35,W34)","v":0},{"$f":"COUNTIF($AK$33:$AK$35,W34)","v":0},null,{"$f":"X34*$X$31","v":0},{"$f":"Y34*$Y$31","v":0},{"$f":"Z34*$Z$31","v":0},{"$f":"SUM(AB34:AD34)","v":0},null,null,"slot2",{"$f":"'Server10 Lotto3 HP CS250'!#REF!","v":{"$error":"#REF!"}},{"$f":"'Server10 Lotto1 R730xd 2'!$D$102","v":""},{"$f":"'Server10 Lotto1 R730xd 3'!$D$102","v":""}]
[null,"","",null,null,null,"",null,null,"",null,null,null,null,null,null,null,"",null,"",null,0,"10L3-16GB-HP-U",{"$f":"COUNTIF($AI$33:$AI$35,W35)","v":0},{"$f":"COUNTIF($AJ$33:$AJ$35,W35)","v":0},{"$f":"COUNTIF($AK$33:$AK$35,W35)","v":0},null,0,0,0,0,null,null,"slot3",{"$f":"'Server10 Lotto3 HP CS250'!#REF!","v":{"$error":"#REF!"}},{"$f":"'Server10 Lotto1 R730xd 2'!D105","v":""},{"$f":"'Server10 Lotto1 R730xd 3'!D105","v":""}]
[null,"","",null,null,null,"",null,null,"",null,null,null,null,null,null,null,"",null,{"$f":"IF(B36=\"\",\"\",R36*B36)","v":""},null,0,"10L3-SWITCH",{"$f":"'RACK, Accessori e Servizi'!J11","v":0},{"$f":"IF('Server10 Lotto1 R730xd 2'!$D$141=W36,'Server10 Lotto1 R730xd 2'!$C$141,0)","v":0},{"$f":"IF('Server10 Lotto1 R730xd 3'!$D$141=W36,'Server10 Lotto1 R730xd 3'!$C$141,0)","v":0},null,{"$f":"X36","v":0},{"$f":"Y36*$Y$31","v":0},{"$f":"Z36*$Z$31","v":0},{"$f":"SUM(AB36:AD36)","v":0}]
[null,"OPZIONI COMUNI",null,null,null,null,null,null,null,null,null,null,null,null,null,null,null,null,null,null,null,1,null,"R630","R630 1","R630 2","R730xd","R730xd 1","R730xd 2","T630",null,null,null,null,null,null,null,null,"R630","R730xd","T630"]
[null,{"$f":"IF('RACK, Accessori e Servizi'!J16=0,\"\",'RACK, Accessori e Servizi'!J16)","v":""},{"$f":"IF(B38>0,(VLOOKUP(G38,COD_A,2,FALSE)),\"\")","v":""},null,null,null,{"$f":"IF('RACK, Accessori e Servizi'!J16>0,'RACK, Accessori e Servizi'!K16,\"\")","v":""},null,null,{"$f":"IF(B38>0,(VLOOKUP(G38,COD_A,5,FALSE)),\"\")","v":""},null,null,null,null,null,null,null,{"$f":"IF(B38>0,(VLOOKUP(G38,COD_A,3,FALSE)),\"\")","v":""},null,{"$f":"IF(B38=\"\",\"\",R38*B38)","v":""},null,0]
[null,{"$f":"IF('RACK, Accessori e Servizi'!J19=0,\"\",'RACK, Accessori e Servizi'!J19)","v":""},"",null,null,null,{"$f":"IF('RACK, Accessori e Servizi'!J19>0,'RACK, Accessori e Servizi'!K19,\"\")","v":""},null,null,"",null,null,null,null,null,null,null,"",null,{"$f":"IF(B39=\"\",\"\",R39*B39)","v":""},null,0]
[null,{"$f":"IF('RACK, Accessori e Servizi'!J22=0,\"\",'RACK, Accessori e Servizi'!J22)","v":""},"",null,null,null,{"$f":"IF('RACK, Accessori e Servizi'!J22>0,'RACK, Accessori e Servizi'!K22,\"\")","v":""},null,null,"",null,null,null,null,null,null,null,"",null,"",null,0]
[null,{"$f":"IF('RACK, Accessori e Servizi'!J25=0,\"\",'RACK, Accessori e Servizi'!J25)","v":""},"",null,null,null,{"$f":"IF('RACK, Accessori e Servizi'!J25>0,'RACK, Accessori e Servizi'!K25,\"\")","v":""},null,null,"",null,null,null,null,null,null,null,"",null,"",null,0]
[null,{"$f":"IF('RACK, Accessori e Servizi'!J5=0,\"\",'RACK, Accessori e Servizi'!J5)","v":""},{"$f":"IF(B42>0,(VLOOKUP(G42,COD_A,2,FALSE)),\"\")","v":""},null,null,null,{"$f":"IF('RACK, Accessori e Servizi'!J5>0,'RACK, Accessori e Servizi'!K5,\"\")","v":""},null,null,{"$f":"IF(B42>0,(VLOOKUP(G42,COD_A,5,FALSE)),\"\")","v":""},null,null,null,null,null,null,null,{"$f":"IF(B42>0,(VLOOKUP(G42,COD_A,3,FALSE)),\"\")","v":""},null,"",null,0]
[null,{"$f":"IF('RACK, Accessori e Servizi'!J7=0,\"\",'RACK, Accessori e Servizi'!J7)","v":""},{"$f":"IF(B43>0,(VLOOKUP(G43,COD_A,2,FALSE)),\"\")","v":""},null,null,null,{"$f":"IF('RACK, Accessori e Servizi'!J7>0,'RACK, Accessori e Servizi'!K7,\"\")","v":""},null,null,{"$f":"IF(B43>0,(VLOOKUP(G43,COD_A,5,FALSE)),\"\")","v":""},null,null,null,null,null,null,null,{"$f":"IF(B43>0,(VLOOKUP(G43,COD_A,3,FALSE)),\"\")","v":""},null,"",null,0]
[null,"I.V.A.",null,null,null,null,null,null,null,null,null,null,null,null,null,null,null,{"$f":"R45*22%","v":0},null,null,null,1]
[null,"TOTALE COSTO (I.V.A. Esclusa)",null,null,null,null,null,null,null,null,null,null,null,null,null,null,null,{"$f":"SUM(T15:U43)","v":0},null,null,null,1]
[null,"TOTALE ORDINE",null,null,null,null,null,null,null,null,null,null,null,null,null,null,null,{"$f":"SUM(R44:U45)","v":0},null,null,null,1]
[null,null,null,null,null,null,null,null,null,null,null,null,null,null,null,null,null,null,null,null,null,1]
[null,null,null,null,null,null,null,null,null,null,null,null,null,null,null,null,null,null,null,null,null,1]
[null,null,null,null,null,null,null,null,null,null,null,null,null,null,null,null,null,null,null,null,null,1]
[null,null,null,{"$f":"IF(G6>0,\"DETTAGLIO CONFIGURAZIONI SERVER LOTTO 3 \",\"\")","v":""},null,null,null,null,null,null,null,null,null,null,null,null,null,null,null,null,null,1]
[null,null,null,null,null,null,null,null,null,null,null,null,null,null,null,null,null,null,null,null,null,1]
[null,null,null,null,null,null,null,null,null,null,null,null,null,null,null,null,null,null,null,null,null,1]
[null,null,null,null,null,null,null,null,null,null,null,null,null,null,null,null,null,null,null,null,null,{"$f":"IF($E$54+$S$54=0,0,1)","v":0}]
[null,"DELL PowerEdge VRTX",null,null,{"$f":"SRV_C","v":0},"Server",null,null,null,null,null,null,null,null,null,"HP Converged System 250-HC",null,null,{"$f":"SRV_B","v":0},"Server",null,{"$f":"IF($E$54+$S$54=0,0,1)","v":0}]
[null,null,null,null,null,null,null,null,null,null,null,null,null,null,null,null,null,null,null,null,null,0]
[null,{"$f":"IF(SRV_C>0,\"1\",\"-\")","v":"-"},{"$f":"IF(B56=\"-\",\"-\",CONCATENATE(MID($C$15,1,21),\" - \",$G$15))","v":"-"},null,null,null,null,null,null,null,null,null,null,null,null,{"$f":"IF(SRV_B>0,\"1\",\"-\")","v":"-"},{"$f":"IF(P56=\"-\",\"-\",CONCATENATE(MID($C$31,1,21),\" - \",$G$31))","v":"-"},null,null,null,null,{"$f":"IF(W56=0,0,1)","v":0},{"$f":"X56+Y56","v":0},{"$f":"IF(B56=\"-\",0,1)","v":0},{"$f":"IF(P56=\"-\",0,1)","v":0}]
[null,{"$f":"IF(X16=0,\"-\",X16)","v":"-"},{"$f":"IF(B57=\"-\",\"-\",CONCATENATE(MID($C$16,1,21),\" - \",$G$16))","v":"-"},null,null,null,null,null,null,null,null,null,null,null,null,{"$f":"IF(X32=0,\"-\",X32)","v":"-"},{"$f":"IF(P57=\"-\",\"-\",CONCATENATE(MID($C32,1,21),\" - \",$G32))","v":"-"},null,null,null,null,{"$f":"IF(W57=0,0,1)","v":0},{"$f":"X57+Y57","v":0},{"$f":"IF(B57=\"-\",0,1)","v":0},{"$f":"IF(P57=\"-\",0,1)","v":0}]
[null,"-",{"$f":"IF(B58=\"-\",\"-\",CONCATENATE(MID($C$17,1,21),\" - \",$G$17))","v":"-"},null,null,null,null,null,null,null,null,null,null,null,null,{"$f":"IF(X33=0,\"-\",X33)","v":"-"},{"$f":"IF(P58=\"-\",\"-\",CONCATENATE(MID($C33,1,21),\" - \",$G33))","v":"-"},null,null,null,null,0,0,0,0]
[null,"-",{"$f":"IF(B59=\"-\",\"-\",CONCATENATE(MID($C$18,1,21),\" - \",$G$18))","v":"-"},null,null,null,null,null,null,null,null,null,null,null,null,"-","-",null,null,null,null,0,0,0,0]
[null,"-",{"$f":"IF(B60=\"-\",\"-\",CONCATENATE(MID(C19,1,21),\" - \",G19))","v":"-"},null,null,null,null,null,null,null,null,null,null,null,null,"-","-",null,null,null,null,0,0,0,0]
[null,"-","-",null,null,null,null,null,null,null,null,null,null,null,null,"-","-",null,null,null,null,0,0,0,0]
[null,"-","-",null,null,null,null,null,null,null,null,null,null,null,null,{"$f":"\"-\"","v":"-"},"-",null,null,null,null,0,0,0,0]
[null,"-","-",null,null,null,null,null,null,null,null,null,null,null,null,{"$f":"\"-\"","v":"-"},"-",null,null,null,null,0,0,0,0]
[null,"-","-",null,null,null,null,null,null,null,null,null,null,null,null,{"$f":"\"-\"","v":"-"},"-",null,null,null,null,0,0,0,0]
[null,"-","-",null,null,null,null,null,null,null,null,null,null,null,null,{"$f":"\"-\"","v":"-"},"-",null,null,null,null,0,0,0,0]
[null,"-","-",null,null,null,null,null,null,null,null,null,null,null,null,{"$f":"\"-\"","v":"-"},{"$f":"IF(P66=\"-\",\"-\",CONCATENATE(MID(C25,1,21),\" - \",G25))","v":"-"},null,null,null,null,0,0,0,0]
[null,"-","-",null,null,null,null,null,null,null,null,null,null,null,null,"-",{"$f":"IF(P67=\"-\",\"-\",CONCATENATE(MID(C26,1,21),\" - \",G26))","v":"-"},null,null,null,null,0,0,0,0]
[null,"-","-",null,null,null,null,null,null,null,null,null,null,null,null,"-",{"$f":"IF(P68=\"-\",\"-\",CONCATENATE(MID(C27,1,21),\" - \",G27))","v":"-"},null,null,null,null,0,0,0,0]
[null,{"$f":"IF(X28=0,\"-\",X28)","v":"-"},{"$f":"IF(B69=\"-\",\"-\",CONCATENATE(MID(C28,1,21),\" - \",G28))","v":"-"},null,null,null,null,null,null,null,null,null,null,null,null,"-",{"$f":"IF(P69=\"-\",\"-\",CONCATENATE(MID(#REF!,1,21),\" - \",#REF!))","v":"-"},null,null,null,null,0,0,0,0]
[null,"-","-",null,null,null,null,null,null,null,null,null,null,null,null,{"$f":"\"-\"","v":"-"},{"$f":"IF(P70=\"-\",\"-\",CONCATENATE(MID(#REF!,1,21),\" - \",#REF!))","v":"-"},null,null,null,null,0,0,0,0]
[null,null,null,null,null,null,null,null,null,null,null,null,null,null,null,null,null,null,null,null,null,{"$f":"IF($E$54+$S$54=0,0,1)","v":0}]
[null,null,null,null,null,null,null,null,null,null,null,null,null,null,null,null,null,null,null,null,null,1]
[null,null,null,null,null,null,null,null,null,null,null,null,null,null,null,null,null,null,null,null,null,1]
[null,null,null,{"$f":"MID(C72,13,5)","v":""},null,{"$f":"MID(E72,13,5)","v":""},null,"",null,"",null,"",null,"",null,"",null,"",null,"",null,1]
[null,null,null,"AREA RISERVATA AL FORNITORE",null,null,null,null,null,null,null,null,null,null,null,null,null,null,null,null,null,1]
[null,null,null,null,null,null,null,null,null,null,null,null,null,null,null,null,null,null,null,null,null,1]
[null,null,null,null,null,null,null,null,null,null,null,null,null,null,null,null,null,null,null,null,null,1]
[null,null,"VERIFICA STAGING",null,null,null,null,null,null,null,null,null,null,null,"VERIFICA INSTALLATORE",null,null,null,null,null,null,1]
[null,null,null,null,null,null,null,null,null,null,null,null,null,null,null,null,null,null,null,null,null,1]
[null,null,null,null,null,null,null,null,null,null,null,null,null,null,null,null,null,null,null,null,null,1]
[null,null,null,null,null,null,null,null,null,null,null,null,null,null,null,null,null,null,null,null,null,1]
[null,null,null,null,null,null,null,null,null,null,null,null,null,null,null,null,null,null,null,null,null,1]
[null,null,null,null,null,null,null,null,null,null,null,null,null,null,null,null,null,null,null,null,null,1]

{"sheet":"Server10 Lotto1 R630 2","index":5,"n_rows":144,"n_cols":8,"rows_kept":144,"cut":false,"hidden":true,"merged":[[71,8,74,10],[75,8,78,10],[138,1,138,4],[139,2,139,4],[141,1,141,4],[121,2,121,4],[105,1,105,4],[106,2,106,4],[108,1,108,4],[109,2,109,4],[111,1,111,4],[112,2,112,4],[114,1,114,4],[115,2,115,4],[117,1,117,4],[118,2,118,4],[142,2,142,4],[144,1,144,4],[136,2,136,4],[123,1,123,4],[124,2,124,4],[126,1,126,4],[127,2,127,4],[129,1,129,4],[130,2,130,4],[132,1,132,4],[133,2,133,4],[135,1,135,4],[120,1,120,4],[103,2,103,4],[87,1,87,4],[88,2,88,4],[90,1,90,4],[91,2,91,4],[93,1,93,4],[94,2,94,4],[96,1,96,4],[97,2,97,4],[99,1,99,4],[100,2,100,4],[102,1,102,4],[85,2,85,4],[63,1,63,4],[64,2,64,4],[70,1,70,4],[71,2,71,4],[74,1,74,4],[75,2,75,4],[78,1,78,4],[79,2,79,4],[81,1,81,4],[82,2,82,4],[84,1,84,4],[61,2,61,4],[40,2,40,4],[42,1,42,4],[43,2,43,4],[49,1,49,4],[50,2,50,4],[52,1,52,4],[53,2,53,4],[55,1,55,4],[56,2,56,4],[58,1,58,4],[60,1,60,4],[39,1,39,4],[20,1,20,4],[21,2,21,4],[23,1,23,4],[24,2,24,4],[26,1,26,4],[27,2,27,4],[29,1,29,4],[30,2,30,4],[33,1,33,4],[34,2,34,4],[36,1,36,4],[18,2,18,4],[0,0,3,5],[4,0,4,4],[5,0,5,4],[10,0,11,5],[12,0,12,5]]}
[]
[]
[]
[]
["Server10 Lotto1 R630",null,null,null,null,null,null,"List Price *"]
[null,null,null,null,null,null,null,{"$f":"F17*C16","v":0}]
[]
[]
[]
[]
["Components: \nServer DELL PowerEdge R630 (1CPU Intel® Xeon® E5-2650 v3, 32GB RDIMM, 2xHDD 300GB 10K RPM SAS 12Gbps 2.5in)"]
[]
[]
[]
["PowerEdge R630","Category: Server",null,null,null,{"$f":"1806","v":1806}]
[null,"Quantity: ",null,null,null,{"$f":"SUM(F20:F145)","v":0}]
[null,null,null,null,null,{"$f":"SUM(F15:F16)","v":1806}]
[]
[null,"Base"]
[null,"PowerEdge R630 Server, 8HDD, TPM",1,null,"[210-ACXS][329-BCIY][461-AACZ]"]
[]
[null,"Chassis Configuration"]
[null,"Chassis with up to 8, 2.5\" Hard Drives, up to 2 PCIe Slots (With Optional Riser)",1,null,"[321-BBKJ]"]
[]
[null,"Processor"]
[null,"Intel® Xeon® E5-2650 v3 2.3GHz,25M Cache,9.60GT/s QPI,Turbo,HT,10C/20T (105W) Max Mem 2133MHz",1,null,"[338-BFFF]"]
[]
[null,"Additional Processor"]
[null,"No Additional Processor",{"$f":"VLOOKUP($B$29, CPU_A, 2, FALSE)","v":0},{"$f":"VLOOKUP($B$29, CPU_A, 3, FALSE)","v":""},{"$f":"VLOOKUP($B$29, CPU_A, 5, FALSE)","v":"[374-BBBX]"},{"$f":"VLOOKUP(B29, CPU_A, 12, FALSE)","v":""}]
[]
[null,"Processor Thermal Configuration"]
[null,"1 CPU up to 120W",1,null,"[370-ABWN][412-AAEE]"]
[null,{"$f":"VLOOKUP($B$29, CPU_A, 6, FALSE)","v":""},{"$f":"VLOOKUP($B$29, CPU_A, 7, FALSE)","v":""},null,{"$f":"VLOOKUP($B$29, CPU_A, 8, FALSE)","v":""}]
[]
[null,"Memory Configuration Type"]
[null,"Performance Optimized",1,null,"[370-AAIP]"]
[]
[null,"Total Memory in GB",null,{"$f":"IF(('Server10 Lotto1 R630 2'!$D$12=0),\"\",'Server10 Lotto1 R630 2'!#REF!)","v":""}]
[null,32]
[]
[null,"Memory DIMM Type and Speed"]
[null,"2133MT/s RDIMMs ",1,null,"[370-ABUF]"]
[]
[null,"Memory Capacity"]
[null,{"$f":"IF($B$29=\"No Additional Processor\",VLOOKUP($B$39, MEM_A1, 8, FALSE),VLOOKUP($B$39, MEM_A2, 8, FALSE))","v":"16GB RDIMM, 2133MT/s, Dual Rank, x4 Data Width"},{"$f":"IF($B$29=\"No Additional Processor\",VLOOKUP($B$39, MEM_A1, 9, FALSE),VLOOKUP($B$39, MEM_A2, 9, FALSE))","v":"2"},null,{"$f":"IF($B$29=\"No Additional Processor\",VLOOKUP($B$39, MEM_A1, 10, FALSE),VLOOKUP($B$39, MEM_A2, 10, FALSE))","v":"[370-ABUG]"}]
[]
[null,{"$f":"IF($B$29=\"No Additional Processor\",VLOOKUP($B$39, MEM_A1, 2, FALSE),VLOOKUP($B$39, MEM_A2, 2, FALSE))","v":""},{"$f":"IF($B$29=\"No Additional Processor\",VLOOKUP($B$39, MEM_A1, 3, FALSE),VLOOKUP($B$39, MEM_A2, 3, FALSE))","v":""},{"$f":"IF($B$29=\"No Additional Processor\",VLOOKUP($B$39, MEM_A1, 4, FALSE),VLOOKUP($B$39, MEM_A2, 4, FALSE))","v":""},{"$f":"IF($B$29=\"No Additional Processor\",VLOOKUP($B$39, MEM_A1, 6, FALSE),VLOOKUP($B$39, MEM_A2, 6, FALSE))","v":""},{"$f":"IF($B$29=\"No Additional Processor\",VLOOKUP($B$39, MEM_A1, 7, FALSE),VLOOKUP($B$39, MEM_A2, 7, FALSE))","v":""}]
[]
[null,{"$f":"IF($B$29=\"No Additional Processor\",VLOOKUP($B$39, MEM_A1, 11, FALSE),VLOOKUP($B$39, MEM_A2, 11, FALSE))","v":""},{"$f":"IF($B$29=\"No Additional Processor\",VLOOKUP($B$39, MEM_A1, 12, FALSE),VLOOKUP($B$39, MEM_A2, 12, FALSE))","v":""},{"$f":"IF($B$29=\"No Additional Processor\",VLOOKUP($B$39, MEM_A1, 13, FALSE),VLOOKUP($B$39, MEM_A2, 13, FALSE))","v":""},{"$f":"IF($B$29=\"No Additional Processor\",VLOOKUP($B$39, MEM_A1, 15, FALSE),VLOOKUP($B$39, MEM_A2, 15, FALSE))","v":""},{"$f":"IF($B$29=\"No Additional Processor\",VLOOKUP($B$39, MEM_A1, 16, FALSE),VLOOKUP($B$39, MEM_A2, 16, FALSE))","v":""}]
[]
[null,"Operating System"]
[null,"No Operating System",{"$f":"VLOOKUP($B$52, OS_A, 2, FALSE)","v":""},{"$f":"VLOOKUP($B$52, OS_A, 3, FALSE)","v":""},{"$f":"VLOOKUP($B$52, OS_A, 5, FALSE)","v":"[611-BBBF]"},{"$f":"VLOOKUP($B$52, OS_A, 6, FALSE)","v":""}]
[]
[null,"OS Media Kits"]
[null,"No Media Required",1,null,"[605-BBFN]"]
[]
[null,"Client Access Licenses"]
[null,{"$f":"VLOOKUP($B$52, OS_A, 7, FALSE)","v":"None"},null,{"$f":"VLOOKUP($B$52, OS_A, 9, FALSE)","v":""},{"$f":"VLOOKUP($B$52, OS_A, 11, FALSE)","v":""},{"$f":"VLOOKUP($B$52, OS_A, 12, FALSE)*C58","v":0}]
[]
[null,{"$f":"VLOOKUP($B$52, OS_A, 13, FALSE)","v":"None"},null,{"$f":"VLOOKUP($B$52, OS_A, 15, FALSE)","v":""},{"$f":"VLOOKUP($B$52, OS_A, 17, FALSE)","v":""},{"$f":"VLOOKUP($B$52, OS_A, 18, FALSE)*C60","v":0}]
[]
[null,"RAID Controller"]
[null,"PERC H330 RAID Controller",1,null,"[405-AAEF]"]
[]
[null,"Hard Drives"]
[null,"300GB 10K RPM SAS 12Gbps 2.5in Hot-plug Hard Drive",2,null,"[400-AJPK]"]
[]
[null,"300GB 10K RPM SAS 12Gbps 2.5in Hot-plug Hard Drive,CusKit",null,{"$f":"VLOOKUP($B$68, HDD_A,3, FALSE)","v":"10L1-HDD300GB"},{"$f":"VLOOKUP($B$68, HDD_A,5, FALSE)","v":"[400-AJOQ]"},{"$f":"VLOOKUP($B$68, HDD_A,6, FALSE)*C68","v":0}]
[]
[null,"1TB 7.2K RPM NLSAS 6Gbps 2.5in Hot-plug Hard Drive,13G,CusKit",null,{"$f":"VLOOKUP($B$70, HDD_A,3, FALSE)","v":"10L1-HDD1TB"},{"$f":"VLOOKUP($B$70, HDD_A,5, FALSE)","v":"[400-AEFF]"},{"$f":"VLOOKUP($B$70, HDD_A,6, FALSE)*C70","v":0}]
[]
[null,"RAID Configuration HDD 300GB"]
[null,"C3 - RAID 1 for H330 (2 HDDs)",1,null,{"$f":"VLOOKUP($B$73,  RAID_AA1, 2, FALSE)","v":"[780-BBJK]"}]
[null,"Hot Spare for 300GB HDD","No"]
[]
[null,"RAID Configuration HDD 1TB"]
[null,"",1,null,{"$f":"VLOOKUP($B$77,  RAID_AA2, 2, FALSE)","v":""}]
[null,"Hot Spare for 1TB HDD","No"]
[]
[null,"Power Management BIOS Settings"]
[null,"Performance BIOS Setting",1,null,"[384-BBBL]"]
[]
[null,"Power Supply"]
[null,"Dual, Hot-plug, Redundant Power Supply (1+1), 750W, Titanium, 200-240VAC",1,null,"[450-ADWT]"]
[]
[null,"Power Cords"]
[null,"Rack Power Cord 2M (C13/C14 12A)",2,null,"[450-AADY]"]
[]
[null,"PCIe Riser"]
[null,{"$f":"VLOOKUP(B29, CPU_A, 9, FALSE)","v":"Riser with up to 1, x8 PCIe Slots + 1, x16 PCIe Slots for x8, 2 PCIe Chassis with 1 Processor"},{"$f":"VLOOKUP($B$29, CPU_A, 10, FALSE)","v":1},null,{"$f":"VLOOKUP($B$29, CPU_A, 11, FALSE)","v":"[330-BBCS]"}]
[]
[null,"Embedded Systems Management"]
[null,"iDrac8, Enterprise",1,null,"[385-BBHO]"]
[]
[null,"Network Daughter Card"]
[null,"Broadcom 5720 QP 1Gb Network Daughter Card",1,null,"[540-BBBW]"]
[]
[null,"Additional Card for PCIe Slot 1 (Low Profile)"]
[null,"None",{"$f":"VLOOKUP($B$99,  PCI_A1, 2, FALSE)","v":""},{"$f":"VLOOKUP($B$99,  PCI_A1, 3, FALSE)","v":""},{"$f":"VLOOKUP($B$99,  PCI_A1, 5, FALSE)","v":""},{"$f":"VLOOKUP($B$99,  PCI_A1, 6, FALSE)","v":""}]
[]
[null,"Additional Card for PCIe Slot 2 (Full height)"]
[null,"None",{"$f":"VLOOKUP($B$102,  PCI_A2, 2, FALSE)","v":""},{"$f":"VLOOKUP($B$102,  PCI_A2, 3, FALSE)","v":""},{"$f":"VLOOKUP($B$102,  PCI_A2, 5, FALSE)","v":""},{"$f":"VLOOKUP($B$102,  PCI_A2, 6, FALSE)","v":""}]
[]
[null,"Bezel"]
[null,"Bezel 8 Drive Chassis",1,null,"[325-BBII]"]
[]
[null,"Rack Rails"]
[null,"ReadyRails™ Sliding Rails Without Cable Management Arm",1,null,"[770-BBBC]"]
[]
[null,"Internal Optical Drive"]
[null,"No Internal Optical Drive for 8 HDD Chassis",1,null,"[429-AAQN]"]
[]
[null,"Server Accessories"]
[null,"PowerEdge SFP+, 10GbE SR/SX, Optical Tranceiver, LC Connector, for Intel and Broadcom,CusKit",{"$f":"(VLOOKUP(B102,PCI_A2,8,FALSE))+((VLOOKUP(B99,PCI_A1,8,FALSE)))","v":0},null,"[407-BBQE]"]
[]
[null,"System Documentation"]
[null,"Electronic System Documentation and OpenManage DVD Kit",1,null,"[343-BBDK]"]
[]
[null,"SHIPPING"]
[null,"R630 Shipping - 8 Drive Chassis, EMEA1 (English/French/German/Spanish/Russian/Hebrew)",1,null,"[340-AMIN]"]
[]
[null,"Order Information"]
[null,"PowerEdge Order - EMEA",1,null,"[800-11671]"]
[]
[null,"Base warranty"]
[null,"3Yr Basic Warranty - Next Business Day - Minimum Warranty",1,null,"[709-12767][709-12768]"]
[]
[null,"Servizi di assitenza"]
[null,"Dell Channel Order - Service Info only",1,null,"[710-31085]"]
[]
[null,"Warranty Upgrades"]
[null,"None",{"$f":"VLOOKUP($B$132,  SO_A1, 2, FALSE)","v":""},{"$f":"VLOOKUP($B$132,  SO_A1, 3, FALSE)","v":""},{"$f":"VLOOKUP($B$132,  SO_A1, 5, FALSE)","v":""},{"$f":"VLOOKUP($B$132,  SO_A1, 6, FALSE)","v":""}]
[]
[null,"Protezione dei dati - Keep Your Hard Drive "]
[null,"None",{"$f":"VLOOKUP($B$135,  SO_AA2, 2, FALSE)","v":""},{"$f":"VLOOKUP($B$135,  SO_AA2, 3, FALSE)","v":""},{"$f":"VLOOKUP($B$135,  SO_AA2,5, FALSE)","v":""},{"$f":"VLOOKUP($B$135,  SO_AA2, 6, FALSE)","v":""}]
[]
[null,"Servizi di Installazione"]
[null,"No Installation Service Selected",1,null,"[683-11870]"]
[]
[null,"Channel only - Support Extension"]
[null,"Channel 39M Basic Warranty - Next Business Day",1,null,"[723-28776]"]
[]
[null,"Warranty Upgrades - Non-Std/Local POS"]
[null,"CSTM CONSIP - 39M Onsite Labor Support for CRU for Servers with Basic Warranty",1,null,"[681-24467]"]

{"sheet":"Server10 Lotto1 R630 3","index":6,"n_rows":144,"n_cols":8,"rows_kept":144,"cut":false,"hidden":true,"merged":[[71,8,74,10],[75,8,78,10],[138,1,138,4],[139,2,139,4],[141,1,141,4],[121,2,121,4],[105,1,105,4],[106,2,106,4],[108,1,108,4],[109,2,109,4],[111,1,111,4],[112,2,112,4],[114,1,114,4],[115,2,115,4],[117,1,117,4],[118,2,118,4],[142,2,142,4],[144,1,144,4],[136,2,136,4],[123,1,123,4],[124,2,124,4],[126,1,126,4],[127,2,127,4],[129,1,129,4],[130,2,130,4],[132,1,132,4],[133,2,133,4],[135,1,135,4],[120,1,120,4],[103,2,103,4],[87,1,87,4],[88,2,88,4],[90,1,90,4],[91,2,91,4],[93,1,93,4],[94,2,94,4],[96,1,96,4],[97,2,97,4],[99,1,99,4],[100,2,100,4],[102,1,102,4],[85,2,85,4],[63,1,63,4],[64,2,64,4],[70,1,70,4],[71,2,71,4],[74,1,74,4],[75,2,75,4],[78,1,78,4],[79,2,79,4],[81,1,81,4],[82,2,82,4],[84,1,84,4],[61,2,61,4],[40,2,40,4],[42,1,42,4],[43,2,43,4],[49,1,49,4],[50,2,50,4],[52,1,52,4],[53,2,53,4],[55,1,55,4],[56,2,56,4],[58,1,58,4],[60,1,60,4],[39,1,39,4],[20,1,20,4],[21,2,21,4],[23,1,23,4],[24,2,24,4],[26,1,26,4],[27,2,27,4],[29,1,29,4],[30,2,30,4],[33,1,33,4],[34,2,34,4],[36,1,36,4],[18,2,18,4],[0,0,3,5],[4,0,4,4],[5,0,5,4],[10,0,11,5],[12,0,12,5]]}
[]
[]
[]
[]
["Server10 Lotto1 R630",null,null,null,null,null,null,"List Price *"]
[null,null,null,null,null,null,null,{"$f":"F17*C16","v":0}]
[]
[]
[]
[]
["Components: \nServer DELL PowerEdge R630 (1CPU Intel® Xeon® E5-2650 v3, 32GB RDIMM, 2xHDD 300GB 10K RPM SAS 12Gbps 2.5in)"]
[]
[]
[]
["PowerEdge R630","Category: Server",null,null,null,{"$f":"1806","v":1806}]
[null,"Quantity: ",null,null,null,{"$f":"SUM(F20:F145)","v":0}]
[null,null,null,null,null,{"$f":"SUM(F15:F16)","v":1806}]
[]
[null,"Base"]
[null,"PowerEdge R630 Server, 8HDD, TPM",1,null,"[210-ACXS][329-BCIY][461-AACZ]"]
[]
[null,"Chassis Configuration"]
[null,"Chassis with up to 8, 2.5\" Hard Drives, up to 2 PCIe Slots (With Optional Riser)",1,null,"[321-BBKJ]"]
[]
[null,"Processor"]
[null,"Intel® Xeon® E5-2650 v3 2.3GHz,25M Cache,9.60GT/s QPI,Turbo,HT,10C/20T (105W) Max Mem 2133MHz",1,null,"[338-BFFF]"]
[]
[null,"Additional Processor"]
[null,"No Additional Processor",{"$f":"VLOOKUP($B$29, CPU_A, 2, FALSE)","v":0},{"$f":"VLOOKUP($B$29, CPU_A, 3, FALSE)","v":""},{"$f":"VLOOKUP($B$29, CPU_A, 5, FALSE)","v":"[374-BBBX]"},{"$f":"VLOOKUP(B29, CPU_A, 12, FALSE)","v":""}]
[]
[null,"Processor Thermal Configuration"]
[null,"1 CPU up to 120W",1,null,"[370-ABWN][412-AAEE]"]
[null,{"$f":"VLOOKUP($B$29, CPU_A, 6, FALSE)","v":""},{"$f":"VLOOKUP($B$29, CPU_A, 7, FALSE)","v":""},null,{"$f":"VLOOKUP($B$29, CPU_A, 8, FALSE)","v":""}]
[]
[null,"Memory Configuration Type"]
[null,"Performance Optimized",1,null,"[370-AAIP]"]
[]
[null,"Total Memory in GB",null,{"$f":"IF(('Server10 Lotto1 R630 3'!$D$12=0),\"\",'Server10 Lotto1 R630 3'!#REF!)","v":""}]
[null,32]
[]
[null,"Memory DIMM Type and Speed"]
[null,"2133MT/s RDIMMs ",1,null,"[370-ABUF]"]
[]
[null,"Memory Capacity"]
[null,{"$f":"IF($B$29=\"No Additional Processor\",VLOOKUP($B$39, MEM_A1, 8, FALSE),VLOOKUP($B$39, MEM_A2, 8, FALSE))","v":"16GB RDIMM, 2133MT/s, Dual Rank, x4 Data Width"},{"$f":"IF($B$29=\"No Additional Processor\",VLOOKUP($B$39, MEM_A1, 9, FALSE),VLOOKUP($B$39, MEM_A2, 9, FALSE))","v":"2"},null,{"$f":"IF($B$29=\"No Additional Processor\",VLOOKUP($B$39, MEM_A1, 10, FALSE),VLOOKUP($B$39, MEM_A2, 10, FALSE))","v":"[370-ABUG]"}]
[]
[null,{"$f":"IF($B$29=\"No Additional Processor\",VLOOKUP($B$39, MEM_A1, 2, FALSE),VLOOKUP($B$39, MEM_A2, 2, FALSE))","v":""},{"$f":"IF($B$29=\"No Additional Processor\",VLOOKUP($B$39, MEM_A1, 3, FALSE),VLOOKUP($B$39, MEM_A2, 3, FALSE))","v":""},{"$f":"IF($B$29=\"No Additional Processor\",VLOOKUP($B$39, MEM_A1, 4, FALSE),VLOOKUP($B$39, MEM_A2, 4, FALSE))","v":""},{"$f":"IF($B$29=\"No Additional Processor\",VLOOKUP($B$39, MEM_A1, 6, FALSE),VLOOKUP($B$39, MEM_A2, 6, FALSE))","v":""},{"$f":"IF($B$29=\"No Additional Processor\",VLOOKUP($B$39, MEM_A1, 7, FALSE),VLOOKUP($B$39, MEM_A2, 7, FALSE))","v":""}]
[]
[null,{"$f":"IF($B$29=\"No Additional Processor\",VLOOKUP($B$39, MEM_A1, 11, FALSE),VLOOKUP($B$39, MEM_A2, 11, FALSE))","v":""},{"$f":"IF($B$29=\"No Additional Processor\",VLOOKUP($B$39, MEM_A1, 12, FALSE),VLOOKUP($B$39, MEM_A2, 12, FALSE))","v":""},{"$f":"IF($B$29=\"No Additional Processor\",VLOOKUP($B$39, MEM_A1, 13, FALSE),VLOOKUP($B$39, MEM_A2, 13, FALSE))","v":""},{"$f":"IF($B$29=\"No Additional Processor\",VLOOKUP($B$39, MEM_A1, 15, FALSE),VLOOKUP($B$39, MEM_A2, 15, FALSE))","v":""},{"$f":"IF($B$29=\"No Additional Processor\",VLOOKUP($B$39, MEM_A1, 16, FALSE),VLOOKUP($B$39, MEM_A2, 16, FALSE))","v":""}]
[]
[null,"Operating System"]
[null,"No Operating System",{"$f":"VLOOKUP($B$52, OS_A, 2, FALSE)","v":""},{"$f":"VLOOKUP($B$52, OS_A, 3, FALSE)","v":""},{"$f":"VLOOKUP($B$52, OS_A, 5, FALSE)","v":"[611-BBBF]"},{"$f":"VLOOKUP($B$52, OS_A, 6, FALSE)","v":""}]
[]
[null,"OS Media Kits"]
[null,"No Media Required",1,null,"[605-BBFN]"]
[]
[null,"Client Access Licenses"]
[null,{"$f":"VLOOKUP($B$52, OS_A, 7, FALSE)","v":"None"},null,{"$f":"VLOOKUP($B$52, OS_A, 9, FALSE)","v":""},{"$f":"VLOOKUP($B$52, OS_A, 11, FALSE)","v":""},{"$f":"VLOOKUP($B$52, OS_A, 12, FALSE)*C58","v":0}]
[]
[null,{"$f":"VLOOKUP($B$52, OS_A, 13, FALSE)","v":"None"},null,{"$f":"VLOOKUP($B$52, OS_A, 15, FALSE)","v":""},{"$f":"VLOOKUP($B$52, OS_A, 17, FALSE)","v":""},{"$f":"VLOOKUP($B$52, OS_A, 18, FALSE)*C60","v":0}]
[]
[null,"RAID Controller"]
[null,"PERC H330 RAID Controller",1,null,"[405-AAEF]"]
[]
[null,"Hard Drives"]
[null,"300GB 10K RPM SAS 12Gbps 2.5in Hot-plug Hard Drive",2,null,"[400-AJPK]"]
[]
[null,"300GB 10K RPM SAS 12Gbps 2.5in Hot-plug Hard Drive,CusKit",null,{"$f":"VLOOKUP($B$68, HDD_A,3, FALSE)","v":"10L1-HDD300GB"},{"$f":"VLOOKUP($B$68, HDD_A,5, FALSE)","v":"[400-AJOQ]"},{"$f":"VLOOKUP($B$68, HDD_A,6, FALSE)*C68","v":0}]
[]
[null,"1TB 7.2K RPM NLSAS 6Gbps 2.5in Hot-plug Hard Drive,13G,CusKit",null,{"$f":"VLOOKUP($B$70, HDD_A,3, FALSE)","v":"10L1-HDD1TB"},{"$f":"VLOOKUP($B$70, HDD_A,5, FALSE)","v":"[400-AEFF]"},{"$f":"VLOOKUP($B$70, HDD_A,6, FALSE)*C70","v":0}]
[]
[null,"RAID Configuration HDD 300GB"]
[null,"C3 - RAID 1 for H330 (2 HDDs)",1,null,{"$f":"VLOOKUP($B$73,  RAID_AAA1, 2, FALSE)","v":"[780-BBJK]"}]
[null,"Hot Spare for 300GB HDD","No"]
[]
[null,"RAID Configuration HDD 1TB"]
[null,"",1,null,{"$f":"VLOOKUP($B$77,  RAID_AAA2, 2, FALSE)","v":""}]
[null,"Hot Spare for 1TB HDD","No"]
[]
[null,"Power Management BIOS Settings"]
[null,"Performance BIOS Setting",1,null,"[384-BBBL]"]
[]
[null,"Power Supply"]
[null,"Dual, Hot-plug, Redundant Power Supply (1+1), 750W, Titanium, 200-240VAC",1,null,"[450-ADWT]"]
[]
[null,"Power Cords"]
[null,"Rack Power Cord 2M (C13/C14 12A)",2,null,"[450-AADY]"]
[]
[null,"PCIe Riser"]
[null,{"$f":"VLOOKUP(B29, CPU_A, 9, FALSE)","v":"Riser with up to 1, x8 PCIe Slots + 1, x16 PCIe Slots for x8, 2 PCIe Chassis with 1 Processor"},{"$f":"VLOOKUP($B$29, CPU_A, 10, FALSE)","v":1},null,{"$f":"VLOOKUP($B$29, CPU_A, 11, FALSE)","v":"[330-BBCS]"}]
[]
[null,"Embedded Systems Management"]
[null,"iDrac8, Enterprise",1,null,"[385-BBHO]"]
[]
[null,"Network Daughter Card"]
[null,"Broadcom 5720 QP 1Gb Network Daughter Card",1,null,"[540-BBBW]"]
[]
[null,"Additional Card for PCIe Slot 1 (Low Profile)"]
[null,"None",{"$f":"VLOOKUP($B$99,  PCI_A1, 2, FALSE)","v":""},{"$f":"VLOOKUP($B$99,  PCI_A1, 3, FALSE)","v":""},{"$f":"VLOOKUP($B$99,  PCI_A1, 5, FALSE)","v":""},{"$f":"VLOOKUP($B$99,  PCI_A1, 6, FALSE)","v":""}]
[]
[null,"Additional Card for PCIe Slot 2 (Full height)"]
[null,"None",{"$f":"VLOOKUP($B$102,  PCI_A2, 2, FALSE)","v":""},{"$f":"VLOOKUP($B$102,  PCI_A2, 3, FALSE)","v":""},{"$f":"VLOOKUP($B$102,  PCI_A2, 5, FALSE)","v":""},{"$f":"VLOOKUP($B$102,  PCI_A2, 6, FALSE)","v":""}]
[]
[null,"Bezel"]
[null,"Bezel 8 Drive Chassis",1,null,"[325-BBII]"]
[]
[null,"Rack Rails"]
[null,"ReadyRails™ Sliding Rails Without Cable Management Arm",1,null,"[770-BBBC]"]
[]
[null,"Internal Optical Drive"]
[null,"No Internal Optical Drive for 8 HDD Chassis",1,null,"[429-AAQN]"]
[]
[null,"Server Accessories"]
[null,"PowerEdge SFP+, 10GbE SR/SX, Optical Tranceiver, LC Connector, for Intel and Broadcom,CusKit",{"$f":"(VLOOKUP(B102,PCI_A2,8,FALSE))+((VLOOKUP(B99,PCI_A1,8,FALSE)))","v":0},null,"[407-BBQE]"]
[]
[null,"System Documentation"]
[null,"Electronic System Documentation and OpenManage DVD Kit",1,null,"[343-BBDK]"]
[]
[null,"SHIPPING"]
[null,"R630 Shipping - 8 Drive Chassis, EMEA1 (English/French/German/Spanish/Russian/Hebrew)",1,null,"[340-AMIN]"]
[]
[null,"Order Information"]
[null,"PowerEdge Order - EMEA",1,null,"[800-11671]"]
[]
[null,"Base warranty"]
[null,"3Yr Basic Warranty - Next Business Day - Minimum Warranty",1,null,"[709-12767][709-12768]"]
[]
[null,"Servizi di assitenza"]
[null,"Dell Channel Order - Service Info only",1,null,"[710-31085]"]
[]
[null,"Warranty Upgrades"]
[null,"None",{"$f":"VLOOKUP($B$132,  SO_A1, 2, FALSE)","v":""},{"$f":"VLOOKUP($B$132,  SO_A1, 3, FALSE)","v":""},{"$f":"VLOOKUP($B$132,  SO_A1, 5, FALSE)","v":""},{"$f":"VLOOKUP($B$132,  SO_A1, 6, FALSE)","v":""}]
[]
[null,"Protezione dei dati - Keep Your Hard Drive "]
[null,"None",{"$f":"VLOOKUP($B$135,  SO_AAA2, 2, FALSE)","v":""},{"$f":"VLOOKUP($B$135,  SO_AAA2, 3, FALSE)","v":""},{"$f":"VLOOKUP($B$135,  SO_AAA2,5, FALSE)","v":""},{"$f":"VLOOKUP($B$135,  SO_AAA2, 6, FALSE)","v":""}]
[]
[null,"Servizi di Installazione"]
[null,"No Installation Service Selected",1,null,"[683-11870]"]
[]
[null,"Channel only - Support Extension"]
[null,"Channel 39M Basic Warranty - Next Business Day",1,null,"[723-28776]"]
[]
[null,"Warranty Upgrades - Non-Std/Local POS"]
[null,"CSTM CONSIP - 39M Onsite Labor Support for CRU for Servers with Basic Warranty",1,null,"[681-24467]"]

{"sheet":"Server10 Lotto1 R730xd 2","index":7,"n_rows":153,"n_cols":8,"rows_kept":153,"cut":false,"hidden":true,"merged":[[71,8,74,10],[75,8,78,10],[27,2,27,4],[0,0,3,5],[4,0,4,4],[5,0,5,4],[10,0,11,5],[12,0,12,5],[18,2,18,4],[20,1,20,4],[21,2,21,4],[23,1,23,4],[24,2,24,4],[26,1,26,4],[52,1,52,4],[29,1,29,4],[30,2,30,4],[33,1,33,4],[34,2,34,4],[36,1,36,4],[39,1,39,4],[40,2,40,4],[42,1,42,4],[43,2,43,4],[49,1,49,4],[50,2,50,4],[75,2,75,4],[53,2,53,4],[55,1,55,4],[56,2,56,4],[58,1,58,4],[60,1,60,4],[61,2,61,4],[63,1,63,4],[64,2,64,4],[70,1,70,4],[71,2,71,4],[74,1,74,4],[94,2,94,4],[78,1,78,4],[79,2,79,4],[81,1,81,4],[82,2,82,4],[84,1,84,4],[85,2,85,4],[87,1,87,4],[88,2,88,4],[90,1,90,4],[91,2,91,4],[93,1,93,4],[112,2,112,4],[96,1,96,4],[97,2,97,4],[99,1,99,4],[100,2,100,4],[102,1,102,4],[103,2,103,4],[105,1,105,4],[106,2,106,4],[108,1,108,4],[109,2,109,4],[111,1,111,4],[130,2,130,4],[114,1,114,4],[115,2,115,4],[117,1,117,4],[118,2,118,4],[120,1,120,4],[121,2,121,4],[123,1,123,4],[124,2,124,4],[126,1,126,4],[127,2,127,4],[129,1,129,4],[145,2,145,4],[132,1,132,4],[133,2,133,4],[135,1,135,4],[136,2,136,4],[138,1,138,4],[139,2,139,4],[141,1,141,4],[142,2,142,4],[144,1,144,4],[147,1,147,4],[148,2,148,4],[150,1,150,4],[151,2,151,4],[153,1,153,4]]}
[]
[]
[]
[]
["Server10 Lotto1 R730xd",null,null,null,null,null,null,"List Price *"]
[null,null,null,null,null,null,null,{"$f":"F17*C16","v":{"$error":"#N/A"}}]
[]
[]
[]
[]
["Components: \nServer DELL PowerEdge R730xd (1CPU Intel® Xeon® E5-2630L v3, 32GB RDIMM, 2xHDD 300GB 10K RPM SAS 12Gbps 2.5in)"]
[]
[]
[]
["PowerEdge R730xd","Category: Server",null,null,null,{"$f":"1728","v":1728}]
[null,"Quantity: ",null,null,null,{"$f":"SUM(F20:F154)","v":{"$error":"#N/A"}}]
[null,null,null,null,null,{"$f":"SUM(F15:F16)","v":{"$error":"#N/A"}}]
[]
[null,"Base"]
[null,"PowerEdge R730xd Server, TPM",1,null,"[210-ADBC][461-AACZ][591-BBCH]"]
[]
[null,"Chassis Configuration"]
[null,"Chassis with up to 24, 2.5\" Hard Drives",1,null,"[350-BBFD]"]
[]
[null,"Processor"]
[null,"Intel® Xeon® E5-2630L v3 1.8GHz,20M Cache,8.00GT/s QPI,Turbo,HT,8C/16T (55W) Max Mem 1866MHz",1,null,"[338-BFFR]"]
[]
[null,"Additional Processor"]
[null,"No Additional Processor",{"$f":"VLOOKUP($B$29, CPU_B, 2, FALSE)","v":0},{"$f":"VLOOKUP($B$29, CPU_B, 3, FALSE)","v":""},{"$f":"VLOOKUP($B$29, CPU_B, 5, FALSE)","v":"[374-BBBX]"},{"$f":"VLOOKUP(B29, CPU_B, 12, FALSE)","v":""}]
[]
[null,"Processor Thermal Configuration"]
[null,"1 CPU Standard",1,null,"[370-ABWF][374-BBHM][750-AAEL]"]
[null,{"$f":"VLOOKUP($B$29, CPU_B, 6, FALSE)","v":""},{"$f":"VLOOKUP($B$29, CPU_B, 7, FALSE)","v":""},null,{"$f":"VLOOKUP($B$29, CPU_B, 8, FALSE)","v":""}]
[]
[null,"Memory Configuration Type"]
[null,"Performance Optimized",1,null,"[370-AAIP]"]
[]
[null,"Total Memory in GB",null,{"$f":"IF(('Server10 Lotto1 R730xd 2'!$D$12=0),\"\",'Server10 Lotto1 R730xd 2'!#REF!)","v":""}]
[null,32]
[]
[null,"Memory DIMM Type and Speed"]
[null,"2133MT/s RDIMMs ",1,null,"[370-ABUF]"]
[]
[null,"Memory Capacity"]
[null,{"$f":"IF($B$29=\"No Additional Processor\",VLOOKUP($B$39, MEM_B1, 8, FALSE),VLOOKUP($B$39, MEM_B2, 8, FALSE))","v":{"$error":"#N/A"}},{"$f":"IF($B$29=\"No Additional Processor\",VLOOKUP($B$39, MEM_B1, 9, FALSE),VLOOKUP($B$39, MEM_B2, 9, FALSE))","v":{"$error":"#N/A"}},null,{"$f":"IF($B$29=\"No Additional Processor\",VLOOKUP($B$39, MEM_B1, 10, FALSE),VLOOKUP($B$39, MEM_B2, 10, FALSE))","v":{"$error":"#N/A"}}]
[]
[null,{"$f":"IF($B$29=\"No Additional Processor\",VLOOKUP($B$39, MEM_B1, 2, FALSE),VLOOKUP($B$39, MEM_B2, 2, FALSE))","v":{"$error":"#N/A"}},{"$f":"IF($B$29=\"No Additional Processor\",VLOOKUP($B$39, MEM_B1, 3, FALSE),VLOOKUP($B$39, MEM_B2, 3, FALSE))","v":{"$error":"#N/A"}},{"$f":"IF($B$29=\"No Additional Processor\",VLOOKUP($B$39, MEM_B1, 4, FALSE),VLOOKUP($B$39, MEM_B2, 4, FALSE))","v":{"$error":"#N/A"}},{"$f":"IF($B$29=\"No Additional Processor\",VLOOKUP($B$39, MEM_B1, 6, FALSE),VLOOKUP($B$39, MEM_B2, 6, FALSE))","v":{"$error":"#N/A"}},{"$f":"IF($B$29=\"No Additional Processor\",VLOOKUP($B$39, MEM_B1, 7, FALSE),VLOOKUP($B$39, MEM_B2, 7, FALSE))","v":{"$error":"#N/A"}}]
[]
[null,{"$f":"IF($B$29=\"No Additional Processor\",VLOOKUP($B$39, MEM_B1, 11, FALSE),VLOOKUP($B$39, MEM_B2, 11, FALSE))","v":{"$error":"#N/A"}},{"$f":"IF($B$29=\"No Additional Processor\",VLOOKUP($B$39, MEM_B1, 12, FALSE),VLOOKUP($B$39, MEM_B2, 12, FALSE))","v":{"$error":"#N/A"}},{"$f":"IF($B$29=\"No Additional Processor\",VLOOKUP($B$39, MEM_B1, 13, FALSE),VLOOKUP($B$39, MEM_B2, 13, FALSE))","v":{"$error":"#N/A"}},{"$f":"IF($B$29=\"No Additional Processor\",VLOOKUP($B$39, MEM_B1, 15, FALSE),VLOOKUP($B$39, MEM_B2, 15, FALSE))","v":{"$error":"#N/A"}},{"$f":"IF($B$29=\"No Additional Processor\",VLOOKUP($B$39, MEM_B1, 16, FALSE),VLOOKUP($B$39, MEM_B2, 16, FALSE))","v":{"$error":"#N/A"}}]
[]
[null,"Operating System"]
[null,"No Operating System",{"$f":"VLOOKUP($B$52, OS_B, 2, FALSE)","v":""},{"$f":"VLOOKUP($B$52, OS_B, 3, FALSE)","v":""},{"$f":"VLOOKUP($B$52, OS_B, 5, FALSE)","v":"[611-BBBF]"},{"$f":"VLOOKUP($B$52, OS_B, 6, FALSE)","v":""}]
[]
[null,"OS Media Kits"]
[null,"No Media Required",1,null,"[605-BBFN]"]
[]
[null,"Client Access Licenses"]
[null,{"$f":"VLOOKUP($B$52, OS_B, 7, FALSE)","v":"None"},null,{"$f":"VLOOKUP($B$52, OS_B, 9, FALSE)","v":""},{"$f":"VLOOKUP($B$52, OS_B, 11, FALSE)","v":""},{"$f":"VLOOKUP($B$52, OS_B, 12, FALSE)*C58","v":0}]
[]
[null,{"$f":"VLOOKUP($B$52, OS_B, 13, FALSE)","v":"None"},null,{"$f":"VLOOKUP($B$52, OS_B, 15, FALSE)","v":""},{"$f":"VLOOKUP($B$52, OS_B, 17, FALSE)","v":""},{"$f":"VLOOKUP($B$52, OS_B, 18, FALSE)*C60","v":0}]
[]
[null,"RAID Controller"]
[null,"PERC H330 RAID Controller",1,null,"[405-AAEF]"]
[]
[null,"Hard Drives"]
[null,"300GB 10K RPM SAS 12Gbps 2.5in Hot-plug Hard Drive",2,null,"[400-AJPK]"]
[]
[null,"300GB 10K RPM SAS 12Gbps 2.5in Hot-plug Hard Drive,CusKit",null,{"$f":"VLOOKUP($B$68, HDD_A,3, FALSE)","v":"10L1-HDD300GB"},{"$f":"VLOOKUP($B$68, HDD_A,5, FALSE)","v":"[400-AJOQ]"},{"$f":"VLOOKUP($B$68, HDD_A,6, FALSE)*C68","v":0}]
[]
[null,"1TB 7.2K RPM NLSAS 6Gbps 2.5in Hot-plug Hard Drive,13G,CusKit",null,{"$f":"VLOOKUP($B$70, HDD_A,3, FALSE)","v":"10L1-HDD1TB"},{"$f":"VLOOKUP($B$70, HDD_A,5, FALSE)","v":"[400-AEFF]"},{"$f":"VLOOKUP($B$70, HDD_A,6, FALSE)*C70","v":0}]
[]
[null,"RAID Configuration HDD 300GB"]
[null,"C3 - RAID 1 for H330 (2 HDDs)",1,null,{"$f":"VLOOKUP($B$73,  RAID_BB1, 2, FALSE)","v":"[780-BBJK]"}]
[null,"Hot Spare for 300GB HDD","No"]
[]
[null,"RAID Configuration HDD 1TB"]
[null,"",1,null,{"$f":"VLOOKUP($B$77,  RAID_BB2, 2, FALSE)","v":""}]
[null,"Hot Spare for 1TB HDD","No"]
[]
[null,"Power Management BIOS Settings"]
[null,"Performance BIOS Setting",1,null,"[384-BBBL]"]
[]
[null,"Power Supply"]
[null,"Dual, Hot-plug, Redundant Power Supply (1+1), 750W, Titanium, 200-240VAC",1,null,"[450-ADWT]"]
[]
[null,"Power Cords"]
[null,"Rack Power Cord 2M (C13/C14 12A)",2,null,"[450-AADY]"]
[]
[null,"PCIe Riser"]
[null,"Risers with up to 4, x8 PCIe Slots + 2, x16 PCIe Slots",1,null,"[330-BBCO][330-BBCR]"]
[]
[null,"Embedded Systems Management"]
[null,"iDRAC8 Enterprise, integrated Dell Remote Access Controller, Enterprise",1,null,"[385-BBHO]"]
[]
[null,"Network Daughter Card"]
[null,"Broadcom 5720 QP 1Gb Network Daughter Card",1,null,"[540-BBBW]"]
[]
[null,"Additional Card for PCIe Slot 1 (Full height) (CPU 1)"]
[null,"None",{"$f":"VLOOKUP($B$99,  PCI_B1, 2, FALSE)","v":""},{"$f":"VLOOKUP($B$99,  PCI_B1, 3, FALSE)","v":""},{"$f":"VLOOKUP($B$99,  PCI_B1, 5, FALSE)","v":""},{"$f":"VLOOKUP($B$99,  PCI_B1, 6, FALSE)","v":""}]
[]
[null,"Additional Card for PCIe Slot 2 (Full height) (CPU 1)"]
[null,"None",{"$f":"VLOOKUP($B$102,  PCI_B2, 2, FALSE)","v":""},{"$f":"VLOOKUP($B$102,  PCI_B2, 3, FALSE)","v":""},{"$f":"VLOOKUP($B$102,  PCI_B2, 5, FALSE)","v":""},{"$f":"VLOOKUP($B$102,  PCI_B2, 6, FALSE)","v":""}]
[]
[null,"Additional Card for PCIe Slot 3 (Full height) (CPU 1)"]
[null,"None",{"$f":"VLOOKUP($B$105,  PCI_B3, 2, FALSE)","v":""},{"$f":"VLOOKUP($B$105,  PCI_B3, 3, FALSE)","v":""},{"$f":"VLOOKUP($B$105,  PCI_B3, 5, FALSE)","v":""},{"$f":"VLOOKUP($B$105,  PCI_B3, 6, FALSE)","v":""}]
[]
[null,"Additional Card for PCIe Slot 4 (Low Profile) (CPU 2)"]
[null,"None",{"$f":"VLOOKUP($B$108,  PCI_B4, 2, FALSE)","v":""},{"$f":"VLOOKUP($B$108,  PCI_B4, 3, FALSE)","v":""},{"$f":"VLOOKUP($B$108,  PCI_B4, 5, FALSE)","v":""},{"$f":"VLOOKUP($B$108,  PCI_B4, 6, FALSE)","v":""}]
[]
[null,"Additional Card for PCIe Slot 5 (Low Profile) (CPU 2)"]
[null,"None",{"$f":"VLOOKUP($B$111,  PCI_B5, 2, FALSE)","v":""},{"$f":"VLOOKUP($B$111,  PCI_B5, 3, FALSE)","v":""},{"$f":"VLOOKUP($B$111,  PCI_B5, 5, FALSE)","v":""},{"$f":"VLOOKUP($B$111,  PCI_B5, 6, FALSE)","v":""}]
[]
[null,"Additional Card for PCIe Slot 6 (Low Profile) (CPU 2)"]
[null,"None",{"$f":"VLOOKUP($B$114,  PCI_B5, 2, FALSE)","v":""},{"$f":"VLOOKUP($B$114,  PCI_B5, 3, FALSE)","v":""},{"$f":"VLOOKUP($B$114,  PCI_B5, 5, FALSE)","v":""},{"$f":"VLOOKUP($B$114,  PCI_B5, 6, FALSE)","v":""}]
[]
[null,"Bezel"]
[null,"Bezel",1,null,"[350-BBEJ]"]
[]
[null,"Rack Rails"]
[null,"ReadyRails™ Sliding Rails Without Cable Management Arm",1,null,"[770-BBBQ]"]
[]
[null,"Server Accessories"]
[null,"PowerEdge SFP+, 10GbE SR/SX, Optical Tranceiver, LC Connector, for Intel and Broadcom,CusKit",{"$f":"(VLOOKUP(B114,PCI_A2,8,FALSE))+((VLOOKUP(B99,PCI_A1,8,FALSE)))","v":0},null,"[407-BBQE]"]
[]
[null,"System Documentation"]
[null,"Electronic System Documentation and OpenManage DVD Kit",1,null,"[631-AAJG]"]
[]
[null,"SHIPPING"]
[null,"PowerEdge R730xd Shipping EMEA1 (English/French/German/Spanish/Russian/Hebrew)",1,null,"[340-AMGS]"]
[]
[null,"Order Information"]
[null,"PowerEdge Order - EMEA",1,null,"[800-11671]"]
[]
[null,"Base warranty"]
[null,"3Yr Basic Warranty - Next Business Day - Minimum Warranty",1,null,"[709-12780][709-12781]"]
[]
[null,"Servizi di assitenza"]
[null,"Dell Channel Order - Service Info only",1,null,"[710-31085]"]
[]
[null,"Warranty Upgrades"]
[null,"None",{"$f":"VLOOKUP($B$141,  SO_B1,2, FALSE)","v":""},{"$f":"VLOOKUP($B$141,  SO_B1, 3, FALSE)","v":""},{"$f":"VLOOKUP($B$141,  SO_B1, 5, FALSE)","v":""},{"$f":"VLOOKUP($B$141,  SO_B1, 6, FALSE)","v":""}]
[]
[null,"Protezione dei dati - Keep Your Hard Drive "]
[null,"None",{"$f":"VLOOKUP($B$144,  SO_BB2, 2, FALSE)","v":""},{"$f":"VLOOKUP($B$144,  SO_BB2, 3, FALSE)","v":""},{"$f":"VLOOKUP($B$144,  SO_BB2,5, FALSE)","v":""},{"$f":"VLOOKUP($B$144,  SO_BB2, 6, FALSE)","v":""}]
[]
[null,"Servizi di Installazione"]
[null,"No Installation Service Selected",1,null,"[683-11870]"]
[]
[null,"Channel only - Support Extension"]
[null,"Channel 39M Basic Warranty - Next Business Day",1,null,"[723-28780]"]
[]
[null,"Warranty Upgrades - Non-Std/Local POS"]
[null,"CSTM CONSIP - 39M Onsite Labor Support for CRU for Servers with Basic Warranty",1,null,"[681-24467]"]

{"sheet":"Server10 Lotto1 R730xd 3","index":8,"n_rows":153,"n_cols":8,"rows_kept":153,"cut":false,"hidden":true,"merged":[[71,8,74,10],[75,8,78,10],[27,2,27,4],[0,0,3,5],[4,0,4,4],[5,0,5,4],[10,0,11,5],[12,0,12,5],[18,2,18,4],[20,1,20,4],[21,2,21,4],[23,1,23,4],[24,2,24,4],[26,1,26,4],[52,1,52,4],[29,1,29,4],[30,2,30,4],[33,1,33,4],[34,2,34,4],[36,1,36,4],[39,1,39,4],[40,2,40,4],[42,1,42,4],[43,2,43,4],[49,1,49,4],[50,2,50,4],[75,2,75,4],[53,2,53,4],[55,1,55,4],[56,2,56,4],[58,1,58,4],[60,1,60,4],[61,2,61,4],[63,1,63,4],[64,2,64,4],[70,1,70,4],[71,2,71,4],[74,1,74,4],[94,2,94,4],[78,1,78,4],[79,2,79,4],[81,1,81,4],[82,2,82,4],[84,1,84,4],[85,2,85,4],[87,1,87,4],[88,2,88,4],[90,1,90,4],[91,2,91,4],[93,1,93,4],[112,2,112,4],[96,1,96,4],[97,2,97,4],[99,1,99,4],[100,2,100,4],[102,1,102,4],[103,2,103,4],[105,1,105,4],[106,2,106,4],[108,1,108,4],[109,2,109,4],[111,1,111,4],[130,2,130,4],[114,1,114,4],[115,2,115,4],[117,1,117,4],[118,2,118,4],[120,1,120,4],[121,2,121,4],[123,1,123,4],[124,2,124,4],[126,1,126,4],[127,2,127,4],[129,1,129,4],[145,2,145,4],[132,1,132,4],[133,2,133,4],[135,1,135,4],[136,2,136,4],[138,1,138,4],[139,2,139,4],[141,1,141,4],[142,2,142,4],[144,1,144,4],[147,1,147,4],[148,2,148,4],[150,1,150,4],[151,2,151,4],[153,1,153,4]]}
[]
[]
[]
[]
["Server10 Lotto1 R730xd",null,null,null,null,null,null,"List Price *"]
[null,null,null,null,null,null,null,{"$f":"F17*C16","v":{"$error":"#N/A"}}]
[]
[]
[]
[]
["Components: \nServer DELL PowerEdge R730xd (1CPU Intel® Xeon® E5-2630L v3, 32GB RDIMM, 2xHDD 300GB 10K RPM SAS 12Gbps 2.5in)"]
[]
[]
[]
["PowerEdge R730xd","Category: Server",null,null,null,{"$f":"1728","v":1728}]
[null,"Quantity: ",null,null,null,{"$f":"SUM(F20:F154)","v":{"$error":"#N/A"}}]
[null,null,null,null,null,{"$f":"SUM(F15:F16)","v":{"$error":"#N/A"}}]
[]
[null,"Base"]
[null,"PowerEdge R730xd Server, TPM",1,null,"[210-ADBC][461-AACZ][591-BBCH]"]
[]
[null,"Chassis Configuration"]
[null,"Chassis with up to 24, 2.5\" Hard Drives",1,null,"[350-BBFD]"]
[]
[null,"Processor"]
[null,"Intel® Xeon® E5-2630L v3 1.8GHz,20M Cache,8.00GT/s QPI,Turbo,HT,8C/16T (55W) Max Mem 1866MHz",1,null,"[338-BFFR]"]
[]
[null,"Additional Processor"]
[null,"No Additional Processor",{"$f":"VLOOKUP($B$29, CPU_B, 2, FALSE)","v":0},{"$f":"VLOOKUP($B$29, CPU_B, 3, FALSE)","v":""},{"$f":"VLOOKUP($B$29, CPU_B, 5, FALSE)","v":"[374-BBBX]"},{"$f":"VLOOKUP(B29, CPU_B, 12, FALSE)","v":""}]
[]
[null,"Processor Thermal Configuration"]
[null,"1 CPU Standard",1,null,"[370-ABWF][374-BBHM][750-AAEL]"]
[null,{"$f":"VLOOKUP($B$29, CPU_B, 6, FALSE)","v":""},{"$f":"VLOOKUP($B$29, CPU_B, 7, FALSE)","v":""},null,{"$f":"VLOOKUP($B$29, CPU_B, 8, FALSE)","v":""}]
[]
[null,"Memory Configuration Type"]
[null,"Performance Optimized",1,null,"[370-AAIP]"]
[]
[null,"Total Memory in GB",null,{"$f":"IF(('Server10 Lotto1 R730xd 3'!$D$12=0),\"\",'Server10 Lotto1 R730xd 3'!#REF!)","v":""}]
[null,32]
[]
[null,"Memory DIMM Type and Speed"]
[null,"2133MT/s RDIMMs ",1,null,"[370-ABUF]"]
[]
[null,"Memory Capacity"]
[null,{"$f":"IF($B$29=\"No Additional Processor\",VLOOKUP($B$39, MEM_B1, 8, FALSE),VLOOKUP($B$39, MEM_B2, 8, FALSE))","v":{"$error":"#N/A"}},{"$f":"IF($B$29=\"No Additional Processor\",VLOOKUP($B$39, MEM_B1, 9, FALSE),VLOOKUP($B$39, MEM_B2, 9, FALSE))","v":{"$error":"#N/A"}},null,{"$f":"IF($B$29=\"No Additional Processor\",VLOOKUP($B$39, MEM_B1, 10, FALSE),VLOOKUP($B$39, MEM_B2, 10, FALSE))","v":{"$error":"#N/A"}}]
[]
[null,{"$f":"IF($B$29=\"No Additional Processor\",VLOOKUP($B$39, MEM_B1, 2, FALSE),VLOOKUP($B$39, MEM_B2, 2, FALSE))","v":{"$error":"#N/A"}},{"$f":"IF($B$29=\"No Additional Processor\",VLOOKUP($B$39, MEM_B1, 3, FALSE),VLOOKUP($B$39, MEM_B2, 3, FALSE))","v":{"$error":"#N/A"}},{"$f":"IF($B$29=\"No Additional Processor\",VLOOKUP($B$39, MEM_B1, 4, FALSE),VLOOKUP($B$39, MEM_B2, 4, FALSE))","v":{"$error":"#N/A"}},{"$f":"IF($B$29=\"No Additional Processor\",VLOOKUP($B$39, MEM_B1, 6, FALSE),VLOOKUP($B$39, MEM_B2, 6, FALSE))","v":{"$error":"#N/A"}},{"$f":"IF($B$29=\"No Additional Processor\",VLOOKUP($B$39, MEM_B1, 7, FALSE),VLOOKUP($B$39, MEM_B2, 7, FALSE))","v":{"$error":"#N/A"}}]
[]
[null,{"$f":"IF($B$29=\"No Additional Processor\",VLOOKUP($B$39, MEM_B1, 11, FALSE),VLOOKUP($B$39, MEM_B2, 11, FALSE))","v":{"$error":"#N/A"}},{"$f":"IF($B$29=\"No Additional Processor\",VLOOKUP($B$39, MEM_B1, 12, FALSE),VLOOKUP($B$39, MEM_B2, 12, FALSE))","v":{"$error":"#N/A"}},{"$f":"IF($B$29=\"No Additional Processor\",VLOOKUP($B$39, MEM_B1, 13, FALSE),VLOOKUP($B$39, MEM_B2, 13, FALSE))","v":{"$error":"#N/A"}},{"$f":"IF($B$29=\"No Additional Processor\",VLOOKUP($B$39, MEM_B1, 15, FALSE),VLOOKUP($B$39, MEM_B2, 15, FALSE))","v":{"$error":"#N/A"}},{"$f":"IF($B$29=\"No Additional Processor\",VLOOKUP($B$39, MEM_B1, 16, FALSE),VLOOKUP($B$39, MEM_B2, 16, FALSE))","v":{"$error":"#N/A"}}]
[]
[null,"Operating System"]
[null,"No Operating System",{"$f":"VLOOKUP($B$52, OS_B, 2, FALSE)","v":""},{"$f":"VLOOKUP($B$52, OS_B, 3, FALSE)","v":""},{"$f":"VLOOKUP($B$52, OS_B, 5, FALSE)","v":"[611-BBBF]"},{"$f":"VLOOKUP($B$52, OS_B, 6, FALSE)","v":""}]
[]
[null,"OS Media Kits"]
[null,"No Media Required",1,null,"[605-BBFN]"]
[]
[null,"Client Access Licenses"]
[null,{"$f":"VLOOKUP($B$52, OS_B, 7, FALSE)","v":"None"},null,{"$f":"VLOOKUP($B$52, OS_B, 9, FALSE)","v":""},{"$f":"VLOOKUP($B$52, OS_B, 11, FALSE)","v":""},{"$f":"VLOOKUP($B$52, OS_B, 12, FALSE)*C58","v":0}]
[]
[null,{"$f":"VLOOKUP($B$52, OS_B, 13, FALSE)","v":"None"},null,{"$f":"VLOOKUP($B$52, OS_B, 15, FALSE)","v":""},{"$f":"VLOOKUP($B$52, OS_B, 17, FALSE)","v":""},{"$f":"VLOOKUP($B$52, OS_B, 18, FALSE)*C60","v":0}]
[]
[null,"RAID Controller"]
[null,"PERC H330 RAID Controller",1,null,"[405-AAEF]"]
[]
[null,"Hard Drives"]
[null,"300GB 10K RPM SAS 12Gbps 2.5in Hot-plug Hard Drive",2,null,"[400-AJPK]"]
[]
[null,"300GB 10K RPM SAS 12Gbps 2.5in Hot-plug Hard Drive,CusKit",0,{"$f":"VLOOKUP($B$68, HDD_A,3, FALSE)","v":"10L1-HDD300GB"},{"$f":"VLOOKUP($B$68, HDD_A,5, FALSE)","v":"[400-AJOQ]"},{"$f":"VLOOKUP($B$68, HDD_A,6, FALSE)*C68","v":0}]
[]
[null,"1TB 7.2K RPM NLSAS 6Gbps 2.5in Hot-plug Hard Drive,13G,CusKit",0,{"$f":"VLOOKUP($B$70, HDD_A,3, FALSE)","v":"10L1-HDD1TB"},{"$f":"VLOOKUP($B$70, HDD_A,5, FALSE)","v":"[400-AEFF]"},{"$f":"VLOOKUP($B$70, HDD_A,6, FALSE)*C70","v":0}]
[]
[null,"RAID Configuration HDD 300GB"]
[null,"C4 - RAID 5 for H330 (3-8 HDDs)",1,null,{"$f":"VLOOKUP($B$73,  RAID_BBB1, 2, FALSE)","v":{"$error":"#N/A"}}]
[null,"Hot Spare for 300GB HDD","No"]
[]
[null,"RAID Configuration HDD 1TB"]
[null,"",1,null,{"$f":"VLOOKUP($B$77,  RAID_BBB2, 2, FALSE)","v":""}]
[null,"Hot Spare for 1TB HDD","No"]
[]
[null,"Power Management BIOS Settings"]
[null,"Performance BIOS Setting",1,null,"[384-BBBL]"]
[]
[null,"Power Supply"]
[null,"Dual, Hot-plug, Redundant Power Supply (1+1), 750W, Titanium, 200-240VAC",1,null,"[450-ADWT]"]
[]
[null,"Power Cords"]
[null,"Rack Power Cord 2M (C13/C14 12A)",2,null,"[450-AADY]"]
[]
[null,"PCIe Riser"]
[null,"Risers with up to 4, x8 PCIe Slots + 2, x16 PCIe Slots",1,null,"[330-BBCO][330-BBCR]"]
[]
[null,"Embedded Systems Management"]
[null,"iDRAC8 Enterprise, integrated Dell Remote Access Controller, Enterprise",1,null,"[385-BBHO]"]
[]
[null,"Network Daughter Card"]
[null,"Broadcom 5720 QP 1Gb Network Daughter Card",1,null,"[540-BBBW]"]
[]
[null,"Additional Card for PCIe Slot 1 (Full height) (CPU 1)"]
[null,"None",{"$f":"VLOOKUP($B$99,  PCI_B1, 2, FALSE)","v":""},{"$f":"VLOOKUP($B$99,  PCI_B1, 3, FALSE)","v":""},{"$f":"VLOOKUP($B$99,  PCI_B1, 5, FALSE)","v":""},{"$f":"VLOOKUP($B$99,  PCI_B1, 6, FALSE)","v":""}]
[]
[null,"Additional Card for PCIe Slot 2 (Full height) (CPU 1)"]
[null,"None",{"$f":"VLOOKUP($B$102,  PCI_B2, 2, FALSE)","v":""},{"$f":"VLOOKUP($B$102,  PCI_B2, 3, FALSE)","v":""},{"$f":"VLOOKUP($B$102,  PCI_B2, 5, FALSE)","v":""},{"$f":"VLOOKUP($B$102,  PCI_B2, 6, FALSE)","v":""}]
[]
[null,"Additional Card for PCIe Slot 3 (Full height) (CPU 1)"]
[null,"None",{"$f":"VLOOKUP($B$105,  PCI_B3, 2, FALSE)","v":""},{"$f":"VLOOKUP($B$105,  PCI_B3, 3, FALSE)","v":""},{"$f":"VLOOKUP($B$105,  PCI_B3, 5, FALSE)","v":""},{"$f":"VLOOKUP($B$105,  PCI_B3, 6, FALSE)","v":""}]
[]
[null,"Additional Card for PCIe Slot 4 (Low Profile) (CPU 2)"]
[null,"None",{"$f":"VLOOKUP($B$108,  PCI_B4, 2, FALSE)","v":""},{"$f":"VLOOKUP($B$108,  PCI_B4, 3, FALSE)","v":""},{"$f":"VLOOKUP($B$108,  PCI_B4, 5, FALSE)","v":""},{"$f":"VLOOKUP($B$108,  PCI_B4, 6, FALSE)","v":""}]
[]
[null,"Additional Card for PCIe Slot 5 (Low Profile) (CPU 2)"]
[null,"None",{"$f":"VLOOKUP($B$111,  PCI_B5, 2, FALSE)","v":""},{"$f":"VLOOKUP($B$111,  PCI_B5, 3, FALSE)","v":""},{"$f":"VLOOKUP($B$111,  PCI_B5, 5, FALSE)","v":""},{"$f":"VLOOKUP($B$111,  PCI_B5, 6, FALSE)","v":""}]
[]
[null,"Additional Card for PCIe Slot 6 (Low Profile) (CPU 2)"]
[null,"None",{"$f":"VLOOKUP($B$114,  PCI_B5, 2, FALSE)","v":""},{"$f":"VLOOKUP($B$114,  PCI_B5, 3, FALSE)","v":""},{"$f":"VLOOKUP($B$114,  PCI_B5, 5, FALSE)","v":""},{"$f":"VLOOKUP($B$114,  PCI_B5, 6, FALSE)","v":""}]
[]
[null,"Bezel"]
[null,"Bezel",1,null,"[350-BBEJ]"]
[]
[null,"Rack Rails"]
[null,"ReadyRails™ Sliding Rails Without Cable Management Arm",1,null,"[770-BBBQ]"]
[]
[null,"Server Accessories"]
[null,"PowerEdge SFP+, 10GbE SR/SX, Optical Tranceiver, LC Connector, for Intel and Broadcom,CusKit",{"$f":"(VLOOKUP(B114,PCI_A2,8,FALSE))+((VLOOKUP(B99,PCI_A1,8,FALSE)))","v":0},null,"[407-BBQE]"]
[]
[null,"System Documentation"]
[null,"Electronic System Documentation and OpenManage DVD Kit",1,null,"[631-AAJG]"]
[]
[null,"SHIPPING"]
[null,"PowerEdge R730xd Shipping EMEA1 (English/French/German/Spanish/Russian/Hebrew)",1,null,"[340-AMGS]"]
[]
[null,"Order Information"]
[null,"PowerEdge Order - EMEA",1,null,"[800-11671]"]
[]
[null,"Base warranty"]
[null,"3Yr Basic Warranty - Next Business Day - Minimum Warranty",1,null,"[709-12780][709-12781]"]
[]
[null,"Servizi di assitenza"]
[null,"Dell Channel Order - Service Info only",1,null,"[710-31085]"]
[]
[null,"Warranty Upgrades"]
[null,"None",{"$f":"VLOOKUP($B$141,  SO_B1,2, FALSE)","v":""},{"$f":"VLOOKUP($B$141,  SO_B1, 3, FALSE)","v":""},{"$f":"VLOOKUP($B$141,  SO_B1, 5, FALSE)","v":""},{"$f":"VLOOKUP($B$141,  SO_B1, 6, FALSE)","v":""}]
[]
[null,"Protezione dei dati - Keep Your Hard Drive "]
[null,"None",{"$f":"VLOOKUP($B$144,  SO_BBB2, 2, FALSE)","v":""},{"$f":"VLOOKUP($B$144,  SO_BBB2, 3, FALSE)","v":""},{"$f":"VLOOKUP($B$144,  SO_BBB2,5, FALSE)","v":""},{"$f":"VLOOKUP($B$144,  SO_BBB2, 6, FALSE)","v":""}]
[]
[null,"Servizi di Installazione"]
[null,"No Installation Service Selected",1,null,"[683-11870]"]
[]
[null,"Channel only - Support Extension"]
[null,"Channel 39M Basic Warranty - Next Business Day",1,null,"[723-28780]"]
[]
[null,"Warranty Upgrades - Non-Std/Local POS"]
[null,"CSTM CONSIP - 39M Onsite Labor Support for CRU for Servers with Basic Warranty",1,null,"[681-24467]"]

{"sheet":"Codici","index":9,"n_rows":90,"n_cols":5,"rows_kept":90,"cut":false,"hidden":true,"merged":[[78,0,79,0],[78,1,79,1],[76,0,77,0],[76,1,77,1],[58,2,61,2],[72,1,73,1],[74,1,75,1],[58,1,61,1],[32,1,33,1],[34,1,35,1],[36,1,37,1],[38,1,39,1],[18,1,19,1],[18,0,19,0],[20,1,21,1],[23,0,25,0],[23,1,25,1],[20,0,21,0]]}
["Codici"]
["10L3-250HC-U","DC BOX sddc",75694,1,"ConvergedSystem 250-HC StoreVirtual System"]
[{"$f":"\"\"","v":""},{"$f":"\"\"","v":""},{"$f":"\"\"","v":""},{"$f":"\"\"","v":""},{"$f":"\"\"","v":""}]
["10L3-16GB-HP-U","OpzRam16",143,1,"Kit Upgrade Ram 16GB"]
["10L3-32GB-HP-U","OpzRam32",286,1,"Kit Upgrade Ram 32GB"]
["10L3-SWITCH","OpzSwitchRete",1947,1,"HP 5130-24G-4SFP+ EI Switch"]
["10L3-HD300-HP-U","OpzStorage300",136,1,"HDD 300GB SAS"]
["10L3-HD1TB-HP-U","OpzStorage1Tb",220,1,"HDD 1.2TB SAS"]
["10L3-UPS","OpzUPS 3000VA",502,1,"UPS MSR 3000 VA"]
["10L3-GUI","OpzGUIRack",493,1,"Console KVM per rack"]
["10L3-KVMIP","OpzSWGUIRack",550,1,"KVM Switch IP per GUI con cavi"]
["10L3-RACK","OpzRack",564,null,"Armadio Rack 42U"]
["10L3-SO-AVV","Package 5 WM avvio",1500,1,"Servizio di creazione, configurazione e installazione fino a 5 VM"]
["10L3-SO-MIG","Package 5 WM migrazione",1500,1,"Servizio di migrazione server fisico a virtuale fino a 5 VM"]
[]
["10L1-R730xd","Server scalabile storage",1728,1,"DELL PowerEdge R730xd"]
[{"$f":"\"\"","v":""},{"$f":"\"\"","v":""},{"$f":"\"\"","v":""},{"$f":"\"\"","v":""},{"$f":"\"\"","v":""}]
["10L1-WIN","OpzWinServ1",505,1,"WIN SERVER 2012 Standard"]
["10L1-CALDEV","OpzDeviceCal",25,1,"MS Windows Srv 2012 CAL 1 DEV"]
[null,null,null,1,"CS_Consip9_Windows Server CAL 2012 Italian 1pk DSP OEI 1 Clt Device CAL"]
["10L1-CALUSER","OpzUserCal",25,1,"MS Windows Srv 2012 CAL 1 USR"]
[null,null,null,1,"CS_Consip9_Windows Server CAL 2012 Italian 1pk DSP OEI 1 Clt User CAL"]
["10L1-LINUX","OpzOpenSource",45,1,"DVD Linux Centos 7.x"]
["10L1-CPU-S","Opz1P",500,1,"Xeon Processor E5-2630L V3"]
[null,null,null,1,"Kit - 1.2U CPU Heatsink for PowerEdge R730xd (CPU with 105W or less)"]
[]
["10L1-16GB","OpzRam16",160,1,"Kit Upgrade Ram 16GB"]
["10L1-32GB","OpzRam32",320,1,"Kit Upgrade Ram 32GB"]
["10L1-32GB-L","OpzRam32",320,1,"Kit Upgrade Ram 32GB"]
["10L1-64GB","OpzRam64",644,1,"Kit Upgrade Ram 64GB"]
["10L1-LAN1GB-LP","OpzGigabit",35,1,"Scheda Lan Gigabit Low"]
["10L1-LAN1GB","OpzGigabit",35,1,"Scheda Lan Gigabit Full"]
["10L1-LAN10GB-LP","OpzGigabit 10GB",417,1,"QLogic 57810 Dual Port 10Gb Low"]
[null,null,null,2,"PowerEdge SFP+, 10GbE SR/SX, Optical Tranceiver, LC Connector, for Intel and Broadcom,CusKit"]
["10L1-LAN10GB","OpzGigabit 10GB",417,1,"QLogic 57810 Dual Port 10Gb Full"]
[null,null,null,2,"PowerEdge SFP+, 10GbE SR/SX, Optical Tranceiver, LC Connector, for Intel and Broadcom,CusKit"]
["10L1-CNA10-LP","OpzGigabit 10GB CNA",774,1,"QLogic 57810 Dual Port 10Gb CNA Low"]
[null,null,null,2,"PowerEdge SFP+, 10GbE SR/SX, Optical Tranceiver, LC Connector, for Intel and Broadcom,CusKit"]
["10L1-CNA10","OpzGigabit 10GB CNA",774,1,"QLogic 57810 DualPort 10GbCNA Full"]
[null,null,null,2,"PowerEdge SFP+, 10GbE SR/SX, Optical Tranceiver, LC Connector, for Intel and Broadcom,CusKit"]
["10L1-HDD300GB","OpzStorage300",140,1,"HDD 300GB SAS"]
["10L1-HDD1TB","OpzStorage1Tb",296,1,"HDD 1TB NLSAS"]
["10L1-FC-LP","OpzFibreChannel",940,1,"Emulex LPE12002 Low"]
["10L1-FC","OpzFibreChannel",940,1,"Emulex LPE 12002 Full"]
[]
[]
["10L1-UPS","OpzUPS 3000VA",422,1,"UPS MSR 3000 VA"]
[]
["10L1-GUI","OpzGUIRack",461,1,"Console KVM per rack"]
["10L1-KVMIP","OpzSWGUIRack",550,1,"KVM Switch IP per GUI con cavi"]
[]
[]
[]
["10L1-RACK","OpzRack",497,null,"Armadio Rack 42U"]
[]
["10L1-SO-WIN","ServOpzSysManWindows",193,1,"System-Network Mng. svc Windows"]
["10L1-SO-LINUX","ServOpzSysManOS",193,1,"System-Network Mng. svc Linux"]
["10L1-SO-PREV","Manutenzione Preventiva",193,1,"Servizi di manutenzione Preventiva"]
["10L1-SO-HDD","Hard-Disk retention",150,1,"Servizio HDD Retention"]
[null,null,null,1,"Servizio HDD Retention 36 mesi"]
[null,null,null,1,"Servizio HDD Retention 48 mesi"]
[null,null,null,1,"Servizio HDD Retention 60 mesi"]
["10L1-SO-12M-S","OpzEstensione12",175,1,"Estensione garanzia 12 mesi Agg."]
["10L1-SO-24M-S","OpzEstensione24",350,1,"Estensione garanzia 24 mesi Agg."]
[]
["10L3-VRTX-U","DC BOX general purpose",10281,1,"DELL PowerEdge VRTX"]
["10L3-CPU-U","Opz1P",677,1,"Intel Xeon Processor E5-2620 V4\n(Intel Xeon E5-2620 v4  2.1GHz,20M Cache,8.0GT/s QPI,Turbo,HT,8C/16T)"]
["10L3-16GB-VRTX","OpzRam16",160,1,"Kit Upgrade Ram 16GB V4\n(16GB RDIMM, 2400MT/s, Dual Rank, x8 Data Width,CusKit)"]
["10L3-32GB-VRTX","OpzRam32",319,1,"Kit Upgrade Ram 32GB V4\n(32GB RDIMM, 2400MT/s, Dual Rank, x4 Data Width,CusKit)"]
["10L3-LAN1GB","OpzGigabit",37,1,"Scheda Lan Gigabit Full\n(Broadcom 5720 DP 1Gb Network Interface Card,Full Height,CusKit)"]
["10L3-LAN1GB-LP","OpzGigabit",37,1,"Scheda Lan Gigabit Low\n(Broadcom 5720 DP 1Gb Network Interface Card, Low Profile,CusKit)"]
["10L3-BLADE-U","OpzLama",2009,1,"PowerEdge M630 Blade Server"]
["10L3-LAN10GB","OpzGigabit 10GB",416,1,"Broadcom 57810 DP\n(Broadcom 57810 DP 10Gb DA/SFP+ Full Height,CusKit)"]
[null,null,null,2,"PowerEdge SFP+, 10GbE SR/SX, Optical Tranceiver, LC Connector, for Intel and Broadcom,CusKit"]
["10L3-LAN10GB-LP","OpzGigabit 10GB",416,1,"Broadcom 57810 DP Low\n(Broadcom 57810 DP 10Gb DA/SFP+ Low Profile,CusKit)"]
[null,null,null,2,"PowerEdge SFP+, 10GbE SR/SX, Optical Tranceiver, LC Connector, for Intel and Broadcom,CusKit"]
["10L3-CNA10","OpzGigabit 10GB CNA",425,1,"Broadcom 57810 DP CNA\n(Broadcom 57810 DP 10Gb DA/SFP+ Converged Network Adapter (CNA) Full Height,CusKit)"]
[null,null,null,2,"PowerEdge SFP+, 10GbE SR/SX, Optical Tranceiver, LC Connector, for Intel and Broadcom,CusKit"]
["10L3-CNA10-LP","OpzGigabit 10GB CNA",425,1,"Broadcom 57810 DP CNA Low\n(Broadcom 57810 DP 10Gb DA/SFP+ Converged Network Adapter (CNA) Low Profile,CusKit)"]
[null,null,null,2,"PowerEdge SFP+, 10GbE SR/SX, Optical Tranceiver, LC Connector, for Intel and Broadcom,CusKit"]
["10L3-HDD300GB-DELL","OpzStorage300",93,1,"HDD 300GB SAS\n(300GB 10K RPM SAS 12Gbps 2.5in Hot-plug Hard Drive)"]
["10L3-HDD1TB-DELL","OpzStorage1Tb",217,1,"HDD 1.2TB SAS\n(1.2TB 10K RPM SAS 12Gbps 2.5in Hot-plug Hard Drive)"]
["10L3-FC-U","OpzFibreChannel",516,1,"QLogic 2562 DP Full\n(QLogic 2562, Dual Port 8Gb Optical Fibre Channel HBA,Full Height,CusKit)"]
["10L3-FC-LP-U","OpzFibreChannel",516,1,"QLogic 2562 DP Low\n(Qlogic 2562 Dual Channel 8Gb Optical Fibre Channel HBA PCIe, Low Profile,CusKit)"]
["10L3-UPS","OpzUPS 3000VA",502,1,"UPS MSR 3000 VA"]
["10L3-GUI","OpzGUIRack",493,1,"Console KVM per rack"]
["10L3-KVMIP","OpzSWGUIRack",550,1,"KVM Switch IP per GUI con cavi"]
["10L3-RACK","OpzRack",564,null,"Armadio Rack 42U"]
[]
[null,null,null,null,"Intel Xeon Processor E5-2620 V4\n(Intel Xeon E5-2620 v4  2.1GHz,20M Cache,8.0GT/s QPI,Turbo,HT,8C/16T)"]

{"sheet":"Processor","index":10,"n_rows":12,"n_cols":12,"rows_kept":12,"cut":false,"hidden":true,"merged":[]}
["Additional Processor"]
["Server R630",null,"CPU-A"]
["No Additional Processor",0,{"$f":"\"\"","v":""},null,"[374-BBBX]",{"$f":"\"\"","v":""},{"$f":"\"\"","v":""},{"$f":"\"\"","v":""},"Riser with up to 1, x8 PCIe Slots + 1, x16 PCIe Slots for x8, 2 PCIe Chassis with 1 Processor",1,"[330-BBCS]",{"$f":"\"\"","v":""}]
["Intel Xeon E5-2650 v3 2.3GHz,25M Cache,9.60GT/s QPI,Turbo,HT,10C/20T (105W) Max Mem 2133MHz,Customer Kit",1,"10L1-CPU-P","S10L1-R630-CPU","[338-BFCF]","Kit - 120W Heatsink for PowerEdge R630",1,"[412-AAFB]","R630 PCIe Riser for up to 2, x16 PCIe Slots for x8, 2 PCIe Chassis with 2 Processors,CusKit",1,"[330-BBCM]",800]
[]
["Server R730xd",null,"CPU-B"]
["No Additional Processor",0,{"$f":"\"\"","v":""},null,"[374-BBBX]",{"$f":"\"\"","v":""},{"$f":"\"\"","v":""},{"$f":"\"\"","v":""},null,null,null,{"$f":"\"\"","v":""}]
["Intel Xeon E5-2630L v3 1.8GHz,20M Cache,8.00GT/s QPI,Turbo,HT,8C/16T (55W) Max Mem 1866MHz,Customer Kit",1,"10L1-CPU-S","S10L1-R730xd-CPU","[338-BFCR]","Kit - 1.2U CPU Heatsink for PowerEdge R730xd (CPU with 105W or less)",1,"[412-AAFU]",null,null,null,500]
[]
["VRTX",null,"CPU-C"]
["No Additional Processor",0,{"$f":"\"\"","v":""},null,"[374-BBBX]",{"$f":"\"\"","v":""},{"$f":"\"\"","v":""},{"$f":"\"\"","v":""},null,null,null,{"$f":"\"\"","v":""}]
["Intel Xeon E5-2620 v4 2.1GHz,20M Cache,8.0GT/s QPI,Turbo,HT,8C/16T (85W) Max Mem 2133MHz, processor only,Cust Kit",1,"10L3-CPU-U","S10L3-VRTXCPU","[338-BJEU]","CUS,THRM,HTSNK,CPU2,68MM,M630",1,"[412-AAEP]",null,null,null,677]

{"sheet":"Memory","index":11,"n_rows":64,"n_cols":16,"rows_kept":64,"cut":false,"hidden":true,"merged":[]}
[null,"Total Memory"]
[]
[null,"16GB RDIMM, 2133 MT/s, Dual Rank, x4 Data Width,CusKit",1,"10L3-16GB-DELL",null,"370-ABUK",160]
[null,"32GB LRDIMM, 2133 MT/s, Quad Rank, x4 Data Width,CusKit",1,"10L3-32GB-DELL",null,"A8217683",319]
[null,"HP 16GB 2Rx4 PC4-2133P-R Kit",1,"10L3-16GB-HP",null,"370-ABUL",143]
[null,"HPE 32GB 2Rx4 PC4-2400T-R Kit",1,"10L3-32GB-HP",null,"728629-B21",286]
[]
[]
["1CPU","MEMORY A"]
[32,{"$f":"\"\"","v":""},{"$f":"\"\"","v":""},{"$f":"\"\"","v":""},{"$f":"\"\"","v":""},{"$f":"\"\"","v":""},{"$f":"\"\"","v":""},"16GB RDIMM, 2133MT/s, Dual Rank, x4 Data Width","2","[370-ABUG]",{"$f":"\"\"","v":""},{"$f":"\"\"","v":""},{"$f":"\"\"","v":""},{"$f":"\"\"","v":""},{"$f":"\"\"","v":""},{"$f":"\"\"","v":""}]
[64,"16GB RDIMM, 2133 MT/s, Dual Rank, x4 Data Width,CusKit",2,"10L1-16GB","S10L1-R630-16GB","370-ABUK",{"$f":"$G$3*C11","v":320},"16GB RDIMM, 2133MT/s, Dual Rank, x4 Data Width","2","[370-ABUG]",{"$f":"\"\"","v":""},{"$f":"\"\"","v":""},{"$f":"\"\"","v":""},{"$f":"\"\"","v":""},{"$f":"\"\"","v":""},{"$f":"\"\"","v":""}]
[80,"16GB RDIMM, 2133 MT/s, Dual Rank, x4 Data Width,CusKit",3,"10L1-16GB","S10L1-R630-16GB","370-ABUK",{"$f":"$G$3*C12","v":480},"16GB RDIMM, 2133MT/s, Dual Rank, x4 Data Width",2,"[370-ABUG]",{"$f":"\"\"","v":""},{"$f":"\"\"","v":""},{"$f":"\"\"","v":""},{"$f":"\"\"","v":""},{"$f":"\"\"","v":""},{"$f":"\"\"","v":""}]
[128,"16GB RDIMM, 2133 MT/s, Dual Rank, x4 Data Width,CusKit",6,"10L1-16GB","S10L1-R630-16GB","370-ABUK",{"$f":"$G$3*C13","v":960},"16GB RDIMM, 2133MT/s, Dual Rank, x4 Data Width","2","[370-ABUG]",{"$f":"\"\"","v":""},{"$f":"\"\"","v":""},{"$f":"\"\"","v":""},{"$f":"\"\"","v":""},{"$f":"\"\"","v":""},{"$f":"\"\"","v":""}]
[160,"16GB RDIMM, 2133 MT/s, Dual Rank, x4 Data Width,CusKit",8,"10L1-16GB","S10L1-R630-16GB","370-ABUK",1280,"16GB RDIMM, 2133MT/s, Dual Rank, x4 Data Width","2","[370-ABUG]",{"$f":"\"\"","v":""},{"$f":"\"\"","v":""},{"$f":"\"\"","v":""},{"$f":"\"\"","v":""},{"$f":"\"\"","v":""},{"$f":"\"\"","v":""}]
[192,"16GB RDIMM, 2133 MT/s, Dual Rank, x4 Data Width,CusKit",10,"10L1-16GB","S10L1-R630-16GB","370-ABUK",1600,"16GB RDIMM, 2133MT/s, Dual Rank, x4 Data Width","2","[370-ABUG]",{"$f":"\"\"","v":""},{"$f":"\"\"","v":""},{"$f":"\"\"","v":""},{"$f":"\"\"","v":""},{"$f":"\"\"","v":""},{"$f":"\"\"","v":""}]
[256,"16GB RDIMM, 2133 MT/s, Dual Rank, x4 Data Width,CusKit",6,"10L1-16GB","S10L1-R630-16GB","370-ABUK",960,"16GB RDIMM, 2133MT/s, Dual Rank, x4 Data Width","2","[370-ABUG]","32GB RDIMM, 2133 MT/s, Low Volt, Dual Rank, x4 Data Width",4,"10L1-32GB","S10L1-R630-32GB","[A8217683]",{"$f":"$G$4*L16","v":1276}]
["2CPU"]
[32,{"$f":"\"\"","v":""},{"$f":"\"\"","v":""},{"$f":"\"\"","v":""},{"$f":"\"\"","v":""},{"$f":"\"\"","v":""},{"$f":"\"\"","v":""},"16GB RDIMM, 2133MT/s, Dual Rank, x4 Data Width","2","[370-ABUG]",{"$f":"\"\"","v":""},{"$f":"\"\"","v":""},{"$f":"\"\"","v":""},{"$f":"\"\"","v":""},{"$f":"\"\"","v":""},{"$f":"\"\"","v":""}]
[64,"16GB RDIMM, 2133 MT/s, Dual Rank, x4 Data Width,CusKit",2,"10L1-16GB","S10L1-R630-16GB","370-ABUK",{"$f":"$G$3*C19","v":320},"16GB RDIMM, 2133MT/s, Dual Rank, x4 Data Width","2","[370-ABUG]",{"$f":"\"\"","v":""},{"$f":"\"\"","v":""},{"$f":"\"\"","v":""},{"$f":"\"\"","v":""},{"$f":"\"\"","v":""},{"$f":"\"\"","v":""}]
[80,"16GB RDIMM, 2133 MT/s, Dual Rank, x4 Data Width,CusKit",3,"10L1-16GB","S10L1-R630-16GB","370-ABUK",{"$f":"$G$3*C20","v":480},"16GB RDIMM, 2133MT/s, Dual Rank, x4 Data Width",2,"[370-ABUG]",{"$f":"\"\"","v":""},{"$f":"\"\"","v":""},{"$f":"\"\"","v":""},{"$f":"\"\"","v":""},{"$f":"\"\"","v":""},{"$f":"\"\"","v":""}]
[128,"16GB RDIMM, 2133 MT/s, Dual Rank, x4 Data Width,CusKit",6,"10L1-16GB","S10L1-R630-16GB","370-ABUK",960,"16GB RDIMM, 2133MT/s, Dual Rank, x4 Data Width","2","[370-ABUG]",{"$f":"\"\"","v":""},{"$f":"\"\"","v":""},{"$f":"\"\"","v":""},{"$f":"\"\"","v":""},{"$f":"\"\"","v":""},{"$f":"\"\"","v":""}]
[160,"16GB RDIMM, 2133 MT/s, Dual Rank, x4 Data Width,CusKit",8,"10L1-16GB","S10L1-R630-16GB","370-ABUK",1280,"16GB RDIMM, 2133MT/s, Dual Rank, x4 Data Width","2","[370-ABUG]",{"$f":"\"\"","v":""},{"$f":"\"\"","v":""},{"$f":"\"\"","v":""},{"$f":"\"\"","v":""},{"$f":"\"\"","v":""},{"$f":"\"\"","v":""}]
[192,"16GB RDIMM, 2133 MT/s, Dual Rank, x4 Data Width,CusKit",10,"10L1-16GB","S10L1-R630-16GB","370-ABUK",1600,"16GB RDIMM, 2133MT/s, Dual Rank, x4 Data Width","2","[370-ABUG]",{"$f":"\"\"","v":""},{"$f":"\"\"","v":""},{"$f":"\"\"","v":""},{"$f":"\"\"","v":""},{"$f":"\"\"","v":""},{"$f":"\"\"","v":""}]
[256,"16GB RDIMM, 2133 MT/s, Dual Rank, x4 Data Width,CusKit",14,"10L1-16GB","S10L1-R630-16GB","370-ABUK",2240,"16GB RDIMM, 2133MT/s, Dual Rank, x4 Data Width","2","[370-ABUG]",{"$f":"\"\"","v":""},{"$f":"\"\"","v":""},{"$f":"\"\"","v":""},{"$f":"\"\"","v":""},{"$f":"\"\"","v":""},{"$f":"\"\"","v":""}]
[320,"16GB RDIMM, 2133 MT/s, Dual Rank, x4 Data Width,CusKit",18,"10L1-16GB","S10L1-R630-16GB","370-ABUK",{"$f":"$G$3*C25","v":2880},"16GB RDIMM, 2133MT/s, Dual Rank, x4 Data Width","2","[370-ABUG]",{"$f":"\"\"","v":""},{"$f":"\"\"","v":""},{"$f":"\"\"","v":""},{"$f":"\"\"","v":""},{"$f":"\"\"","v":""},{"$f":"\"\"","v":""}]
[384,"16GB RDIMM, 2133 MT/s, Dual Rank, x4 Data Width,CusKit",22,"10L1-16GB","S10L1-R630-16GB","370-ABUK",3520,"16GB RDIMM, 2133MT/s, Dual Rank, x4 Data Width","2","[370-ABUG]",{"$f":"\"\"","v":""},{"$f":"\"\"","v":""},{"$f":"\"\"","v":""},{"$f":"\"\"","v":""},{"$f":"\"\"","v":""},{"$f":"\"\"","v":""}]
[512,"16GB RDIMM, 2133 MT/s, Dual Rank, x4 Data Width,CusKit",14,"10L1-16GB","S10L1-R630-16GB","370-ABUK",{"$f":"$G$3*C27","v":2240},"16GB RDIMM, 2133MT/s, Dual Rank, x4 Data Width","2","[370-ABUG]","32GB RDIMM, 2133 MT/s, Low Volt, Dual Rank, x4 Data Width",8,"10L1-32GB","S10L1-R630-32GB","[A8217683]",{"$f":"$G$4*L27","v":2552}]
[]
[]
["1CPU","MEMORY B CS250-HC"]
[192,{"$f":"\"\"","v":""},{"$f":"\"\"","v":""},{"$f":"\"\"","v":""},{"$f":"\"\"","v":""},{"$f":"\"\"","v":""},{"$f":"\"\"","v":""},"HPE 32GB 2Rx4 PC4-2400T-R Kit",24,"728629-B21",{"$f":"\"\"","v":""},{"$f":"\"\"","v":""},{"$f":"\"\"","v":""},{"$f":"\"\"","v":""},{"$f":"\"\"","v":""},{"$f":"\"\"","v":""}]
[256,"HPE 32GB 2Rx4 PC4-2400T-R Kit",2,"10L3-32GB-HP-U",null,"728629-B21",{"$f":"$G$6*C32","v":572},"HPE 32GB 2Rx4 PC4-2400T-R Kit",24,"728629-B21",{"$f":"\"\"","v":""},{"$f":"\"\"","v":""},{"$f":"\"\"","v":""},{"$f":"\"\"","v":""},{"$f":"\"\"","v":""},{"$f":"\"\"","v":""}]
[512,"HPE 32GB 2Rx4 PC4-2400T-R Kit",10,"10L3-32GB-HP-U",null,"728629-B21",{"$f":"$G$6*C33","v":2860},"HPE 32GB 2Rx4 PC4-2400T-R Kit",24,"728629-B21",{"$f":"\"\"","v":""},{"$f":"\"\"","v":""},{"$f":"\"\"","v":""},{"$f":"\"\"","v":""},{"$f":"\"\"","v":""},{"$f":"\"\"","v":""}]
["2CPU"]
[32,{"$f":"\"\"","v":""},{"$f":"\"\"","v":""},{"$f":"\"\"","v":""},{"$f":"\"\"","v":""},{"$f":"\"\"","v":""},{"$f":"\"\"","v":""},"16GB RDIMM, 2133MT/s, Dual Rank, x4 Data Width","2","[370-ABUG]",{"$f":"\"\"","v":""},{"$f":"\"\"","v":""},{"$f":"\"\"","v":""},{"$f":"\"\"","v":""},{"$f":"\"\"","v":""},{"$f":"\"\"","v":""}]
[64,"16GB RDIMM, 2133 MT/s, Dual Rank, x4 Data Width,CusKit",2,"10L1-16GB","S10L1-R730xd-16GB","370-ABUK",{"$f":"$G$3*C36","v":320},"16GB RDIMM, 2133MT/s, Dual Rank, x4 Data Width","2","[370-ABUG]",{"$f":"\"\"","v":""},{"$f":"\"\"","v":""},{"$f":"\"\"","v":""},{"$f":"\"\"","v":""},{"$f":"\"\"","v":""},{"$f":"\"\"","v":""}]
[128,"16GB RDIMM, 2133 MT/s, Dual Rank, x4 Data Width,CusKit",6,"10L1-16GB","S10L1-R730xd-16GB","370-ABUK",960,"16GB RDIMM, 2133MT/s, Dual Rank, x4 Data Width","2","[370-ABUG]",{"$f":"\"\"","v":""},{"$f":"\"\"","v":""},{"$f":"\"\"","v":""},{"$f":"\"\"","v":""},{"$f":"\"\"","v":""},{"$f":"\"\"","v":""}]
[160,"16GB RDIMM, 2133 MT/s, Dual Rank, x4 Data Width,CusKit",8,"10L1-16GB","S10L1-R730xd-16GB","370-ABUK",1280,"16GB RDIMM, 2133MT/s, Dual Rank, x4 Data Width","2","[370-ABUG]",{"$f":"\"\"","v":""},{"$f":"\"\"","v":""},{"$f":"\"\"","v":""},{"$f":"\"\"","v":""},{"$f":"\"\"","v":""},{"$f":"\"\"","v":""}]
[192,"16GB RDIMM, 2133 MT/s, Dual Rank, x4 Data Width,CusKit",10,"10L1-16GB","S10L1-R730xd-16GB","370-ABUK",1600,"16GB RDIMM, 2133MT/s, Dual Rank, x4 Data Width","2","[370-ABUG]",{"$f":"\"\"","v":""},{"$f":"\"\"","v":""},{"$f":"\"\"","v":""},{"$f":"\"\"","v":""},{"$f":"\"\"","v":""},{"$f":"\"\"","v":""}]
[256,"16GB RDIMM, 2133 MT/s, Dual Rank, x4 Data Width,CusKit",14,"10L1-16GB","S10L1-R730xd-16GB","370-ABUK",2240,"16GB RDIMM, 2133MT/s, Dual Rank, x4 Data Width","2","[370-ABUG]",{"$f":"\"\"","v":""},{"$f":"\"\"","v":""},{"$f":"\"\"","v":""},{"$f":"\"\"","v":""},{"$f":"\"\"","v":""},{"$f":"\"\"","v":""}]
[320,"16GB RDIMM, 2133 MT/s, Dual Rank, x4 Data Width,CusKit",18,"10L1-16GB","S10L1-R730xd-16GB","370-ABUK",2880,"16GB RDIMM, 2133MT/s, Dual Rank, x4 Data Width","2","[370-ABUG]",{"$f":"\"\"","v":""},{"$f":"\"\"","v":""},{"$f":"\"\"","v":""},{"$f":"\"\"","v":""},{"$f":"\"\"","v":""},{"$f":"\"\"","v":""}]
[384,"16GB RDIMM, 2133 MT/s, Dual Rank, x4 Data Width,CusKit",22,"10L1-16GB","S10L1-R730xd-16GB","370-ABUK",3520,"16GB RDIMM, 2133MT/s, Dual Rank, x4 Data Width","2","[370-ABUG]",{"$f":"\"\"","v":""},{"$f":"\"\"","v":""},{"$f":"\"\"","v":""},{"$f":"\"\"","v":""},{"$f":"\"\"","v":""},{"$f":"\"\"","v":""}]
[512,"16GB RDIMM, 2133 MT/s, Dual Rank, x4 Data Width,CusKit",14,"10L1-16GB","S10L1-R730xd-16GB","370-ABUK",2240,"16GB RDIMM, 2133MT/s, Dual Rank, x4 Data Width","2","[370-ABUG]","32GB RDIMM, 2133 MT/s, Low Volt, Dual Rank, x4 Data Width",8,"10L1-32GB","S10L1-R730xd-32GB","[A8217683]",{"$f":"$G$4*L43","v":2552}]
[]
[]
["1CPU","MEMORY C VRTX"]
[32,{"$f":"\"\"","v":""},{"$f":"\"\"","v":""},{"$f":"\"\"","v":""},{"$f":"\"\"","v":""},{"$f":"\"\"","v":""},{"$f":"\"\"","v":""},"16GB RDIMM, 2400MT/s, Dual Rank, x8 Data Width","2","[370-ACNX]",{"$f":"\"\"","v":""},{"$f":"\"\"","v":""},{"$f":"\"\"","v":""},{"$f":"\"\"","v":""},{"$f":"\"\"","v":""},{"$f":"\"\"","v":""}]
[64,"16GB RDIMM, 2400MT/s, Dual Rank, x8 Data Width, CusKit",2,"10L3-16GB-VRTX","S10L1-T630-16GB","[A8711887]",{"$f":"$G$3*C48","v":320},"16GB RDIMM, 2400MT/s, Dual Rank, x8 Data Width","2","[370-ACNX]",{"$f":"\"\"","v":""},{"$f":"\"\"","v":""},{"$f":"\"\"","v":""},{"$f":"\"\"","v":""},{"$f":"\"\"","v":""},{"$f":"\"\"","v":""}]
[96,"16GB RDIMM, 2400MT/s, Dual Rank, x8 Data Width, CusKit",4,"10L3-16GB-VRTX","S10L1-T630-16GB","[A8711887]",{"$f":"$G$3*C49","v":640},"16GB RDIMM, 2400MT/s, Dual Rank, x8 Data Width","2","[370-ACNX]",{"$f":"\"\"","v":""},{"$f":"\"\"","v":""},{"$f":"\"\"","v":""},{"$f":"\"\"","v":""},{"$f":"\"\"","v":""},{"$f":"\"\"","v":""}]
[128,"16GB RDIMM, 2400MT/s, Dual Rank, x8 Data Width, CusKit",6,"10L3-16GB-VRTX","S10L1-T630-16GB","[A8711887]",{"$f":"$G$3*C50","v":960},"16GB RDIMM, 2400MT/s, Dual Rank, x8 Data Width","2","[370-ACNX]",{"$f":"\"\"","v":""},{"$f":"\"\"","v":""},{"$f":"\"\"","v":""},{"$f":"\"\"","v":""},{"$f":"\"\"","v":""},{"$f":"\"\"","v":""}]
[160,"16GB RDIMM, 2400MT/s, Dual Rank, x8 Data Width, CusKit",8,"10L3-16GB-VRTX","S10L1-T630-16GB","[A8711887]",1280,"16GB RDIMM, 2400MT/s, Dual Rank, x8 Data Width","2","[370-ACNX]",{"$f":"\"\"","v":""},{"$f":"\"\"","v":""},{"$f":"\"\"","v":""},{"$f":"\"\"","v":""},{"$f":"\"\"","v":""},{"$f":"\"\"","v":""}]
[192,"16GB RDIMM, 2400MT/s, Dual Rank, x8 Data Width, CusKit",10,"10L3-16GB-VRTX","S10L1-T630-16GB","[A8711887]",1600,"16GB RDIMM, 2400MT/s, Dual Rank, x8 Data Width","2","[370-ACNX]",{"$f":"\"\"","v":""},{"$f":"\"\"","v":""},{"$f":"\"\"","v":""},{"$f":"\"\"","v":""},{"$f":"\"\"","v":""},{"$f":"\"\"","v":""}]
[256,"16GB RDIMM, 2400MT/s, Dual Rank, x8 Data Width, CusKit",6,"10L3-16GB-VRTX","S10L1-T630-16GB","[A8711887]",960,"16GB RDIMM, 2400MT/s, Dual Rank, x8 Data Width","2","[370-ACNX]","32GB RDIMM, 2400MT/s, Dual Rank, x4 Data Width, CusKit",4,"10L3-32GB-VRTX","S10L1-T630-32GB","[A8711888]",{"$f":"$G$4*L53","v":1276}]
["2CPU"]
[32,{"$f":"\"\"","v":""},{"$f":"\"\"","v":""},{"$f":"\"\"","v":""},{"$f":"\"\"","v":""},{"$f":"\"\"","v":""},{"$f":"\"\"","v":""},"16GB RDIMM, 2400MT/s, Dual Rank, x8 Data Width","2","[370-ACNX]",{"$f":"\"\"","v":""},{"$f":"\"\"","v":""},{"$f":"\"\"","v":""},{"$f":"\"\"","v":""},{"$f":"\"\"","v":""},{"$f":"\"\"","v":""}]
[64,"16GB RDIMM, 2400MT/s, Dual Rank, x8 Data Width, CusKit",2,"10L3-16GB-VRTX","S10L3-VRTX-16GB","[A8711887]",{"$f":"$G$3*C56","v":320},"16GB RDIMM, 2400MT/s, Dual Rank, x8 Data Width","2","[370-ACNX]",{"$f":"\"\"","v":""},{"$f":"\"\"","v":""},{"$f":"\"\"","v":""},{"$f":"\"\"","v":""},{"$f":"\"\"","v":""},{"$f":"\"\"","v":""}]
[96,"16GB RDIMM, 2400MT/s, Dual Rank, x8 Data Width, CusKit",4,"10L3-16GB-VRTX","S10L1-T630-16GB","[A8711887]",{"$f":"$G$3*C57","v":640},"16GB RDIMM, 2400MT/s, Dual Rank, x8 Data Width","2","[370-ACNX]",{"$f":"\"\"","v":""},{"$f":"\"\"","v":""},{"$f":"\"\"","v":""},{"$f":"\"\"","v":""},{"$f":"\"\"","v":""},{"$f":"\"\"","v":""}]
[128,"16GB RDIMM, 2400MT/s, Dual Rank, x8 Data Width, CusKit",6,"10L3-16GB-VRTX","S10L3-VRTX-16GB","[A8711887]",960,"16GB RDIMM, 2400MT/s, Dual Rank, x8 Data Width","2","[370-ACNX]",{"$f":"\"\"","v":""},{"$f":"\"\"","v":""},{"$f":"\"\"","v":""},{"$f":"\"\"","v":""},{"$f":"\"\"","v":""},{"$f":"\"\"","v":""}]
[160,"16GB RDIMM, 2400MT/s, Dual Rank, x8 Data Width, CusKit",8,"10L3-16GB-VRTX","S10L3-VRTX-16GB","[A8711887]",1280,"16GB RDIMM, 2400MT/s, Dual Rank, x8 Data Width","2","[370-ACNX]",{"$f":"\"\"","v":""},{"$f":"\"\"","v":""},{"$f":"\"\"","v":""},{"$f":"\"\"","v":""},{"$f":"\"\"","v":""},{"$f":"\"\"","v":""}]
[192,"16GB RDIMM, 2400MT/s, Dual Rank, x8 Data Width, CusKit",10,"10L3-16GB-VRTX","S10L3-VRTX-16GB","[A8711887]",1600,"16GB RDIMM, 2400MT/s, Dual Rank, x8 Data Width","2","[370-ACNX]",{"$f":"\"\"","v":""},{"$f":"\"\"","v":""},{"$f":"\"\"","v":""},{"$f":"\"\"","v":""},{"$f":"\"\"","v":""},{"$f":"\"\"","v":""}]
[256,"16GB RDIMM, 2400MT/s, Dual Rank, x8 Data Width, CusKit",14,"10L3-16GB-VRTX","S10L3-VRTX-16GB","[A8711887]",2240,"16GB RDIMM, 2400MT/s, Dual Rank, x8 Data Width","2","[370-ACNX]",{"$f":"\"\"","v":""},{"$f":"\"\"","v":""},{"$f":"\"\"","v":""},{"$f":"\"\"","v":""},{"$f":"\"\"","v":""},{"$f":"\"\"","v":""}]
[320,"16GB RDIMM, 2400MT/s, Dual Rank, x8 Data Width, CusKit",18,"10L3-16GB-VRTX","S10L3-VRTX-16GB","[A8711887]",2880,"16GB RDIMM, 2400MT/s, Dual Rank, x8 Data Width","2","[370-ACNX]",{"$f":"\"\"","v":""},{"$f":"\"\"","v":""},{"$f":"\"\"","v":""},{"$f":"\"\"","v":""},{"$f":"\"\"","v":""},{"$f":"\"\"","v":""}]
[384,"16GB RDIMM, 2400MT/s, Dual Rank, x8 Data Width, CusKit",22,"10L3-16GB-VRTX","S10L3-VRTX-16GB","[A8711887]",3520,"16GB RDIMM, 2400MT/s, Dual Rank, x8 Data Width","2","[370-ACNX]",{"$f":"\"\"","v":""},{"$f":"\"\"","v":""},{"$f":"\"\"","v":""},{"$f":"\"\"","v":""},{"$f":"\"\"","v":""},{"$f":"\"\"","v":""}]
[512,"16GB RDIMM, 2400MT/s, Dual Rank, x8 Data Width, CusKit",14,"10L3-16GB-VRTX","S10L3-VRTX-16GB","[A8711887]",2240,"16GB RDIMM, 2400MT/s, Dual Rank, x8 Data Width","2","[370-ACNX]","32GB RDIMM, 2400MT/s, Dual Rank, x4 Data Width, CusKit",8,"10L3-32GB-VRTX","S10L3-VRTX-32GB","[A8711888]",{"$f":"$G$4*L64","v":2552}]

{"sheet":"Operating System","index":12,"n_rows":17,"n_cols":18,"rows_kept":17,"cut":false,"hidden":true,"merged":[[0,1,0,2]]}
["Operating System"]
["R630"]
["No Operating System",{"$f":"\"\"","v":""},{"$f":"\"\"","v":""},{"$f":"\"\"","v":""},"[611-BBBF]",{"$f":"\"\"","v":""},"None",{"$f":"\"\"","v":""},{"$f":"\"\"","v":""},{"$f":"\"\"","v":""},{"$f":"\"\"","v":""},null,"None",{"$f":"\"\"","v":""},{"$f":"\"\"","v":""},{"$f":"\"\"","v":""},{"$f":"\"\"","v":""}]
["Kit Windows Server 2012 R2, Standard Edition, 2 Socket, 2VM, ROK, COA + Media",1,"10L1-WIN","S10L1-R630-WIN","[638-BBBD]",505,"1-pack of Windows Server 2012 User CALs (Standard or Datacenter)",1,"10L1-CALUSER","S10L1-R630-USR","[618-10778]",25,"1-pack of Windows Server 2012 Device CALs (Standard or Datacenter)",1,"10L1-CALDEV","S10L1-R630-DEV","[618-10777]",25]
["CentOS 7.0",1,"10L1-LINUX","S10L1-R630-LINUX",{"$f":"\"\"","v":""},45,"None",{"$f":"\"\"","v":""},{"$f":"\"\"","v":""},{"$f":"\"\"","v":""},{"$f":"\"\"","v":""},null,"None",{"$f":"\"\"","v":""},{"$f":"\"\"","v":""},{"$f":"\"\"","v":""},{"$f":"\"\"","v":""}]
[]
[]
["R730xd"]
["No Operating System",{"$f":"\"\"","v":""},{"$f":"\"\"","v":""},{"$f":"\"\"","v":""},"[611-BBBF]",{"$f":"\"\"","v":""},"None",{"$f":"\"\"","v":""},{"$f":"\"\"","v":""},{"$f":"\"\"","v":""},{"$f":"\"\"","v":""},null,"None",{"$f":"\"\"","v":""},{"$f":"\"\"","v":""},{"$f":"\"\"","v":""},{"$f":"\"\"","v":""}]
["Kit Windows Server 2012 R2, Standard Edition, 2 Socket, 2VM, ROK, COA + Media",1,"10L1-WIN","S10L1-R730xd-WIN","[638-BBBD]",505,"1-pack of Windows Server 2012 User CALs (Standard or Datacenter)",1,"10L1-CALUSER","S10L1-R730xd-USR","[618-10778]",25,"1-pack of Windows Server 2012 Device CALs (Standard or Datacenter)",1,"10L1-CALDEV","S10L1-R730xd-DEV","[618-10777]",25]
["CentOS 7.0",1,"10L1-LINUX","S10L1-R730xd-LINUX",{"$f":"\"\"","v":""},45,"None",{"$f":"\"\"","v":""},{"$f":"\"\"","v":""},{"$f":"\"\"","v":""},{"$f":"\"\"","v":""},null,"None",{"$f":"\"\"","v":""},{"$f":"\"\"","v":""},{"$f":"\"\"","v":""},{"$f":"\"\"","v":""}]
[]
[]
["T630"]
["No Operating System",{"$f":"\"\"","v":""},{"$f":"\"\"","v":""},{"$f":"\"\"","v":""},"[611-BBBF]",{"$f":"\"\"","v":""},"None",{"$f":"\"\"","v":""},{"$f":"\"\"","v":""},{"$f":"\"\"","v":""},{"$f":"\"\"","v":""},null,"None",{"$f":"\"\"","v":""},{"$f":"\"\"","v":""},{"$f":"\"\"","v":""},{"$f":"\"\"","v":""}]
["Kit Windows Server 2012 R2, Standard Edition, 2 Socket, 2VM, ROK, COA + Media",1,"10L1-WIN","S10L1-T630-WIN","[638-BBBD]",505,"1-pack of Windows Server 2012 User CALs (Standard or Datacenter)",1,"10L1-CALUSER","S10L1-T630-USR","[618-10778]",25,"1-pack of Windows Server 2012 Device CALs (Standard or Datacenter)",1,"10L1-CALDEV","S10L1-T630-DEV","[618-10777]",25]
["CentOS 7.0",1,"10L1-LINUX","S10L1-T630-LINUX",{"$f":"\"\"","v":""},45,"None",{"$f":"\"\"","v":""},{"$f":"\"\"","v":""},{"$f":"\"\"","v":""},{"$f":"\"\"","v":""},null,"None",{"$f":"\"\"","v":""},{"$f":"\"\"","v":""},{"$f":"\"\"","v":""},{"$f":"\"\"","v":""}]

{"sheet":"HDD","index":13,"n_rows":202,"n_cols":15,"rows_kept":202,"cut":false,"hidden":true,"merged":[]}
["Hard Drives"]
["R630"]
["300GB 10K RPM SAS 12Gbps 2.5in Hot-plug Hard Drive,CusKit",null,"10L1-HDD300GB","S10L1-R630-HDD300","[400-AJOQ]",140]
["1TB 7.2K RPM NLSAS 6Gbps 2.5in Hot-plug Hard Drive,13G,CusKit",null,"10L1-HDD1TB","S10L1-R630-HDD1000","[400-AEFF]",296]
[null,"R630 ","R630 1","R630 2"]
["HDD max",8,8,8]
["HDD 300GB Base",2,2,2,"Hot Spare for 300GB HDD",{"$f":"'Server10 Lotto1 R630'!$C$74","v":"No"},{"$f":"IF(F7=\"Yes\",1,0)","v":0},{"$f":"'Server10 Lotto1 R630 2'!$C$74","v":"No"},{"$f":"IF(H7=\"Yes\",1,0)","v":0},{"$f":"'Server10 Lotto1 R630 3'!$C$74","v":"No"},{"$f":"IF(J7=\"Yes\",1,0)","v":0}]
["HDD 300GB Selected",{"$f":"'Server10 Lotto1 R630'!$C$68","v":0},{"$f":"'Server10 Lotto1 R630 2'!$C$68","v":0},{"$f":"'Server10 Lotto1 R630 2'!$C$68","v":0}]
["300GB 10K RPM SAS 12Gbps 2.5in Hot-plug Hard Drive,CusKit",0,0,0]
[null,1,1,1]
[null,2,2,2]
[null,3,3,3]
[null,4,4,4]
[null,5,5,5]
[null,6,6,6]
["HDD max",8,8,8]
["HDD 300GB",{"$f":"B7+B8","v":2},{"$f":"C7+C8","v":2},2]
["HDD 1TB Selected",{"$f":"'Server10 Lotto1 R630'!$C$70","v":0},{"$f":"'Server10 Lotto1 R630 2'!$C$70","v":0},{"$f":"'Server10 Lotto1 R630 3'!$C$70","v":0},"Hot Spare for 1TB HDD",{"$f":"'Server10 Lotto1 R630'!$C$78","v":"No"},{"$f":"IF(F18=\"Yes\",1,0)","v":0},{"$f":"'Server10 Lotto1 R630 2'!$C$78","v":"No"},{"$f":"IF(H18=\"Yes\",1,0)","v":0},{"$f":"'Server10 Lotto1 R630 3'!$C$78","v":"No"},{"$f":"IF(J18=\"Yes\",1,0)","v":0}]
["1TB 7.2K RPM NLSAS 6Gbps 2.5in Hot-plug Hard Drive,13G,CusKit",{"$f":"B$6-B$7-B$8","v":6},{"$f":"C$6-C$7-C$8","v":6},6]
[null,{"$f":"IF(B19-1<1,0,B19-1)","v":5},5,5]
[null,4,4,4]
[null,3,3,3]
[null,2,2,2]
[null,1,1,1]
[null,0,0,0]
[null,0]
[null,0]
[]
["Hot Spare","Yes"]
[null,"No"]
[]
["RAID Configuration",null,null,"HDD 300GB R630",null,"HDD 1TB R630",null,"HDD 300GB R630 2",null,"HDD 1TB R630 2",null,"HDD 300GB R630 3",null,"HDD 1TB R630 3"]
["RAID Personalizzato",{"$f":"IF($B$135<=8,0,\"\")","v":0},"[780-BBJC]","RAID Personalizzato","[780-BBJC]","RAID Personalizzato","[780-BBJC]","RAID Personalizzato","[780-BBJC]","RAID Personalizzato","[780-BBJC]","RAID Personalizzato","[780-BBJC]","RAID Personalizzato","[780-BBJC]"]
["C10 - Unconfigured RAID for H330 (1-8 HDDs)",1,"[780-BBJD] ",{"$f":"IF($G$7=0,A34,\"\")","v":"C10 - Unconfigured RAID for H330 (1-8 HDDs)"},{"$f":"IF($G$7=0,C34,\"\")","v":"[780-BBJD] "},{"$f":"IF($G$18=0,A34,\"\")","v":"C10 - Unconfigured RAID for H330 (1-8 HDDs)"},{"$f":"IF($G$18=0,C34,\"\")","v":"[780-BBJD] "},{"$f":"IF(I7=0,$A$34,\"\")","v":"C10 - Unconfigured RAID for H330 (1-8 HDDs)"},{"$f":"IF(I7=0,$C$34,\"\")","v":"[780-BBJD] "},{"$f":"IF(I18=0,$A$34,\"\")","v":"C10 - Unconfigured RAID for H330 (1-8 HDDs)"},{"$f":"IF(I18=0,$C$34,\"\")","v":"[780-BBJD] "},{"$f":"IF(K7=0,$A$34,\"\")","v":"C10 - Unconfigured RAID for H330 (1-8 HDDs)"},{"$f":"IF(K7=0,$C$34,\"\")","v":"[780-BBJD] "},{"$f":"IF(K18=0,$A$34,\"\")","v":"C10 - Unconfigured RAID for H330 (1-8 HDDs)"},{"$f":"IF(K18=0,$C$34,\"\")","v":"[780-BBJD] "}]
["C2 - RAID 0 for H330 (1-8 HDDs)",1,"[780-BBJF]",{"$f":"IF($G$7=0,A35,\"\")","v":"C2 - RAID 0 for H330 (1-8 HDDs)"},{"$f":"IF($G$7=0,C35,\"\")","v":"[780-BBJF]"},{"$f":"IF($G$18=0,A35,\"\")","v":"C2 - RAID 0 for H330 (1-8 HDDs)"},{"$f":"IF($G$18=0,C35,\"\")","v":"[780-BBJF]"},{"$f":"IF(I7=0,$A$35,\"\")","v":"C2 - RAID 0 for H330 (1-8 HDDs)"},{"$f":"IF(I7=0,$C$35,\"\")","v":"[780-BBJF]"},{"$f":"IF(I18=0,$A$35,\"\")","v":"C2 - RAID 0 for H330 (1-8 HDDs)"},{"$f":"IF(I18=0,$C$35,\"\")","v":"[780-BBJF]"},{"$f":"IF(K7=0,$A$35,\"\")","v":"C2 - RAID 0 for H330 (1-8 HDDs)"},{"$f":"IF(K7=0,$C$35,\"\")","v":"[780-BBJF]"},{"$f":"IF(K18=0,$A$35,\"\")","v":"C2 - RAID 0 for H330 (1-8 HDDs)"},{"$f":"IF(K18=0,$C$35,\"\")","v":"[780-BBJF]"}]
["C3 - RAID 1 for H330 (2 HDDs)",1,"[780-BBJK]",{"$f":"IF($B$7+$B$8-$G$7=2,A36,\"\")","v":"C3 - RAID 1 for H330 (2 HDDs)"},{"$f":"IF($B$7+$B$8-$G$7=2,C36,\"\")","v":"[780-BBJK]"},{"$f":"IF($B$18-$G$18=2,A36,\"\")","v":""},{"$f":"IF($B$18-$G$18=2,C36,\"\")","v":""},{"$f":"IF($C$7+$C$8-I7=2,$A$36,\"\")","v":"C3 - RAID 1 for H330 (2 HDDs)"},{"$f":"IF($C$7+$C$8-I7=2,$C$36,\"\")","v":"[780-BBJK]"},{"$f":"IF($C$18-I18=2,A36,\"\")","v":""},{"$f":"IF($C$18-I18=2,$C$36,\"\")","v":""},{"$f":"IF($C$7+$C$8-K7=2,$A$36,\"\")","v":"C3 - RAID 1 for H330 (2 HDDs)"},{"$f":"IF($C$7+$C$8-K7=2,$C$36,\"\")","v":"[780-BBJK]"},{"$f":"IF($C$18-M18=2,E36,\"\")","v":""},{"$f":"IF($D$18-K18=2,$C$36,\"\")","v":""}]
["C4 - RAID 5 for H330 (3-8 HDDs)",1,"[780-BBJL]",{"$f":"IF($B$7+$B$8-$G$7>=3,A37,\"\")","v":""},{"$f":"IF($B$7+$B$8-$G$7>=3,C37,\"\")","v":""},{"$f":"IF($B$18-$G$18>=3,A37,\"\")","v":""},{"$f":"IF($B$18-$G$18>=3,C37,\"\")","v":""},{"$f":"IF($C$7+$C$8-I7>=3,$A$37,\"\")","v":""},{"$f":"IF($C$7+$C$8-I7>=3,$C$37,\"\")","v":""},{"$f":"IF($C$18-I18>=3,$A$37,\"\")","v":""},{"$f":"IF($C$18-I18>=3,$C$37,\"\")","v":""},{"$f":"IF($D$7+$D$8-K7>=3,$A$37,\"\")","v":""},{"$f":"IF($D$7+$D$8-K7>=3,$C$37,\"\")","v":""},{"$f":"IF($D$18-K18>=3,$A$37,\"\")","v":""},{"$f":"IF($D$18-K18>=3,$C$37,\"\")","v":""}]
["C6 - RAID 10 forH330 (4-8 HDDs in pairs) ",1,"[780-BBJN]",{"$f":"IF($B$7+$B$8-$G$7=4,A38,\"\")","v":""},{"$f":"IF($B$7+$B$8-$G$7=4,C38,\"\")","v":""},{"$f":"IF($B$18-$G$18=4,A38,\"\")","v":""},{"$f":"IF($B$18-$G$18=4,C38,\"\")","v":""},{"$f":"IF($C$7+$C$8-I7=4,$A$38,\"\")","v":""},{"$f":"IF($C$7+$C$8-I7=4,$C$38,\"\")","v":""},{"$f":"IF($C$18-I18=4,$A$38,\"\")","v":""},{"$f":"IF($C$18-I18=4,$C$38,\"\")","v":""},{"$f":"IF($D$7+$D$8-K7=4,$A$38,\"\")","v":""},{"$f":"IF($D$7+$D$8-K7=4,$C$38,\"\")","v":""},{"$f":"IF($D$18-K18=4,$A$38,\"\")","v":""},{"$f":"IF($D$18-K18=4,$C$38,\"\")","v":""}]
["C7 - RAID 1+RAID 1 for H330 (2 + 2 HDDs) ",1,"[780-BBJO]",{"$f":"IF($B$7+$B$8-$G$7=4,A39,\"\")","v":""},{"$f":"IF($B$7+$B$8-$G$7=4,C39,\"\")","v":""},{"$f":"IF($B$18-$G$18=4,A39,\"\")","v":""},{"$f":"IF($B$18-$G$18=4,C39,\"\")","v":""},{"$f":"IF($C$7+$C$8-I7=4,$A$39,\"\")","v":""},{"$f":"IF($C$7+$C$8-I7=4,$C$39,\"\")","v":""},{"$f":"IF($C$18-I18=4,A39,\"\")","v":""},{"$f":"IF($C$18-I18=4,$C$39,\"\")","v":""},{"$f":"IF($D$7+$D$8-K7=4,$A$39,\"\")","v":""},{"$f":"IF($D$7+$D$8-K7=4,$C$39,\"\")","v":""},{"$f":"IF($D$18-K18=4,A39,\"\")","v":""},{"$f":"IF($D$18-K18=4,$C$39,\"\")","v":""}]
["C8 - RAID 1+RAID 5 for H330 (2 + 3-8 HDDs)",1,"[780-BBJP]",{"$f":"IF($B$7+$B$8-$G$7>=5,A40,\"\")","v":""},{"$f":"IF($B$7+$B$8-$G$7>=5,C40,\"\")","v":""},{"$f":"IF($B$18-$G$18>=5,A40,\"\")","v":""},{"$f":"IF($B$18-$G$18>=5,C40,\"\")","v":""},{"$f":"IF($C$7+$C$8-I7>=5,$A$40,\"\")","v":""},{"$f":"IF($C$7+$C$8-I7>=5,$C$40,\"\")","v":""},{"$f":"IF($C$18-I18>=5,$A$40,\"\")","v":""},{"$f":"IF($C$18-I18>=5,$C$40,\"\")","v":""},{"$f":"IF($D$7+$D$8-K7>=5,$A$40,\"\")","v":""},{"$f":"IF($D$7+$D$8-K7>=5,$C$40,\"\")","v":""},{"$f":"IF($D$18-K18>=5,$A$40,\"\")","v":""},{"$f":"IF($D$18-K18>=5,$C$40,\"\")","v":""}]
["C9 - RAID 1+RAID 10 for H330 (2 + 4 HDDs in pairs) ",1,"[780-BBJQ] ",{"$f":"IF($B$7+$B$8-$G$7=6,A41,\"\")","v":""},{"$f":"IF($B$7+$B$8-$G$7=6,C41,\"\")","v":""},{"$f":"IF($B$18-$G$18=6,A41,\"\")","v":""},{"$f":"IF($B$18-$G$18=6,C41,\"\")","v":""},{"$f":"IF($C$7+$C$8-I7=6,$A$41,\"\")","v":""},{"$f":"IF($C$7+$C$8-I7=6,$C$41,\"\")","v":""},{"$f":"IF($C$18-I18=6,A41,\"\")","v":""},{"$f":"IF($C$18-I18=6,$C$41,\"\")","v":""},{"$f":"IF($D$7+$D$8-M7=6,$A$41,\"\")","v":""},{"$f":"IF($D$7+$D$8-M7=6,$C$41,\"\")","v":""},{"$f":"IF($D$18-K18=6,A41,\"\")","v":""},{"$f":"IF($D$18-K18=6,$C$41,\"\")","v":""}]
[]
["CS250-HC"]
["HP 480GB 6G SATA VE 2.5in SC EV SSD",null,"10L3-HD300-HP-U",null,"717971-B21",136]
["None",0,{"$f":"\"\"","v":""},0,{"$f":"\"\"","v":""},0]
["HP 1.2TB 12G SAS 10K 2.5in SC ENT HDD",1,"10L3-HD1TB-HP-U",1,"781518-B21",220]
[null,null,{"$f":"'Server10 Lotto1 R730xd 2'!$C$74","v":"No"},{"$f":"'Server10 Lotto1 R730xd 3'!$C$74","v":"No"}]
["HDD max",24,24,24]
["HDD 300GB Base",2,2,2]
["Hot Spare for 300GB HDD",{"$f":"IF(B47=\"Yes\",1,0)","v":0},{"$f":"IF(C47=\"Yes\",1,0)","v":0},{"$f":"IF(D47=\"Yes\",1,0)","v":0}]
["HDD 300GB Selected",{"$f":"'Server10 Lotto3 HP CS250'!$C$52","v":0},{"$f":"'Server10 Lotto1 R730xd 2'!$C$68","v":0},{"$f":"'Server10 Lotto1 R730xd 3'!$C$68","v":0}]
["300GB 10K RPM SAS 12Gbps 2.5in Hot-plug Hard Drive,CusKit",0,0,0]
[null,1,1,1]
[null,2,2,2]
[null,3,3,3]
[null,4,4,4]
[null,5,5,5]
[null,6,6,6]
[null,7,7,7]
[null,8,8,8]
[null,9,9,9]
[null,10,10,10]
[null,11,11,11]
[null,12,12,12]
[null,13,13,13]
[null,14,14,14]
[null,15,15,15]
[null,16,16,16]
[null,17,17,17]
[null,18,18,18]
[null,19,19,19]
[null,20,20,20]
[null,21,21,21]
[null,22,22,22]
[]
[]
[]
[]
[]
[]
[null,{"$f":"'Server10 Lotto3 HP CS250'!#REF!","v":{"$error":"#REF!"}},{"$f":"'Server10 Lotto1 R730xd 2'!$C$78","v":"No"},{"$f":"'Server10 Lotto1 R730xd 3'!$C$78","v":"No"}]
["HDD max",24,24,24]
["HDD 300GB",{"$f":"B49+B51","v":2},{"$f":"C49+C51","v":2},{"$f":"D49+D51","v":2}]
["Hot Spare for 1TB HDD",{"$f":"IF(B81=\"Yes\",1,0)","v":{"$error":"#REF!"}},{"$f":"IF(C81=\"Yes\",1,0)","v":0},{"$f":"IF(D81=\"Yes\",1,0)","v":0}]
["HDD 1TB Selected",{"$f":"'Server10 Lotto3 HP CS250'!#REF!","v":{"$error":"#REF!"}},{"$f":"'Server10 Lotto1 R730xd 2'!$C$70","v":0},{"$f":"'Server10 Lotto1 R730xd 3'!$C$70","v":0}]
["1TB 7.2K RPM NLSAS 6Gbps 2.5in Hot-plug Hard Drive,13G,CusKit",{"$f":"$B$82-$B$83-$B$85","v":{"$error":"#REF!"}},{"$f":"$C$82-$C$83-$C$85","v":22},{"$f":"$D$82-$D$83-$D$85","v":22}]
[null,{"$f":"IF(B86-1<1,0,B86-1)","v":{"$error":"#REF!"}},21,{"$f":"IF(D86-1<1,0,D86-1)","v":21}]
[null,{"$error":"#REF!"},20,{"$f":"IF(D87-1<1,0,D87-1)","v":20}]
[null,{"$error":"#REF!"},19,{"$f":"IF(D88-1<1,0,D88-1)","v":19}]
[null,{"$error":"#REF!"},18,{"$f":"IF(D89-1<1,0,D89-1)","v":18}]
[null,{"$error":"#REF!"},17,{"$f":"IF(D90-1<1,0,D90-1)","v":17}]
[null,{"$error":"#REF!"},16,{"$f":"IF(D91-1<1,0,D91-1)","v":16}]
[null,{"$error":"#REF!"},15,{"$f":"IF(D92-1<1,0,D92-1)","v":15}]
[null,{"$error":"#REF!"},14,{"$f":"IF(D93-1<1,0,D93-1)","v":14}]
[null,{"$f":"IF(B94-1<1,0,B94-1)","v":{"$error":"#REF!"}},13,{"$f":"IF(D94-1<1,0,D94-1)","v":13}]
[null,{"$error":"#REF!"},12,{"$f":"IF(D95-1<1,0,D95-1)","v":12}]
[null,{"$error":"#REF!"},11,{"$f":"IF(D96-1<1,0,D96-1)","v":11}]
[null,{"$error":"#REF!"},10,{"$f":"IF(D97-1<1,0,D97-1)","v":10}]
[null,{"$error":"#REF!"},9,{"$f":"IF(D98-1<1,0,D98-1)","v":9}]
[null,{"$error":"#REF!"},8,{"$f":"IF(D99-1<1,0,D99-1)","v":8}]
[null,{"$error":"#REF!"},7,{"$f":"IF(D100-1<1,0,D100-1)","v":7}]
[null,{"$error":"#REF!"},6,{"$f":"IF(D101-1<1,0,D101-1)","v":6}]
[null,{"$error":"#REF!"},5,{"$f":"IF(D102-1<1,0,D102-1)","v":5}]
[null,{"$error":"#REF!"},4,{"$f":"IF(D103-1<1,0,D103-1)","v":4}]
[null,{"$error":"#REF!"},3,{"$f":"IF(D104-1<1,0,D104-1)","v":3}]
[null,{"$error":"#REF!"},2,{"$f":"IF(D105-1<1,0,D105-1)","v":2}]
[null,{"$error":"#REF!"},1,{"$f":"IF(D106-1<1,0,D106-1)","v":1}]
[null,{"$error":"#REF!"},0,{"$f":"IF(D107-1<1,0,D107-1)","v":0}]
[]
[]
[]
[]
[]
[]
[]
[]
[]
["RAID Configuration",null,null,"HDD 300GB R730xd",null,"HDD 1TB R730xd",null,"HDD 300GB R730xd 2",null,"HDD 1TB R730xd 2",null,"HDD 300GB R730xd 3",null,"HDD 1TB R730xd 3"]
["RAID Personalizzato",{"$f":"IF($B$135<=8,0,\"\")","v":0},"[780-BBJC]","RAID Personalizzato","[780-BBJC]","RAID Personalizzato","[780-BBJC]","RAID Personalizzato","[780-BBJC]","RAID Personalizzato","[780-BBJC]","RAID Personalizzato","[780-BBJC]","RAID Personalizzato","[780-BBJC]"]
["C10 - Unconfigured RAID for H330 (1-8 HDDs)",1,"[780-BBJD] ",{"$f":"IF($B$50=0,A120,\"\")","v":"C10 - Unconfigured RAID for H330 (1-8 HDDs)"},{"$f":"IF($B$50=0,C120,\"\")","v":"[780-BBJD] "},{"$f":"IF($B$84=0,A120,\"\")","v":{"$error":"#REF!"}},{"$f":"IF($B$84=0,C120,\"\")","v":{"$error":"#REF!"}},{"$f":"IF($C$50=0,A120,\"\")","v":"C10 - Unconfigured RAID for H330 (1-8 HDDs)"},{"$f":"IF($C$50=0,C120,\"\")","v":"[780-BBJD] "},{"$f":"IF($C$84=0,A120,\"\")","v":"C10 - Unconfigured RAID for H330 (1-8 HDDs)"},{"$f":"IF($C$84=0,C120,\"\")","v":"[780-BBJD] "},{"$f":"IF($D$50=0,A120,\"\")","v":"C10 - Unconfigured RAID for H330 (1-8 HDDs)"},{"$f":"IF($D$50=0,C120,\"\")","v":"[780-BBJD] "},{"$f":"IF($D$84=0,A120,\"\")","v":"C10 - Unconfigured RAID for H330 (1-8 HDDs)"},{"$f":"IF($D$84=0,C120,\"\")","v":"[780-BBJD] "}]
["C2 - RAID 0 for H330 (1-8 HDDs)",1,"[780-BBJF]",{"$f":"IF($B$50=0,A121,\"\")","v":"C2 - RAID 0 for H330 (1-8 HDDs)"},{"$f":"IF($B$50=0,C121,\"\")","v":"[780-BBJF]"},{"$f":"IF($B$84=0,A121,\"\")","v":{"$error":"#REF!"}},{"$f":"IF($B$84=0,C121,\"\")","v":{"$error":"#REF!"}},{"$f":"IF($C$50=0,A121,\"\")","v":"C2 - RAID 0 for H330 (1-8 HDDs)"},{"$f":"IF($C$50=0,C121,\"\")","v":"[780-BBJF]"},{"$f":"IF($C$84=0,A121,\"\")","v":"C2 - RAID 0 for H330 (1-8 HDDs)"},{"$f":"IF($C$84=0,C121,\"\")","v":"[780-BBJF]"},{"$f":"IF($D$50=0,A121,\"\")","v":"C2 - RAID 0 for H330 (1-8 HDDs)"},{"$f":"IF($D$50=0,C121,\"\")","v":"[780-BBJF]"},{"$f":"IF($D$84=0,A121,\"\")","v":"C2 - RAID 0 for H330 (1-8 HDDs)"},{"$f":"IF($D$84=0,C121,\"\")","v":"[780-BBJF]"}]
["C3 - RAID 1 for H330 (2 HDDs)",1,"[780-BBJK]",{"$f":"IF($B$49+$B$51-$B$50=2,A122,\"\")","v":"C3 - RAID 1 for H330 (2 HDDs)"},{"$f":"IF($B$49+$B$51-$B$50=2,C122,\"\")","v":"[780-BBJK]"},{"$f":"IF($B$85-$B$84=2,A122,\"\")","v":{"$error":"#REF!"}},{"$f":"IF($B$85-$B$84=2,C122,\"\")","v":{"$error":"#REF!"}},{"$f":"IF($C$49+$C$51-$C$50=2,A122,\"\")","v":"C3 - RAID 1 for H330 (2 HDDs)"},{"$f":"IF($C$49+$C$51-$C$50=2,C122,\"\")","v":"[780-BBJK]"},{"$f":"IF($C$85-$C$84=2,A122,\"\")","v":""},{"$f":"IF($C$85-$C$84=2,C122,\"\")","v":""},{"$f":"IF($D$49+$D$51-$D$50=2,A122,\"\")","v":"C3 - RAID 1 for H330 (2 HDDs)"},{"$f":"IF($D$49+$D$51-$D$50=2,C122,\"\")","v":"[780-BBJK]"},{"$f":"IF($D$85-$D$84=2,A122,\"\")","v":""},{"$f":"IF($D$85-$D$84=2,C122,\"\")","v":""}]
["C4 - RAID 5 for H330 (3-8 HDDs)",1,"[780-BBJL]",{"$f":"IF($B$49+$B$51-$B$50>=3,A123,\"\")","v":""},{"$f":"IF($B$49+$B$51-$B$50>=3,C123,\"\")","v":""},{"$f":"IF($B$85-$B$84>=3,A123,\"\")","v":{"$error":"#REF!"}},{"$f":"IF($B$85-$B$84>=3,C123,\"\")","v":{"$error":"#REF!"}},{"$f":"IF($C$49+$C$51-$C$50>=3,A123,\"\")","v":""},{"$f":"IF($C$49+$C$51-$C$50>=3,C123,\"\")","v":""},{"$f":"IF($C$85-$C$84>=3,A123,\"\")","v":""},{"$f":"IF($C$85-$C$84>=3,C123,\"\")","v":""},{"$f":"IF($D$49+$D$51-$D$50>=3,A123,\"\")","v":""},{"$f":"IF($D$49+$D$51-$D$50>=3,C123,\"\")","v":""},{"$f":"IF($D$85-$D$84>=3,A123,\"\")","v":""},{"$f":"IF($D$85-$D$84>=3,C123,\"\")","v":""}]
["C6 - RAID 10 forH330 (4-8 HDDs in pairs) ",1,"[780-BBJN]",{"$f":"IF($B$49+$B$51-$B$50=4,A124,\"\")","v":""},{"$f":"IF($B$49+$B$51-$B$50=4,C124,\"\")","v":""},{"$f":"IF($B$85-$B$84=4,A124,\"\")","v":{"$error":"#REF!"}},{"$f":"IF($B$85-$B$84=4,C124,\"\")","v":{"$error":"#REF!"}},{"$f":"IF($C$49+$C$51-$C$50=4,A124,\"\")","v":""},{"$f":"IF($C$49+$C$51-$C$50=4,C124,\"\")","v":""},{"$f":"IF($C$85-$C$84=4,A124,\"\")","v":""},{"$f":"IF($C$85-$C$84=4,C124,\"\")","v":""},{"$f":"IF($D$49+$D$51-$D$50=4,A124,\"\")","v":""},{"$f":"IF($D$49+$D$51-$D$50=4,C124,\"\")","v":""},{"$f":"IF($D$85-$D$84=4,A124,\"\")","v":""},{"$f":"IF($D$85-$D$84=4,C124,\"\")","v":""}]
["C7 - RAID 1+RAID 1 for H330 (2 + 2 HDDs) ",1,"[780-BBJO]",{"$f":"IF($B$49+$B$51-$B$50=4,A125,\"\")","v":""},{"$f":"IF($B$49+$B$51-$B$50=4,C125,\"\")","v":""},{"$f":"IF($B$85-$B$84=4,A125,\"\")","v":{"$error":"#REF!"}},{"$f":"IF($B$85-$B$84=4,C125,\"\")","v":{"$error":"#REF!"}},{"$f":"IF($C$49+$C$51-$C$50=4,A125,\"\")","v":""},{"$f":"IF($C$49+$C$51-$C$50=4,C125,\"\")","v":""},{"$f":"IF($C$85-$C$84=4,A125,\"\")","v":""},{"$f":"IF($C$85-$C$84=4,C125,\"\")","v":""},{"$f":"IF($D$49+$D$51-$D$50=4,A125,\"\")","v":""},{"$f":"IF($D$49+$D$51-$D$50=4,C125,\"\")","v":""},{"$f":"IF($D$85-$D$84=4,A125,\"\")","v":""},{"$f":"IF($D$85-$D$84=4,C125,\"\")","v":""}]
["C8 - RAID 1+RAID 5 for H330 (2 + 3-8 HDDs)",1,"[780-BBJP]",{"$f":"IF($B$49+$B$51-$B$50>=5,A126,\"\")","v":""},{"$f":"IF($B$49+$B$51-$B$50>=5,C126,\"\")","v":""},{"$f":"IF($B$85-$B$84>=5,A126,\"\")","v":{"$error":"#REF!"}},{"$f":"IF($B$85-$B$84>=5,C126,\"\")","v":{"$error":"#REF!"}},{"$f":"IF($C$49+$C$51-$C$50>=5,A126,\"\")","v":""},{"$f":"IF($C$49+$C$51-$C$50>=5,C126,\"\")","v":""},{"$f":"IF($C$85-$C$84>=5,A126,\"\")","v":""},{"$f":"IF($C$85-$C$84>=5,C126,\"\")","v":""},{"$f":"IF($D$49+$D$51-$D$50>=5,A126,\"\")","v":""},{"$f":"IF($D$49+$D$51-$D$50>=5,C126,\"\")","v":""},{"$f":"IF($D$85-$D$84>=5,A126,\"\")","v":""},{"$f":"IF($D$85-$D$84>=5,C126,\"\")","v":""}]
["C9 - RAID 1+RAID 10 for H330 (2 + 4 HDDs in pairs) ",1,"[780-BBJQ] ",{"$f":"IF($B$49+$B$51-$B$50=6,A127,\"\")","v":""},{"$f":"IF($B$49+$B$51-$B$50=6,C127,\"\")","v":""},{"$f":"IF($B$85-$B$84=6,A127,\"\")","v":{"$error":"#REF!"}},{"$f":"IF($B$85-$B$84=6,C127,\"\")","v":{"$error":"#REF!"}},{"$f":"IF($C$49+$C$51-$C$50=6,A127,\"\")","v":""},{"$f":"IF($C$49+$C$51-$C$50=6,C127,\"\")","v":""},{"$f":"IF($C$85-$C$84=6,A127,\"\")","v":""},{"$f":"IF($C$85-$C$84=6,C127,\"\")","v":""},{"$f":"IF($D$49+$D$51-$D$50=6,A127,\"\")","v":""},{"$f":"IF($D$49+$D$51-$D$50=6,C127,\"\")","v":""},{"$f":"IF($D$85-$D$84=6,A127,\"\")","v":""},{"$f":"IF($D$85-$D$84=6,C127,\"\")","v":""}]
[]
[]
[]
[]
[]
[]
["T630"]
["300GB 10K RPM SAS 12Gbps 2.5in Hot-plug Hard Drive - Kit",null,"10L3-HDD300GB-DELL","S10L1-T630-HDD300","[400-AJQC]",93]
["1.2TB 10K RPM SAS 12Gbps 2.5in Hot-plug Hard Drive - Kit",null,"10L3-HDD1TB-DELL","S10L1-T630-HDD1000","[400-AJPX]",217]
[]
["HDD max",32]
["HDD 300GB Base",2]
["HDD 300GB Selected",{"$f":"'Server10 Lotto3 VRTX'!C59","v":0}]
["300GB SAS 6Gbps 10k 2.5\" HD Hot Plug Fully Assembled - Kit",0,null,"Hot Spare for 300GB HDD",{"$f":"'Server10 Lotto3 VRTX'!#REF!","v":{"$error":"#REF!"}},{"$f":"IF(E141=\"Yes\",1,0)","v":{"$error":"#REF!"}}]
[null,1]
[null,2]
[null,3]
[null,4]
[null,5]
[null,6]
[null,7]
[null,8]
[null,9]
[null,10]
[null,11]
[null,12]
[null,13]
[null,14]
[null,15]
[null,16]
[null,17]
[null,18]
[null,19]
[null,20]
[null,21]
[null,22]
[null,23]
["HDD max",25]
["HDD 300GB",{"$f":"B139+B140","v":2}]
["HDD 1TB Selected",{"$f":"'Server10 Lotto3 VRTX'!C61","v":0},null,"Hot Spare for 1TB HDD",{"$f":"'Server10 Lotto3 VRTX'!#REF!","v":{"$error":"#REF!"}},{"$f":"IF(E167=\"Yes\",1,0)","v":{"$error":"#REF!"}}]
["1.2TB 10K RPM SAS 6Gbps 2.5in Hot-plug Hard Drive - Kit",{"$f":"$B$165-$B$166-$B$167","v":23}]
[null,{"$f":"IF(B168-1<1,0,B168-1)","v":22}]
[null,21]
[null,20]
[null,19]
[null,18]
[null,17]
[null,16]
[null,15]
[null,{"$f":"IF(B176-1<1,0,B176-1)","v":14}]
[null,13]
[null,12]
[null,11]
[null,10]
[null,9]
[null,8]
[null,7]
[null,6]
[null,5]
[null,4]
[null,3]
[null,2]
[null,1]
[null,0]
[]
["RAID Configuration",null,null,"HDD 300GB",null,"HDD 1TB"]
["RAID Personalizzato",{"$f":"IF($B$135<=8,0,\"\")","v":0},"[780-BBJC]","RAID Personalizzato","[780-BBJC]","RAID Personalizzato","[780-BBJC]"]
["C10 - Unconfigured RAID for H330 (1-8 HDDs)",1,"[780-BBJD] ",{"$f":"IF($F$141=0,A195,\"\")","v":{"$error":"#REF!"}},{"$f":"IF($F$141=0,C195,\"\")","v":{"$error":"#REF!"}},{"$f":"IF($F$167=0,A195,\"\")","v":{"$error":"#REF!"}},{"$f":"IF($F$167=0,C195,\"\")","v":{"$error":"#REF!"}}]
["C2 - RAID 0 for H330 (1-8 HDDs)",1,"[780-BBJF]",{"$f":"IF($F$141=0,A196,\"\")","v":{"$error":"#REF!"}},{"$f":"IF($F$141=0,C196,\"\")","v":{"$error":"#REF!"}},{"$f":"IF($F$167=0,A196,\"\")","v":{"$error":"#REF!"}},{"$f":"IF($F$167=0,C196,\"\")","v":{"$error":"#REF!"}}]
["C3 - RAID 1 for H330 (2 HDDs)",1,"[780-BBJK]",{"$f":"IF($B$139+$B$140-$F$141=2,A197,\"\")","v":{"$error":"#REF!"}},{"$f":"IF($B$139+$B$140-$F$141=2,C197,\"\")","v":{"$error":"#REF!"}},{"$f":"IF($B$167-$F$167=2,A197,\"\")","v":{"$error":"#REF!"}},{"$f":"IF($B$167-$F$167=2,C197,\"\")","v":{"$error":"#REF!"}}]
["C4 - RAID 5 for H330 (3-8 HDDs)",1,"[780-BBJL]",{"$f":"IF($B$139+$B$140-$F$141>=3,A198,\"\")","v":{"$error":"#REF!"}},{"$f":"IF($B$139+$B$140-$F$141>=3,C198,\"\")","v":{"$error":"#REF!"}},{"$f":"IF($B$167-$F$167>=3,A198,\"\")","v":{"$error":"#REF!"}},{"$f":"IF($B$167-$F$167>=3,C198,\"\")","v":{"$error":"#REF!"}}]
["C6 - RAID 10 forH330 (4-8 HDDs in pairs) ",1,"[780-BBJN]",{"$f":"IF($B$139+$B$140-$F$141=4,A199,\"\")","v":{"$error":"#REF!"}},{"$f":"IF($B$139+$B$140-$F$141=4,C199,\"\")","v":{"$error":"#REF!"}},{"$f":"IF($B$167-$F$167=4,A199,\"\")","v":{"$error":"#REF!"}},{"$f":"IF($B$167-$F$167=4,C199,\"\")","v":{"$error":"#REF!"}}]
["C7 - RAID 1+RAID 1 for H330 (2 + 2 HDDs) ",1,"[780-BBJO]",{"$f":"IF($B$139+$B$140-$F$141=4,A200,\"\")","v":{"$error":"#REF!"}},{"$f":"IF($B$139+$B$140-$F$141=4,C200,\"\")","v":{"$error":"#REF!"}},{"$f":"IF($B$167-$F$167=4,A200,\"\")","v":{"$error":"#REF!"}},{"$f":"IF($B$167-$F$167=4,C200,\"\")","v":{"$error":"#REF!"}}]
["C8 - RAID 1+RAID 5 for H330 (2 + 3-8 HDDs)",1,"[780-BBJP]",{"$f":"IF($B$139+$B$140-$F$141>=5,A201,\"\")","v":{"$error":"#REF!"}},{"$f":"IF($B$139+$B$140-$F$141>=5,C201,\"\")","v":{"$error":"#REF!"}},{"$f":"IF($B$167-$F$167>=5,A201,\"\")","v":{"$error":"#REF!"}},{"$f":"IF($B$167-$F$167>=5,C201,\"\")","v":{"$error":"#REF!"}}]
["C9 - RAID 1+RAID 10 for H330 (2 + 4 HDDs in pairs) ",1,"[780-BBJQ] ",{"$f":"IF($B$139+$B$140-$F$141=6,A202,\"\")","v":{"$error":"#REF!"}},{"$f":"IF($B$139+$B$140-$F$141=6,C202,\"\")","v":{"$error":"#REF!"}},{"$f":"IF($B$167-$F$167=6,A202,\"\")","v":{"$error":"#REF!"}},{"$f":"IF($B$167-$F$167=6,C202,\"\")","v":{"$error":"#REF!"}}]

{"sheet":"PCI","index":14,"n_rows":131,"n_cols":9,"rows_kept":131,"cut":false,"hidden":true,"merged":[]}
["Additional Card for PCIe Slot 1 (Low Profile)"]
["R630"]
["None",{"$f":"\"\"","v":""},{"$f":"\"\"","v":""},{"$f":"\"\"","v":""},{"$f":"\"\"","v":""},{"$f":"\"\"","v":""},{"$f":"\"\"","v":""},0,{"$f":"\"\"","v":""}]
["Broadcom 5720 DP 1Gb Network Interface Card, Low Profile,CusKit",1,"10L1-LAN1GB-LP","S10L1-R630-LAN1-LP","[540-BBGW]",35,"",0,""]
["QLogic 57810 Dual Port 10Gb Direct Attach/SFP+ Converged Network Adapter (CNA), Low Profile,CusKit",1,"10L1-CNA10-LP","S10L1-R630-CNA10-LP","[540-BBCV]",774,"PowerEdge SFP+, 10GbE SR/SX, Optical Tranceiver, LC Connector, for Intel and Broadcom,CusKit",2,"[407-BBOK]"]
["Emulex LPE12002 Dual Channel 8Gb PCIe Host Bus Adapter, Low Profile",1,"10L1-FC-LP","S10L1-R630-FC-LP","[406-BBHB]",940,null,0,""]
["QLogic 57810 Dual Port 10Gb Direct Attach/SFP+ Low Profile Network Adapter,CusKit",1,"10L1-LAN10GB-LP","S10L1-R630-LAN10-LP","[540-BBDX]",417,"PowerEdge SFP+, 10GbE SR/SX, Optical Tranceiver, LC Connector, for Intel and Broadcom,CusKit",2,"[407-BBOK]"]
[]
["Additional Card for PCIe Slot 2 (Full height)"]
["R630"]
["None",{"$f":"\"\"","v":""},{"$f":"\"\"","v":""},{"$f":"\"\"","v":""},{"$f":"\"\"","v":""},{"$f":"\"\"","v":""},{"$f":"\"\"","v":""},0,{"$f":"\"\"","v":""}]
["Broadcom 5720 DP 1Gb Network Interface Card,Full Height,CusKit",1,"10L1-LAN1GB","S10L1-R630-LAN1","[540-BBGY]",35,"",0,""]
["QLogic 57810 Dual Port 10Gb Direct Attach/SFP+ Converged Network Adapter (CNA),Full Height,CusKit",1,"10L1-CNA10","S10L1-R630-CNA10","[540-BBCV]",774,"PowerEdge SFP+, 10GbE SR/SX, Optical Tranceiver, LC Connector, for Intel and Broadcom,CusKit",2,"[407-BBOK]"]
["Emulex LPE 12002, Dual Port 8Gb Fibre Channel HBA,Full Height,CusKit",1,"10L1-FC","S10L1-R630-FC","[406-BBGR]",940,null,0,""]
["QLogic 57810 Dual Port 10Gb Direct Attach/SFP+ Network Adapter,Full Height,CusKit",1,"10L1-LAN10GB","S10L1-R630-LAN10","[540-BBGS]",417,"PowerEdge SFP+, 10GbE SR/SX, Optical Tranceiver, LC Connector, for Intel and Broadcom,CusKit",2,"[407-BBOK]"]
[]
[]
["CS250-HC"]
["Switch"]
["None",{"$f":"\"\"","v":""},{"$f":"\"\"","v":""},{"$f":"\"\"","v":""},{"$f":"\"\"","v":""},{"$f":"\"\"","v":""},{"$f":"\"\"","v":""},0,{"$f":"\"\"","v":""}]
["HP 5130-24G-4SFP+ EI Switch",1,"10L3-SWITCH","S10L1-R630-LAN1","JG932A",1947,"HP X240 10G SFP+ SFP+ 3m DAC Cable",4,"JD097C"]
[]
["Additional Card for PCIe Slot 2 (Full height) (CPU 1)"]
["R730xd"]
["None",{"$f":"\"\"","v":""},{"$f":"\"\"","v":""},{"$f":"\"\"","v":""},{"$f":"\"\"","v":""},{"$f":"\"\"","v":""},{"$f":"\"\"","v":""},0,{"$f":"\"\"","v":""}]
["Broadcom 5720 DP 1Gb Network Interface Card,Full Height,CusKit",1,"10L1-LAN1GB","S10L1-R630-LAN1","[540-BBGY]",35,"",0,""]
["QLogic 57810 Dual Port 10Gb Direct Attach/SFP+ Converged Network Adapter (CNA),Full Height,CusKit",1,"10L1-CNA10","S10L1-R630-CNA10","[540-BBCV]",774,"PowerEdge SFP+, 10GbE SR/SX, Optical Tranceiver, LC Connector, for Intel and Broadcom,CusKit",2,"[407-BBOK]"]
["QLogic 2562, Dual Port 8Gb Optical Fibre Channel HBA,Full Height,CusKit",1,"10L1-FC-U","S10L1-R630-FC","[406-BBEK]",940,null,0,""]
["QLogic 57810 Dual Port 10Gb Direct Attach/SFP+ Network Adapter,Full Height,CusKit",1,"10L1-LAN10GB","S10L1-R630-LAN10","[540-BBGS]",417,"PowerEdge SFP+, 10GbE SR/SX, Optical Tranceiver, LC Connector, for Intel and Broadcom,CusKit",2,"[407-BBOK]"]
[]
["Additional Card for PCIe Slot 3 (Full height) (CPU 1)"]
["R730xd"]
["None",{"$f":"\"\"","v":""},{"$f":"\"\"","v":""},{"$f":"\"\"","v":""},{"$f":"\"\"","v":""},{"$f":"\"\"","v":""},{"$f":"\"\"","v":""},0,{"$f":"\"\"","v":""}]
["Broadcom 5720 DP 1Gb Network Interface Card,Full Height,CusKit",1,"10L1-LAN1GB","S10L1-R630-LAN1","[540-BBGY]",35,"",0,""]
["QLogic 57810 Dual Port 10Gb Direct Attach/SFP+ Converged Network Adapter (CNA),Full Height,CusKit",1,"10L1-CNA10","S10L1-R630-CNA10","[540-BBCV]",774,"PowerEdge SFP+, 10GbE SR/SX, Optical Tranceiver, LC Connector, for Intel and Broadcom,CusKit",2,"[407-BBOK]"]
["QLogic 2562, Dual Port 8Gb Optical Fibre Channel HBA,Full Height,CusKit",1,"10L1-FC-U","S10L1-R630-FC","[406-BBEK]",940,null,0,""]
["QLogic 57810 Dual Port 10Gb Direct Attach/SFP+ Network Adapter,Full Height,CusKit",1,"10L1-LAN10GB","S10L1-R630-LAN10","[540-BBGS]",417,"PowerEdge SFP+, 10GbE SR/SX, Optical Tranceiver, LC Connector, for Intel and Broadcom,CusKit",2,"[407-BBOK]"]
[]
["Additional Card for PCIe Slot 4 (Low Profile) (CPU 2)"]
["R730xd"]
["None",{"$f":"\"\"","v":""},{"$f":"\"\"","v":""},{"$f":"\"\"","v":""},{"$f":"\"\"","v":""},{"$f":"\"\"","v":""},{"$f":"\"\"","v":""},0,{"$f":"\"\"","v":""}]
["Broadcom 5720 DP 1Gb Network Interface Card, Low Profile,CusKit",1,"10L1-LAN1GB-LP","S10L1-R630-LAN1-LP","[540-BBGW]",35,"",0,""]
["QLogic 57810 Dual Port 10Gb Direct Attach/SFP+ Converged Network Adapter (CNA), Low Profile,CusKit",1,"10L1-CNA10-LP","S10L1-R630-CNA10-LP","[540-BBCV]",774,"PowerEdge SFP+, 10GbE SR/SX, Optical Tranceiver, LC Connector, for Intel and Broadcom,CusKit",2,"[407-BBOK]"]
["Qlogic 2562 Dual Channel 8Gb Optical Fibre Channel HBA PCIe, Low Profile",1,"10L1-FC-LP-U","S10L1-R630-FC-LP","[406-BBEL]",940,null,0,""]
["QLogic 57810 Dual Port 10Gb Direct Attach/SFP+ Low Profile Network Adapter,CusKit",1,"10L1-LAN10GB-LP","S10L1-R630-LAN10-LP","[540-BBDX]",417,"PowerEdge SFP+, 10GbE SR/SX, Optical Tranceiver, LC Connector, for Intel and Broadcom,CusKit",2,"[407-BBOK]"]
[]
["Additional Card for PCIe Slot 5 (Low Profile) (CPU 2)"]
["R730xd"]
["None",{"$f":"\"\"","v":""},{"$f":"\"\"","v":""},{"$f":"\"\"","v":""},{"$f":"\"\"","v":""},{"$f":"\"\"","v":""},{"$f":"\"\"","v":""},0,{"$f":"\"\"","v":""}]
["Broadcom 5720 DP 1Gb Network Interface Card, Low Profile,CusKit",1,"10L1-LAN1GB-LP","S10L1-R630-LAN1-LP","[540-BBGW]",35,"",0,""]
["QLogic 57810 Dual Port 10Gb Direct Attach/SFP+ Converged Network Adapter (CNA), Low Profile,CusKit",1,"10L1-CNA10-LP","S10L1-R630-CNA10-LP","[540-BBCV]",774,"PowerEdge SFP+, 10GbE SR/SX, Optical Tranceiver, LC Connector, for Intel and Broadcom,CusKit",2,"[407-BBOK]"]
["Qlogic 2562 Dual Channel 8Gb Optical Fibre Channel HBA PCIe, Low Profile",1,"10L1-FC-LP-U","S10L1-R630-FC-LP","[406-BBEL]",940,null,0,""]
["QLogic 57810 Dual Port 10Gb Direct Attach/SFP+ Low Profile Network Adapter,CusKit",1,"10L1-LAN10GB-LP","S10L1-R630-LAN10-LP","[540-BBDX]",417,"PowerEdge SFP+, 10GbE SR/SX, Optical Tranceiver, LC Connector, for Intel and Broadcom,CusKit",2,"[407-BBOK]"]
[]
["Additional Card for PCIe Slot 6 (Low Profile) (CPU 2)"]
["R730xd"]
["None",{"$f":"\"\"","v":""},{"$f":"\"\"","v":""},{"$f":"\"\"","v":""},{"$f":"\"\"","v":""},{"$f":"\"\"","v":""},{"$f":"\"\"","v":""},0,{"$f":"\"\"","v":""}]
["Broadcom 5720 DP 1Gb Network Interface Card, Low Profile,CusKit",1,"10L1-LAN1GB-LP","S10L1-R630-LAN1-LP","[540-BBGW]",35,"",0,""]
["QLogic 57810 Dual Port 10Gb Direct Attach/SFP+ Converged Network Adapter (CNA), Low Profile,CusKit",1,"10L1-CNA10-LP","S10L1-R630-CNA10-LP","[540-BBCV]",774,"PowerEdge SFP+, 10GbE SR/SX, Optical Tranceiver, LC Connector, for Intel and Broadcom,CusKit",2,"[407-BBOK]"]
["Qlogic 2562 Dual Channel 8Gb Optical Fibre Channel HBA PCIe, Low Profile",1,"10L1-FC-LP-U","S10L1-R630-FC-LP","[406-BBEL]",940,null,0,""]
["QLogic 57810 Dual Port 10Gb Direct Attach/SFP+ Low Profile Network Adapter,CusKit",1,"10L1-LAN10GB-LP","S10L1-R630-LAN10-LP","[540-BBDX]",417,"PowerEdge SFP+, 10GbE SR/SX, Optical Tranceiver, LC Connector, for Intel and Broadcom,CusKit",2,"[407-BBOK]"]
[]
[]
["Additional Card for PCIe Slot 1 (Full height)"]
["VRTX"]
["None",{"$f":"\"\"","v":""},{"$f":"\"\"","v":""},{"$f":"\"\"","v":""},{"$f":"\"\"","v":""},{"$f":"\"\"","v":""},{"$f":"\"\"","v":""},0,{"$f":"\"\"","v":""}]
["Broadcom 5720 DP 1Gb Network Interface Card, Full Height, CusKit",1,"10L3-LAN1GB","S10L3-VRTX-LAN1","[540-BBGY]",37,"",0,""]
["Broadcom 57810 DP 10Gb DA/SFP+ Converged Network Adapter (CNA), Full Height, CusKit",1,"10L3-CNA10","S10L1-R630-CNA10","[540-11149]",425,"10GbE SR SFP+ Transceiver, 10Gb and 1Gb compatible for Intel and Broadcom Server Adapter - Kit",2,"[407-10357]"]
["QLogic 2562, Dual Port 8Gb Optical Fibre Channel HBA, Full Height, CusKit",1,"10L3-FC-U","S10L3-VRTX-FC","[406-BBEK]",516,null,0,""]
["Broadcom 57810 DP 10Gb DA/SFP+ Network Adapter, Full Height, CusKit",1,"10L3-LAN10GB","S10L1-T630-LAN10","[540-11149]",416,"10GbE SR SFP+ Transceiver, 10Gb and 1Gb compatible for Intel and Broadcom Server Adapter - Kit",2,"[407-10357]"]
[]
[]
["Additional Card for PCIe Slot 2 (Full height)"]
["VRTX"]
["None",{"$f":"\"\"","v":""},{"$f":"\"\"","v":""},{"$f":"\"\"","v":""},{"$f":"\"\"","v":""},{"$f":"\"\"","v":""},{"$f":"\"\"","v":""},0,{"$f":"\"\"","v":""}]
["Broadcom 5720 DP 1Gb Network Interface Card, Full Height, CusKit",1,"10L3-LAN1GB","S10L3-VRTX-LAN1","[540-BBGY]",37,"",0,""]
["Broadcom 57810 DP 10Gb DA/SFP+ Converged Network Adapter (CNA), Full Height, CusKit",1,"10L3-CNA10","S10L1-R630-CNA10","[540-11149]",425,"10GbE SR SFP+ Transceiver, 10Gb and 1Gb compatible for Intel and Broadcom Server Adapter - Kit",2,"[407-10357]"]
["QLogic 2562, Dual Port 8Gb Optical Fibre Channel HBA, Full Height, CusKit",1,"10L3-FC-U","S10L3-VRTX-FC","[406-BBEK]",516,null,0,""]
["Broadcom 57810 DP 10Gb DA/SFP+ Network Adapter, Full Height, CusKit",1,"10L3-LAN10GB","S10L1-T630-LAN10","[540-11149]",416,"10GbE SR SFP+ Transceiver, 10Gb and 1Gb compatible for Intel and Broadcom Server Adapter - Kit",2,"[407-10357]"]
[]
[]
["Additional Card for PCIe Slot 3 (Full height)"]
["VRTX"]
["None",{"$f":"\"\"","v":""},{"$f":"\"\"","v":""},{"$f":"\"\"","v":""},{"$f":"\"\"","v":""},{"$f":"\"\"","v":""},{"$f":"\"\"","v":""},0,{"$f":"\"\"","v":""}]
["Broadcom 5720 DP 1Gb Network Interface Card, Full Height, CusKit",1,"10L3-LAN1GB","S10L3-VRTX-LAN1","[540-BBGY]",37,"",0,""]
["Broadcom 57810 DP 10Gb DA/SFP+ Converged Network Adapter (CNA), Full Height, CusKit",1,"10L3-CNA10","S10L1-R630-CNA10","[540-11149]",425,"10GbE SR SFP+ Transceiver, 10Gb and 1Gb compatible for Intel and Broadcom Server Adapter - Kit",2,"[407-10357]"]
["QLogic 2562, Dual Port 8Gb Optical Fibre Channel HBA, Full Height, CusKit",1,"10L3-FC-U","S10L3-VRTX-FC","[406-BBEK]",516,null,0,""]
["Broadcom 57810 DP 10Gb DA/SFP+ Network Adapter, Full Height, CusKit",1,"10L3-LAN10GB","S10L1-T630-LAN10","[540-11149]",416,"10GbE SR SFP+ Transceiver, 10Gb and 1Gb compatible for Intel and Broadcom Server Adapter - Kit",2,"[407-10357]"]
[]
[]
["Additional Card for PCIe Slot 4 (Low Profile)"]
["VRTX"]
["None",{"$f":"\"\"","v":""},{"$f":"\"\"","v":""},{"$f":"\"\"","v":""},{"$f":"\"\"","v":""},{"$f":"\"\"","v":""},{"$f":"\"\"","v":""},0,{"$f":"\"\"","v":""}]
["Broadcom 5720 DP 1Gb Network Interface Card, Low Profile, CusKit",1,"10L3-LAN1GB-LP","S10L3-VRTX-LAN1-LP","[540-BBGW]",37,"",0,""]
["Broadcom 57810 DP 10Gb DA/SFP+ Converged Network Adapter (CNA), Low Profile, CusKit",1,"10L3-CNA10-LP","S10L3-VRTX-CNA10-LP","[540-11145]",425,"10GbE SR SFP+ Transceiver, 10Gb and 1Gb compatible for Intel and Broadcom Server Adapter - Kit",2,"[407-10357]"]
["Qlogic 2562 Dual Channel 8Gb Optical Fibre Channel HBA PCIe, Low Profile, CusKit",1,"10L3-FC-LP-U","S10L3-VRTX-LP-FC","[406-BBEL]",516,null,0,""]
["Broadcom 57810 DP 10Gb DA/SFP+ Network Adapter, Low Profile, CusKit",1,"10L3-LAN10GB-LP","S10L3-VRTX-LAN10-LP","[540-11145]",416,"10GbE SR SFP+ Transceiver, 10Gb and 1Gb compatible for Intel and Broadcom Server Adapter - Kit",2,"[407-10357]"]
[]
[]
[]
["Additional Card for PCIe Slot 5 (Low Profile)"]
["VRTX"]
["None",{"$f":"\"\"","v":""},{"$f":"\"\"","v":""},{"$f":"\"\"","v":""},{"$f":"\"\"","v":""},{"$f":"\"\"","v":""},{"$f":"\"\"","v":""},0,{"$f":"\"\"","v":""}]
["Broadcom 5720 DP 1Gb Network Interface Card, Low Profile, CusKit",1,"10L3-LAN1GB-LP","S10L3-VRTX-LAN1-LP","[540-BBGW]",37,"",0,""]
["Broadcom 57810 DP 10Gb DA/SFP+ Converged Network Adapter (CNA), Low Profile, CusKit",1,"10L3-CNA10-LP","S10L3-VRTX-CNA10-LP","[540-11145]",425,"10GbE SR SFP+ Transceiver, 10Gb and 1Gb compatible for Intel and Broadcom Server Adapter - Kit",2,"[407-10357]"]
["Qlogic 2562 Dual Channel 8Gb Optical Fibre Channel HBA PCIe, Low Profile, CusKit",1,"10L3-FC-LP-U","S10L3-VRTX-LP-FC","[406-BBEL]",516,null,0,""]
["Broadcom 57810 DP 10Gb DA/SFP+ Network Adapter, Low Profile, CusKit",1,"10L3-LAN10GB-LP","S10L3-VRTX-LAN10-LP","[540-11145]",416,"10GbE SR SFP+ Transceiver, 10Gb and 1Gb compatible for Intel and Broadcom Server Adapter - Kit",2,"[407-10357]"]
[]
["Additional Card for PCIe Slot 6 (Low Profile)"]
["VRTX"]
["None",{"$f":"\"\"","v":""},{"$f":"\"\"","v":""},{"$f":"\"\"","v":""},{"$f":"\"\"","v":""},{"$f":"\"\"","v":""},{"$f":"\"\"","v":""},0,{"$f":"\"\"","v":""}]
["Broadcom 5720 DP 1Gb Network Interface Card, Low Profile, CusKit",1,"10L3-LAN1GB-LP","S10L3-VRTX-LAN1-LP","[540-BBGW]",37,"",0,""]
["Broadcom 57810 DP 10Gb DA/SFP+ Converged Network Adapter (CNA), Low Profile, CusKit",1,"10L3-CNA10-LP","S10L3-VRTX-CNA10-LP","[540-11145]",425,"10GbE SR SFP+ Transceiver, 10Gb and 1Gb compatible for Intel and Broadcom Server Adapter - Kit",2,"[407-10357]"]
["Qlogic 2562 Dual Channel 8Gb Optical Fibre Channel HBA PCIe, Low Profile, CusKit",1,"10L3-FC-LP-U","S10L3-VRTX-LP-FC","[406-BBEL]",516,null,0,""]
["Broadcom 57810 DP 10Gb DA/SFP+ Network Adapter, Low Profile, CusKit",1,"10L3-LAN10GB-LP","S10L3-VRTX-LAN10-LP","[540-11145]",416,"10GbE SR SFP+ Transceiver, 10Gb and 1Gb compatible for Intel and Broadcom Server Adapter - Kit",2,"[407-10357]"]
[]
["Additional Card for PCIe Slot 7 (Low Profile)"]
["VRTX"]
["None",{"$f":"\"\"","v":""},{"$f":"\"\"","v":""},{"$f":"\"\"","v":""},{"$f":"\"\"","v":""},{"$f":"\"\"","v":""},{"$f":"\"\"","v":""},0,{"$f":"\"\"","v":""}]
["Broadcom 5720 DP 1Gb Network Interface Card, Low Profile, CusKit",1,"10L3-LAN1GB-LP","S10L3-VRTX-LAN1-LP","[540-BBGW]",37,"",0,""]
["Broadcom 57810 DP 10Gb DA/SFP+ Converged Network Adapter (CNA), Low Profile, CusKit",1,"10L3-CNA10-LP","S10L3-VRTX-CNA10-LP","[540-11145]",425,"10GbE SR SFP+ Transceiver, 10Gb and 1Gb compatible for Intel and Broadcom Server Adapter - Kit",2,"[407-10357]"]
["Qlogic 2562 Dual Channel 8Gb Optical Fibre Channel HBA PCIe, Low Profile, CusKit",1,"10L3-FC-LP-U","S10L3-VRTX-LP-FC","[406-BBEL]",516,null,0,""]
["Broadcom 57810 DP 10Gb DA/SFP+ Network Adapter, Low Profile, CusKit",1,"10L3-LAN10GB-LP","S10L3-VRTX-LAN10-LP","[540-11145]",416,"10GbE SR SFP+ Transceiver, 10Gb and 1Gb compatible for Intel and Broadcom Server Adapter - Kit",2,"[407-10357]"]
[]
["Additional Card for PCIe Slot 8 (Low Profile)"]
["VRTX"]
["None",{"$f":"\"\"","v":""},{"$f":"\"\"","v":""},{"$f":"\"\"","v":""},{"$f":"\"\"","v":""},{"$f":"\"\"","v":""},{"$f":"\"\"","v":""},0,{"$f":"\"\"","v":""}]
["Broadcom 5720 DP 1Gb Network Interface Card, Low Profile, CusKit",1,"10L3-LAN1GB-LP","S10L3-VRTX-LAN1-LP","[540-BBGW]",37,"",0,""]
["Broadcom 57810 DP 10Gb DA/SFP+ Converged Network Adapter (CNA), Low Profile, CusKit",1,"10L1-CNA10-LP","S10L3-VRTX-CNA10-LP","[540-11145]",425,"10GbE SR SFP+ Transceiver, 10Gb and 1Gb compatible for Intel and Broadcom Server Adapter - Kit",2,"[407-10357]"]
["Qlogic 2562 Dual Channel 8Gb Optical Fibre Channel HBA PCIe, Low Profile, CusKit",1,"10L3-FC-LP-U","S10L3-VRTX-LP-FC","[406-BBEL]",516,null,0,""]
["Broadcom 57810 DP 10Gb DA/SFP+ Network Adapter, Low Profile, CusKit",1,"10L3-LAN10GB-LP","S10L3-VRTX-LAN10-LP","[540-11145]",416,"10GbE SR SFP+ Transceiver, 10Gb and 1Gb compatible for Intel and Broadcom Server Adapter - Kit",2,"[407-10357]"]

{"sheet":"Servizi Opzionali","index":15,"n_rows":81,"n_cols":13,"rows_kept":81,"cut":false,"hidden":true,"merged":[]}
["Warranty Upgrades",null,null,null,null,null,"Protezione dei dati - Keep Your Hard Drive "]
["R630"]
["None",{"$f":"\"\"","v":""},{"$f":"\"\"","v":""},{"$f":"\"\"","v":""},{"$f":"\"\"","v":""},{"$f":"\"\"","v":""},null,null,{"$f":"IF(($A$22=$A$12),\"\",IF($A$8=$A$3,I13,IF($A$8=$A$4,I14,IF($A$8=$A$5,I15))))","v":""},{"$f":"IF(($A$22=$A$12),\"\",IF($A$8=$A$3,J13,IF($A$8=$A$4,J14,IF($A$8=$A$5,J15))))","v":""},{"$f":"IF(($A$22=$A$12),\"\",IF($A$8=$A$3,K13,IF($A$8=$A$4,K14,IF($A$8=$A$5,K15))))","v":""},{"$f":"IF(($A$22=$A$12),\"\",IF($A$8=$A$3,L13,IF($A$8=$A$4,L14,IF($A$8=$A$5,L15))))","v":""},{"$f":"IF(($A$22=$A$12),\"\",IF($A$8=$A$3,M13,IF($A$8=$A$4,M14,IF($A$8=$A$5,M15))))","v":""}]
["4Yr Warranty upgrade ",1,"10L1-SO-12M-P","S10L1-R630-S-12M",{"$f":"\"\"","v":""},175]
["5Yr Warranty upgrade ",1,"10L1-SO-24M-P","S10L1-R630-S-24M",{"$f":"\"\"","v":""},350]
[]
["Estensione Garanzia Selezionata"]
[{"$f":"'Server10 Lotto1 R630'!$B$132","v":"None"},null,"R630"]
[{"$f":"'Server10 Lotto1 R630 2'!$B$132","v":"None"},null,"R630 2"]
[{"$f":"'Server10 Lotto1 R630 3'!$B$132","v":"None"},null,"R630 3"]
[]
["None",{"$f":"\"\"","v":""},{"$f":"\"\"","v":""},{"$f":"\"\"","v":""},{"$f":"\"\"","v":""},{"$f":"\"\"","v":""},null,"None"]
[{"$f":"IF($A$8=$A$3,H13,IF($A$8=$A$4,H14,IF($A$8=$A$5,H15)))","v":"3Yr Data Protection - Keep Your Hard Drive"},1,"10L1-SO-HDD","S10L1-R630-S-HDD",{"$f":"IF($A$8=$A$3,L13,IF($A$8=$A$4,L14,IF($A$8=$A$5,L15)))","v":"[733-10057]"},150,null,"3Yr Data Protection - Keep Your Hard Drive",1,"10L1-SO-HDD","S10L1-R630-S-HDD","[733-10057]",150]
["None",{"$f":"\"\"","v":""},{"$f":"\"\"","v":""},{"$f":"\"\"","v":""},{"$f":"\"\"","v":""},{"$f":"\"\"","v":""},null,"4Yr Data Protection - Keep Your Hard Drive",{"$f":"I13","v":1},{"$f":"J13","v":"10L1-SO-HDD"},{"$f":"K13","v":"S10L1-R630-S-HDD"},"[733-10058]",{"$f":"M13","v":150}]
[{"$f":"IF(A9=A3,H13,IF(A9=A4,H14,IF(A9=A5,H15)))","v":"3Yr Data Protection - Keep Your Hard Drive"},1,"10L1-SO-HDD","S10L1-R730xd-S-HDD",{"$f":"IF(A9=A3,L13,IF(A9=A4,L14,IF(A9=A5,L15)))","v":"[733-10057]"},150,null,"5Yr Data Protection - Keep Your Hard Drive",{"$f":"I13","v":1},{"$f":"J13","v":"10L1-SO-HDD"},{"$f":"K13","v":"S10L1-R630-S-HDD"},"[733-10059]",{"$f":"M13","v":150}]
["None",{"$f":"\"\"","v":""},{"$f":"\"\"","v":""},{"$f":"\"\"","v":""},{"$f":"\"\"","v":""},{"$f":"\"\"","v":""}]
[{"$f":"IF(A10=A3,H13,IF(A10=A4,H14,IF(A10=A5,H15)))","v":"3Yr Data Protection - Keep Your Hard Drive"},1,"10L1-SO-HDD","S10L1-R730xd-S-HDD",{"$f":"IF(A10=A3,L13,IF(A10=A4,L14,IF(A10=A5,L15)))","v":"[733-10057]"},150]
[]
[]
[]
["Protezione dei dati Selezionata"]
[{"$f":"'Server10 Lotto1 R630'!B135","v":"None"}]
[]
["Servizio Specialistico di System and Network Management per sistema opertivo Windows, erogato on site.",1,"10L1-SO-WIN","S10L1-R630-S-WIN",null,193]
["Servizio Specialistico di System and Network Management per sistema opertivo Linux, erogato on site.",1,"10L1-SO-LINUX","S10L1-R630-S-LINUX",null,193]
[]
["None",{"$f":"\"\"","v":""},{"$f":"\"\"","v":""},{"$f":"\"\"","v":""},{"$f":"\"\"","v":""},{"$f":"\"\"","v":""}]
[{"$f":"IF('Server10 Lotto1 R630'!$C$16>=5,H28,\"None\")","v":"None"},{"$f":"IF('Server10 Lotto1 R630'!$C$16>=5,I28,\"\")","v":""},{"$f":"IF('Server10 Lotto1 R630'!$C$16>=5,J28,\"\")","v":""},{"$f":"IF('Server10 Lotto1 R630'!$C$16>=5,K28,\"\")","v":""},{"$f":"IF('Server10 Lotto1 R630'!$C$16>=5,L28,\"\")","v":""},{"$f":"IF('Server10 Lotto1 R630'!$C$16>=5,M28,\"\")","v":""},null,"Servizi di manutenzione preventiva",1,"10L1-SO-PREV","S10L1-T630-S-PREV",null,193]
[]
["Warranty Upgrades",null,null,null,null,null,"Protezione dei dati - Keep Your Hard Drive "]
["R730xd"]
["None",{"$f":"\"\"","v":""},{"$f":"\"\"","v":""},{"$f":"\"\"","v":""},{"$f":"\"\"","v":""},{"$f":"\"\"","v":""},null,null,{"$f":"IF(($A$22=$A$12),\"\",IF($A$8=$A$3,I42,IF($A$8=$A$4,I43,IF($A$8=$A$5,I44))))","v":""},{"$f":"IF(($A$22=$A$12),\"\",IF($A$8=$A$3,J42,IF($A$8=$A$4,J43,IF($A$8=$A$5,J44))))","v":""},{"$f":"IF(($A$22=$A$12),\"\",IF($A$8=$A$3,K42,IF($A$8=$A$4,K43,IF($A$8=$A$5,K44))))","v":""},{"$f":"IF(($A$22=$A$12),\"\",IF($A$8=$A$3,L42,IF($A$8=$A$4,L43,IF($A$8=$A$5,L44))))","v":""},{"$f":"IF(($A$22=$A$12),\"\",IF($A$8=$A$3,M42,IF($A$8=$A$4,M43,IF($A$8=$A$5,M44))))","v":""}]
["4Yr Warranty upgrade ",1,"10L1-SO-12M-S","S10L1-R730xd-S-12M",{"$f":"\"\"","v":""},175]
["5Yr Warranty upgrade ",1,"10L1-SO-24M-S","S10L1-R730xd-S-24M",{"$f":"\"\"","v":""},350]
[]
["Estensione Garanzia Selezionata"]
[{"$f":"'Server10 Lotto3 HP CS250'!#REF!","v":{"$error":"#REF!"}},null,"R730xd"]
[{"$f":"'Server10 Lotto1 R730xd 2'!$B$141","v":"None"},null,"R730xd 2"]
[{"$f":"'Server10 Lotto1 R730xd 3'!$B$141","v":"None"},null,"R730xd 3"]
[]
["None",{"$f":"\"\"","v":""},{"$f":"\"\"","v":""},{"$f":"\"\"","v":""},{"$f":"\"\"","v":""},{"$f":"\"\"","v":""},null,"None"]
[{"$f":"IF($A$37=$A$32,H42,IF($A$37=$A$33,H43,IF($A$37=$A$34,H44)))","v":{"$error":"#REF!"}},1,"10L1-SO-HDD","S10L1-R730xd-S-HDD",{"$f":"IF($A$37=$A$32,L42,IF($A$37=$A$33,L43,IF($A$37=$A$34,L44)))","v":{"$error":"#REF!"}},150,null,"3Yr Data Protection - Keep Your Hard Drive",1,"10L1-SO-HDD","S10L1-R730xd-S-HDD","[733-10057]",150]
["None",{"$f":"\"\"","v":""},{"$f":"\"\"","v":""},{"$f":"\"\"","v":""},{"$f":"\"\"","v":""},{"$f":"\"\"","v":""},null,"4Yr Data Protection - Keep Your Hard Drive",{"$f":"I42","v":1},{"$f":"J42","v":"10L1-SO-HDD"},{"$f":"K42","v":"S10L1-R730xd-S-HDD"},"[733-10058]",{"$f":"M42","v":150}]
[{"$f":"IF(A38=A32,H42,IF(A38=A33,H43,IF(A38=A34,H44)))","v":"3Yr Data Protection - Keep Your Hard Drive"},1,"10L1-SO-HDD","S10L1-R730xd-S-HDD",{"$f":"IF(A38=A32,L42,IF(A38=A33,L43,IF(A38=A34,L44)))","v":"[733-10057]"},150,null,"5Yr Data Protection - Keep Your Hard Drive",{"$f":"I42","v":1},{"$f":"J42","v":"10L1-SO-HDD"},{"$f":"K42","v":"S10L1-R730xd-S-HDD"},"[733-10059]",{"$f":"M42","v":150}]
["None",{"$f":"\"\"","v":""},{"$f":"\"\"","v":""},{"$f":"\"\"","v":""},{"$f":"\"\"","v":""},{"$f":"\"\"","v":""}]
[{"$f":"IF(A39=A32,H42,IF(A39=A33,H43,IF(A39=A34,H44)))","v":"3Yr Data Protection - Keep Your Hard Drive"},1,"10L1-SO-HDD","S10L1-R730xd-S-HDD",{"$f":"IF(A39=A32,L42,IF(A39=A33,L43,IF(A39=A34,L44)))","v":"[733-10057]"},150]
[]
[]
[]
["Protezione dei dati Selezionata"]
[{"$f":"'Server10 Lotto3 HP CS250'!#REF!","v":{"$error":"#REF!"}}]
[]
["Servizio Specialistico di System and Network Management per sistema opertivo Windows, erogato on site.",1,"10L1-SO-WIN","S10L1-R730xd-S-WIN",null,193]
["Servizio Specialistico di System and Network Management per sistema opertivo Linux, erogato on site.",1,"10L1-SO-LINUX","S10L1-R730xd-S-LINUX",null,193]
[]
["None",{"$f":"\"\"","v":""},{"$f":"\"\"","v":""},{"$f":"\"\"","v":""},{"$f":"\"\"","v":""},{"$f":"\"\"","v":""}]
[{"$f":"IF('Server10 Lotto3 HP CS250'!$C$16>=5,H57,\"None\")","v":"None"},{"$f":"IF('Server10 Lotto3 HP CS250'!$C$16>=5,I57,\"\")","v":""},{"$f":"IF('Server10 Lotto3 HP CS250'!$C$16>=5,J57,\"\")","v":""},{"$f":"IF('Server10 Lotto3 HP CS250'!$C$16>=5,K57,\"\")","v":""},{"$f":"IF('Server10 Lotto3 HP CS250'!$C$16>=5,L57,\"\")","v":""},{"$f":"IF('Server10 Lotto3 HP CS250'!$C$16>=5,M57,\"\")","v":""},null,"Servizi di manutenzione preventiva",1,"10L1-SO-PREV","S10L1-R730xd-S-PREV",null,193]
[]
[]
["Warranty Upgrades",null,null,null,null,null,"Protezione dei dati - Keep Your Hard Drive "]
["T630"]
["None",{"$f":"\"\"","v":""},{"$f":"\"\"","v":""},{"$f":"\"\"","v":""},{"$f":"\"\"","v":""},{"$f":"\"\"","v":""},null,null,{"$f":"IF(($A$22=$A$12),\"\",IF($A$8=$A$3,I70,IF($A$8=$A$4,I71,IF($A$8=$A$5,I72))))","v":""},{"$f":"IF(($A$22=$A$12),\"\",IF($A$8=$A$3,J70,IF($A$8=$A$4,J71,IF($A$8=$A$5,J72))))","v":""},{"$f":"IF(($A$22=$A$12),\"\",IF($A$8=$A$3,K70,IF($A$8=$A$4,K71,IF($A$8=$A$5,K72))))","v":""},{"$f":"IF(($A$22=$A$12),\"\",IF($A$8=$A$3,L70,IF($A$8=$A$4,L71,IF($A$8=$A$5,L72))))","v":""},{"$f":"IF(($A$22=$A$12),\"\",IF($A$8=$A$3,M70,IF($A$8=$A$4,M71,IF($A$8=$A$5,M72))))","v":""}]
["4Yr Warranty upgrade ",1,"10L1-SO-12M-T","S10L1-T630-S-12M",{"$f":"\"\"","v":""},175]
["5Yr Warranty upgrade ",1,"10L1-SO-24M-T","S10L1-T630-S-24M",{"$f":"\"\"","v":""},350]
[]
["Estensione Garanzia Selezionata"]
[{"$f":"'Server10 Lotto3 VRTX'!#REF!","v":{"$error":"#REF!"}}]
[]
["None",{"$f":"\"\"","v":""},{"$f":"\"\"","v":""},{"$f":"\"\"","v":""},{"$f":"\"\"","v":""},{"$f":"\"\"","v":""},null,"None"]
[{"$f":"IF($A$67=$A$62,H70,IF($A$67=$A$63,H71,IF($A$67=$A$64,H72)))","v":{"$error":"#REF!"}},1,"10L1-SO-HDD","S10L1-T630-S-HDD",{"$f":"IF($A$67=$A$62,L70,IF($A$67=$A$63,L71,IF($A$67=$A$64,L72)))","v":{"$error":"#REF!"}},150,null,"3Yr Data Protection - Keep Your Hard Drive",1,"10L1-SO-HDD","S10L1-T630-S-HDD","[733-10057]",150]
[null,null,null,null,null,null,null,"4Yr Data Protection - Keep Your Hard Drive",{"$f":"I70","v":1},{"$f":"J70","v":"10L1-SO-HDD"},{"$f":"K70","v":"S10L1-T630-S-HDD"},"[733-10058]",{"$f":"M70","v":150}]
[null,null,null,null,null,null,null,"5Yr Data Protection - Keep Your Hard Drive",{"$f":"I70","v":1},{"$f":"J70","v":"10L1-SO-HDD"},{"$f":"K70","v":"S10L1-T630-S-HDD"},"[733-10059]",{"$f":"M70","v":150}]
[]
["Protezione dei dati Selezionata"]
[{"$f":"'Server10 Lotto3 VRTX'!#REF!","v":{"$error":"#REF!"}}]
[]
["Servizio Specialistico di System and Network Management per sistema opertivo Windows, erogato on site.",1,"10L1-SO-WIN","S10L1-T630-S-WIN",null,193]
["Servizio Specialistico di System and Network Management per sistema opertivo Linux, erogato on site.",1,"10L1-SO-LINUX","S10L1-T630-S-LINUX",null,193]
[]
["None",{"$f":"\"\"","v":""},{"$f":"\"\"","v":""},{"$f":"\"\"","v":""},{"$f":"\"\"","v":""},{"$f":"\"\"","v":""}]
[{"$f":"IF('Server10 Lotto3 VRTX'!$C$12>=5,H81,\"None\")","v":"None"},{"$f":"IF('Server10 Lotto3 VRTX'!$C$12>=5,I81,\"\")","v":""},{"$f":"IF('Server10 Lotto3 VRTX'!$C$12>=5,J81,\"\")","v":""},{"$f":"IF('Server10 Lotto3 VRTX'!$C$12>=5,K81,\"\")","v":""},{"$f":"IF('Server10 Lotto3 VRTX'!$C$12>=5,L81,\"\")","v":""},{"$f":"IF('Server10 Lotto3 VRTX'!$C$12>=5,M81,\"\")","v":""},null,"Servizi di manutenzione preventiva",1,"10L1-SO-PREV","S10L1-T630-S-PREV",null,193]